##TITLE=31Pdec_47-2024
 DMSO, 24 sc
 2.7.2024
##JCAMPDX= 6.0         $$ Bruker NMR JCAMP-DX V2.0
##DATA TYPE= NMR SPECTRUM
##DATA CLASS= NTUPLES
##ORIGIN= UXNMR, Bruker Analytische Messtechnik GmbH
##OWNER= root
$$ XWIN-NMR		Version 3.5
$$ Tue Jul  2 14:06:07 2024 Russian Standard Time (UT+4h)  she@DPX200
##.OBSERVE FREQUENCY= 81.013821
##.OBSERVE NUCLEUS= ^31P
##.ACQUISITION MODE= SIMULTANEOUS
##.ACQUISITION SCHEME= undefined
##.AVERAGES= 24
##.DIGITISER RES= 17
##SPECTROMETER/DATA SYSTEM= spect
##.PULSE SEQUENCE= zgpg30
##.SOLVENT NAME= DMSO
##.SHIFT REFERENCE= (INTERNAL, DMSO, 0, 198.062)
##AUDIT TRAIL= $$ (NUMBER, WHEN, WHO, WHERE, WHAT)
$$ ##TITLE= Audit trail, XWIN-NMR		Version 3.5
$$ ##JCAMPDX= 5.01
$$ ##ORIGIN= Bruker BioSpin GmbH
$$ ##OWNER= she
$$ F:/spectra/data/she/nmr/P31/2/pdata/1/auditp.txt
$$ ##AUDIT TRAIL=  $$ (NUMBER, WHEN, WHO, WHERE, WHAT)
(   1,<2024-07-02 14:05:09.54 +0400>,<she>,<DPX200>,
      <created by zg, POWCHK disabled, PULCHK disabled
       configuration hash MD5:
       00 E9 B6 7A A2 85 ED C7 34 08 36 98 17 FE 4E 26
       data hash MD5: 32K
       FC 15 87 CD D8 58 51 0F EE EA A2 34 FF 63 82 8E>)
(   2,<2024-07-02 14:05:11.82 +0400>,<she>,<DPX200>,
      <Start of raw data processing
       efp BC_mod = 2 LB = 1.5 FT_mod = 6 PKNL = 1 PHC0 = 2999.374 PHC1 = -441.7136 SI = 64K 
       data hash MD5: 64K
       9B 83 88 BC CE 10 83 50 3E 16 58 7D F3 33 6D 3A>)
(   3,<2024-07-02 14:05:31.82 +0400>,<she>,<DPX200>,
      <pk PHC0 = 43.58561 PHC1 = -86.8 
       data hash MD5: 64K
       01 98 4E 47 34 C5 BE 48 5D 97 06 D7 F2 69 6E 78>)
(   4,<2024-07-02 14:05:34.98 +0400>,<she>,<DPX200>,
      <abs ABSG = 5 
       data hash MD5: 64K
       7E 0F D8 1C 73 C0 4E 32 9C 5B D4 DB FC 26 D3 C0>)
$$ ##END=
$$ 
$$ hash MD5
$$ A7 B8 FF A5 FB 1D E7 B4 A8 AF AE B2 C4 38 E2 40
##$RELAX= 
##$RELAX= 
##$RELAX= 
##$RELAX= 
##$RELAX= 
##$RELAX= 
##$RELAX= 
##$RELAX= 
$$ Bruker specific parameters
$$ --------------------------
##$DU= <F:/spectra>
##$EXPNO= 2
##$NAME= <P31>
##$PROCNO= 1
##$TYPE= <nmr>
##$USER= <she>
##$AMP= (0..31)
100 100 100 100 100 100 100 100 100 100 100 100 100 100 100 100 100 100 
100 100 100 100 100 100 100 100 100 100 100 100 100 100 
##$AQSEQ= 0
##$AQ_mod= 1
##$AUNM= <au_zg>
##$AUTOPOS= <>
##$BF1= 81.014009
##$BF2= 200.13
##$BF3= 200.13
##$BF4= 200.13
##$BF5= 200.13
##$BF6= 200.13
##$BF7= 200.13
##$BF8= 200.13
##$BYTORDA= 1
##$CFDGTYP= 0
##$CFRGTYP= 5
##$CHEMSTR= <none>
##$CNST= (0..31)
1 1 145 1 1 1 1 1 1 1 1 1 1 1 1 1 1 1 1 1 1 1 1 1 1 1 1 1 1 1 1 1 
##$CPDPRG= <waltz16>
##$CPDPRG1= <>
##$CPDPRG2= <waltz16>
##$CPDPRG3= <>
##$CPDPRG4= <mlev>
##$CPDPRG5= <mlev>
##$CPDPRG6= <mlev>
##$CPDPRG7= <mlev>
##$CPDPRG8= <mlev>
##$CPDPRGB= <>
##$CPDPRGT= <>
##$D= (0..31)
0 1 0 0 0 0 0 0 0 0.06 0 0.03 2e-05 3e-06 0 0 0.0002 0 0 0 0 0 0 0 0 0 
0 0 0 0 0 0 
##$DATE= 1719914708
##$DBL= (0..7)
120 120 120 11 120 120 24 19 
##$DBP= (0..7)
150 150 150 150 150 150 150 150 
##$DBP07= 0
##$DBPNAM0= <>
##$DBPNAM1= <>
$$ [...]
##$SUBNAM3= <"">
##$SUBNAM4= <"">
##$SUBNAM5= <"">
##$SUBNAM6= <"">
##$SUBNAM7= <"">
##$SUBNAM8= <"">
##$SUBNAM9= <"">
##$SW= 400.765351723535
##$SWIBOX= (0..15)
0 1 3 0 0 0 0 0 0 0 0 0 0 0 0 0 
##$SW_h= 32467.5324675325
##$TD= 32768
##$TD0= 1
##$TE= 0
##$TE2= 300
##$TE3= 300
##$TEG= 300
##$TL= (0..7)
0 120 53 12 22 120 120 120 
##$TP= (0..7)
150 150 150 150 150 150 150 150 
##$TP07= 0
##$TPNAME0= <>
##$TPNAME1= <>
##$TPNAME2= <>
##$TPNAME3= <>
##$TPNAME4= <>
##$TPNAME5= <>
##$TPNAME6= <>
##$TPNAME7= <>
##$TPOAL= (0..7)
0.5 0.5 0.5 0.5 0.5 0.5 0.5 0.5 
##$TPOFFS= (0..7)
0 0 0 0 0 0 0 0 
##$TUNHIN= 0
##$TUNHOUT= 0
##$TUNXOUT= 0
##$USERA1= <user>
##$USERA2= <user>
##$USERA3= <user>
##$USERA4= <user>
##$USERA5= <user>
##$V9= 5
##$VALIST= <valist>
##$VCLIST= <CCCCCCCCCCCCCCC>
##$VD= 0
##$VDLIST= <DDDDDDDDDDDDDDD>
##$VPLIST= <PPPPPPPPPPPPPPP>
##$VTLIST= <TTTTTTTTTTTTTTT>
##$WBST= 1024
##$WBSW= 4
##$XGAIN= (0..3)
0 0 0 0 
##$XL= 0
##$YL= 0
##$YMAX_a= 11320
##$YMIN_a= -6771
##$ZGOPTNS= <>
##$ZL1= 120
##$ZL2= 120
##$ZL3= 120
##$ZL4= 120
##$ABSF1= 198.0616
##$ABSF2= -202.7028
##$ABSG= 5
##$ABSL= 3
##$ALPHA= 0
##$AQORDER= 0
##$ASSFAC= 0
##$ASSFACI= 0
##$ASSFACX= 0
##$ASSWID= 0
##$AUNMP= <proc_1d>
##$AZFE= 0.1
##$AZFW= 0.5
##$BCFW= 0
##$BC_mod= 2
##$BYTORDP= 0
##$COROFFS= 0
##$CY= -3
##$DATMOD= 1
##$DC= 0
##$DFILT= <>
##$DTYPP= 0
##$F1P= 0
##$F2P= 0
##$FCOR= 1
##$FTSIZE= 65536
##$FT_mod= 6
##$GAMMA= 0
##$GB= 0
##$INTBC= 1
##$INTSCL= 9.790993e-09
##$ISEN= 30
##$LB= 1.5
##$LEV0= 0
##$LPBIN= 0
##$MAXI= 10000
##$MC2= 0
##$MEAN= 0
##$ME_mod= 0
##$MI= 50
##$NCOEF= 0
##$NC_proc= -6
##$NLEV= 6
##$NOISF1= 182.463
##$NOISF2= 159.3651
##$NSP= 0
##$NTH_PI= 0
##$NZP= 0
##$OFFSET= 198.0616
##$PC= 4
##$PHC0= 3042.96
##$PHC1= -528.5136
##$PH_mod= 1
##$PKNL= yes
##$PPARMOD= 0
##$PSCAL= 0
##$PSIGN= 0
##$REVERSE= no
##$SF= 81.0140089999434
##$SI= 65536
##$SIGF1= 159.3651
##$SIGF2= -187.1042
##$SINO= 113.3802
##$SIOLD= 16384
##$SREGLST= <1H.CDCl3>
##$SSB= 0
##$STSI= 65536
##$STSR= 0
##$SW_p= 32467.5324675325
##$SYMM= 0
##$S_DEV= 0
##$TDeff= 32768
##$TDoff= 0
##$TI= <>
##$TILT= no
##$TM1= 0
##$TM2= 0
##$TOPLEV= 0
##$USERP1= <user>
##$USERP2= <user>
##$USERP3= <user>
##$USERP4= <user>
##$USERP5= <user>
##$WDW= 1
##$XDIM= 65536
##$YMAX_p= 516825684
##$YMIN_p= -7760500
$$ End of Bruker specific parameters
$$ ---------------------------------
##NTUPLES= NMR SPECTRUM
##VAR_NAME=  FREQUENCY,     SPECTRUM/REAL,   SPECTRUM/IMAG
##SYMBOL=    X,             R,               I
##VAR_TYPE=  INDEPENDENT,   DEPENDENT,       DEPENDENT
##VAR_FORM=  AFFN,          ASDF,            ASDF
##VAR_DIM=   65536,         65536,           65536
##UNITS=     HZ,            ARBITRARY UNITS, ARBITRARY UNITS
##FACTOR=    0.49542278885378, 1,            1
##FIRST=     16045.7642231865, 0,            0
##LAST=      -16421.768244346, 0,            0
##MIN=       -16421.768244346, -7760500,     0
##MAX=       16045.7642231865, 516825684,    0
$$ Real data points
##PAGE= N=1
##DATA TABLE= (X++(R..R)), XYDATA
$$ [...]
$$ plain form
41924 -683325 -753809 -759993 -906617 -1132350 -1192220 -996933 -652863 -246575 165900 386256
41914 386256 161971 -470974 -1120887 -1419395 -1352208 -1154674 -1024980 -1042315 -1230909 -1525039
41904 -1525039 -1700390 -1497981 -880873 -135673 292484 93251 -652378 -1413306 -1534305
41895 -1534305 -839822 104370 558993 473922 512805 1090552 1704091 1550851 619880 -266307
41885 -266307 -465284 -124864 302521 679553 1042730 1229963 1081950 826117 833601 1062236
41875 1062236 1131640 944161 834903 1015819 1244282 1249566 1201522 1460901 2006130 2413204
41865 2413204 2406789 2181737 2065383 2023101 1706502 983332 199484 -231530 -342855 -468749
41855 -468749 -673327 -694940 -522055 -590748 -1131076 -1670171 -1604499 -1047907 -642835 -642459 -683567
$$ packed form
41924f83325p0484o184j46624k25733n9870J95287L44070M06288M12475K20356
41914C86256k24285o32945o49913k98508O7187J97534J29694j7335j88594k94130
41904a525039j75351K02409O17108P45200M28157j99233p45629p60928j20999
41895a534305O94483R44192M54623q5071L8883N77747O13539j53240r30971q86187
41885b66307j98977L40420M27385L77032L63177J87233j48013k55833P484K28635
41875A062236O9404j87479j09258J80916K28463N284m8044K59379N45229M07074
41865B413204o415k25052j16354m2282l16599p23170p83848m31014j11325j25894
41855d68749k04578k1613J72885o8693n40328n39095O5672N56592M05072L76m1108
$$ plain form
41844 -683567 -472492 -185312 -44199 66605 325771 622488 706974 488171 37243 -495650
41834 -495650 -859747 -835472 -506316 -185065 121 193008 449007 635235 768173 1030754
41824 1030754 1282675 1003032 15915 -1108594 -1713208 -1782618 -1685095 -1546033 -1303985 -1100295
41814 -1100295 -1145675 -1382010 -1654309 -1979132 -2258111 -2064044 -1260269 -548384 -726363 -1553953
41804 -1553953 -2054457 -1865924 -1531025 -1414236 -1177131 -594195 -113138 -140252 -358490 -277333
41794 -277333 -19726 -27005 -296137 -437420 -303054 -96380 29509 91972 85459 5601 -8902
41783 -8902 141026 266328 117368 -190044 -254215 106997 635684 912698 718783 182503
41773 182503 -297560 -374881 -134460 -24192 -269529 -538270 -392925 103102 502318 571685
$$ packed form
41844f83567K11075K87180J41113J10804K59166K96717Q4486k18803m50928n32893
41834d95650l64097K4275L29156L21251J85186J92887K55999J86228J32938K62581
41824A030754K51921k79643r87117j124509o04614o9410R7523J39062K42048K03690
41814a100295m5380k36335k72299l24823k78979J94067Q03775P11885j77979q27590
41804a553953n00504J88533L34899J16789K37105N82936M81057k7114k18238Q1157
41794b77333K57607p279k69132j41283J34366K06674J25889O2463o513p9858j4503
41783h902J49928J25302j48960l07412o4171L61212N28687K77014j93915n36280
41773A82503m80063p7321K40421J10268k45337k68741J45345M96027L99216O9367
$$ plain form
41763 571685 483056 462432 514842 497091 281297 -125137 -497248 -547262 -315451 -233368 -584146
41752 -584146 -1096444 -1352889 -1387753 -1494057 -1606663 -1371616 -800882 -369281 -380673 -657860
41742 -657860 -947532 -1195202 -1277178 -921580 -174787 405921 341574 -221756 -804010 -1181791
41732 -1181791 -1414705 -1506703 -1367552 -998874 -464933 218159 955773 1477536 1602885 1492333
41722 1492333 1422807 1445037 1478970 1566307 1716895 1642969 1041505 141516 -381593 -127026
41712 -127026 633000 1316469 1555399 1324340 825646 375624 214428 299827 391577 370255
41702 370255 331154 365114 448506 569080 720649 722800 334744 -316146 -709780 -579522
41692 -579522 -363582 -692268 -1519024 -2084881 -1786314 -844127 -24119 148366 -206987 -604674
$$ packed form
41763E71685q8629k0624N2410j7751k15794m06434l72111n0014K31811Q2083l50778
41752e84146n12298k56445l4864j06304j12606K35047N70734M31601j1392k77187
41742f57860k89672k47670q1976L55598P46793N80708o4347n63330n82254l77781
41732a181791k32914r1998J39151L68678N33941O83092P37614N21763J25349j10552
41722A492333o9526K2230L3933Q7337J50588p3926o01464q99989n23109K54567
41712a27026P60026O83469K38930k31059m98694m50022j61196Q5399R1750k1322
41702C70255l9101L3960Q3392J20574J51569K151l88056o50890l93634J30258
41692e79522K15940l28686q26756n65857K98567R42187Q20008J72485l55353l97687
$$ plain form
41682 -604674 -742539 -744076 -903970 -1277613 -1598915 -1587126 -1243064 -832603 -671067 -923029
41672 -923029 -1470018 -1931208 -1972719 -1686464 -1521814 -1742240 -2101010 -2178890 -1873837 -1380852
41662 -1380852 -859413 -383379 -112525 -189523 -441526 -452547 -28936 572103 936780 877963
41652 877963 501613 59279 -202733 -177244 48959 326066 596907 832176 902955 702930
41642 702930 338857 -8843 -346990 -728211 -926132 -641257 -68738 173397 -141347 -498871
41632 -498871 -369156 68959 260292 38839 -341870 -743133 -1258232 -1855419 -2286481 -2362213
41622 -2362213 -2051109 -1373737 -508416 80716 21850 -425958 -576146 -145650 421770 546591
41612 546591 133422 -489976 -949988 -1016306 -707810 -386761 -502558 -1046477 -1451786 -1216818
$$ packed form
41682f04674j37865j537j59894l73643l21302J1789L44062M10461J61536k51962
41672i23029n46989m61190m1511K86255J64650k20426l58770p7880L05053M92985
41662a380852N21439M76034K70854p6998k52003j1021M23611O01039L64677n8817
41652H77963l76350m42334k62012K5489K26203K77107K70841K35269P0779k00025
41642G02930l64073l47700l38147l81221j97921K84875N72519K42135l14744l57524
41632d98871J29715M38115J91333k21453l80709m01263n15099n97187m31062p5732
41622b362213L11104O77372Q65321N89132n8866m47808j50188M30496N67420J24821
41612E46591m13169o23398m60012o6318L08496L21049j15797n43919m05309K34968
$$ plain form
41602 -1216818 -474701 197984 381866 105884 -272211 -331227 88909 670703 876714 548693
41592 548693 85784 -71232 95668 365370 646796 935123 1132040 1175788 1174153 1172894
41582 1172894 997689 595338 311757 486568 930904 1157245 995017 637515 244330
41573 244330 -90871 -133782 207713 444820 -82872 -1269281 -2217865 -2300829 -1789954 -1293994
41563 -1293994 -1066755 -1096468 -1378039 -1745228 -1827147 -1535247 -1264192 -1284059 -1311120 -1078154
41553 -1078154 -936078 -1347270 -2064160 -2414604 -2239436 -1936035 -1661883 -1159912 -436317
41544 -436317 28844 -37022 -317466 -448462 -498708 -649750 -811636 -874684 -988359 -1222725
41534 -1222725 -1232820 -677728 169688 610456 288842 -475523 -1081454 -1178521 -871267 -560944
$$ packed form
41602a216818P42117O72685J83882k75982l78095n9016M20136N81794K06011l28021
41592E48693m62909j57016J66900K69702K81426K88327J96917M3748j635j259
41582A172894j75205m02351k83581J74811M44336K26341j62228l57502l93185
41573B44330l35201m2911L41495K37107n27692j186409r48584q2964N10875M95960
41563a293994K27239k9713k81571l67189q1919K91900K71055j9867k7061K32966
41553a078154J42076m11192p16890l50444J75168L03401K74152N01971P23595
41544d36317M65161o5866k80444j30996n0246j51042j61886o3048j13675k34366
41534a222725j0095N55092Q47416M40768l21614p64365o05931r7067L07254L10323
$$ plain form
41524 -560944 -526769 -586458 -340098 169595 355915 -118200 -773716 -932937 -645594 -490365
41514 -490365 -600082 -504956 -15357 343278 65377 -599170 -1005596 -933400 -689697 -568628
41504 -568628 -562234 -562499 -557763 -564555 -512325 -269378 205899 689570 731746 94905 -804553
41493 -804553 -1178682 -768718 -215325 -279341 -906661 -1393972 -1322041 -906996 -473500 -62994
41483 -62994 289983 322705 -95219 -622554 -818510 -727140 -750977 -992928 -1090245 -780032
41473 -780032 -293442 2675 81466 95712 -41147 -509614 -1082902 -1226068 -812136 -327039
41463 -327039 -133544 73546 702910 1484747 1783631 1531341 1252328 1159834 851491 86861
41453 86861 -715085 -1097600 -1211941 -1414853 -1600755 -1443759 -1057204 -877162 -1000028 -1117921
$$ packed form
41524e60944L4175n9689K46360N09693J86320m74115o55516j59221K87343J55229
41514d90365j09717R5126M89599L58635k77901o64547m06426P2196K43703J21069
41504e68628O394k65M736o792N2230K42947M75277M83671M2176o36841q99458
41493h04553l74129M09964N53393o4016o27320m87311P1931M15045M33496M10506
41483f2994L52977L2722m17924n27335j95956R1370k3837k41951r7317L10213
41473g80032M86590K96117P8791J4246j36859m68467n73288j43166M13932M85097
41463c27039J93495K07090O29364P81837K98884k52290k79013r2494l08343p64630
41453H6861q01946l82515j14341k02912j85902J56996L86555J80042j22866j17893
$$ plain form
41443 -1117921 -1058724 -936218 -774847 -423593 114861 650583 1118394 1528569 1614138 1039786
41433 1039786 89699 -374856 70415 844510 1117189 780057 311373 -3138 -242309
41424 -242309 -406518 -295911 127011 597695 865022 928058 900669 827933 711959 589024
41414 589024 504105 470757 489482 560664 657711 705366 604549 325430 12055 -87251 92992
41403 92992 287721 203908 -88437 -280198 -289395 -317678 -432905 -433096 -228283 -32606 -14493
41392 -14493 -49996 -4678 31414 -6932 18836 137105 88563 -232053 -463869 -292354 -16434
41381 -16434 -165171 -732589 -1246631 -1466452 -1547143 -1603337 -1596309 -1625114 -1841073 -2040478 -1811048
41370 -1811048 -1162669 -579187 -358114 -337062 -375004 -614151 -1056632 -1338301 -1225720 -986814
$$ packed form
41443a117921N9197J22506J61371L51254N38454N35722M67811M10175Q5569n74352
41433A039786r50087m64555M45271P74095K72679l37132m68684l14511k39171
41424b42309j64209J10607M22922M70684K67327O3036k7389p2736j15974j22935
41414E89024q4919l3348J8725P1182R7047M7655j00817k79119l13375r9306J80243
41403I2992J94729q3813k92345j91761r197k8283j15227j91K04813J95677J8113
41392a4493l5503M5318L6092l8346K5768J18269m8542l20616k31816J71515K75920
41381a6434j48737n67418n14042k19821q0691n6194P028k8805k15959j99405K29430
41370a811048O48379N83482K21073K1052l7942k39147m42481k81669J12581K38906
$$ plain form
41360 -986814 -964460 -1072514 -1005555 -691007 -253851 218734 587376 577268 118186 -408066
41350 -408066 -576828 -433841 -312659 -309007 -276012 -207454 -235486 -293336 -162417 116465 226177
41339 226177 45390 -175298 -230544 -263819 -457449 -640201 -472557 58219 573775 755371
41329 755371 667644 551904 459253 273377 34273 -16268 193347 370558 244966 -9363
41319 -9363 -19072 217779 360602 314515 366172 604942 648989 248054 -202845 -182015 152618
41308 152618 172728 -269637 -601141 -346848 214744 434654 69117 -548687 -935071 -842093
41298 -842093 -345515 213437 399375 11916 -669089 -1071936 -869908 -314183 29209 -139127
41288 -139127 -613355 -1026885 -1279981 -1488117 -1628240 -1510299 -1137175 -825474 -807020 -890874
$$ packed form
41360i86814K2354j08054O6959L14548M37156M72585L68642j0108m59082n26252
41350d08066j68762J42987J21182L652L2995O8558k8032n7850J30919K78882J09712
41339B26177j80787k20688n5246l3275j93630j82752J67644N30776N15556J81596
41329G55371q7727j15740r2651j85876k39104n0541K09615J77211j25592k54329
41319i363r709K36851J42823m6087N1657K38770M4047m00935m50899K0830L34633
41308A52618K0110m42365l31504K54293N61592K19910l65537o17804l86384R2978
41298h42093M96578N58952J85938l87459o81005m02847K02028N55725L43392j68336
41288a39127m74228m13530k53096k08136j40123J17941L73124L11701J8454q3854
$$ plain form
41278 -890874 -713965 -211327 347104 693999 752119 572045 305022 200475 402467 729147
41268 729147 845937 680608 470254 355537 156807 -317187 -925930 -1361527 -1550848 -1668140
41258 -1668140 -1774188 -1694166 -1344621 -961643 -805070 -782338 -643409 -483082 -679019 -1240421
41248 -1240421 -1606727 -1351448 -764526 -384749 -244903 -64754 26409 -391017 -1204175 -1744770
41238 -1744770 -1754056 -1733159 -2044809 -2275663 -1922947 -1202646 -663485 -407287 -222541 -122279
41228 -122279 -166440 -68873 377747 739850 496722 -31465 -64381 415079 620222 191283
41218 191283 -342057 -515706 -568269 -791912 -943964 -760967 -508391 -530317 -680455 -672414
41208 -672414 -634562 -839453 -1160613 -1258293 -1108043 -945653 -855024 -764544 -695393 -688212 -622243
$$ packed form
41278h90874J76909N02638N58431L46895N8120j80074k67023j04547K01992L26680
41268G29147J16790j65329k10354j14717j98730m73994o08743m35597j89321j17292
41258a668140j06048Q0022L49545L82978J56573K2732J38929J60327j95937n61402
41248a240421l66306K55279N86922L79777J39846J80149R1163m17426q13158n40595
41238a744770r286K0897l11650k30854L52716P20301N39161K56198J84746J00262
41228a22279m4161R7567M46620L62103k43128n28187l2916M79460K05143m28939
41218A91283n33340j73649n2563k23643j52052J82997K52576k1926j50138Q041
41208f72414L7852k04891l21160r7680J50250J62390R0629R0480O9151P181O5969
$$ plain form
41197 -622243 -382465 -54952 265268 640520 1040795 1222305 1136949 1119925 1291450 1132879
41187 1132879 193823 -1032997 -1569369 -1202584 -693089 -714776 -1127065 -1401760 -1300110
41178 -1300110 -959397 -669620 -714111 -1139576 -1580758 -1580259 -1140271 -686836 -482446 -415709
41168 -415709 -391247 -500479 -677156 -608104 -231329 14082 -267100 -856738 -1180805 -999537
41158 -999537 -616337 -494779 -831079 -1413296 -1782363 -1637308 -1175517 -907135 -1055400 -1301746
41148 -1301746 -1220069 -782292 -294485 11902 159039 290237 490757 684727 672246 394269
41138 394269 176058 476578 1284630 1996994 2091004 1740260 1532831 1701101 1892167 1678502
41128 1678502 1072334 470435 204609 214601 153078 -193512 -631165 -779244 -521230 -94518
$$ packed form
41197f22243K39778L27513L20220L75252M00275J81510q5356j7024J71525j58571
41187A132879r39056j226820n36372L66785N09495k1687m12289k74695J01650
41178a300110L40713K89777m4491m25465m41182M99M39988M53435K04390O6737
41168d15709K4462j09232j76677O9052L76775K45411k81182n89638l24067J81268
41158i99537L83200J21558l36300n82217l69067J45055M61791K68382j48265k46346
41148a301746Q1677M37777M87807L06387J47137J31198K00520J93970j2481k77977
41138C94269k18211L00520Q08052P12364R4010l50744k07429J68270J91066k13665
41128A678502o06168o01899k65826R992o1523l46590m37653j48079K58014M26712
$$ plain form
41118 -94518 242977 432673 483715 375225 199528 180764 405028 717431 1010728 1377705
41108 1377705 1785422 1848018 1238786 210495 -588624 -780715 -535924 -272497 -313488 -762095
41098 -762095 -1435210 -1907625 -1848575 -1363764 -873632 -678456 -774623 -1007527 -1189720 -1122125
41088 -1122125 -752848 -343409 -279011 -665926 -1235146 -1615865 -1574390 -1073905 -312123 343642
41078 343642 661901 741610 724858 461999 -220484 -1015351 -1313488 -937593 -347415 -45166
41068 -45166 -99352 -300183 -407747 -166787 502121 1181123 1256604 732102 284014 271635
41058 271635 233331 -238467 -688615 -503307 -1852 -18789 -578429 -838446 -412413 57648
41048 57648 -78508 -554214 -692094 -358733 27851 131138 -61946 -414275 -705103 -675000
$$ packed form
41118i4518L37495J89696N1042j08490j75697j8764K24264L12403K93297L66977
41108A377705M07717O2596o09232j028291p99119j92091K44791K63427m0991m48607
41098g62095o73115m72415N9050M84811M90132J95176r6167k32904j82193O7595
41088a122125L69277M09439O4398l86915n69220l80719M1475N00485P61782O55765
41078C43642L18259P9709j6752k62859o82483p94867k98137L75895N90178L02249
41068d5166n4186k00831j07564K40960O68908O79002P5481n24502m48088j2379
41058B71635l8304m71798m50148J85308N01455j6937n59640k60017M26033M70061
41048E7648j36156m75706j37880L33361L86584J03287j93084l52329k90828L0103
$$ plain form
41038 -675000 -292811 128110 265319 74534 -400549 -1210295 -2212936 -2874345 -2742099
41029 -2742099 -1998614 -1234349 -812817 -756906 -1021102 -1376529 -1145628 301027 2584955
41020 2584955 4338517 4515233 3432105 2267918 1764624 1708556 1524728 1018744 466495
41011 466495 177912 137259 106525 16779 84075 420583 708789 552094 79825 -167354
41001 -167354 -5364 145803 -33300 -208365 106342 774341 1210825 1209402 1149876 1369354
40991 1369354 1728448 1920201 1881223 1702876 1366009 803709 135778 -350926 -465082 -286332
40981 -286332 -90446 -103866 -276935 -324544 -103673 69621 -330906 -1394714 -2526684 -2972890
40971 -2972890 -2517123 -1580268 -752408 -354661 -346412 -447454 -339862 85231 611628 905588
$$ packed form
41038f75000L82189M20921J37209j90785m75083q09746j002641o61409J32246
41029b742099P43485P64265M21532N5911k64196l55427K30901J446655K283928
41020B584955J753562J76716j083128j164187n03294n6068j83828n05984n52249
41011D66495k88583m0653l0734q9746O7296L36508K88206j56695m72269k47179
41001a67354J61990J51167j79103j75065L14707O67999M36484j423n9526K19478
40991A369354L59094J91753l8978j78347l36867n62300o67931m86704j14156J78750
40981b86332J95886j3420j73069m7609K20871J73294m00527j063808j131970m46206
40971b972890M55767R36855Q27860L97747Q249j01042J07592M25093N26397K93960
$$ plain form
40961 905588 867550 701405 621728 604094 488995 233709 -57664 -313928 -568033 -816213
40951 -816213 -925456 -788545 -527659 -420489 -591541 -863956 -975847 -871089 -684479 -498973
40941 -498973 -280615 -80086 -105128 -424033 -705266 -505466 149554 710212 761621 528010
40931 528010 496153 708103 783337 599085 509381 739409 977532 883783 670098 735969
40921 735969 964027 941627 799032 1162138 2104869 2766956 2393505 1300673 372584 -24508
40911 -24508 -120444 -61864 185251 381515 159348 -291468 -296752 340837 987475 1063137 801872
40900 801872 760342 969461 1035893 819099 519470 234971 -102370 -393718 -404852 -157874
40890 -157874 72918 200591 409486 721344 833869 559608 137968 -95646 -134257 -190505
$$ packed form
40961I05588l8038j66145p9677j7634j15099k55286k91373k56264k54105k48180
40951h16213j09243J36911K60886J07170j71052k72415j11891J04758J86610J85506
40941d98973K18358K00529k5042l18905k81233J99800O55020N60658N1409k33611
40931E28010l1857K11950P5234j84252q9704K30028K38123r3749k13685O5871
40921G35969K28058k2400j42595L63106R42731O62087l73451j092832r28089l97092
40911b4508r5936N8580K47115J96264k22167m50816n284O37589O46638P5662k61265
40900H01872m1530K09119O6432k16794k99629k84499l37341k91348j1134K46978
40890a57874K30792J27673K08895L11858J12525k74261m21640k33614l8611n6248
$$ plain form
40880 -190505 -351659 -569947 -857147 -1237063 -1559745 -1586195 -1273036 -836590 -535968 -481021
40870 -481021 -595441 -652068 -416368 89767 517059 548112 285062 85537 44562 -101003
40860 -101003 -498305 -881392 -915173 -644914 -401500 -381422 -516599 -662958 -699180 -499472
40850 -499472 -61371 321150 255166 -278222 -818876 -912985 -577599 -163167 126708 394182
40840 394182 750009 1045932 1023401 685115 389912 484879 875285 1090542 825420 283331
40830 283331 -122342 -261836 -289561 -271231 -116452 107408 107786 -261077 -788987 -1195010
40820 -1195010 -1399927 -1389775 -1077876 -524475 -67566 40515 -37013 -30903 -46648 -397583
40810 -397583 -1044699 -1563802 -1677681 -1513038 -1306705 -1156404 -1110425 -1202457 -1290638 -1115149
$$ packed form
40880a90505j61154k18288k87200l79916l22682k6450L13159M36446L00622N4947
40870d81021j14420n6627K35700N06135M27292L1053k63050j99525m0975j45565
40860a01003l97302l83087l3781K70259K43414K0078j35177j46359l6222J99708
40850d99472M38101L82521o5984n33388n40654r4109L35386M14432K89875K67474
40840C94182L55827K95923k2531l38286k95203R4967L90406K15257k65122n42089
40830B83331m05673j39494k7725J8330J54779K23860L78l68863n27910m06023
40820a195010k04917J0152L11899N53401M56909J08081p7528O110j5745l50935
40810c97583o47116n19103j13879J64643K06333J50301M5979r2032q8181J75489
$$ plain form
40800 -1115149 -646913 -189619 -28068 -130050 -262969 -250023 -74455 103099 25985 -360548
40790 -360548 -712675 -645880 -272683 -62891 -162011 -253220 -183271 -259093 -691494 -1163967
40780 -1163967 -1267930 -1016453 -604707 -27992 652105 996859 662821 -24125 -475647
40771 -475647 -659918 -983716 -1480255 -1719339 -1535834 -1261118 -1127295 -990728 -807847 -841360
40761 -841360 -1133202 -1257967 -933801 -479669 -317895 -381960 -393293 -383317 -489434 -517673
40751 -517673 -248431 -12911 -372768 -1218175 -1738274 -1443421 -767888 -435348 -601965 -925790
40741 -925790 -1197537 -1505617 -1862339 -2029886 -1825719 -1428602 -1257645 -1563035 -2157881 -2562571
40731 -2562571 -2451286 -1950199 -1423774 -994519 -452969 292062 901265 969636 581701 221289
$$ packed form
40800a115149M68236M57294J61551j01982j32919J2946J75568J77554p7114l86533
40790c60548l52127O6795L73197K09792r9120r1209O9949p5822m32401m72473
40780a163967j03963K51477M11746N76715O80097L44754l34038o86946m51522
40771d75647j84271l23798m96539k39084J83505K74716J33823J36567J82881l3513
40761h41360k91842j24765L24166M54132J61774o4065j1333R976j06117k8239
40751e17673K69242K35520l59857q45407n20099K94853O75533L32540j66617l23825
40741i25790k71747l08080l56722j67547K04167L97117J70957l05390n94846m04690
40731b562571J11285N01087N26425M29255N41550P45031O09203O8371l87935l60412
$$ plain form
40721 221289 153120 197557 179944 255710 547732 724361 337260 -458536 -893230 -430176
40711 -430176 592155 1319208 1255293 660748 184664 238993 692617 1079653 1098001 899898
40701 899898 836825 960099 942739 538092 -71033 -497914 -572773 -389728 -69777 314565
40691 314565 627800 680484 391045 -129038 -623954 -797091 -504391 30296 317660 91985
40681 91985 -390330 -701442 -769751 -835258 -984177 -1028750 -844614 -545001 -269508 -45084
40671 -45084 78294 -11876 -298491 -594715 -775281 -859330 -793701 -380485 435897 1364468
40661 1364468 1976666 2020746 1509107 697903 40216 -94468 200882 475774 525484 634679
40651 634679 1051520 1525139 1672489 1567586 1575933 1736433 1729831 1436539 1111246 926938
$$ packed form
40721B21289o8169M4437j7613P5766K92022J76629l87101p95796m34694M63054
40711d30176J022331P27053o3915n94545m76084N4329M53624L87036J8348j98103
40701H99898o3073J23274j7360m04647o09125m26881p4859J83045L19951L84342
40691C14565L13235N2684k89439n20083m94916j73137K92700N34687K87364k25675
40681I1985m82315l11112o8309o5507j48919m4573J84136K99613K75493K24424
40671d5084J23378r0170k86615k96224j80566q4049O5629M13216Q16382R28571
40661A364468O12198M4080n11639q11204o57687j34684K95350K74892M9710J09195
40651F34679M16841M73619J47350j04903Q347J60500o602k93292l25293j84308
$$ plain form
40641 926938 719471 347522 1032 -75075 35396 35193 -206716 -568171 -864548 -961932
40631 -961932 -793887 -448252 -185413 -195728 -359513 -405140 -288191 -234039 -379719 -563785
40621 -563785 -565707 -400342 -238185 -147577 -91272 -113676 -310078 -571137 -560111 -88341 580132
40610 580132 947664 801464 423847 273925 513037 862700 910697 536154 3399 -364140
40600 -364140 -504853 -523894 -395743 4506 579346 990389 1063908 982825 953107 936875
40590 936875 890024 965852 1193521 1225941 794736 198989 -122103 -328222 -899538 -1663769
40580 -1663769 -1788430 -936024 187405 762633 801204 743232 604322 122469 -525457 -798583
40570 -798583 -544793 -178957 -88297 -266725 -556151 -841722 -929756 -617258 -48796 284084
$$ packed form
40641I26938k07467l71949l46490p6107J10471k03k41909l61455k96377r7384
40631i61932J68045L45635K62839j0315j63785m5627J16949N4152j45680j84066
40621e63785j922J65365J62157R0608N6305k2404j96402k61059J1026M71770O68473
40610E80132L67532j46200l77617j49922K39112L49663M7997l74543n32755l67539
40600c64140j40713j9041J28151M00249N74840M11043P3519q1083k9718j6232
40590I36875m6851P5828K27669L2420m31205n95747l21092k06119n71316p64231
40580a663769j24661Q52406J123429N75228L8571n7972j38910m81853o47926k73126
40570g98583K53790L65836R0660j78428k89426k85571q8034L12498N68462L32880
$$ plain form
40560 284084 85056 -400202 -721769 -727734 -575619 -408182 -238300 -108257 -154791 -428006
40550 -428006 -729868 -746971 -365853 217221 739699 1122259 1376666 1405370 1128648 741863
40540 741863 534620 438793 107383 -469739 -832322 -741689 -610425 -902768 -1422280 -1602188
40530 -1602188 -1278052 -755670 -292660 44897 140619 -84590 -386273 -430455 -301857 -376682
40520 -376682 -707739 -962354 -986899 -992185 -1106394 -1164241 -1052004 -878173 -677588 -307178
40510 -307178 229300 685051 922799 1046566 1085136 896840 517369 247109 218376 169863
40500 169863 -203006 -927761 -1835312 -2641938 -2948668 -2591876 -2034999 -1906182 -2078344 -1828940
40490 -1828940 -1073923 -692574 -1231281 -1999570 -2042567 -1425240 -877291 -666629 -603757 -773692
$$ packed form
40560B84084j99028m85258l21567n965J52115J67437J69882J30043m6534k73215
40550d28006l01862j7103L81118N83074N22478L82560K54407K8704k76722l86785
40540G41863k07243r5827l31410n77122l62583R0633J31264k92343n19512j79908
40530a602188L24136N22382M63010L37557R5722k25209l01683m4182J28598p4825
40520c76682l31057k54615k4545n286j14209n7847J12237J73831K00585L70410
40510c07178N36478M55751K37748J23767L8570j88296l79471k70260k8733m8513
40500A69863l72869p24755r07551q06626l06730L56792N56877J28817j72162K49404
40490a828940P55017L81349n38707p68289m2997O17327N47949K10662O2872j69935
$$ plain form
40480 -773692 -1371276 -1986602 -1931391 -1279830 -816284 -888842 -1042526 -905883 -712821 -703075
40470 -703075 -661575 -405126 -205406 -337077 -582537 -543824 -177887 250092 501713 441811
40460 441811 40667 -491228 -803410 -806789 -734840 -690635 -465406 13517 419540 492892
40450 492892 460500 655731 963741 1023593 832769 759303 971737 1178912 1018465 522715
40440 522715 104953 120445 459020 621982 289849 -279325 -632073 -804253 -1231287 -1939920
40430 -1939920 -2340469 -2095639 -1734502 -1941737 -2550131 -2793120 -2410488 -1923815 -1795343
40421 -1795343 -1857878 -1750557 -1475488 -1253267 -1142428 -1097659 -1185334 -1430937 -1586413 -1371865
40411 -1371865 -917288 -664295 -777561 -929644 -807855 -586052 -629731 -880351 -896777 -534334
$$ packed form
40480g73692n97584o15326N5211O51561M63546p2558j53684J36643J93062R746
40470g03075M1500K56449J99720j31671k45460L8713L65937M27979K51621n9902
40460D41811m01144n31895l12182l379P1949M4205K25229M78923M06023P3352
40450D92892l2392J95231L08010N9852j90824p3466K12434K07175j60447m95750
40440E22715m17762J5492L38575J62962l32133n69174l52748j72180m27034p08633
40430a939920m00549K44830L61137k07235o08394k42989L82632M86673J28472
40421a795343o2535J07321K75069K22221J10839M4769q7675k45603j55476K14548
40411a371865M54577K52993j13266j52083J21789K21803m3679k50620j6426L62443
$$ plain form
40401 -534334 -213100 -320461 -650662 -751315 -626582 -703642 -1164469 -1704014 -1996017 -2057267
40391 -2057267 -2067428 -2136682 -2333678 -2613438 -2615372 -1922414 -724409 155701 194267 -193940
40381 -193940 -276772 50261 360298 473768 603208 811497 848507 577110 147272 -305158
40371 -305158 -735844 -906282 -462860 506692 1350443 1529551 1172830 755946 477456 202637
40361 202637 -162174 -522317 -749338 -785344 -657471 -538317 -690040 -1158497 -1589083 -1550597
40351 -1550597 -1034725 -461512 -178699 -127405 -55345 112492 256697 312288 336113 326179
40341 326179 188268 -7150 60061 537177 1003345 845811 68310 -625959 -689854 -314003
40331 -314003 64005 426618 928669 1291806 1049466 332618 -169214 -121957 88321 68861
$$ packed form
40401e34334L21234j07361l30201j00653J24733p7060m60827n39545k92003o1250
40391b057267j0161o9254j96996k79760j934O92958J198005Q80110L8566l88207
40381a93940q2832L27033L10037J13470J29440K08289L7010k71397m29838m52430
40371c05158m30686j70438M43422R69552Q43751J79108l56721m16884k78490k74819
40361B02637l64811l60143k27021l6006J27873J19154j51723m68457m30586L8486
40351a550597N15872N73213K82813N1294P2060J67837J44205N5591K3825r934
40341C26179j37911j95418O7211M77116M66168j57534p77501o94269o3895L75851
40331c14003L78008L62613N02051L63137k42340p16848n01832M7257K10278j9460
$$ plain form
40321 68861 13148 297593 870999 1395037 1735122 1971339 2089525 1979170 1664525 1306968
40311 1306968 1023659 842319 751577 694006 613872 556095 550669 407835 -58601 -550850
40301 -550850 -457493 297291 1013842 1140550 1005768 1189315 1561342 1548206 1109068 776274
40291 776274 789614 823291 622007 337672 120779 -108550 -333722 -359441 -231329 -301484
40281 -301484 -680514 -1024723 -1063741 -952666 -908858 -901748 -909415 -1047387 -1186318 -900973 -134464
40270 -134464 535020 687110 663131 884350 1029367 575196 -177794 -454020 -254134 -375340
40260 -375340 -1067545 -1528072 -1105634 -299403 -13457 -311581 -529121 -324868 17531 237077
40250 237077 430411 617327 444499 -382302 -1567991 -2376306 -2303815 -1545540 -810276 -650511
$$ packed form
40321F8861n5713K84445N73406N24038L40085K36217J18186j10355l14645l57557
40311A306968k83309j81340r0742n7571q0134n7777n426j42834m66436m92249
40301e50850R3357P54784P16551J26708j34782J83547L72027j3136m39138l32794
40291G76274J3340L3677k01284k84335k16893k29329k25172k5719J28112p0155
40281c01484l79030l44209l9018J11075M3808P110p667j37972j38931K85345P66509
40270a34464O69484J52090k3979K21219J45017m54171p52990k76226J99886j21206
40260c75340o92205m60527M22438Q06231K85946k98124k17540K04253L42399K19546
40250B37077J93334J86916j72828q26801j185689q08315P2491P58275P35264J59765
$$ plain form
40240 -650511 -905046 -853499 -39452 1114579 1701691 1350958 636836 366875 661804 953841
40230 953841 781553 293320 -83860 -209144 -268333 -389220 -459928 -337625 -54081 251895
40220 251895 484600 604716 589116 453807 252050 863 -306077 -559801 -529308 -111326
40210 -111326 481911 895145 940809 660192 187646 -288590 -518683 -374982 -59897 61013
40200 61013 -120853 -370520 -487921 -574549 -804294 -1100906 -1240162 -1201376 -1222146 -1483107
40190 -1483107 -1865960 -2067701 -1884940 -1367315 -762563 -340252 -199250 -183772 -18900 403376
40180 403376 871856 1049707 834706 453218 153868 -91835 -465505 -957864 -1346380 -1513457
40170 -1513457 -1552817 -1483939 -1129369 -482811 25543 -42812 -537980 -893644 -878327 -808427
$$ packed form
40240f50511k54535N1547Q14047J154031N87112l50733p14122k69961K94929K92037
40230I53841j72288m88233l77180j25284n9189j20887p0708J22303K83544L05976
40220B51895K32705J20116j5600j35309k01757k51187l06940k53724L0493M17982
40210a11326N93237M13234M5664k80617m72546m76236k30093J43701L15085J20910
40200F1013j81866k49667j17401q6628k29745k96612j39256L8786k0770k60961
40190a483107l82853k01741J82761N17625O04752M22311J41002J5478J64872M22276
40180D03376M68480J77851k15001l81488k99350k45703l73670m92359l88516j67077
40170a513457l9360O8878L54570O46558N08354o8355m95168l55664J5317O9900
$$ plain form
40160 -808427 -923716 -924496 -388229 584475 1436431 1763922 1605510 1177102 590299 -98478
40150 -98478 -745756 -1166779 -1291475 -1221000 -1137991 -1170656 -1328753 -1550533 -1770216 -1902806
40140 -1902806 -1820945 -1469213 -1014181 -756514 -830223 -1067612 -1201744 -1110845 -831193 -467723
40130 -467723 -185347 -166667 -434248 -762043 -868954 -669642 -274063 185809 642534 1074139
40120 1074139 1480956 1815169 1884474 1474267 694619 50483 -56868 180334 218896 -150207
40110 -150207 -633443 -963943 -1271052 -1754097 -2242665 -2356250 -1993591 -1402372 -794964 -161976
40100 -161976 467088 826541 678111 165872 -292408 -449554 -399306 -309217 -192218 -26653
40090 -26653 97256 130328 228196 531509 845862 799432 338003 -181928 -459542 -561301
$$ packed form
40160h08427j15289p80N36267R72704Q51956L27491j58412m28408n86803o88777
40150i8478o47278m21023j24696P0475Q3009l2665j58097k21780k19683j32590
40140a902806Q1861L51732M55032K57667p3709k37389j34132R0899K79652L63470
40130d67723K82376J8680k67581l27795j06911J99312L95579M59872M56725M31605
40120A074139M06817L34213O9305m10207p79648o44136j07351K37202L8562l69103
40110a50207m83236l30500l07109m83045m88568j13585L62659N91219O07408O32988
40100a61976O29064L59453j48430n12239m58280j57146N0248R0089J16999J65565
40090b6653J23909L3072R7868L03313L14353m6430m61429n19931k77614j01759
$$ plain form
40080 -561301 -634194 -545585 -54655 763687 1495834 1774365 1549390 1034422 540240 321710
40070 321710 416363 617102 708700 700981 709197 670568 392815 -91158 -437944 -396091 -159354
40059 -159354 -149047 -494823 -906866 -1092427 -1123791 -1249152 -1451817 -1453069 -1184833 -970052
40049 -970052 -1033385 -1065570 -598617 321462 1225773 1913070 2546006 2986441 2642302 1351493
40039 1351493 -43097 -539778 -160384 230896 141378 -74021 55884 454460 733711
40030 733711 705678 454821 159063 -1841 47085 153243 71000 -254735 -695350 -1150455
40020 -1150455 -1490702 -1402874 -721943 86685 284227 -166658 -487814 -173978 338837 483522
40010 483522 527646 1089648 1969582 2215471 1411394 282037 -223188 -9866 301066 291804
$$ packed form
40080e61301p2893Q8609M90930Q18342P32147K78531k24975n14968m94182k18530
40070C21710R4653K00739R1598p719Q216l8629k77753m83973l46786M1853K36737
40059a59354J0307l45776m12043j85561l1364j25361k02665j252K68236K14781
40049i70052o3333l2185M66953R20079R04311O87297O32936M40435l44139j290809
40039A351493j394590m96681L79394L91280q9518k15399J29905L98576K79251
40030G33711k8033k50857k95758j60904M8926J06158q2243l25735m40615m55105
40020a150455l40247Q7828O80931Q08628J97542m50885l21156L13836N12815J44685
40010D83522M4124N62002Q79934K45889q04077j129357n05225K13322L10932r262
$$ plain form
40000 291804 150599 239973 581982 876978 896864 724458 590316 558423 478236 248424
39990 248424 -6787 -120973 -156074 -343401 -759073 -1181691 -1334752 -1226121 -1177602 -1471712
39980 -1471712 -1978867 -2227606 -1914746 -1250567 -666439 -289688 47572 339590 323359 -17673
39970 -17673 -235027 11554 413853 407399 -26795 -329628 -118329 372900 679416 636055
39960 636055 378017 49769 -262371 -408722 -212380 321496 926544 1270753 1226439 931380
39950 931380 608360 391065 342335 507593 787932 838277 363807 -413103 -837963 -543829
39940 -543829 106747 494590 487063 460836 702998 1080554 1285624 1164049 786305 385756
39930 385756 217597 286279 243364 -211847 -847379 -1092975 -756023 -240123 55603 230597
$$ packed form
40000B91804j41205Q9374L42009K94996J9886j72406j34142l1893q0187k29812
39990B48424k55211j14186l5101j87327m15672m22618j53061J08631M8519k94110
39980a471712n07155k48739L12860O64179N84128L76751L37260K92018j6231l41032
39970a7673k17354K46581M02299o454m34194l02833K11299M91229L06516m3361
39960F36055k58038l28248l12140j46351J96342N33876O05048L44209m4314k95059
39950I31380l23020k17295m8730J65258K80339N0345m74470p76910m24860K94134
39940e43829O50576L87843p527k6227K42162L77556K05070j21575l77744m00549
39930C85756j68159O8682m2915m55211o35532k45596L36952N15900K95726J74994
$$ plain form
39920 230597 550793 897802 910516 575702 309713 387200 566204 436509 -23780 -422135
39910 -422135 -424843 -100392 222553 320942 235597 128863 80113 40149 -64352 -226333 -357785
39899 -357785 -372991 -260612 -80421 80725 125351 -41559 -433945 -919922 -1337875 -1699283
39889 -1699283 -2130060 -2530928 -2487084 -1734108 -612144 199751 376907 147960 -145672
39880 -145672 -361295 -392357 -86448 458632 799220 619931 144158 -145799 -51251 271661
39870 271661 603494 785142 707085 449518 327146 532342 832730 895815 807679 931143
39860 931143 1296400 1519511 1397068 1225773 1351654 1652728 1688134 1234992 508101 -86335
39850 -86335 -299486 -187305 8707 135723 284384 617328 1063042 1284892 995014 251666
$$ packed form
39920B30597L20196L47009J2714l34814k65989P7487J79004j29695m60289l98355
39910d22135k708L24451L22945R8389q5345j06734m8750l9964j04501j61981j31452
39899c57785j5206J12379J80191J61146M4626j66910l92386m85977m17953l61408
39889a699283m30777m00868M3844P52976J121964Q11895J77156k28947k93632
39880a45672k15623l1062L05909N45080L40588j79289m75773k89957R4548L22912
39870B71661L31833J81648p8057k57567j22372K05196L00388O3085q8136J23464
39860I31143L65257K23111j22443j71295J25881L01074L5406m53142p26891n94436
39850h6335k13151J12181J96012J27016J48661L32944M45714K21850k89878p43348
$$ plain form
39840 251666 -569969 -1079626 -1169415 -1044969 -946787 -873912 -684138 -425126 -342945 -504759
39830 -504759 -663866 -635409 -557950 -598713 -668436 -686400 -846921 -1249805 -1498804 -1150778
39820 -1150778 -451923 -101448 -262647 -318707 246133 1161161 1782812 1857781 1638468 1485668
39810 1485668 1576760 1836080 1985708 1799855 1408468 1193675 1319280 1554833 1637506 1590822
39800 1590822 1575359 1619755 1632058 1539922 1324594 1027245 764517 627114 572753 540599
39790 540599 586430 721178 757109 602746 563374 946555 1471710 1571522 1258515 1119996
39780 1119996 1365025 1487644 1095238 480236 47061 -273234 -623219 -742575 -405662
39771 -405662 59011 226858 249287 532364 998873 1223794 1121631 962006 849569 724936
$$ packed form
39840B51666q21635n09657q9789J24446R8182P2875J89774K59012Q2181j61814
39830e04759j59107K8457P7459m0763o9723j7964j60521m02884k48999L48026
39820a150778O98855L50475j61199n6060N64840R15028O21651P4969k19313j52800
39810A485668R1092K59320J49628j85853l91387k14793J25605K35553Q2673m6684
39800A590822j5463M4396J2303r2136k15328k97349k62728j37403n4361l2154
39790E40599M5831J34748L5931j54363l9372L83181N25155R9812l13007j38519
39780A119996K45029J22619l92406o15002m33175l20295l49985j19356L36913
39771d05662M64673J67847K2429K83077M66509K24921j02163j59625j12437j24633
$$ plain form
39761 724936 754838 1141865 1602402 1626628 1279033 1151756 1433039 1631122 1440110 1294301
39751 1294301 1664439 2230401 2253773 1581959 835943 626645 915114 1198785 1095908 645569
39741 645569 172893 -6100 219174 714123 1176337 1331378 1193999 1119805 1426086 1934109
39731 1934109 2103072 1722185 1246021 1252545 1745482 2228609 2349167 2216368 2143813 2305752
39721 2305752 2628723 2845273 2679946 2131300 1541644 1289302 1487322 2041194 2796087
39712 2796087 3467869 3664816 3260648 2610228 2141472 1874791 1608835 1404669 1524051
39703 1524051 1976835 2489257 2889187 3203528 3415131 3462622 3473316 3658486 3940737 3978521
39693 3978521 3602454 2987526 2405685 2053872 2060521 2352675 2571167 2452403 2231679 2295752
$$ packed form
39761G24936K9902L87027M60537K4226l47595j27277K81283J98083j91012j45809
39751A294301L70138N65962K3372o71814p46016k09298K88469K83671j02877m50339
39741F45569m72676j78993K25274M94949M62214J55041j37379p4194L06281N08023
39731A934109J68963l80887m76164O524M92937M83127J20558j32799p2555J61939
39721B305752L22971K16550j65327n48646n89656k52342J98020N53872P54893
39712B796087O71782J96947m04168o50420m68756k66681k65956k04166J19382
39703A524051M52784N12422L99930L14341K11603M7491J0694J85170K82251L7784
39693C978521l76067o14928n81841l51813O649K92154K18492j18764k20724O4073
$$ plain form
39683 2295752 2532747 2524239 2339029 2497375 3008378 3117859 2378351 1409599 1100687 1473446
39673 1473446 1886642 2050834 2200283 2402423 2382565 2133631 2112490 2551891 2998274 2902747
39663 2902747 2416336 2183735 2432366 2686869 2489507 2050653 1920110 2224197 2570838
39654 2570838 2644100 2534059 2426239 2313284 2170429 2109315 2129067 1970118 1487200 962284
39644 962284 756237 818359 835230 704347 544645 393538 247181 268506 569533 885118
39634 885118 858781 567458 347569 195750 -161169 -641882 -828372 -689086 -716252 -1138302
39624 -1138302 -1493277 -1265210 -557072 132518 467985 381634 -41647 -525612 -730105 -647962
39614 -647962 -623302 -809374 -927537 -767775 -581530 -684224 -933963 -915808 -496520 5116
$$ packed form
39683B295752K36995q508j85210J58346N11003J09481p39508r68752l08912L72759
39673A473446M13196J64192J49449K02140j9858k48934k1141M39401M46383r5527
39663B902747m86411k32601K48631K54503j97362m38854j30543L04087L46641
39654B570838P3262j10041j07820j12955j42855o1114J9752j58949m82918n24916
39644I62284k06047O2122J6871j30883j59702j51107j46357K1325L01027L15585
39634H85118k6337k91323k19889j51819l56919m80713j86490J39286k7166m22050
39624a138302l54975K28067P08138O89590L35467q6351m23281m83965k04493Q2143
39614f47962K4660j86072j18163J59762J86245j02694k49739J8155M19288N01636
$$ plain form
39604 5116 76656 -605396 -1793985 -2659770 -2567914 -1951317 -1915117 -2796179 -3680479 -3664692
39594 -3664692 -3012244 -2570719 -2553058 -2530325 -2285768 -1995191 -1732702 -1422828 -1219539 -1393370
39584 -1393370 -1846104 -2163066 -2118133 -1781749 -1258210 -702751 -432579 -572848 -749637 -616052
39574 -616052 -501758 -950871 -1747128 -2103755 -1833034 -1584711 -1757223 -1905165 -1567528 -1042437
39564 -1042437 -860097 -969615 -973429 -815952 -699481 -564615 -220139 126750 30710 -468516
39554 -468516 -772815 -515586 -20753 241479 322906 610575 1183312 1724962 2025184 2206101
39544 2206101 2373138 2366450 2069538 1735938 1723862 2017920 2297570 2426141 2577184 2874587
39534 2874587 3207301 3453918 3599346 3552035 3167938 2605400 2339369 2588808 2978716 3024556
$$ packed form
39604E116P1540o82052j188589q65785R1856O16597L6200q81062q84300J5787
39594c664692O52448M41525J7661K2733K44557K90577K62489L09874K03289j73831
39584a393370m52734l16962M4933L36384N23539N55459K70172j40269j76789J33585
39574f16052J14294m49113p96257l56627K70721K48323j72512j47942L37637N25091
39564a042437J82340j09518l814J57477J16471J34866L44476L46889r6040m99226
39554d68516l04299K57229M94833K62232Q1427K87669N72737N41650L00222J80917
39544B206101J67037o688k96912l33600j2076K94058K79650J28571J51043K97403
39534B874587L32714K46617J45428m7311l84097n62538k66031K49439L89908M5840
$$ plain form
39524 3024556 2749013 2558562 2678834 2976091 3205018 3191827 2900212 2547749 2521540 2934056
39514 2934056 3383873 3391905 2945231 2375420 1866904 1388056 974028 730100 611853 515436
39504 515436 538439 831160 1203552 1204346 649733 -169318 -847817 -1226730 -1378607 -1452410
39494 -1452410 -1587066 -1827284 -2088459 -2288805 -2469000 -2686673 -2885340 -2976498 -2933813 -2719411
39484 -2719411 -2325470 -2020334 -2253242 -3042720 -3723023 -3644007 -2924180 -2176591 -1726104 -1511076
39474 -1511076 -1526935 -1826447 -2179337 -2264208 -2170936 -2213575 -2278282 -1920195 -1152991 -545151
39464 -545151 -364803 -196986 303259 762301 580470 -233881 -1074514 -1393847 -1099845 -483190
39454 -483190 15537 100673 -124211 -272794 -113711 250361 658904 1101699 1564150 1918306
$$ packed form
39524C024556k75543j90451J20272K97257K28927j3191k91615l52463k6209M12516
39514B934056M49817Q032m46674n69811n08516m78848m14028k43928j18247r6417
39504E15436K3003K92721L72392P94n54613q19051o78499l78913j51877p3803
39494a452410j34656k40218k61175k00346j80195k17673j98667r1158M2685K14402
39484b719411L93941L05136k32908p89478o80303P9016P19827P47589M50487K15028
39474a511076j5859k99512l52890q4871R3272m2639o4707L58087P67204O07840
39464e45151J80348J67817N00245M59042j81831q14351q40633l19333K94002O16655
39454d83190M98727Q5136k24884j48583J59083L64072M08543M42795M62451L54156
$$ plain form
39444 1918306 2114484 2283400 2508789 2667957 2625980 2447639 2313377 2336096 2506230 2689262
39434 2689262 2669478 2357020 1947844 1704138 1616350 1512669 1456408 1719894 2326769 2927348
39424 2927348 3218486 3220084 3041378 2638888 1950584 1082901 249725 -346666 -561826 -434699
39414 -434699 -290957 -500148 -1062879 -1599611 -1771240 -1568572 -1231155 -1064165 -1270985 -1749712
39404 -1749712 -2107515 -2064569 -1741507 -1383097 -1043003 -821417 -1083366 -1949193 -2808448 -2932994
39394 -2932994 -2438451 -2020742 -1842706 -1401179 -527818 221942 364703 49417 -348340
39385 -348340 -583596 -346486 594416 1788345 2312106 1930640 1448887 1565927 2007377
39376 2007377 2214284 2259258 2507657 2858393 2931201 2687548 2351218 1983711 1576195 1286861
$$ packed form
39444A918306J96178J68916K25389J59168m1977j78341j34262K2719J70134J83032
39434B689262j9784l12458m09176k43706q7788j03681n6261K63486O06875O00579
39424B927348K91138J598j78706m02490o88304q67683q33176n96391k15160J27127
39414d34699J43742k09191n62731n36732j71629K02668L37417J66990k06820m78727
39404a749712l57803M2946L23062L58410L40094K21586k61949q65827q59255j24546
39394b932994M94543M17709J78036M41527Q73361P49760J42761l15286l97757
39385c48340k35256K37110R40902J193929N23761l81466m81753J17040M41450
39376B007377K06907M4974K48399L50736P2808k43653l36330l67507m07516k89334
$$ plain form
39366 1286861 1176288 969224 454067 -134969 -457082 -511521 -474989 -433223 -544682 -1070241
39356 -1070241 -1923696 -2592790 -2811592 -2869638 -2963418 -2806439 -2289762 -1927558 -2102981 -2419788
39346 -2419788 -2407746 -2345754 -2696159 -3194883 -3264956 -2948166 -2645256 -2265298 -1452031 -394041
39336 -394041 418158 1033074 1800830 2483570 2521307 2123611 2157367 2848897 3458116 3431715
39326 3431715 3101557 2984717 3074666 3113577 2986531 2581407 1785875 879178 452492 700582
39316 700582 1194005 1488736 1493746 1115132 127881 -1292692 -2398058 -2609653 -2140988 -1626419
39306 -1626419 -1446637 -1657808 -2230434 -2999114 -3577615 -3649337 -3279452 -2777155 -2355736 -2052580
39296 -2052580 -1847111 -1690591 -1462021 -1002155 -228038 752320 1644771 2208085 2533752
$$ packed form
39366A286861j10573k07064n15157n89036l22113n4439L6532M1766j11459n25559
39356a070241q53455o69094k18802n8046r3780J56979N16677L62204j75423l16807
39346b419788J2042O1992l50405m98724p0073L16790L02910L79958Q13267J057990
39336c94041Q12199O14916P67756O82740L7737l97696L3756O91530O09219k6401
39326C431715l30158j16840Q9949L8911j27046m05124p95532r06697m26686K48090
39316G00582M93423K94731N010l78614r87251j420573j105366k11595M68665N14569
39306a626419J79782k11171n72626p68680n78501p1722L69885N02297M21419L03156
39296b052580K05469J56520K28570M59866P74117R80358Q92451N63314L25667
$$ plain form
39287 2533752 2931081 3476614 3896567 3977828 3801857 3440402 2788934 1923033 1217997 811246
39277 811246 361867 -292227 -706948 -553370 -309786 -609688 -1275562 -1695045 -1843919 -2169018
39267 -2169018 -2680974 -2971113 -2995228 -3028675 -2924410 -2266811 -1280181 -737995 -852214 -1034135
39257 -1034135 -887142 -644773 -444517 10982 756684 1270291 1264162 1160433 1403237 1838491
39247 1838491 2125158 2256988 2333869 2275905 2086711 1984730 2003478 1873229 1513230 1170501
39237 1170501 845047 114196 -1138241 -2308494 -2797881 -2777145 -2823848 -3077801 -3143490 -2681133
39227 -2681133 -1805143 -936949 -361802 100096 865278 1893286 2521202 2355338 1977318
39218 1977318 2158025 2657111 2605641 1933858 1483836 1652847 1880267 1699748 1380838 1176694
$$ packed form
39287B533752L97329N45533M19953Q1261j75971l61455o51468q65901p05036m06751
39277H11246m49379o54094m14721J53578K43584k99902o65874m19483j48874l25099
39267b169018n11956k90139k4115l3447J04265O57599R86630N42186j14219j81921
39257a034135J46993K42369K00256M55499P45702N13607o129j03729K42804M35254
39247A838491K86667J31830P6881n7964j89194j01981J8748j30249l59999l42729
39237A170501l25454p30851j252437j170253m89387K0736m6703k53953o5689M62357
39227b681133Q75990Q68194N75147M61898P65182J028008O27916j65864l78020
39218A977318J80707M99086n1470o71783m50022J69011K27420j80519l18910k04144
$$ plain form
39208 1176694 785905 12915 -763846 -1223653 -1530951 -1731708 -1448235 -666591 -132404
39199 -132404 -369070 -867009 -824026 -192111 561001 1253631 1972941 2637532 3117660 3506553
39189 3506553 3857040 3949891 3662652 3226523 2823822 2317429 1639015 994944 426467 -330306
39179 -330306 -1265120 -1908248 -2018424 -1902572 -1767356 -1377967 -692591 -159155 37465 366175
39169 366175 1136327 1943616 2402370 2765583 3284347 3601248 3371297 2897117 2568860 2248919
39159 2248919 1777691 1476590 1519438 1383349 588856 -520377 -1342283 -1830737 -2154195
39150 -2154195 -2115819 -1565652 -858551 -263299 555251 1851750 3177516 4082889 4832860
39141 4832860 5733442 6370445 6281645 5792697 5379469 4767211 3527357 2077908 1213817
$$ packed form
39208A176694l90789p72990p76761m59807l07298k00757K83473P81644N34187
39199a32404k36666m97939M2983O31915P53112O92630P19310O64591M80128L88893
39189C506553L50487R2851k87239m36129m02701n06393o78414o44071n68477p56773
39179c30306r34814o43128j10176J15852J35216L89389O85376N33436J96620L28710
39169C66175P70152Q07289M58754L63213N18764L16901k29951m74180l28257l19941
39159B248919m71228l01101M2848j36089p94493j109233q21906m88454l23458
39150b154195L8376N50167P07101N95252Q18550J296499J325766R05373P49971
39141D832860R00582O37003q8800m88948m13228o12258j239854j449449q64091
$$ plain form
39132 1213817 1035825 1136646 1444529 2106328 2922680 3647113 4497746 5739860 7167606
39123 7167606 8519656 9815866 10733382 10430522 8735701 6755002 5489096 4605524 3416400
39114 3416400 2212655 1615831 1412139 1150673 1196070 2053711 3287521 4203249 4956068
39105 4956068 5899717 6550736 6344734 5707266 5216917 4485014 3098247 1837077 1585486
39096 1585486 1828477 1679965 1614643 2620493 4343817 5678971 6543409 7454645 8009677
39087 8009677 7486332 6392586 5764641 5478444 4837529 4170265 4226475 4737343 5217197
39078 5217197 6298613 8516789 10787072 11981196 12873664 14475307 15754201 15361269
39070 15361269 14260075 14069471 14258582 13840133 14218756 17005370 20545611 22308333 23197229
$$ packed form
39132A213817j77992J00821L07883O61799Q16352P24433Q50633J242114J427746
39123G167606J352050J296210R17516l02860j694821j980699j265906q83572j189124
39114C416400j203745n96824k03692k61466M5397Q57641J233810R15728P52819
39105D956068R43649O51019k06002o37468m90349p31903j386767j261170k51591
39096A585486K42991j48512o5322J005850J723324J335154Q64438R11236N55032
39087H009677n23345j093746o27945k86197o40915o67264N6210N10868M79854
39078E217197J081416K218176K270283J194124Q92468J601643J278894l92932
39070A5361269j101194j90604J89111m18449L78623K786614L540241J762722Q88896
$$ plain form
39061 23197229 25497172 28278253 29534307 31234867 36895908 45584289 54163073 63804287
39053 63804287 77381379 92179898 103774422 115996298 137138954 167663021 205126138
39046 205126138 260815963 350044575 454970461 516825684 487786676 384393066 270963297
39039 270963297 193870412 150336772 118350580 91577567 75108035 66277663 56696595
39032 56696595 45502655 37680272 33255616 27978167 21801973 18241517 17104197 14966372
39024 14966372 11629588 9950683 10091840 9338000 7111464 5454701 4893396 4005266 2822669
39015 2822669 2851535 3827458 3841078 2633103 1778099 1718675 1375593 574515 305677 667567
39005 667567 816948 746203 1028872 1207741 518835 -286470 16884 785294 415792 -858155
$$ packed form
39061B3197229K299943K781081J256054J700560N661041Q688381Q578784R641214
39053F3804287J3577092J4798519J1594524J2221876K1142656L0524067L7463117
39046B05126138N5689825Q9228612J04925886O1855223k9039008j03393610j13429769
39039B70963297p7092885m3533640l1986192k6773013j6469532q830372r581068
39032E6696595j1193940p822383m424656n277449o176194l560456j137320k137825
39024A4966372l336784j678905J41157p53840k226536j656763n61305q88130j182597
39015B822669K8866R75923J3620j207975q55004n9424l43082q01078k68838L61890
39005F67567J49381p0745K82669J78869o88906q05305L03354P68410l69502j273947
$$ plain form
38995 -858155 -1341421 -716752 -252046 -364214 -197158 402690 597874 322747 391627 764227
38985 764227 552978 -157818 -301406 260222 560434 375753 520419 1129454 1348061 987019
38975 987019 878223 1288292 1499225 1266616 1233334 1583549 1691589 1422209 1424430 1838561
38965 1838561 2064487 2123842 2870586 4420187 5651875 5749775 5103528 4297132 3363051
38956 3363051 2439847 2004809 1960992 1530072 499737 -405066 -765204 -1040366 -1484240
38947 -1484240 -1539678 -851492 29103 467315 473189 218190 -320912 -838418 -696384 97464
38937 97464 698850 609621 251172 10898 -368459 -980133 -1249386 -854950 -384186 -433902
38927 -433902 -719113 -693358 -461346 -447200 -637216 -738598 -720536 -715452 -696287 -616410 -571404
$$ packed form
38995h58155m83266O24669M64706j12168J67056N99848J95184k75127O8880L72600
38985G64227k11249p10796j43588N61628L00212j84681J44666O09035K18607l61042
38975I87019j08796M10069K10933k32609l3282L50215J08040k69380K221M14131
38965A838561K25926N9355P46744J549601J231688R7900o46247q06396r34081
38956C363051r23204m35038m3817m30920j030335r04803l60138k75162m43874
38947a484240n5438O88186Q80595M38212N874k54999n39102n17506J42034P93848
38937I7464O01386q9229l58449k40274l79357o11674k69253L94436M70764m9716
38927d33902k85211K5755K32012J4146j90016j01382J8062N084J9165P9877M5006
$$ plain form
38916 -571404 -585334 -574212 -637054 -929944 -1181444 -917297 -275068 57384 -145082 -403222
38906 -403222 -468300 -695938 -1214569 -1542545 -1411021 -1193175 -1120951 -878906 -427836 -375440
38896 -375440 -926844 -1276446 -771905 22947 221255 -47317 -50031 294132 483444 415366
38886 415366 397467 364439 -69264 -813469 -1273529 -1155276 -754284 -454582 -416570 -703598
38876 -703598 -1241236 -1685780 -1750511 -1598847 -1534324 -1445667 -1025169 -429891 -199645 -506633
38866 -506633 -951761 -1153852 -1109075 -887056 -408212 270509 756268 659016 15047 -741795
38856 -741795 -1129432 -904004 -176196 636053 1072453 990955 677775 539805 663708 713924
38846 713924 317755 -461707 -1123015 -1224500 -800274 -263297 -30116 -261648 -749780 -975475
$$ packed form
38916e71404j3930J1122o2842k92890k51500K64147O42229L32452k02466k58140
38906d03222o5078k27638n18631l27976J31524K17846P2224K42045M51070N2396
38896c75440n51404l49602N04541P94852J98308k68572k714L44163J89312o8078
38886D15366j7899l3028m33703p44205m60060J18253M00992K99702L8012k87028
38876g03598n37638m44544o4731J51664O4523Q8657M20498N95278K30246l06988
38866e06633m45128k02091M4777K22019M78844O78721M85759r7252o43969p56842
38856g41795l87637K25428P27808Q12249M36400q1498l13180j37970J23903N0216
38846G13924l96169p79462o61308j01485M24226N36977K33181k31532m88132k25695
$$ plain form
38836 -975475 -568199 127136 281113 -361063 -1037765 -989862 -526044 -484417 -937459 -1175521
38826 -1175521 -855911 -391421 -164731 -102657 -155263 -473917 -899082 -943195 -548045 -246748
38816 -246748 -325533 -467829 -503945 -786039 -1389181 -1645810 -1071491 -184868 252393 351673
38806 351673 740386 1426577 1792006 1594975 1276141 1214220 1232504 992153 498988 56928
38796 56928 -89362 9516 43272 -234755 -652585 -736890 -283701 384882 865207 1143751
38786 1143751 1434435 1752869 1899200 1766907 1486094 1291222 1293958 1317915 1015113 307200
38776 307200 -389015 -615114 -420950 -157744 82325 364970 436248 -33105 -781489 -1192292
38766 -1192292 -1206893 -1318264 -1627419 -1688547 -1399070 -1179675 -1059206 -520269 383542 731515
$$ packed form
38836i75475M07276O95335J53977o42176o76702M7903M63818M1627m53042k38062
38826a175521L19610M64490K26690O2074n2606l18654m25165m4113L95150L01297
38816b46748p8785j42296l6116k82094o03142k56629N74319Q86623M37261R9280
38806C51673L88713O86191L65429j97031l18834o1921J8284k40351m93165m42060
38796E6928j46290R8878L3756k78027m17830q4305M53189O68583M80325K78544
38786A143751K90684L18434J46331j32293k80813j94872K736K3957l02802p07913
38776C07200o96215k26099J94164K63206K40069K82645P1278m69353p48384m10803
38766a192292j4601j11371l09155o1128K89477K19395J20469N38937R03811L47973
$$ plain form
38756 731515 111075 -606662 -538752 -28805 130434 -38091 -51084 48204 -66010 -292362
38746 -292362 -472696 -963990 -1979176 -2838799 -2789541 -2150869 -1737077 -1555629 -1062594 -341878
38736 -341878 43690 131713 410122 740765 516605 -153070 -469937 -209543 18958 -147971
38726 -147971 -421146 -614573 -884969 -1105751 -917203 -537674 -609397 -1076114 -1160671 -685592
38716 -685592 -444616 -912447 -1499097 -1520925 -1090681 -588011 -26577 537511 663330 148700
38706 148700 -540719 -911477 -1003834 -984632 -798428 -593711 -812709 -1374013 -1423946 -491296
38696 -491296 663322 966213 344296 -458817 -944387 -1116367 -1033555 -752412 -525831 -538848
38686 -538848 -591137 -417531 -104852 132761 281210 286867 -118439 -911776 -1478859 -1349105
$$ packed form
38756G31515o20440p17737O7910N09947J59239j68525j2993R9288j14214k26352
38746b92362j80334m91294j015186q59623M9258O38672M13792J81448M93035P20716
38736c41878L85568Q8023K78409L30643k24160o69675l16867K60394K28501j66929
38726a47971k73175j93427k70396k20782J88548L79529p1723m66717q4557M75079
38716f85592K40976m67831n86650k1828M30244N02670N61434N64088J25819n14630
38706A48700o89419l70758r2357J9202J86204K04717k18998n61304m9933R32650
38696d91296J154618L02891o21917q03113m85570j71980Q2812K81143K26581j3017
38686e38848n2289J73606L12679K37613J48449N657m05306p93337n67083J29754
$$ plain form
38676 -1349105 -923256 -901774 -1229655 -1224216 -640351 -17027 70587 -348349 -815574 -937090
38666 -937090 -658383 -268319 -118718 -210104 -184114 151502 531774 652885 592174 554205
38656 554205 492111 296031 83798 -43739 -278395 -756826 -1172656 -1146939 -798354 -535994
38646 -535994 -446644 -301750 -41626 166053 268266 344125 341940 138896 -199818 -513398
38636 -513398 -782251 -979509 -860736 -273244 462525 867432 885988 782894 613905 253873
38626 253873 -158260 -312375 -242148 -251314 -311598 -57343 523186 919529 838505 655796
38616 655796 826564 1198236 1270347 927332 560701 529067 757725 883204 644739 120755
38606 120755 -343582 -449708 -231318 -17590 -102272 -475197 -878386 -1093706 -1166855 -1339922
$$ packed form
38676a349105M25849K1482l27881N439N83865O23324Q7614m18936m67225j21516
38666i37090K78707L90064J49601r1386K5990L35616L80272J21111o0711l7969
38656E54205o2094j96080k12233j27537k34656m78431m15830K5717L48585K62360
38646e35994Q9350J44894K60124K07679J02213P5859k185k03044l38714l13580
38636e13398k68853j97258J18773N87492P35769M04907J8556j03094j68989l60032
38626B53873m12133j54115P0227r166o0284K54255N80529L96343q1024j82709
38616F55796J70768L71672P2111l43015l66631l1634K28658J25479k38465n23984
38606A20755m64337j06126K18390K13728q4682l72925m03189k15320p3149j73067
$$ plain form
38596 -1339922 -1739417 -2172730 -2312175 -2026904 -1406611 -550500 419838 1194569 1484725
38587 1484725 1454776 1564283 1859110 1851840 1321300 766498 720675 1040669 1296336 1437225
38577 1437225 1532973 1256589 349837 -633088 -838419 -309760 85993 -56122 -266825 -209103
38567 -209103 -238723 -586768 -756549 -324495 224010 139446 -455245 -737071 -319372 384325
38557 384325 866504 1040806 1005869 781136 443310 193999 122324 116700 110849 193894 367702
38546 367702 421851 220123 -57740 -158043 -120711 -174452 -307839 -207964 289395 899345
38536 899345 1197593 1086129 759372 335362 -192035 -672341 -823574 -644189 -478988 -487014
38526 -487014 -355070 161003 674063 575683 -92369 -616665 -500359 1514 331193 272593
$$ packed form
38596a339922l99495m33313j39445K85271O20293Q56111R70338P74731K90156
38587A484725k9949J09507K94827p270n30540n54802m5823L19994K55667J40889
38577A437225R5748k76384r06752r82925k05331N28659L95753j42115k10703N7722
38567b09103k9620l48045j69781M32054N48505q4564n94691k81826M17699P03697
38557C84325M82179J74302l4937k24733l37826k49311p1675n624n851Q3045J73808
38546C67702N4149k01728k77863j00303L7332n3741j33387R9875M97359O09950
38536H99345K98248j11464l26757m24010n27397m80306j51233J79385J65201q026
38526d87014J31944N16073N13060r8380o68052n24296J16306N01873L29679n8600
$$ plain form
38516 272593 -19661 -352525 -615791 -726459 -670771 -547364 -441257 -310491 -89412 156648
38506 156648 265232 132462 -203273 -584604 -822403 -828230 -696869 -620028 -703896 -879069
38496 -879069 -943241 -680414 -66021 561678 696622 212278 -412390 -643698 -569261 -735193
38486 -735193 -1352103 -2001291 -2197672 -1941135 -1573942 -1336938 -1237239 -1179159 -1062398 -869226
38476 -869226 -763902 -963499 -1386521 -1573393 -1133280 -216581 590776 837220 608017 374003
38466 374003 466800 715395 679037 282414 37893 414936 1120075 1366218 880805 266140
38456 266140 199599 610794 910039 769301 339362 -144643 -573401 -783275 -549661 54352
38446 54352 514060 342048 -336851 -852935 -708636 -123914 231160 -19553 -631450 -1141171
$$ packed form
38516B72593k92254l32864k63266j10668N5688J23407J06107J30766K21079K46060
38506A56648J08584j32770l35735l81331k37799n827J31361P6841q3868j75173
38496h79069o4172K62827O14393O27699J34944m84344o24668k31308P4437j65932
38486g35193o16910o49188j96381K56537L67193K37004R9699N8080J16761J93172
38476h69226J05324j99597m23022j86872M40113R16699Q07357K46444k29203k34014
38466C74003R2797K48595l6358l96623k44521L77043P05139K46143m85413o14665
38456B66140o6541M11195K99245j40738m29939m84005m28758k09874K33614O04013
38446E4352M59708j72012o78899n16084J44299N84722L55074k50713o11897n09721
$$ plain form
38436 -1141171 -1375338 -1439370 -1395120 -1193659 -864745 -545781 -319869 -189589 -173562 -230617
38426 -230617 -128644 342484 982586 1263470 913437 223310 -346507 -681433 -985152 -1377296
38416 -1377296 -1710107 -1767144 -1526110 -1182127 -922781 -728402 -493749 -330075 -502688 -934670
38406 -934670 -1074832 -594063 24614 76184 -309602 -307570 344564 876991 571745 -231112
38396 -231112 -648938 -378485 187381 683399 1081739 1404865 1609919 1738537 1806995 1591426
38386 1591426 911224 119192 -106875 424799 1140412 1375957 1083562 720572 647909 821987
38376 821987 965024 873877 582409 292536 137230 25640 -206255 -509742 -610527 -327218
38366 -327218 183782 569620 635122 505149 431925 481560 475850 265163 -39204 -214770
$$ packed form
38436a141171k34167o4032M4250K01461L28914L18964K25912J30280J6027n7055
38426b30617J01973M71128O40102K80884l50033o90127n69817l34926l03719l92144
38416a377296l32811n7037K41034L43983K59346J94379K34653J63674j72613m31982
38406i34670j40162M80769O18677N1570l85786K032O52134N32427l05246q02857
38396b31112m17826K70453N65866M96018L98340L23126K05054J28618O8458k15569
38386A591426o80202p92032k26067N31674P15613K35545k92395l62990p2663J74078
38376H21987J43037r1147k91468k89873j55306j11590k31895l03487j00785K83309
38366c27218N11000L85838O5502j29973p3224M9635n710k10687l04367j75566
$$ plain form
38356 -214770 -232814 -234679 -235194 -80896 256116 581208 766498 907061 1065389 1098831 916062
38345 916062 685301 584404 554903 527603 649109 963645 1079662 588267 -253205 -691640
38335 -691640 -388744 199992 449438 237562 -141336 -427296 -543916 -518676 -495754 -697627
38325 -697627 -1147758 -1502820 -1377625 -831304 -338390 -222052 -280927 -113276 292074 515995
38315 515995 307262 -8144 73369 544188 875551 687371 143173 -381600 -721278 -865819
38305 -865819 -781448 -527167 -329149 -280119 -158625 171406 381048 70944 -569350 -914889
38295 -914889 -717950 -375939 -314552 -469443 -540245 -456458 -357220 -294162 -194892 -52240 38540
38284 38540 42352 75657 277880 600094 777939 597578 176249 -149852 -224847 -167774 -28622
$$ packed form
38356b14770j8044j865n15J54298L37012L25092J85290J40563J58328L3442j82769
38345I16062k30761j00897k9501k7300J21506L14536J16017m91395q41472m38435
38335f91640L02896N88736K49446k11876l78898k85960j16620K5240K2922k01873
38325f97627m50131l55062J25195N46321M92914J16338n8875J67651M05350K23921
38315E15995k08733l15406Q1513M70819L31363j88180n44198n24773l39678j44541
38305h65819Q4371K54281J98018M9030J21494L30031K09642l10104o40294l45539
38295i14889J96939L42011O1387j54891p0802Q3787R9238O3058R9270J42652R0780
38284C8540L812L3305K02223L22214J77845j80361m21329l26101p4995N7073J39152
$$ plain form
38273 -28622 352635 968406 1434311 1462770 1294181 1287254 1307917 993212 461281 195711
38263 195711 261394 235934 5855 7927 428144 730587 400082 -251179 -487946 -123554
38253 -123554 348056 470350 299613 193019 400283 885099 1398310 1729736 1920775 2113528
38243 2113528 2193165 1843907 1059431 308565 16443 141992 451943 902084 1467023 1872819
38233 1872819 1865753 1582496 1334719 1183066 1035963 996222 1236492 1632911 1871760 1844882
38223 1844882 1638416 1270214 803589 571763 827087 1246688 1292939 1041760 1072548 1441037
38213 1441037 1401789 472461 -751516 -1301151 -1006807 -502436 -293340 -303555 -247810 7534
38203 7534 480996 1099607 1592415 1640821 1256334 816364 618199 544421 279700 -230534
$$ packed form
38273b8622L81257O15771M65905K8459j68589o927K0663l14705n31931k65570
38263A95711O5683k5460k30079K072M20217L02443l30505o51261k36767L64392
38253a23554M71610J22294j70737j06594K07264M84816N13211L31426J91039J92753
38243B113528P9637l49258p84476p50866k92122J25549L09951M50141N64939M05796
38233A872819p066k83257k47777j51653j47103l9741K40270L96419K38849k6878
38223A844882k06466l68202m66625k31826K55324M19601M6251k51179L0788L68489
38213A441037l9248r29328j223977n49635K94344N04371K09096j0215N5745K55344
38203G534M73462O18611M92808M8406l84487m39970j98165p3778k64721n10234
$$ plain form
38193 -230534 -639954 -520711 176755 980483 1297422 1021963 636218 594392 763079 702799
38183 702799 378913 216501 408358 574212 339734 -57995 -94160 286793 628178 635513
38173 635513 510719 537026 677756 770239 849851 1032055 1237405 1285029 1166346 999712
38163 999712 784316 436014 34953 -211448 -284356 -417012 -777252 -1261358 -1671603 -1937361
38153 -1937361 -2077551 -2084771 -1945677 -1684241 -1323097 -885499 -452170 -98754 219790 555656
38143 555656 744927 545664 67405 -211043 -7027 424352 698354 800590 920586 1004361
38133 1004361 816329 342153 -187266 -612281 -899822 -958571 -718152 -347798 -64963 239722
38123 239722 812526 1477980 1720739 1430006 1097370 1049896 927491 275277 -693763 -1358694
$$ packed form
38193b30534m09420J19243O97466Q03728L16939k75459l85745m1826J68687o0280
38183G02799l23886j62412J91857J65854k34478l97729l6165L80953L41385P335
38173F35513j24794K6307J40730R2483P9612J82204K05350M7624j18683j66634
38163I99712k15396l48302m01061k46401p2908j32656l60240m84106m10245k65758
38153a937361j40190p220J39094K61436L61144M37598M33329L53416L18544L35866
38143E55656J89271j99263m78259k78448K04016M31379K74002J02236J19996Q3775
38133A004361j88032m74176n29419m25015k87541n8749K40419L70354K82835L04685
38123B39722N72804O65454K42759k90733l32636m7474j22405o52214r69040o64931
$$ plain form
38113 -1358694 -1480643 -1292900 -971681 -511157 -74124 41340 -121178 -163519 51382 161627
38103 161627 -100563 -437342 -421272 -133006 16622 -62750 -95692 -13405 -124705 -567926
38093 -567926 -955762 -849896 -371738 -6733 108766 336764 907432 1483308 1592311 1280169
38083 1280169 1006543 977185 962624 853115 980873 1572668 2148013 1942465 927714 -39381
38073 -39381 -267110 -63228 -195287 -759847 -1049083 -544628 388782 1011452 1117055 1108477
38063 1108477 1282319 1404227 1102419 430275 -180415 -416639 -305280 27745 531091
38054 531091 1032913 1128681 572327 -290973 -798905 -727003 -486930 -476894 -562594 -441677
38044 -441677 -225685 -247182 -414891 -224732 520887 1381938 1807996 1695051 1264746 688343
$$ packed form
38113a358694j21949J87743L21219M60524M37033J15464j62518m2341K14901J10245
38103A61627k62190l36779J6070K88266J49628p9372l2942Q2287j11300m43221
38093e67926l87836J05866M78158L65005J15499K27998N70668N75876J09003l12142
38083A280169k73626k9358j4561j09509J27758N91795N75345k05548j014751r67095
38073c9381k27729K03882j32059n64560k89236N04455R33410O22670J05603q578
38063A108477J73842J21908l01808o72144o10690k36224J11359L33025N03346
38054E31091N01822R5768n56354q63300n07932P1902K40073J0036q5700J20917
38044d41677K15992k1497j67709J90159P45619Q61051M26058j12945m30305n76403
$$ plain form
38034 688343 64152 -459133 -810854 -1123211 -1503541 -1792168 -1754254 -1410736 -980692 -601828
38024 -601828 -313103 -195180 -273264 -349016 -180060 201311 547538 699848 615208 209559
38014 209559 -501799 -1150836 -1259539 -792638 -185505 210847 411187 489320 357372 -928
38004 -928 -376982 -589600 -654150 -579267 -276294 168633 413373 249382 -172894 -679530
37994 -679530 -1326260 -2066645 -2482547 -2225837 -1550258 -1043210 -941273 -1030186 -1106295 -1183710
37984 -1183710 -1294562 -1414863 -1586170 -1837877 -2010309 -1927165 -1722678 -1710038 -1914765 -2022510
37974 -2022510 -1840006 -1550616 -1423710 -1460300 -1405577 -994656 -193603 663421 1037445 698831
37964 698831 62897 -190447 176807 806042 1218419 1205242 809164 229259 -226007 -358636
$$ packed form
38034F88343o24191n23285l51721l12357l80330k88627L7914L43518M30044L78864
38024f01828K88725J17923p8084p5752J68956L81371L46227J52310q4640m05649
38014B09559p11358o49037j08703M66901O07133L96352K00340P8133j31948l58300
38004i28l76054k12618o4550P4883L02973M44927K44740j63991m22276n06636
37994f79530o46730p40385m15902K56710O75579N07048J01937q8913p6109p7415
37984a183710j10852j20301j71307k51707j72432Q3144K04487J2640k04727j07745
37974b022510J82504K89390J26906l6590N4723M10921Q01053Q57024L74024l38614
37964F98831o35934k53344L67254O29235M12377j3177l96078n79905m55266j32629
$$ plain form
37954 -358636 -305094 -338640 -473665 -515470 -453315 -476385 -600293 -630144 -533002 -482979 -472595
37943 -472595 -274548 89150 241730 4242 -305117 -332728 -120255 125882 341284 444935
37933 444935 245321 -187675 -391670 -100040 331543 449514 374794 542465 1000236 1405476
37923 1405476 1559589 1517269 1282083 807337 227804 -264754 -682027 -1050075 -1130845 -728846
37913 -728846 -106409 353775 727948 1272715 1732496 1580292 914472 421365 364630 313433
37903 313433 44197 -31115 332217 678904 595045 387123 475224 633869 477978 275786
37893 275786 531210 1011628 960902 209283 -617322 -1001819 -1011805 -824877 -437853 -31185
37883 -31185 -27219 -486758 -900426 -869010 -597586 -438251 -344991 -128078 108897 202100 324774
$$ packed form
37954c58636N3542l3546j35025m1805O2155k3070j23908k9851R7142N0023J0384
37943d72595J98047L63698J52580k37488l09359k7611K12473K46137K15402J03651
37933D44935j99614m32996k03995K91630M31583J17971p4720J67671M57771M05240
37923A405476J54113m2320k35186m74746n79533m92558m17273l68048q0770M01999
37913g28846O22437M60184L74173N44767M59781j52204o65820m93107n6735n1197
37903C13433k69236p5312L63332L46687q3859k07922Q8101J58645j55891k02192
37893B75786K55424M80418n0726p51619q26605l84497r986J86928L87024M06668
37883c1185L966m59539m13668L1416K71424J59335R3260K16913K36975R3203J22674
$$ plain form
37872 324774 701594 1103219 1075968 575878 -55694 -668551 -1361056 -1942449 -1897296 -1134764
37862 -1134764 -335300 -172420 -460470 -487812 -49302 309348 115058 -366554 -501089 -99116
37852 -99116 383736 398518 -118290 -731930 -994947 -918803 -933579 -1313497 -1704899 -1449691
37842 -1449691 -452937 532905 725970 233986 -166768 -62474 206655 210732 6690 -177719
37832 -177719 -412790 -814585 -1099983 -892875 -379395 -162929 -423131 -673712 -498921 -114223
37822 -114223 50789 -23008 -77639 -92616 -254188 -489676 -432925 53091 593403 703612
37812 703612 345609 -59733 -133901 57370 149818 -22467 -213783 -150813 976 -178162
37802 -178162 -708019 -1075031 -929316 -620264 -727176 -1241219 -1583793 -1376716 -836118 -375708
$$ packed form
37872C24774L76820M01625k7251n00090o31572o12857o92505n81393M5153P62532
37862a134764P99464J62880k88050k7342M38510L58650j94290m81612j34535M01973
37852i9116M82852J4782n16808o13640k63017P6144j4776l79918l91402K55208
37842a449691R96754R85842J93065m91984m00754J04294K69129M077k04042j84409
37832a77719k35071m01795k85398K07108N13480K16466k60202k50581J74791L84698
37822a14223J65012p3797n4631j4977j61572k35488N6751M86016N40312J10209
37812G03612l58003m05342p4168J91271R2448j72285j91316O2970J51789j79138
37802a78162n29857l67012J45715L09052j06912n14043l42574K07077N40598M60410
$$ plain form
37792 -375708 -146163 -70047 -76269 -162508 -380332 -825548 -1492875 -2128802 -2433958 -2432703 -2404670
37781 -2404670 -2417040 -2212857 -1657880 -1006275 -574857 -415765 -454453 -649733 -820667 -641954
37771 -641954 -104653 296855 169021 -241855 -472800 -529995 -681826 -810456 -593680 -239527
37761 -239527 -332807 -848629 -1023365 -494018 81391 -8756 -493290 -653026 -487542 -599479
37751 -599479 -1068767 -1224375 -672643 88825 380117 190938 -35805 -136270 -327989 -741861
37741 -741861 -1225634 -1581507 -1727728 -1637526 -1356450 -1100710 -1130286 -1458993 -1820173 -1948608
37731 -1948608 -1781441 -1398684 -952024 -687993 -821889 -1248177 -1532308 -1371788 -973140
37722 -973140 -781819 -897342 -988459 -814549 -588024 -662214 -1008325 -1225959 -1060586 -708184
$$ packed form
37792c75708K29545P6116o222q6239k17824m45216o67327o35927l05156J255K8033
37781b404670j2370K04183N54977O51605M31418J59092l8688j95280j70934J78713
37771f41954N37301M01508j27834m10876k30945n7195j51831j28630K16776L54153
37761b39527r3280n15822j74736N29347N75409r0147m84534j59736J65484j11937
37751e99479m69288j55608N51732P61468K91292j89179k26743j00465j91719m13872
37741g41861m83773l55873j46221R0202K81076K55740k9576l28707l61180j28435
37731a948608J67167L82757M46660K64031j33896m26288k84131J60520L98648
37722i73140J91321j15523r1117J73910K26525p4190l46111k17634J65373L52402
$$ plain form
37712 -708184 -505361 -445107 -185719 446633 1136886 1398810 1139010 735892 564210 629336
37702 629336 726168 740641 631654 303623 -237482 -689796 -704654 -326946 67184 273991
37692 273991 418806 580629 613249 484828 450367 626422 669836 215268 -536286 -1004771
37682 -1004771 -916202 -494090 -33960 392666 809273 1193053 1506518 1669490 1516157 996971
37672 996971 376292 -46781 -395442 -1068521 -2075929 -2834928 -2780480 -1972334 -983030 -358521
37662 -358521 -254217 -397736 -325392 168149 766883 998326 839144 677719 680098 580843
37652 580843 208242 -188576 -338076 -300484 -187061 89744 471028 540551 96651 -363170
37642 -363170 -236490 305517 574586 380940 195288 276348 251529 -207001 -771794 -860513
$$ packed form
37712g08184K02823O0254K59388O32352O90253K61924k59800m03118j71682O5126
37702F29336R6832J4473j08987l28031n41105m52314j4858L77708L94130K06807
37692B73991J44815J61823L2620j28421l4461J76055M3414m54568p51554m68485
37682a004771Q8569M22112M60130M26626M16607L83780L13465J62972j53333n19186
37672I96971o20679m23073l48661o73079j007408p58999N4448Q08146R89304O24509
37662c58521J04304j43519P2344M93541N98734K31443j59182j61425K379r9255
37652E80843l72601l96818j49500L7592J13423K76805L81284O9523m43900m59821
37642c63170J26680N42007K69069j93646j85652Q1060k4819m58530n64793q8719
$$ plain form
37632 -860513 -352630 387024 978868 1240690 1103224 643258 183497 108066 487486 973581
37622 973581 1110779 728493 37265 -618543 -1065175 -1332840 -1433851 -1257814 -771096 -188087
37612 -188087 218886 418635 581006 790817 954038 945340 703541 236649 -315055 -697082
37602 -697082 -801562 -827895 -986465 -1163867 -1159309 -1133854 -1427038 -1936334 -2113244 -1687192
37592 -1687192 -996852 -434296 49727 626818 1116124 1181710 820525 364161 130667 280144
37582 280144 798898 1359742 1426978 861326 263772 319813 890452 1182615 818917 292651
37572 292651 238342 637868 963233 817732 196028 -670965 -1457036 -1851533 -1790437 -1548216
37562 -1548216 -1420895 -1349645 -1023193 -336163 416335 822604 712875 226118 -342313 -702573
$$ packed form
37632h60513N07883P39654N91844K61822j37466m59966m59761p5431L79420M86095
37622I73581J37198l82286o91228o55808m46632k67665j01011J76037M86718N83009
37612a88087M06973J99749J62371K09811J63221q698k41799m66892n51704l82027
37602f97082j04480k6333j58570j77402M558K5455k93184n09296j76910M26052
37592a687192O90340N62556M84023N77091M89306O5586l61185m56364k33494J49477
37582B80144N18754N60844O7236n65652n97554N6041N70639K92163l63698n26266
37572B92651n4309L99526L25365j45501o21704q66993p86071l94497O1096K42221
37562a548216J27321P1250L26452O87030P52498M06269j09729m86757n68431l60260
$$ plain form
37552 -702573 -694989 -370790 52305 354856 446505 372026 262016 267076 425031 555441 418839
37541 418839 76062 -47420 364677 1060794 1460067 1330123 974244 706008 445370 10561
37531 10561 -461141 -678038 -618171 -464541 -195954 405234 1304210 2084396 2373232 2168684
37521 2168684 1661815 986328 280692 -227798 -397201 -299223 -41886 373275 858732 1082867
37511 1082867 758756 41348 -564706 -692778 -388273 54712 377294 486068 435462 325918
37501 325918 194302 35597 -66798 42625 375824 727363 911176 944661 900007 748610
37491 748610 513490 376571 369813 121587 -712757 -1798675 -2307498 -1879941 -1077999 -678657
37481 -678657 -783336 -899398 -723415 -487911 -518100 -729342 -714711 -220792 579487 1248794
$$ packed form
37552g02573P584L24199M23095L02551R1649p4479j10010N060J57955J30410j36602
37541D18839l42777j23482M12097O96117L99273j29944l55879k68236k60638m34809
37531A0561m71702k16897N9867J53630K68587O01188Q98976P80186K88836k04548
37521B168684n06869o75487p05636n08490j69403R7978K57337M15161M85457K24135
37511A082867l24111p17408o06054j28072L04505M42985L22582J08774n0606j09544
37501C25918j31616j58705j02395J09423L33199L51539J83813L3485m4654j51397
37491G48610k35120j36919o758k48226q34344j085918n08823M27557Q01942L99342
37481f78657j04679j16062J75983K35504l0189k11242J4631M93919Q00279O69307
$$ plain form
37471 1248794 1446483 1157502 653039 265148 154283 222678 228622 16507 -340335 -629371
37461 -629371 -708044 -572164 -251371 217045 652634 739659 356751 -177696 -411766 -319745
37451 -319745 -333797 -738754 -1258221 -1433454 -1267649 -1219987 -1558192 -1972446 -1958830 -1418626
37441 -1418626 -697465 -123960 260477 498485 485350 107812 -497496 -1008650 -1231665 -1232030
37431 -1232030 -1177305 -1176071 -1261843 -1394140 -1455068 -1373547 -1268010 -1311599 -1418753 -1254053 -667330
37420 -667330 23403 323853 54968 -538371 -1054269 -1208685 -993579 -721012 -783768 -1189755
37410 -1189755 -1459172 -1210238 -723300 -598163 -885019 -946073 -311484 663929 1246907 1199807
37400 1199807 908136 763919 771124 787546 830028 945111 960914 632123 30676 -408191
$$ packed form
37471A248794J97689k88981n04463l87891j10865O8395N944k12115l56842k89036
37461f29371p8673J35880L20793M68416M35589Q7025l82908n34447k34070R2021
37451c19745j4052m04957n19467j75233J65805M7662l38205m14254J3616N40204
37441a418626P21161N73505L84437K38008j3135l77538o05308n11154k23015l65
37431a232030N4725J234q5772j32297o0928Q1521J05537m3589j07154J64700N86723
37420f67330O90733L00450k68885n93339n15898j54416K15106K72567o2756m05987
37410a189755k69417K48934M86938J25137k86856o1054O34589R75413N82978m7100
37400A199807k91671j44217P205J6422M2482J15083J5803l28791o01447m38867
$$ plain form
37390 -408191 -329515 141684 535331 520002 165561 -234790 -480710 -577731 -629016 -679312
37380 -679312 -650909 -435173 -71755 221978 296038 291431 464664 805086 1025812 969510
37370 969510 789207 622319 345719 -123425 -494391 -396192 72280 405278 324107 78259
37360 78259 53062 319596 675907 919408 924914 615505 60511 -446009 -568665 -223894
37350 -223894 366815 900649 1212518 1295444 1201774 992686 766460 652550 706968 830317
37340 830317 853319 695239 380180 -47551 -483784 -680618 -445604 3016 139637 -228293
37330 -228293 -639125 -545335 -35586 322665 273575 154599 349018 751124 905750 529761
37320 529761 -172270 -621284 -338668 535977 1277611 1344777 1035156 1077644 1626473 2065399
$$ packed form
37390d08191P8676M71199L93647j5329l54441m00351k45920r7021n1285n0296
37380f79312K8403K15736L63418K93733P4060m607J73233L40422K20726n6302
37370I69510j80303j66888k76600m69144l70966R8199M68472L32998q1171k45848
37360G8259k5197K66534L56311K43501N506l09409n54994n06520j22656L44771
37350b23894N90709N33834L11869Q2926r3670k09088k26226j13910N4418J23349
37340H30317K3002j58080l15059m27731m36233j96834K35014M48620J36621l67930
37330b28293m10832R3790N09749L58251m9090j18976J94419M02106J54626l75989
37320E29761p02031m49014K82616Q74645P41634O7166l09621M2488N48829M38926
$$ plain form
37310 2065399 1884855 1322112 900588 696465 416591 -9005 -296000 -216387 152506 598893
37300 598893 978938 1218455 1279781 1187638 1006634 766649 455952 88195 -251354 -427541
37290 -427541 -360575 -169371 -140281 -400647 -665735 -542514 -115078 58445 -311297 -758697
37280 -758697 -591110 227221 1008857 1143599 714907 258334 111278 158109 140549 35457
37270 35457 34993 232337 487264 641570 713359 770006 761829 660568 624097 772777 906428
37259 906428 754766 443048 323874 341032 20271 -760522 -1443128 -1506353 -1134046 -817358
37249 -817358 -602939 -171836 518847 1127759 1419988 1495459 1520152 1537929 1582719 1715701
37239 1715701 1883315 1915805 1713467 1327431 881367 518988 361830 400703 508366 649840
$$ packed form
37310B065399j80544n62743m21524k04123k79874m25596k86995P9613L68893M46387
37300E98893L80045K39517O1326r2143j81004k39985l10697l67757l39549j76187
37290d27541O6966J91204K9090k60366k65088J23221M27436J73523l69742m47400
37280g58697J67587Q18331P81636J34742m28692m56573j47056M6831j7560j05092
37270C5457m64J97344K54927J54306P1789N6647q177j01261l6471J48680J33651
37259I06428j51662l11718j19174J7158l20761p80793o82606o3225L72307L16688
37249h17358K14419M31103O90683O08912K92229P5471K4693J7777M4790J32982
37239A715701J67614L2490k02338l86036m46064l62379j57158L8873J07663J41474
$$ plain form
37229 649840 929124 1312117 1530078 1467051 1410993 1629333 1900269 1820379 1412233 1016479
37219 1016479 697478 233930 -313985 -529471 -253732 141013 262688 136104 -43213
37210 -43213 -260672 -569437 -896147 -1185947 -1520428 -1880204 -2008113 -1756454 -1392574 -1271226
37200 -1271226 -1295806 -999050 -185857 715808 1036568 512870 -493017 -1358992 -1723874
37191 -1723874 -1646017 -1342220 -931635 -487873 -164929 -85219 -181310 -320477 -506437 -758887
37181 -758887 -878888 -606872 -2603 598000 1018797 1360445 1644778 1658705 1292278 780329
37171 780329 435391 316942 297431 275418 181743 -61403 -434098 -785035 -1002829 -1093192
37161 -1093192 -1023889 -682452 -91875 520517 985040 1319570 1473930 1211432 503157 -154057
$$ packed form
37229F49840K79284L82993K17961o3027n6058K18340K70936p9890m08146l95754
37219A016479l19001m63548n47915k15486K75739L94745J21675j26584j79317
37210d3213k17459l08765l26710k89800l34481l59776j27909K51659L63880J21348
37200a271226k4580K96756Q13193R01665L20760n23698j005887q65975l64882
37191a723874P7857L03797M10585M43762L22944P9710r6091j39167j85960k52450
37181g58887j20001K72016O04269O00603M20797L41648K84333J3927l66427n11949
37171G80329l44938j18449j9511k2013r3675k43146l72695l50937k17794r0363
37161a093192O9303L41437N90577O12392M64523L34530J54360k62498p08275o57214
$$ plain form
37151 -154057 -160107 474024 1107297 1197092 830928 468803 355238 350051 260288 131602 114496
37140 114496 167742 104849 -61819 -80982 93786 74182 -459945 -1184884 -1419440 -948666
37130 -948666 -231738 201364 224720 -14035 -314781 -433374 -225110 108630 231676 190206
37120 190206 340679 701269 858627 676335 559259 731853 792742 400330 -86037 -167442
37110 -167442 402 -32169 -173586 16396 482273 701217 514486 313203 359092 472654
37100 472654 467629 382001 176802 -305973 -932829 -1247863 -1018478 -478712 54819 440706
37090 440706 524971 143116 -526116 -996292 -1036878 -864557 -667026 -362442 1370 82695
37080 82695 -229656 -539323 -527956 -449064 -647212 -908133 -763141 -250908 94363 -53266
$$ packed form
37151a54057o050O34131O33273Q9795l66164l62125j13565n187q9763j28686j7106
37140A14496N3246o2893j66668j9163J74768j9604n34127p24939k34556M70774
37130i48666P16928M33102K3356k38755l00746j18593K08264L33740J23046m1470
37120A90206J50473L60590J57358j82292j17076J72594O0889l92412m86367q1405
37110a67442J67844l2571j41417J89982M65877K18944j86731k01283M5889J13562
37100D72654n025q5628k05199m82775o26856l15034K29385N39766N33531L85887
37090D40706Q4265l81855o69232m70176m0586J72321J97531L04584L63812Q1325
37080H2695l12351l09667J1367P8892j98148k60921J44992N12233L45271j47629
$$ plain form
37070 -53266 -504629 -905356 -1036402 -789474 -213891 329065 348953 -281005 -1138521 -1627656
37060 -1627656 -1461922 -799256 -45427 442878 566485 471162 360027 375340 631255 1179319
37050 1179319 1857763 2343736 2486543 2443945 2351742 2041340 1319077 408243 -175571 -203157
37040 -203157 26613 69744 -193445 -526489 -652394 -506741 -204716 157074 563323 907615
37030 907615 909028 413553 -277109 -654817 -609816 -484454 -448398 -201003 474345 1205869
37020 1205869 1445318 1169741 805827 600639 436170 186286 -92693 -298324 -328078 -59322
37010 -59322 434113 757853 635115 371668 483519 922151 1124956 845663 453159 313053
37000 313053 346852 366480 388725 390424 180672 -192946 -294620 98918 560622 538467 68894
$$ packed form
37070e3266m51363m00727j31046K46928N75583N42956J9888o29958q57516m89135
37060a627656J65734O62666P53829M88305J23607r5323j11135J5313K55915N48064
37050A179319O78444M85973J42807m2598r2203l10402p22263r10834n83814k7586
37040b03157K29770M3131k63189l33044j25905J45653L02025L61790M06249L44292
37030I07615J413m95475o90662l77708M5001J25362L6056K47395O75348P31524
37020A205869K39449k75577l63914k05188j64469k49884k78979k05631k9754K68756
37010e9322M93435L23740j22738k63447J11851M38632K02805k79293l92504j40106
37000C13053L3799J9628K2245J699k09752l73618j01674L93538M61704k2155m69573
$$ plain form
36989 68894 -386805 -593449 -659439 -688979 -701357 -774010 -913882 -895337 -562625 -173120 -73025
36978 -73025 -134270 79439 633103 1122964 1267976 1195248 1078650 881536 572092 257520
36968 257520 -24085 -354380 -673971 -764802 -594859 -379304 -199116 99778 490268 630603
36958 630603 387511 156336 356587 867200 1259656 1350869 1207103 833063 249771 -256530
36948 -256530 -354163 -90323 200341 325085 277515 2048 -464717 -676842 -99911 1117620
36938 1117620 2078492 2046878 1188877 282304 -67639 192173 695857 976771 824044 476629
36928 476629 350375 529787 720920 723088 640687 535834 249599 -194529 -362123 42012
36918 42012 625868 736186 323775 -29569 76064 421857 612654 589820 538778 550765
$$ packed form
36989F8894m55699k06644o5990k9540j2378p2653j39872J8545L32712L89505J00095
36978g3025o1245K13709N53664M89861J45012p2728j16598j97114l09444l14572
36968B57520k81605l30295l19591r0831J69943K15555J80188K98894L90490J40335
36958F30603k43092k31175K00251N10613L92456R1213j43766l74040n83292n06301
36948b56530r7633K63840K90664J24744m7570k75467m66765k12125N76931J217531
36938A117620R60872l1614q58001r06573l49943K59812N03684K80914j52727l47415
36928D76629j26254J79412J91133K168q2401j04853k86235m44128j67594M04135
36918D2012N83856J10318m12411l53344J05633L45793J90797k2834n1042J1987
$$ plain form
36908 550765 570472 517610 309226 -106011 -605549 -906331 -848451 -562265 -240343 124309
36898 124309 595164 981517 922904 340164 -376412 -751640 -710821 -564190 -567857 -670976
36888 -670976 -731758 -793849 -965182 -1106183 -886620 -207887 637240 1331057 1852646 2259713
36878 2259713 2358657 1914875 1121902 504009 282068 139739 -255574 -792243 -1175880 -1380172
36868 -1380172 -1522557 -1466994 -950208 -90797 602579 834845 823083 829042 689168 102819
36858 102819 -782915 -1424494 -1506186 -1225903 -906479 -588194 -150793 354840 701188 728926
36848 728926 431669 -145433 -902228 -1568013 -1786261 -1456643 -928298 -709167 -949191 -1305903
36838 -1305903 -1389864 -1245499 -1221098 -1396623 -1427499 -1107699 -799951 -951497 -1352087 -1372022
$$ packed form
36908E50765J9707n2862k08384m15237m99538l00782N7880K86186L21922L64652
36898A24309M70855L86353n8613n82740p16576l75228M0819J46631l667j03119
36888f70976o0782o2091j71333j41001K19563O78733Q45127O93817N21589M07067
36878B259713R8944m43782p92973o17893k21941j42329l95313n36669l83637k04292
36868a380172j42385N5563N16786Q59411O93376K32266j1762N959j39874n86349
36858A02819q85734o41579q1692K80283L19424L18285M37401N05633L46348K7738
36848G28926k97257n77102p56795o65785k18248L29618N28345K19131k40024l56712
36838a305903q3961J44365K4401j75525l0876L19800L07748j51546m00590j9935
$$ plain form
36828 -1372022 -952695 -792603 -1304729 -1916701 -1859176 -1256261 -847918 -856978 -792536 -349427
36818 -349427 144333 329113 321279 374086 451297 410038 296204 227385 243919 433992 896838
36807 896838 1420774 1554744 1216193 880638 936713 1222619 1460162 1716025 2055759 2156833
36797 2156833 1767279 1234628 1042485 1068567 864675 469062 316075 448050 468331 278327
36787 278327 227744 440079 584132 483391 413803 579889 773311 785780 719490 637700
36777 637700 336214 -232413 -678798 -653629 -307489 33192 358080 792565 1165030 1154805
36767 1154805 781590 432935 425066 727160 1070219 1197401 1086707 1004011 1202191 1531940
36757 1531940 1590954 1339334 1246630 1628521 2129756 2144060 1534832 663934 -107393 -642705
$$ packed form
36828a372022M19327J60092n12126o11972N7525O02915M08343r060O4442M43109
36818c49427M93760J84780p834N2807P7211m1259j13834o8819J6534J90073M62846
36807H96838N23936J33970l38551l35555N6075K85906K37543K55863L39734J01074
36797B156833l89554n32651j92143K6082k03892l95613j52987J31975K0281j90004
36787B78327n0583K12335J44053j00741o9588J66086J93422J2469o6290q1790
36777F37700l01486n68627m46385K5169L46140L40681L24888M34485L72465j0225
36767A154805l73215l48655p869L02094L43059J27182j10694q2696J98180L29749
36757A531940N9014k51620r2704L81891N01235J4304o09228q70898p71327n35312
$$ plain form
36747 -642705 -883223 -784210 -386575 206134 847962 1262017 1154747 614808 174287 200681
36737 200681 409395 289123 -134819 -324111 36789 676412 1144961 1298344 1278650 1220064
36727 1220064 1111314 878218 527385 198309 44363 68826 156091 240891 303409 232508
36717 232508 -58249 -354384 -292912 97432 331795 120889 -239872 -368230 -347713 -454312
36707 -454312 -616143 -547296 -238549 71561 285039 446462 481133 302826 98391 139462
36697 139462 349613 384500 114823 -258039 -520620 -600234 -453411 -85651 342308 650806
36687 650806 818855 844322 592290 32303 -543277 -804545 -709536 -316595 416882 1309328
36677 1309328 1798102 1601689 1217149 1192031 1235868 768534 55590 -118751 196715 108895
$$ packed form
36747f42705k40518R9013L97635N92709O41828M14055j07270n39939m40521K6394
36737B00681K08714j20272m23942j89292L60900O39623M68549J53383j9694n8586
36727A220064j08750k33096l50833l29076j53946K4463Q7265Q4800O2518p0901
36717B32508k90757k96135O1472L90344K34363k10906l60761j28358K0517j06599
36707d54312j61831O8847L08747L10110K13478J61423L4671j78307k04435M1071
36697A39462K10151L4887k69677l72862k62581p9614J46823L67760M27959L08498
36687F50806J68049K5467k52032n59987n75580k61268R5009L92941P33477Q92446
36677A309328M88774j96413l84540k5118M3837m67334p12944j74341L15466q7820
$$ plain form
36667 108895 -656790 -1287551 -1206752 -927847 -1067223 -1308789 -1020860 -315838 194471 301596
36657 301596 248999 188009 124113 151687 279765 270463 45828 -48714 204813 424164 171343
36646 171343 -356583 -698221 -895468 -1313803 -1905735 -2244713 -2183421 -1949308 -1675454 -1332282
36636 -1332282 -1028865 -880411 -667947 -154323 339517 255959 -299904 -575274 -181082 459918
36626 459918 811957 822952 608432 89968 -669135 -1165156 -941302 -183942 513060 833690
36616 833690 880980 764759 424811 -88775 -446722 -331699 179005 636505 633492 164846
36606 164846 -402541 -662696 -474658 -39612 245905 113163 -261424 -354659 82864 594984
36596 594984 515086 -144060 -689870 -684663 -411135 -246728 -109027 138988 246629 48480
$$ packed form
36667A08895p65685o30761Q0799K78905j39376k41566K87929P05022N10309J07125
36657C01596n2597o0990o3896K7574J28078r302k24635r4542K53527K19351k52821
36646A71343n27926l41638j97247m18335n91932l38978O1292K34113K73854L43172
36636a332282L03417J48454K12464N13624M93840q3558n55863k75370L94192O41000
36626D59918L52039J0995k14520n18464p59103m96021K23854P57360O97002L20630
36616H33690M7290j16221l39948n13586l57947J15023N10704M57500l013m68646
36606A64846n67387k60155J88038M35046K85517j32742l74587r3235M37523N12120
36596E94984p9898o59146n45810N207K73528J64407J37701K48015J07641j98149
$$ plain form
36586 48480 -38272 378907 851942 594136 -331586 -1041675 -1043576 -722365 -533163 -420461
36576 -420461 -281573 -350835 -721932 -980525 -758170 -312899 -148286 -311109 -450282 -379408
36566 -379408 -215622 -84018 -11394 -47826 -219592 -384610 -342957 -87288 189686 310872
36556 310872 251251 118242 64056 142030 207599 69541 -226312 -406518 -311603 -71245
36546 -71245 124404 255568 370724 395310 173311 -349293 -1023799 -1536296 -1601821 -1245902
36536 -1245902 -822125 -584972 -358559 118817 652658 792477 550551 464339 828563 1282238
36526 1282238 1346568 1015859 614654 397037 475467 797196 988885 620179 -111389 -381764
36516 -381764 202572 948698 958608 335952 -65704 118575 435956 483918 451954 635049
$$ packed form
36586D8480q6752M17179M73035k57806r25722p10089j901L21211J89202J12702
36576d20461J38888o9262l71097k58593K22355M45271J64613j62823j39173P0874
36566c79408J63786J31604P2624l6432j71766j65018M1653K55669K76974J21186
36556C10872n9621j33009n4186P7974O5569j38058k95853j80206R4915K40358
36546g1245J95649J31164J15156K4586k21999n22604o74506n12497o5525L55919
36536a245902M23777K37153K26413M77376N33841J39819k41926q6212L64224M53675
36526A282238O4330l30709m01205k17617P8430L21729J91689l68706p31568k70375
36516c81764N84336P46126R910o22656m01656J84279L17381M7962l1964J83095
$$ plain form
36506 635049 935159 1122878 1232367 1399992 1532760 1402991 965089 396901 -101252 -418212
36496 -418212 -501173 -340024 -9194 310584 409494 234179 8982 50912 401134 762655
36486 762655 869858 755135 559610 315088 103262 185692 659621 1138231 1133042 699131
36476 699131 363554 421157 622963 595117 264613 -199823 -599095 -760644 -610008 -287405
36466 -287405 -31149 95499 191076 238649 80785 -297467 -707217 -1028862 -1295687 -1446525
36456 -1446525 -1289821 -851574 -492526 -482813 -650755 -634441 -318945 139757 556096 792702
36446 792702 747793 484805 293973 435315 854893 1265978 1427129 1242291 741956 150344
36436 150344 -157049 -8711 298679 323625 48347 -125013 22824 212566 112509 -127285
$$ packed form
36506F35049L00110J87719J09489J67625J32768j29769m37902n68188m98153l16960
36496d18212q2961J61149L30830L19778R8910j75315k25197M1930L50222L61521
36486G62655J07203j14723j95525k44522k11826Q2430M73929M78610n189m33911
36476F99131l35577N7603K01806k7846l30504m64436l99272j61549J50636L22603
36466b87405K56256J26648R5577M7573j57864l78252m09750l21645k66825j50838
36456a446525J56704M38247L59048R713j67942J6314L15496M58702M16339K36606
36446G92702m4909k62988j90832J41342M19578M11085J61151j84838n00335n91612
36436A50344l07393J48338L07390K4946k75278j73360J47837J89742j00057k39794
$$ plain form
36426 -127285 -70811 346738 671134 534857 159531 35936 254387 450540 386094 246127
36416 246127 252438 303826 234507 168383 284438 399442 174530 -325726 -675777 -700474 -647445
36405 -647445 -677847 -599492 -274209 101461 374748 745503 1362878 1888903 1863744 1355053
36395 1355053 872718 731475 843929 1063364 1337196 1504109 1316168 788324 263641
36386 263641 9672 -55436 -149814 -322462 -438878 -324266 108048 699165 1013202 710256
36376 710256 23830 -376146 -123156 445421 756234 655549 409678 225600 28676 -319082
36366 -319082 -771335 -1105834 -1120132 -834394 -503652 -346785 -280936 -85747 176343 170235
36356 170235 -185882 -497539 -404686 -63660 147304 174173 192432 142834 -203934 -761706
$$ packed form
36426a27285N6474M17549L24396j36277l75326j23595K18451J96153o4446j39967
36416B46127O311N1388o9319o6124J16055J15004k24912n00256l50051k4697N3029
36405f47445l0402P8355L25283L75670K73287L70755O17375N26025k5159n08691
36395A355053m82335j41243J12454K19435K73832J66913j87941n27844n24683
36386B63641k53969o5108r4378j72648j16416J14612M32314N91117L14037l02946
36376G10256o86426l99976K52990N68577L10813j00685k45871j84078j96924l47758
36366c19082m52253l34499j4298K85738L30742J56867O5849J95189K62090o108
36356A70235l56117l11657R2853L41026K10964K6869J8259m9598l46768n57772
$$ plain form
36346 -761706 -1128695 -1118028 -917973 -672787 -320351 16512 -79387 -730793 -1381180 -1364494
36336 -1364494 -694766 20064 318106 227635 -37499 -385766 -801373 -1205450 -1433907 -1290150
36326 -1290150 -709570 9854 305727 -74344 -697991 -926968 -706555 -553931 -764911
36317 -764911 -1010914 -865489 -410937 -70345 -21089 -37422 143706 500081 776460 756928
36307 756928 488827 279555 414388 815175 1040710 718802 -29485 -653721 -678582 -142414
36297 -142414 463496 699759 606236 572099 815367 1159908 1379148 1522296 1699303 1747698
36287 1747698 1441507 948943 736821 1006213 1512847 1945758 2166658 2074337 1629144 1104921
36277 1104921 922280 1084587 1161868 981998 869917 955426 787113 91306 -561410 -481850
$$ packed form
36346g61706l66989J0667K00055K45186L52436L36863r5899o51406o50387J6686
36336a364494O69728P14830K98042r0471k65134l48267m15607m04077k28457J43757
36326a290150N80580P19424K95873l80071o23647k28977K20413J52624k10980
36317g64911k46003J45425M54552L40592M9256j6333J81128L56375K76379j9532
36307G56928k68101k09272J34833M00787K25535l21908p48287o24236k4861N36168
36297a42414O05910K36263r3523l4137K43268L44541K19240J43148J77007M8395
36287A747698l06191m92564k12122K69392N06634M32911K20900r2321m45193n24223
36277A104921j82641J62307P7281j79870j12081Q5509j68313o95807o52716P9560
$$ plain form
36267 -481850 65447 240853 -80588 -193347 222332 571927 321249 -176918 -279675 18074
36257 18074 263661 315150 390055 523846 494485 260177 58237 32701 87505 142786 235486
36246 235486 312335 216781 -23231 -170220 -174325 -324076 -783469 -1204773 -1115376 -582043
36236 -582043 -152299 -139963 -316013 -408821 -551412 -956841 -1402266 -1431782 -1008167 -587666
36226 -587666 -490640 -516320 -302158 199952 752134 1101764 1072846 634862 93830 -11983
36216 -11983 507132 1157250 1283753 823504 266017 -23534 -110135 -159782 -163496 -69643 73639
36205 73639 202544 276783 206254 -43659 -246131 -67325 489393 1017956 1179924 1029853
36195 1029853 790505 560414 400905 468301 798879 1087751 950200 400311 -121156 -241252
$$ packed form
36267d81850N47297J75406l21441j12759M15679L49595k50678m98167j02757K97749
36257A8074K45587N1489P4905J33791k9361k34308k01940k5536N4804N5281R2700
36246B35486P6849r5554k40012j46989m105j49751m59393m21304Q9397N33333
36236e82043M29744J2336j76050r2808j42591m05429m45425k9516M23615M20501
36226e87666R7026k5680K14162N02110N52182L49630k8918m37984n41032j05813
36216a1983N19115O50118J26503m60249n57487k89551q6601m9647l714R3853J43282
36205G3639J28905P4239p0529k49913k02472J78806N56718N28563J61968j50071
36195A029853k39348k30091j59509O7396L30578K88872j37551n49889n21467j20096
$$ plain form
36185 -241252 -57408 23826 -200980 -475296 -398281 51512 461380 509455 366655 415404
36175 415404 723988 1043220 1212398 1251442 1088599 571616 -162837 -678166 -775460 -762168
36165 -762168 -962934 -1197098 -1032594 -433969 144092 316517 196831 181106 421555 644823
36155 644823 527932 176684 67904 445780 938990 954881 347576 -505044 -1182150 -1524135
36145 -1524135 -1542448 -1334096 -1072753 -823376 -426198 149871 490077 220253 -300787 -372330
36135 -372330 -24892 28002 -334715 -264550 705817 1728633 1782955 1154353 905402 1262178
36125 1262178 1489067 1208736 865203 790685 709358 429362 250425 303689 142899 -535164
36115 -535164 -1283232 -1537602 -1464283 -1611191 -1979711 -2041453 -1599303 -1074068 -847944 -780047
$$ packed form
36185b41252J83844Q1234k24806k74316P7015M49793M09868M8075j42800M8749
36175D15404L08584L19232J69178L9044j62843n16983p34453n15329r7294J3292
36165g62168k00766k34164J64504N98625N78061J72425j19686j5725K40449K23268
36155F44823j16891l51248j08780L77876M93210J5891o07305q52620o77106l41985
36145a524135j8313K08352K61343K49377L97178N76069L40206k69824n21040p1543
36135c72330L47438N2894l62717P0165R70367J022816N4322o28602k48951L56776
36125A262178K26889k80331l43533p4518q1327k79996j78937N3264j60790o78063
36115e35164p48068k54370P3319j46908l68520o1742M42150N25235K26124O7897
$$ [...]
##END NTUPLES=NMR SPECTRUM
##END=
