##TITLE=31Pdec_47-2022
 CDCl3, 24 sc
 25.7.2022
##JCAMPDX= 6.0         $$ Bruker NMR JCAMP-DX V2.0
##DATA TYPE= NMR SPECTRUM
##DATA CLASS= NTUPLES
##ORIGIN= UXNMR, Bruker Analytische Messtechnik GmbH
##OWNER= root
$$ XWIN-NMR		Version 3.5
$$ Mon Jul 25 14:41:48 2022 Russian Standard Time (UT+4h)  she@DPX200
##.OBSERVE FREQUENCY= 81.013821
##.OBSERVE NUCLEUS= ^31P
##.ACQUISITION MODE= SIMULTANEOUS
##.ACQUISITION SCHEME= undefined
##.AVERAGES= 24
##.DIGITISER RES= 16
##SPECTROMETER/DATA SYSTEM= spect
##.PULSE SEQUENCE= zgpg30
##.SOLVENT NAME= CDCl3
##.SHIFT REFERENCE= (INTERNAL, CDCl3, 0, 248.564)
##AUDIT TRAIL= $$ (NUMBER, WHEN, WHO, WHERE, WHAT)
$$ ##TITLE= Audit trail, XWIN-NMR		Version 3.5
$$ ##JCAMPDX= 5.01
$$ ##ORIGIN= Bruker BioSpin GmbH
$$ ##OWNER= she
$$ F:/spectra/data/she/nmr/P31/1/pdata/1/auditp.txt
$$ ##AUDIT TRAIL=  $$ (NUMBER, WHEN, WHO, WHERE, WHAT)
(   1,<2022-07-25 14:40:30.10 +0400>,<she>,<DPX200>,
      <created by zg, POWCHK disabled, PULCHK disabled
       configuration hash MD5:
       00 E9 B6 7A A2 85 ED C7 34 08 36 98 17 FE 4E 26
       data hash MD5: 32K
       7C 83 62 10 5E 5A 34 6C 04 BC 52 05 AA FD C9 69>)
(   2,<2022-07-25 14:40:33.14 +0400>,<she>,<DPX200>,
      <Start of raw data processing
       efp BC_mod = 2 LB = 1 FT_mod = 6 PKNL = 1 PHC0 = -10482.39 PHC1 = 537.4568 SI = 64K 
       data hash MD5: 64K
       41 FC 68 08 C0 2B A9 1A 0A 06 EE 96 F4 6C B4 F7>)
(   3,<2022-07-25 14:40:46.09 +0400>,<she>,<DPX200>,
      <pk PHC0 = 23.0438 PHC1 = 0 
       data hash MD5: 64K
       AD 6C 86 20 94 8B 1C BC 58 2A 97 ED D2 F9 1F 5B>)
(   4,<2022-07-25 14:40:48.96 +0400>,<she>,<DPX200>,
      <abs ABSG = 5 
       data hash MD5: 64K
       6F F6 61 87 EF 31 C8 85 B9 38 0A E4 07 59 B1 27>)
$$ ##END=
$$ 
$$ hash MD5
$$ 70 B4 DD A9 49 0E FC 88 A9 F2 B7 E6 72 24 14 56
##$RELAX= 
##$RELAX= 
##$RELAX= 
##$RELAX= 
##$RELAX= 
##$RELAX= 
##$RELAX= 
##$RELAX= 
$$ Bruker specific parameters
$$ --------------------------
##$DU= <F:/spectra>
##$EXPNO= 1
##$NAME= <P31>
##$PROCNO= 1
##$TYPE= <nmr>
##$USER= <she>
##$AMP= (0..31)
100 100 100 100 100 100 100 100 100 100 100 100 100 100 100 100 100 100 
100 100 100 100 100 100 100 100 100 100 100 100 100 100 
##$AQSEQ= 0
##$AQ_mod= 1
##$AUNM= <au_zg>
##$AUTOPOS= <>
##$BF1= 81.014009
##$BF2= 200.13
##$BF3= 200.13
##$BF4= 200.13
##$BF5= 200.13
##$BF6= 200.13
##$BF7= 200.13
##$BF8= 200.13
##$BYTORDA= 1
##$CFDGTYP= 0
##$CFRGTYP= 5
##$CHEMSTR= <none>
##$CNST= (0..31)
1 1 145 1 1 1 1 1 1 1 1 1 1 1 1 1 1 1 1 1 1 1 1 1 1 1 1 1 1 1 1 1 
##$CPDPRG= <waltz16>
##$CPDPRG1= <>
##$CPDPRG2= <waltz16>
##$CPDPRG3= <>
##$CPDPRG4= <mlev>
##$CPDPRG5= <mlev>
##$CPDPRG6= <mlev>
##$CPDPRG7= <mlev>
##$CPDPRG8= <mlev>
##$CPDPRGB= <>
##$CPDPRGT= <>
##$D= (0..31)
0 1 0 0 0 0 0 0 0 0 0 0.03 2e-05 3e-06 0 0 0 0 0 0 0 0 0 0 0 0 0 0 0 0 
0 0 
##$DATE= 1658745629
##$DBL= (0..7)
120 120 120 11 120 120 24 19 
##$DBP= (0..7)
150 150 150 150 150 150 150 150 
##$DBP07= 0
##$DBPNAM0= <>
##$DBPNAM1= <>
##$DBPNAM2= <>
$$ [...]
##$SUBNAM3= <"">
##$SUBNAM4= <"">
##$SUBNAM5= <"">
##$SUBNAM6= <"">
##$SUBNAM7= <"">
##$SUBNAM8= <"">
##$SUBNAM9= <"">
##$SW= 501.771253377433
##$SWIBOX= (0..15)
0 1 3 0 0 0 0 0 0 0 0 0 0 0 0 0 
##$SW_h= 40650.406504065
##$TD= 32768
##$TD0= 1
##$TE= 0
##$TE2= 300
##$TE3= 300
##$TEG= 300
##$TL= (0..7)
0 120 53 12 22 120 120 120 
##$TP= (0..7)
150 150 150 150 150 150 150 150 
##$TP07= 0
##$TPNAME0= <>
##$TPNAME1= <>
##$TPNAME2= <>
##$TPNAME3= <>
##$TPNAME4= <>
##$TPNAME5= <>
##$TPNAME6= <>
##$TPNAME7= <>
##$TPOAL= (0..7)
0.5 0.5 0.5 0.5 0.5 0.5 0.5 0.5 
##$TPOFFS= (0..7)
0 0 0 0 0 0 0 0 
##$TUNHIN= 0
##$TUNHOUT= 0
##$TUNXOUT= 0
##$USERA1= <user>
##$USERA2= <user>
##$USERA3= <user>
##$USERA4= <user>
##$USERA5= <user>
##$V9= 5
##$VALIST= <valist>
##$VCLIST= <CCCCCCCCCCCCCCC>
##$VD= 0
##$VDLIST= <DDDDDDDDDDDDDDD>
##$VPLIST= <PPPPPPPPPPPPPPP>
##$VTLIST= <TTTTTTTTTTTTTTT>
##$WBST= 1024
##$WBSW= 4
##$XGAIN= (0..3)
0 0 0 0 
##$XL= 0
##$YL= 0
##$YMAX_a= 4146
##$YMIN_a= -4217
##$ZGOPTNS= <>
##$ZL1= 120
##$ZL2= 120
##$ZL3= 120
##$ZL4= 120
##$ABSF1= 248.5645
##$ABSF2= -253.2056
##$ABSG= 5
##$ABSL= 3
##$ALPHA= 0
##$AQORDER= 0
##$ASSFAC= 0
##$ASSFACI= 0
##$ASSFACX= 0
##$ASSWID= 0
##$AUNMP= <proc_1d>
##$AZFE= 0.1
##$AZFW= 0.5
##$BCFW= 0
##$BC_mod= 2
##$BYTORDP= 0
##$COROFFS= 0
##$CY= -3
##$DATMOD= 1
##$DC= 0
##$DFILT= <>
##$DTYPP= 0
##$F1P= 0
##$F2P= 0
##$FCOR= 1
##$FTSIZE= 65536
##$FT_mod= 6
##$GAMMA= 0
##$GB= 0
##$INTBC= 1
##$INTSCL= 5.30512e-09
##$ISEN= 30
##$LB= 1
##$LEV0= 0
##$LPBIN= 0
##$MAXI= 10000
##$MC2= 0
##$MEAN= 0
##$ME_mod= 0
##$MI= 50
##$NCOEF= 0
##$NC_proc= -5
##$NLEV= 6
##$NOISF1= 182.463
##$NOISF2= 159.3651
##$NSP= 0
##$NTH_PI= 0
##$NZP= 0
##$OFFSET= 248.5645
##$PC= 4
##$PHC0= -10459.35
##$PHC1= 537.4568
##$PH_mod= 1
##$PKNL= yes
##$PPARMOD= 0
##$PSCAL= 0
##$PSIGN= 0
##$REVERSE= no
##$SF= 81.014009
##$SI= 65536
##$SIGF1= 159.3651
##$SIGF2= -187.1042
##$SINO= 113.3802
##$SIOLD= 16384
##$SREGLST= <1H.CDCl3>
##$SSB= 0
##$STSI= 65536
##$STSR= 0
##$SW_p= 40650.406504065
##$SYMM= 0
##$S_DEV= 0
##$TDeff= 32768
##$TDoff= 0
##$TI= <>
##$TILT= no
##$TM1= 0
##$TM2= 0
##$TOPLEV= 0
##$USERP1= <user>
##$USERP2= <user>
##$USERP3= <user>
##$USERP4= <user>
##$USERP5= <user>
##$WDW= 1
##$XDIM= 65536
##$YMAX_p= 451725789
##$YMIN_p= -23709831
$$ End of Bruker specific parameters
$$ ---------------------------------
##NTUPLES= NMR SPECTRUM
##VAR_NAME=  FREQUENCY,     SPECTRUM/REAL,   SPECTRUM/IMAG
##SYMBOL=    X,             R,               I
##VAR_TYPE=  INDEPENDENT,   DEPENDENT,       DEPENDENT
##VAR_FORM=  AFFN,          ASDF,            ASDF
##VAR_DIM=   65536,         65536,           65536
##UNITS=     HZ,            ARBITRARY UNITS, ARBITRARY UNITS
##FACTOR=    0.620285442955139, 1,           1
##FIRST=     20137.2065510759, 0,            0
##LAST=      -20513.1999529892, 0,           0
##MIN=       -20513.1999529892, -23709831,   0
##MAX=       20137.2065510759, 451725789,    0
$$ Real data points
##PAGE= N=1
##DATA TABLE= (X++(R..R)), XYDATA
$$ [...]
42324 617517 413576 407030 692451 1023270 923879 259117 -437382 -559401 -262353 -248211
42314 -248211 -715414 -1070660 -868029 -484205 -478846 -725228 -691840 -310975 -4956 36950
42304 36950 61891 208164 235676 -51061 -446722 -577799 -292029 260743 757000 895307
42294 895307 679669 519660 811271 1389316 1645664 1252710 525232 -35566 -326698 -598482
42284 -598482 -959532 -1142908 -843221 -239808 -16274 -637286 -1641329 -2013698 -1404068
42275 -1404068 -569455 -313824 -432326 -231530 270109 412468 31389 -282436 -154127
42266 -154127 100141 193668 357316 755988 1044945 954567 793498 883897 949640 597487
42256 597487 35091 -246005 -211762 -158356 -93657 164587 437579 342173 -45030 -235559
42246 -235559 -68553 94284 -12903 -192648 -162752 53770 248770 268353 52185 -317997
42236 -317997 -556521 -398096 71260 502828 680260 603330 255206 -380352 -1054082 -1330218
42226 -1330218 -1034944 -424583 120085 373965 283828 -37243 -343322 -516528 -727870 -1068504
42216 -1068504 -1166390 -619509 230679 509723 -57274 -725262 -710878 -171056 160118 -4255
42206 -4255 -273564 -228237 96964 380794 395939 167536 -101910 -224442 -187989 -104196 -9727
42195 -9727 154559 347453 391179 222073 22899 -7992 107025 227860 314416 415137
42185 415137 525427 582237 562166 504094 448062 372532 177238 -212043 -640921 -730716 -282528
42174 -282528 351795 527282 -11393 -858886 -1382621 -1277442 -704980 -91173 176113 31094
42164 31094 -233976 -328565 -303236 -353651 -405931 -221257 127603 275314 127218 27418 226130
42153 226130 521381 614361 517841 396701 257215 22647 -273368 -560653 -837360 -1060966
42143 -1060966 -1110141 -969593 -762562 -512493 -105526 408166 721944 604756 131163 -452245
42133 -452245 -848560 -761621 -227083 150418 -161556 -717531 -527945 427841 953375 335212
42123 335212 -537807 -461806 376064 892463 804405 767019 1041499 1113038 709844 265824
42113 265824 135037 89890 -147428 -495729 -850764 -1251260 -1519791 -1321618 -786676 -480919
42103 -480919 -525717 -374421 216544 643840 360136 -235223 -397086 -111021 73265 6910
42093 6910 50594 308189 421270 245899 180527 540389 976744 885021 234173 -370412
42083 -370412 -480907 -355490 -503845 -880515 -910357 -353864 254278 281907 -188458 -576923
42073 -576923 -613420 -496717 -381473 -203766 -15543 -13292 -148929 -143892 2458 -49082 -385628
42062 -385628 -628883 -528441 -350451 -395528 -510967 -428103 -260734 -254224 -264521 50654
42052 50654 591518 798312 371887 -271253 -437476 56573 681973 801928 373398 -91088
42042 -91088 -221191 -174880 -214651 -242819 -81365 76617 -34692 -200822 -31378 290170
42032 290170 197635 -313155 -612868 -433493 -237285 -357158 -471310 -308002 -217729 -535201
42022 -535201 -906686 -819363 -396147 -120248 -105672 -159550 -264420 -481735 -635261 -578619
42012 -578619 -529201 -664930 -658040 -130109 645762 1019576 787581 290653 -122311 -283454
42002 -283454 -78545 376116 605629 290834 -269421 -631013 -856169 -1181561 -1347205 -911409
41992 -911409 -49162 602596 758682 560513 55465 -716270 -1306170 -1284605 -951858 -855994
41982 -855994 -777009 -126278 733179 698989 -342204 -1113920 -715020 203790 597741 462024
41972 462024 376612 360098 63317 -336900 -283582 309380 988712 1392562 1437847 1066915
41962 1066915 332849 -366230 -591374 -362340 -52409 87801 19099 -284989 -780189 -1208749
41952 -1208749 -1305740 -1065249 -622096 -52899 506950 781505 650394 349370 162915 111356
41942 111356 115200 196368 292290 161236 -243579 -553709 -428829 -21837 236843 121364
41932 121364 -293135 -749927 -875599 -471939 88964 180347 -179989 -278071 175330 523616
41922 523616 224203 -256935 -294201 -213867 -637456 -1173093 -867788 196309 877327 646595
41912 646595 263212 497853 1094408 1427818 1422512 1281341 904882 175689 -580325 -963823
41902 -963823 -1074460 -1264936 -1536272 -1590702 -1341400 -1009996 -798708 -727291 -702200 -545473
41892 -545473 -97021 499065 770910 443035 -125994 -306332 39939 408922 295693 -220568
41882 -220568 -626501 -584491 -246876 39168 189538 383161 653720 756883 576281 398962
41872 398962 512422 713530 573456 94300 -287843 -333718 -230000 -144419 19770 275762
41862 275762 354094 95729 -251424 -385358 -370214 -453688 -645007 -717683 -516295 -86540
41852 -86540 370423 543712 216243 -387140 -659321 -275740 344131 512116 117128 -277732
41842 -277732 -149842 427804 971639 1114756 870480 501184 230707 98317 89421 313777
41832 313777 858924 1457881 1603464 1183275 735691 763299 999355 794784 151954 -171530
41822 -171530 257101 858001 785038 24187 -691752 -870376 -678294 -441822 -257936 -206210
41812 -206210 -439257 -789541 -710198 -2228 715129 734754 251394 75983 446226 726260
41802 726260 388998 -270813 -647660 -576081 -259479 150674 529463 637360 404088 161504
41792 161504 258452 607182 876885 910552 674048 95482 -659243 -1039739 -728144 -207197
41782 -207197 -209803 -744361 -1175305 -1151133 -903950 -699061 -569289 -598799 -893118 -1202610
41772 -1202610 -1119543 -727104 -517956 -601522 -578703 -309141 -161340 -306276 -409042 -289960
41762 -289960 -244058 -362262 -199181 409725 804299 362735 -554794 -1118800 -1106395 -887225
41752 -887225 -685865 -473041 -322518 -280180 -100145 335462 593107 285634 -170185 -92355
41742 -92355 364608 429872 -26954 -279165 109854 678070 830786 571120 200072 -141537
41732 -141537 -338850 -217448 105774 236708 140947 286686 829653 1158085 711178 -149258
41722 -149258 -618156 -528254 -401734 -565618 -760494 -642901 -233742 223642 527547 557015
41712 557015 317333 30362 -49878 13446 -97479 -445526 -637073 -336970 180139 289301
41702 289301 -172029 -632758 -491988 93302 401322 85211 -407646 -493459 -239821 -185816
41692 -185816 -511691 -773860 -538445 28394 399314 352217 178241 245589 527687 668264
41682 668264 477063 217360 277994 639342 894485 820388 633585 540031 363155 -73687
41672 -73687 -467048 -383020 34574 178418 -196360 -695455 -897086 -823918 -680907 -505067
41662 -505067 -258884 20677 310628 580317 629467 302684 -78407 31531 557517 734541
41652 734541 163463 -585293 -819199 -662003 -607742 -599499 -271726 174514 151165 -316917
41642 -316917 -536792 -191426 245149 320961 195427 129602 -34354 -471103 -878938 -848681
41632 -848681 -472201 -197700 -255424 -530202 -824128 -963777 -826422 -539203 -480078 -804616
41622 -804616 -1149955 -1102133 -772460 -570117 -570844 -516265 -336821 -228953 -220734 -100533 146999
41611 146999 239208 61768 -130886 -156194 -198733 -421973 -581213 -352959 111359 287042
41601 287042 -90720 -710962 -1020878 -771486 -247604 13559 -190607 -451173 -259949 215010
41591 215010 229504 -514977 -1361482 -1543307 -1175680 -907348 -852133 -548454 47454 282124
41581 282124 -184828 -688097 -378435 600998 1293424 1149893 576810 237174 240603 232913
41571 232913 24698 -172354 -121090 48128 -25665 -442371 -865521 -941120 -744048 -600880
41561 -600880 -564215 -371145 53324 388361 357913 92735 -147078 -351499 -602689 -755582
41551 -755582 -600400 -221503 116533 359117 625799 832520 692045 149538 -451222 -724265
41541 -724265 -575954 -153146 323454 615424 576309 323695 160770 235282 388536 405880
41531 405880 299239 257031 381046 541540 498561 192444 -101346 -48025 261013 317007
41521 317007 -138833 -686946 -758328 -398306 -114055 -91128 -46950 145294 214650 9564
41511 9564 -226466 -319257 -468231 -799188 -1006640 -803910 -416852 -237890 -232647 -93266
41501 -93266 207185 422622 457174 385469 180831 -144197 -226732 302853 1135783 1452903
41491 1452903 940309 205462 -45764 137850 231096 45264 -164914 -267107 -459796 -815518
41481 -815518 -958920 -478426 433937 1025577 782826 42109 -402308 -252073 29164 -5005
41471 -5005 -116949 137645 536567 398218 -321407 -784638 -427210 188963 188594 -348469
41461 -348469 -611636 -363316 -211399 -473806 -589888 -98949 468355 363716 -155957 -223239
41451 -223239 204786 251040 -408108 -915138 -555198 73848 -41764 -789194 -1167853 -817808
41441 -817808 -372512 -269649 -130312 378715 838494 727577 239026 -68708 -52032 71148
41431 71148 221490 386539 303924 -226089 -840664 -955109 -568620 -265910 -412351 -774908
41421 -774908 -984987 -991327 -971287 -1084731 -1341023 -1462174 -990713 91333 989980 895979
41411 895979 131073 -150408 469695 1122845 1011496 594187 771456 1408101 1520198 768112
41401 768112 -70030 -239259 62231 199363 43877 -30622 155183 323022 160254 -260224
41391 -260224 -563061 -468342 -49255 381904 602611 640190 591587 397365 -70519 -730833
41381 -730833 -1247551 -1300615 -850085 -162114 365123 489872 374000 460962 929819 1353217
41371 1353217 1162810 438040 -95815 43052 524556 725768 520794 228252 -13951
41362 -13951 -364682 -782853 -872615 -429616 158867 334932 41978 -270009 -233053 69824
41352 69824 301260 240639 -54771 -308699 -240846 139403 475179 462841 264618 267581 444949
41341 444949 341924 -155482 -474990 -161089 326383 203691 -396453 -487441 342211 1265958
41331 1265958 1379091 934161 804615 1108349 1144165 596767 7382 -137983 -111976 -377982
41321 -377982 -844468 -1153912 -1344665 -1687891 -2056647 -1986912 -1341934 -492957 176373 578792
41311 578792 725048 612635 410884 402427 583789 612459 303570 -103931 -351941 -533266
41301 -533266 -792039 -910936 -573837 55510 384951 83219 -524178 -841395 -638995 -218765
41291 -218765 -21622 -154028 -322098 -221580 85822 281863 214228 34380 -63506 -17103
41281 -17103 192308 508637 626919 225416 -453965 -650780 -15633 848928 1153252 911002
41271 911002 700140 703149 572333 143357 -297264 -471655 -360630 -13084 420146 527102
41261 527102 72499 -444402 -323023 225257 250773 -504924 -1181388 -1114774 -735230 -644949
41251 -644949 -608794 -187106 279641 176913 -338014 -644993 -674529 -755224 -733930 -202408
41241 -202408 519001 602133 -23796 -534411 -491890 -386838 -639216 -918726 -887546 -858809
41231 -858809 -1143363 -1331473 -876807 -23441 458994 255762 -273962 -699837 -893835 -885107
41221 -885107 -722507 -487381 -228297 69104 330617 383225 250025 240714 532138 838246
41211 838246 724066 119882 -647001 -1189068 -1294211 -1013562 -655215 -496507 -402058 629
41201 629 655649 979443 674886 246669 312497 716698 814311 443815 91240 116340 276218
41190 276218 115739 -461674 -1089485 -1241639 -698657 116989 430422 3429 -451049 -118242
41180 -118242 801043 1308872 922632 232685 4977 229685 382877 272717 194876 383814
41170 383814 697802 882663 890266 841285 819502 807754 762934 660125 467307 155073 -219405
41159 -219405 -478462 -446412 -112648 357097 732320 793540 409896 -278266 -801397 -731241
41149 -731241 -175146 291711 255643 -158946 -584325 -817616 -813592 -552825 -156990 47976
41139 47976 -159671 -605422 -900159 -827344 -451551 -422 252943 192600 76142 317638
41129 317638 911967 1360260 1348344 1141691 1026680 763902 50349 -799519 -1200906 -1133187
41119 -1133187 -1042341 -1029136 -772778 -265351 38436 -29031 -26296 408802 1021444 1380357
41109 1380357 1443786 1350135 991494 215687 -720246 -1282579 -1234835 -856700 -592547 -606152
41099 -606152 -668085 -432255 141252 665880 726696 328664 -210456 -692489 -1078249 -1193747
41089 -1193747 -833202 -223093 53772 -202001 -500708 -337771 145328 460929 458645 360445
41079 360445 301085 205640 47490 -98682 -240619 -422495 -491740 -193930 413083 861798
41069 861798 747496 200482 -242276 -212690 120870 260490 -99282 -763273 -1196871 -972662
41059 -972662 -138024 761922 1074236 604667 -179952 -633879 -600999 -425026 -335198 -159186
41049 -159186 248729 662696 810304 731224 533066 116711 -486818 -821799 -531261 55721
41039 55721 369263 420947 597681 811006 572866 -85342 -501460 -340885 -26139 -22524
41029 -22524 -292544 -648335 -1019610 -1139843 -641570 197005 476024 -101926 -671018 -431500
41019 -431500 149210 82735 -635135 -1091202 -820984 -315575 -168616 -386556 -666526 -844528
41009 -844528 -889727 -788749 -577148 -312489 -28213 139686 -54777 -593365 -991350 -805057
40999 -805057 -217225 218764 298922 266805 283355 216814 -5899 -192984 -157623 2543
40989 2543 -13206 -411175 -1050561 -1460196 -1273089 -710871 -390349 -535990 -700515 -451079
40979 -451079 31527 315790 317872 187295 -59984 -384050 -510622 -324892 -186686 -385755
40969 -385755 -581723 -317641 188468 367426 190665 96936 194114 201522 79602 38237
40959 38237 -16851 -352362 -750464 -699237 -258122 1832 -19453 189044 768494 1187248
40949 1187248 1176343 1158639 1362323 1276021 514325 -412701 -783345 -618464 -388932 -217023
40939 -217023 34751 240567 199517 114857 321256 691222 809041 604861 360493 199865
40929 199865 17428 -161107 -170460 -45516 -15799 -150552 -292458 -345271 -384302 -471046 -538673
40918 -538673 -467096 -187076 214473 454083 307137 -21522 -42361 372370 778340 770433
40908 770433 480154 230434 49636 -142852 -207483 -68936 -60949 -499419 -1082509 -1212731
40898 -1212731 -828079 -436301 -358709 -408574 -350282 -235080 -174084 -133122 -68605 7684 156661
40887 156661 434244 674660 672805 602395 866589 1438326 1761234 1510394 1076946 996488
40877 996488 1195015 1180936 798337 365823 117059 -72469 -302337 -363783 -92017 228959
40867 228959 149422 -305491 -586767 -299040 301537 629309 420727 -99983 -554234 -683747
40857 -683747 -398030 161089 592414 534240 69967 -350713 -443367 -339582 -255381 -163046
40847 -163046 51442 294683 337135 111411 -194348 -317159 -157578 97968 107602 -249396
40837 -249396 -654951 -691823 -377004 -119031 -148572 -297692 -402016 -563055 -837298 -987480
40827 -987480 -797192 -402994 -79663 102599 201834 221261 234720 432332 740106 660868
40817 660868 -81501 -915045 -958394 -193740 411181 147307 -495833 -516132 199810 676796
40807 676796 176475 -711633 -762369 235790 1130578 933937 124980 -135623 316337 594291
40797 594291 278951 10691 279034 534639 140678 -463662 -372631 384725 896699 705945
40787 705945 314496 261543 355396 103570 -502471 -940245 -741892 21794 781678 995929
40777 995929 696955 416774 505089 739933 755815 568836 420935 379063 411110 599048
40767 599048 895873 907904 363477 -373805 -714587 -630931 -569540 -690367 -700340 -422352
40757 -422352 -46690 226556 384115 403459 239174 31000 -35475 -94797 -478046 -1195109
40747 -1195109 -1845118 -2042374 -1677805 -869453 22124 472648 284134 -116293 -239510
40738 -239510 -200917 -371867 -614051 -475207 18260 439863 712490 1036124 1157048 594805
40728 594805 -336283 -678555 -247483 35048 -382250 -782771 -354401 532761 973580 867115
40718 867115 803137 988050 1068803 855449 557242 344619 165181 -26158 -187461 -272544
40708 -272544 -189510 132095 469787 431468 59464 -108095 129780 225984 -269431 -919223
40698 -919223 -1002966 -539386 -102811 100179 332479 665191 826052 673429 343596 -38343
40688 -38343 -412694 -647484 -690953 -704237 -724610 -471014 119542 505666 223700 -357968
40678 -357968 -589595 -559184 -816287 -1273101 -1252574 -650168 -194458 -347813 -684217 -648978
40668 -648978 -307127 -2340 194845 334123 303440 56390 -171891 -140646 126458 456236
40658 456236 630378 378363 -283278 -675780 -37885 1306695 1996537 1247700 -113201
40649 -113201 -726337 -358611 115714 74976 -227213 -353395 -333652 -401459 -497805 -361356
40639 -361356 35062 399035 503150 502093 703893 1043039 1042526 488138 -104126 -66917 501914
40628 501914 867378 687797 393202 416347 587402 571705 446503 466355 591718 622887
40618 622887 547614 434127 225479 -60218 -182098 -25986 161951 169089 130739 162358
40608 162358 78883 -140404 -68763 459025 809674 409666 -251426 -309981 76876 25093
40598 25093 -511688 -612341 27876 548563 379903 136626 388065 555666 -13246 -686600
40588 -686600 -440067 396984 569335 -112782 -508662 -23095 475844 105429 -656760 -770676
40578 -770676 -144704 430467 493875 342459 380779 618367 830465 849929 684281 550398
40568 550398 693037 989227 941547 324239 -385117 -550446 -164840 285490 584989 940533
40558 940533 1384990 1511811 996455 111030 -466054 -262137 580587 1386922 1494792 884669
40548 884669 204466 29791 250430 379431 228724 -53066 -379891 -704063 -757576 -358194
40538 -358194 111224 117513 -164480 -83692 345965 331033 -412424 -1049506 -781742 69864
40528 69864 717136 1022640 1246398 1190355 494919 -451510 -783198 -322010 257120 446675
40518 446675 413054 423353 443043 469823 663607 913549 788159 168279 -489742 -734959
40508 -734959 -585619 -255297 164323 558172 735718 736768 818486 965393 827236 335796
40498 335796 -73457 -104043 -1812 -28979 -24202 143090 171879 -135137 -370508 -124119
40488 -124119 264364 179914 -297524 -551109 -389647 -187418 -148845 -111057 -81200 -287078
40478 -287078 -586893 -488875 34741 360408 117588 -272612 -303005 -117114 -115187 -242394
40468 -242394 -163811 129446 360628 420563 354102 69259 -486497 -962122 -873198 -240810
40458 -240810 411402 712911 768471 823565 956080 1150261 1357726 1415485 1194201 881387
40448 881387 799756 872742 637444 -55938 -726270 -894399 -713596 -636962 -706192 -580378
40438 -580378 -148994 304998 555701 679030 773752 761797 609035 485447 508246 492834
40428 492834 169328 -419828 -896408 -903188 -404487 312877 845649 936273 659489 371342
40418 371342 399629 739591 1056426 990997 486213 -138831 -436376 -219530 257868 551974
40408 551974 480127 269587 243779 454457 690662 767329 687793 548727 404090 248926
40398 248926 61891 -158257 -342578 -353740 -150603 36762 -124100 -597485 -846005 -429963
40388 -429963 318372 558644 -21584 -766559 -884012 -430724 -99851 -222154 -471455 -532732
40378 -532732 -523120 -587931 -561463 -324053 -116584 -153749 -230971 -85801 121240 100821 -21270
40367 -21270 81796 353343 485613 519481 760481 1131085 1196038 913481 779479 1030673
40357 1030673 1233602 953091 383425 -18073 -162536 -237838 -259745 -75375 329035 770447
40347 770447 1002399 795194 109734 -690359 -1074235 -926042 -612048 -390461 -158592 90468
40337 90468 95299 -96735 83323 902074 1712655 1696049 919537 170762 -3457 361810
40327 361810 977825 1456372 1371026 684792 -50926 -349164 -386853 -527608 -631402 -426827
40317 -426827 -193637 -343865 -618579 -504016 -205205 -315282 -689448 -641229 -198990 -88948
40307 -88948 -384383 -319290 277336 524610 -37622 -601481 -387250 170814 314991 176593
40297 176593 190147 43981 -710671 -1508685 -1357573 -355152 382944 237389 -344999 -758621
40287 -758621 -880593 -744873 -338522 105854 205175 -40133 -268369 -331221 -358274 -293624
40277 -293624 39727 397101 274331 -266803 -553342 -284408 17422 -176588 -638240 -799505
40267 -799505 -558986 -300923 -343188 -660814 -997894 -1052655 -699890 -166398 156796 133611
40257 133611 -64436 -304106 -588334 -787986 -655925 -243409 36924 -61488 -322466 -458991
40247 -458991 -489618 -520089 -455016 -203497 52797 84140 -36057 -49813 109879 256271
40237 256271 196544 -80589 -386920 -448883 -183619 93905 -52488 -614422 -1079945 -1057522
40227 -1057522 -728026 -534210 -649522 -910822 -1041962 -768589 30838 1046218 1627792
40218 1627792 1437472 861282 530825 588743 685956 562515 333084 256219 453929 804885
40208 804885 946315 515236 -395028 -1155359 -1227574 -758164 -304810 -114809 17020 276591
40198 276591 567313 708903 621093 322032 -30191 -170396 -41389 56455 -81364 -160606
40188 -160606 146592 543836 513423 270231 557757 1383142 1766260 1117803 145026 -159926
40178 -159926 167776 431037 459329 621853 929416 973945 710254 531139 519432 346993
40168 346993 28054 42620 481182 768065 580336 385528 604175 840352 558736 54418
40158 54418 12204 374141 419061 -98476 -618021 -674631 -483209 -402856 -366853 -175685 54090
40147 54090 123236 174430 496169 1016254 1322232 1180814 799061 526930 459417 407941
40137 407941 192430 -127085 -348001 -417845 -506174 -710438 -825886 -600742 -162669 46501
40127 46501 -195646 -615343 -772618 -520987 -74380 245756 260531 54997 -78650 77415
40117 77415 382655 433092 337 -695943 -1192170 -1202185 -831332 -428905 -224860 -114816
40107 -114816 89749 215699 -158803 -968235 -1408242 -857226 187995 655768 278316
40098 278316 -194192 -175001 64661 95171 35445 140669 229847 39062 -245667 -310607
40088 -310607 -250330 -297153 -319998 -118105 57269 -132351 -415913 -223640 369041 643641
40078 643641 248969 -356502 -618797 -559026 -517677 -600218 -619410 -385475 84674 522622
40068 522622 587173 252738 -89626 -150417 -173761 -492850 -845652 -644354 143077 913944
40058 913944 1239335 1229156 1064492 739899 388304 304320 458351 476920 254055 67434
40048 67434 -33154 -328198 -728873 -690829 -169585 63560 -445138 -1062749 -1049992 -681372
40038 -681372 -626723 -742163 -385730 380779 839239 736280 497733 367342 163186 -68621
40028 -68621 23002 366189 410551 14067 -296840 -190867 11371 31610 117622 427497
40018 427497 518435 -39869 -953113 -1566473 -1617818 -1250808 -635490 5244 310231 170626
40008 170626 -20463 115483 414638 502347 354048 128555 -237125 -765223 -1032630 -616142
39998 -616142 180275 597714 375292 -65820 -342824 -491730 -608403 -622072 -535170 -478305
39988 -478305 -441930 -314336 -197799 -274594 -365389 -118150 320282 387826 6415 -190316
39978 -190316 202124 735002 788674 409724 42818 -177890 -394601 -573311 -557142 -385544
39968 -385544 -173228 136790 544629 754160 564668 284433 319981 543169 526416 246097
39958 246097 61872 110211 213522 308078 458697 516302 299148 82946 332729 912549
39948 912549 1148940 768443 181973 -271537 -699126 -1064228 -949612 -316652 141079 -67037
39938 -67037 -472859 -413981 -76483 -81623 -403957 -504705 -348415 -432478 -789339 -792934 -192192
39927 -192192 379067 314476 -95416 -179292 125342 329235 218024 79081 128177 187502
39917 187502 73564 -47880 63130 294860 317056 86527 -48228 179436 583641 779055
39907 779055 659407 419478 186960 -104135 -454118 -669434 -611076 -395107 -222115 -134114
39897 -134114 -40174 128300 357705 532836 461611 106554 -192321 -9612 548229 829842
39887 829842 435620 -262300 -636243 -551101 -295311 -52009 150102 164774 -115888 -419692
39877 -419692 -362410 -28965 147955 75803 85781 268370 254312 -125522 -438810 -267005
39867 -267005 118295 114854 -359273 -787191 -772528 -472329 -261939 -268573 -378287 -499830
39857 -499830 -619843 -683668 -631192 -564102 -680804 -947121 -1011889 -640238 -89792 217482
39847 217482 297142 493195 784299 715155 213812 -54081 424089 1155126 1217841 460003
39837 460003 -426322 -867696 -878044 -655808 -332601 -159611 -352409 -633441 -480566 25133
39827 25133 174353 -322765 -835649 -695492 -72119 429721 600087 589148 427271 107451
39817 107451 -122736 -81799 -83297 -529743 -1200227 -1452820 -1085910 -517228 -114960 170268
39807 170268 445755 604152 563321 436295 324787 225446 220111 437824 729868 730159 386484
39796 386484 85357 61122 47073 -213602 -473238 -398570 -207008 -373319 -816346 -910235
39786 -910235 -354424 432550 914837 1016678 913171 646913 255479 -12665 50945 323730
39776 323730 573667 766407 885029 716277 210960 -169943 33525 547330 669905 255777
39766 255777 -172502 -299043 -362072 -502151 -443191 -117756 19882 -278978 -568600 -429418
39756 -429418 -177016 -291859 -581032 -549914 -260153 -121169 -83454 217025 648819 670027
39746 670027 206067 -253756 -473155 -702908 -1000436 -991597 -528108 -7502 215333 256381
39736 256381 320021 346907 284260 297377 463013 589334 539453 424468 337730 227229 134067
39725 134067 185809 249260 -3979 -552036 -942833 -900569 -624657 -363066 -101877 183751
39715 183751 383127 492851 611409 610378 265732 -211761 -306825 24419 261851 137039
39705 137039 -46890 -59343 -66777 -132079 -76710 -51142 -471549 -1104756 -1076363 -221062 447632
39694 447632 176029 -475682 -679541 -572836 -611649 -504476 170902 898817 880952 348903
39684 348903 171121 476008 689325 654779 668353 625375 218050 -168915 114565 706729
39674 706729 531675 -529557 -1379210 -1326087 -904548 -758194 -728631 -518814 -371052 -522417
39664 -522417 -680962 -573036 -441975 -543620 -657913 -507219 -190491 124904 443320 590169
39654 590169 218594 -464024 -596931 199065 1114843 1163539 489813 50192 259541 595637
39644 595637 482538 25145 -251095 -85576 236721 220725 -256412 -770092 -873279 -668607
39634 -668607 -582637 -685076 -655047 -409109 -267251 -379531 -464011 -318049 -168228 -255392
39624 -255392 -415486 -345874 -50018 189621 108435 -346413 -898114 -1018613 -435458 438253
39614 438253 918242 856270 640206 486479 287038 131348 304677 644455 579167 40874
39604 40874 -306705 -46638 405189 546182 524665 700402 985683 1093763 1029345 907874
39594 907874 669548 359503 301139 597589 830591 636862 234444 31350 77183 223320
39584 223320 419854 528612 292206 -158207 -249740 185773 525074 263517 -210950 -269934
39574 -269934 44757 345362 631661 1024983 1200309 823949 241661 18676 74159 -19834
39564 -19834 -160769 75624 538719 633135 289497 42411 114478 123649 -203431 -635901
39554 -635901 -870453 -847390 -564211 -57865 367366 361683 61947 2141 429229 1045527
39544 1045527 1439546 1457481 1180528 832853 656363 642817 534130 267409 99705 63194
39534 63194 -197461 -653873 -590718 282095 1032428 704726 -188296 -422716 66204 288190
39524 288190 -6134 21222 714492 1285847 1136648 701653 505854 371315 75649 -109490
39514 -109490 -77006 -226187 -596676 -525765 193003 658327 142711 -716433 -866175 -354680
39504 -354680 17696 52617 166700 374879 254294 -185941 -453019 -357549 -130226 177993
39494 177993 671927 1014533 635231 -329961 -990584 -813394 -226663 94144 21747 -195837
39484 -195837 -425189 -617768 -627496 -412256 -219118 -286077 -502752 -597616 -527250 -440210 -353993
39473 -353993 -150074 101058 93336 -268745 -552972 -206493 714480 1481121 1472862 801037
39463 801037 -2365 -640772 -1085516 -1206011 -886367 -463406 -493325 -947427 -1130123 -622340
39453 -622340 124729 414428 136609 -337230 -720008 -877656 -639272 -13756 557820 597796
39443 597796 182765 -187671 -235054 -112609 -65469 -199719 -522813 -897129 -999108 -646450
39433 -646450 -152427 -23326 -259253 -291004 231267 852306 793574 -48156 -869260 -877560
39423 -877560 -271809 22057 -383120 -785164 -435198 295667 444807 -67566 -367861 -112836
39413 -112836 -61345 -712877 -1294771 -910039 -14136 257679 -175258 -385412 -78062 -25600
39403 -25600 -665805 -1323471 -1304706 -928157 -854198 -1028733 -989725 -769124 -736231 -792950 -480096
39392 -480096 161801 530994 370301 121301 151867 196757 -49482 -260861 24242 512830
39382 512830 452039 -211806 -672716 -463269 -133782 -303350 -635354 -435610 146673 363548
39372 363548 130573 112655 487897 579915 41874 -477721 -383169 -90426 -260826 -686228
39362 -686228 -721689 -384004 -187416 -183366 -11716 260537 204112 -101342 -70607 430792
39352 430792 860844 859237 654847 461916 136783 -339340 -653722 -704033 -784996 -969980
39342 -969980 -876052 -364387 80934 69540 -94621 29725 297909 300664 62459 -81800
39332 -81800 -53623 -6511 58445 210181 300721 192951 113322 328062 595442 429427 -130419
39321 -130419 -503326 -389416 -166913 -306297 -741804 -1053930 -1035849 -826866 -607709 -401337
39311 -401337 -170788 47336 163122 115130 -107721 -460067 -783912 -824160 -465390 26523
39301 26523 207966 28326 -10532 503158 1250235 1496757 978691 138835 -504333 -868181
39291 -868181 -1117971 -1306496 -1374286 -1310130 -1178646 -1079009 -1050396 -895676 -280500 701513
39281 701513 1286287 858861 -111657 -572954 -302416 -98017 -439070 -772657 -492672 136753
39271 136753 567830 802632 985521 762834 -121936 -995586 -923607 -57898 503026 175274
39261 175274 -520289 -865442 -750177 -434986 -111400 79330 27874 -156213 -243751 -209386
39251 -209386 -134108 133852 755701 1382414 1420119 896636 518414 699932 1039232 978048
39241 978048 525741 51218 -268750 -496886 -705684 -950553 -1265246 -1515932 -1465791 -1099833
39231 -1099833 -669520 -354759 -143457 -78163 -286485 -691438 -1028562 -1219550 -1365192 -1320950
39221 -1320950 -754150 221951 956103 1058075 869937 859978 951036 794406 375277 -21489
39211 -21489 -206762 -148994 120481 400915 379054 49934 -186128 -90725 48778 -124484
39201 -124484 -553555 -1019544 -1491937 -1878092 -1828617 -1243480 -613946 -365822 -208736 297338
39191 297338 868212 886100 429539 134737 138493 -2129 -301118 -155112 564698 1064110
39181 1064110 747514 109644 -90498 1253 -269991 -850339 -1010574 -568524 -268103 -666054
39171 -666054 -1266692 -1239958 -621781 -229206 -492060 -921624 -863468 -334114 161440 328724
39161 328724 248888 45201 -213525 -347555 -189900 113175 254501 212084 192654 167068
39151 167068 -70464 -353715 -235667 204339 277789 -255647 -684436 -413568 48097 -123331
39141 -123331 -735607 -897213 -439258 -109789 -336571 -652013 -559581 -251517 -139928 -223798
39131 -223798 -256162 -124173 207739 753045 1260316 1283392 743931 109985 -181972 -150081
39121 -150081 49059 426325 864534 922243 349221 -434493 -752281 -436276 99836 422792
39111 422792 454374 377952 398019 563313 715534 664718 432697 198000 40165 -38317
39101 -38317 95948 529585 919543 754034 126874 -220059 138912 741904 921976 649869
39091 649869 345429 219979 214585 299581 429058 438165 348090 498438 987547 1288015 902246
39080 902246 147365 -243555 -102455 152651 302013 473901 570563 258196 -343566 -607064
39070 -607064 -269363 195580 361326 470162 866333 1267833 1160765 669168 442204 711871
39060 711871 988514 813189 372805 107244 22902 -214037 -616973 -737660 -301277 332638
39050 332638 576207 295440 -146153 -367759 -223368 266985 851880 992951 355082 -582274
39040 -582274 -896355 -387855 109298 -113753 -643238 -575215 193196 885067 928766 572261
39030 572261 363305 440428 498037 232740 -296056 -693422 -650080 -348128 -251501 -440888
39020 -440888 -492395 -182194 108606 13831 -216291 -196702 -110754 -338781 -673633 -603119
39010 -603119 -223474 -138806 -467263 -665046 -428333 -85186 84544 272296 621930 857771
39000 857771 751236 499012 334718 167548 -112473 -339123 -340955 -176628 96769 521331
38990 521331 924715 941012 578706 328195 426100 456806 25592 -588308 -844658 -657535
38980 -657535 -305321 52158 352084 396156 73169 -346841 -476125 -235010 178498 502216
38970 502216 443753 -115816 -748486 -779695 -225178 136138 -34575 -83195 411302 655463
38960 655463 -160479 -1294487 -1307303 -201646 594963 386508 23628 269170 628354
38951 628354 434609 31516 33945 216660 58343 -198007 42 378937 151408 -675558
38941 -675558 -1226897 -1035543 -573832 -347012 -204325 122783 402476 273568 -140281 -411197
38931 -411197 -387728 -266512 -251013 -418397 -778227 -1197721 -1394989 -1260865 -1057635 -1020987
38921 -1020987 -913085 -362541 410147 689238 208637 -451018 -663972 -544163 -535231 -576273
38911 -576273 -278874 208374 220181 -385144 -825483 -404022 520141 1013005 721823 87921
38901 87921 -395161 -631586 -694329 -628142 -542787 -519878 -349686 285713 1258694 1952885
38891 1952885 1924849 1350346 699778 261833 134412 360104 797810 1073205 931714 520567
38881 520567 138423 -117646 -260212 -208217 9405 34999 -430645 -1097358 -1353612 -1070545
38871 -1070545 -722304 -634108 -569055 -269412 46694 116040 202583 695333 1301553 1270668
38861 1270668 498591 -190027 -148295 207813 88113 -450880 -607082 -73932 468362 297496
38851 297496 -419456 -976678 -1056447 -882486 -650865 -299614 127189 307534 55729 -305989
38841 -305989 -242912 349732 961988 991142 391745 -279839 -490064 -299808 -192903 -396559
38831 -396559 -599995 -425899 34629 348651 283122 15840 -146051 -77716 124263 270115
38821 270115 233881 70763 -41256 -27555 10889 32817 199718 588617 892018 695004
38811 695004 53287 -461392 -379683 156031 570360 447228 -88713 -526346 -522383 -313068
38801 -313068 -427077 -929695 -1232064 -884218 -264878 -67050 -303227 -378216 -94431 66372
38791 66372 -170168 -333114 42215 574346 469309 -400101 -1298348 -1471545 -885093 -129124
38781 -129124 209662 80203 -53048 180899 530274 458144 -30286 -353594 -260539 -205489
38771 -205489 -491000 -614645 -50914 755740 924867 443125 155631 496067 976466 1047262
38761 1047262 770213 416811 21115 -349414 -389391 14622 522394 799439 886678 872458
38751 872458 618135 132954 -176508 -22767 317887 454350 453707 546833 567929 197131
38741 197131 -426153 -829174 -838852 -659019 -435651 -186375 -54300 -163498 -293407 -170680
38731 -170680 -21767 -305646 -896391 -1101557 -608062 115774 520858 573863 460899 227308
38721 227308 20938 209471 834364 1307167 1101074 506921 279181 683253 1254003 1379339
38711 1379339 829207 -139375 -908924 -916359 -279680 158936 -214372 -952081 -1105490 -510151
38701 -510151 20594 -157348 -700534 -855902 -492181 -208736 -543467 -1336691 -1909907 -1779441
38691 -1779441 -1137654 -580493 -390048 -284446 32287 358953 320792 -15388 -247139 -238946
38681 -238946 -183134 -115011 137105 470632 498004 185347 13592 244055 470823 243069
38671 243069 -262097 -596188 -726540 -872628 -905422 -500527 170765 481352 200280 -158912
38661 -158912 -60176 330025 420673 -6068 -569229 -806357 -676213 -472983 -370243 -214907
38651 -214907 166346 580197 604683 148281 -363030 -510374 -390696 -358259 -408227 -165273
38641 -165273 498407 1144506 1214463 640646 -97422 -445431 -257629 115483 204286 -67529
38631 -67529 -306408 -165757 188518 311489 62446 -307865 -579096 -738534 -737931 -456356
38621 -456356 -24667 165186 -33681 -310134 -387347 -389953 -434919 -221803 488885 1212054
38611 1212054 1144328 239822 -648347 -824011 -475889 -154515 17212 249459 518440 540616
38601 540616 220141 -211435 -475525 -446456 -153994 189132 263814 2825 -222287 -51945
38591 -51945 321655 405123 126898 -101900 -60046 10594 -75075 -118999 26118 117481 -53125
38580 -53125 -249632 -191734 -65050 -193443 -444145 -456156 -299527 -365668 -661922 -770567
38570 -770567 -555209 -372554 -439833 -477197 -195092 270824 648069 895589 1042136 980694
38560 980694 687189 378057 216024 111655 15786 108671 460771 805974 910794 868251
38550 868251 771507 469294 -12459 -209737 145044 577738 519693 192886 181000 354823
38540 354823 53996 -690413 -1008120 -499785 106017 35053 -439420 -530390 -93600 339314
38530 339314 388582 129534 -254964 -623129 -784571 -713400 -757212 -1170471 -1501066 -982815
38520 -982815 357995 1494982 1566219 872386 365369 393914 403458 -139581 -939979 -1206842
38510 -1206842 -602659 390722 1025543 998937 558317 94404 -196339 -334713 -452344 -682896
38500 -682896 -1024298 -1293086 -1320944 -1165402 -978619 -717245 -213432 456169 930873 960859
38490 960859 602154 -13268 -750326 -1211366 -885796 99921 803609 551553 -101845 -120801
38480 -120801 512442 839959 491240 291866 909232 1681742 1520905 497263 -303345
38471 -303345 -302536 25675 155206 229783 482129 605947 229879 -376709 -608554 -337399
38461 -337399 52297 321015 583765 858934 883405 556919 225906 258497 519351 522652
38451 522652 47497 -599546 -959078 -935252 -859220 -1038896 -1321486 -1254718 -740581 -316974
38441 -316974 -539465 -1213211 -1612763 -1460901 -1234422 -1331335 -1417869 -1001527 -287143 89730
38431 89730 -9741 -173977 -248014 -500782 -855126 -688782 180473 925156 738437 7646
38421 7646 -258067 101678 335373 124551 63191 527999 913841 549571 -227075 -569009
38411 -569009 -295872 111476 433208 897971 1514352 1894135 1826918 1485556 988369 301244
38401 301244 -330281 -446711 -84862 129737 -124287 -410150 -314385 -152765 -415298 -930232
38391 -930232 -1136832 -907023 -560668 -282314 -54281 -5145 -281988 -647905 -684221 -343737
38381 -343737 101740 532151 930170 1013426 502504 -274514 -624635 -380405 -16960 146198
38371 146198 268815 420214 317492 -121416 -489939 -446521 -145931 103731 216573 188127
38361 188127 13951 -87600 146773 452585 203770 -594522 -1080076 -676789 94722 402739
38351 402739 196863 11591 130344 495702 1068352 1693824 1907678 1436813 677474 206339
38341 206339 76824 42206 123186 402785 575455 311429 -167796 -443734 -559476 -736718
38331 -736718 -756064 -322323 222590 323553 136092 210249 436575 233061 -290104 -354579
38321 -354579 204585 664283 629678 561404 765753 806260 399255 45338 191422 497072
38311 497072 548385 629577 1091859 1530426 1363939 823292 595146 751437 757711 386419
38301 386419 -43435 -276662 -403656 -531886 -617917 -623780 -516910 -204013 239745 445646
38291 445646 186960 -246857 -447997 -433923 -425450 -369214 -165091 -111566 -532291 -1107875
38281 -1107875 -1192738 -728792 -238435 44988 364587 717374 692410 267065 74337 486480
38271 486480 1004761 1028757 750653 730250 945206 897648 479858 107918 23100 22735 -41261
38260 -41261 5073 276046 596807 831001 1049920 1173126 854617 50357 -662093 -760125
38250 -760125 -503347 -487179 -669376 -474630 136636 396138 -204208 -1115977 -1413094 -902581
38240 -902581 -149224 320894 396747 157627 -254708 -585458 -657791 -592430 -555952 -398470
38230 -398470 108229 761202 1069698 913763 669858 617697 582052 287203 -217450 -627657
38220 -627657 -703556 -455032 -146909 -94525 -308529 -454266 -343485 -241570 -382955 -471675
38210 -471675 -161474 213413 66597 -398807 -396811 110221 188114 -599567 -1343405 -1049195
38200 -1049195 -119090 225682 -340074 -924956 -758678 -145382 101176 -287012 -818792
38191 -818792 -905197 -515076 -114347 2386 108208 540592 992875 806779 -16423 -688321
38181 -688321 -716935 -513824 -560928 -586386 -163672 352511 273294 -258799 -353633 339003
38171 339003 1112168 1170413 587458 20940 -152874 -104890 -159429 -419800 -745305 -933006
38161 -933006 -886744 -657497 -379961 -220900 -323895 -648752 -886997 -753103 -378422 -158361
38151 -158361 -177228 -135972 40503 -34848 -555642 -1020155 -814042 -52374 599321 798869
38141 798869 792976 871433 965693 852576 481957 24359 -268056 -255268 -59578 49176
38131 49176 -25395 -164970 -370628 -843017 -1548341 -2003461 -1781923 -1034986 -259610 251103
38121 251103 490807 510183 389954 260926 115892 -191300 -568246 -619458 -221830 184176
38111 184176 212965 84820 158179 283559 135931 -127584 -141338 -32674 -199110 -506721
38101 -506721 -387349 245054 800292 858777 674918 638430 673401 450314 -51564 -436577
38091 -436577 -307629 254690 650407 371761 -304102 -566932 -166997 204950 -41000 -495354
38081 -495354 -456505 -85340 -81940 -469740 -569637 -158171 186181 57430 -184402 -93341
38071 -93341 150388 76620 -371410 -786353 -794020 -443222 -154280 -238916 -439003 -220985
38061 -220985 334408 426988 -291727 -983580 -704642 227042 732877 478797 -24056 -523413
38051 -523413 -1155620 -1594982 -1245474 -390173 -23065 -314075 -374012 118567 261526 -503584
38041 -503584 -1281880 -1028931 -103842 399516 234421 5495 56643 221636 381805 518568
38031 518568 433025 46316 -244505 -75429 263381 249064 -87897 -314289 -256727 -8539
38021 -8539 407688 835845 790537 111520 -488833 -260793 428855 586997 116770 -62109
38011 -62109 480456 986314 733508 204990 352545 1099444 1346125 471815 -800541 -1333917
38001 -1333917 -962321 -453124 -242074 111248 933424 1545861 1079290 -113910 -722949
37992 -722949 -184184 702053 1053126 941809 738171 275938 -580745 -1170721 -774501 163614
37982 163614 442566 -306433 -1184323 -1243334 -501516 396673 959552 1028969 609070 -119778
37972 -119778 -752075 -872440 -389827 323017 647879 239646 -591590 -1170042 -1188670 -943999
37962 -943999 -789931 -693327 -487535 -210531 46252 303221 474485 342895 9634 -47030
37952 -47030 304042 505629 125824 -416800 -474111 -144050 -18867 -237541 -422196 -374700
37942 -374700 -234505 -78121 88350 87857 -148640 -269287 -31652 130234 -235341 -645582
37932 -645582 -270240 665227 1061775 596517 163419 396728 757546 591252 217188 274106
37922 274106 631734 713304 475362 332793 359946 238733 -101217 -353355 -327806 -137869
37912 -137869 98240 362313 515782 300142 -337050 -1085675 -1508195 -1382023 -862627 -366393
37902 -366393 -207379 -312596 -408169 -451866 -624407 -866388 -791597 -261361 264283 246687
37892 246687 -255316 -725513 -877818 -899506 -1035362 -1192421 -1060479 -542741 24767 182785
37882 182785 -70667 -193232 175126 587216 337446 -427111 -746474 -161344 632818 814284
37872 814284 555829 566290 945958 1188341 1090598 949673 903235 725184 332289 -64284
37862 -64284 -376096 -672761 -759110 -330067 333039 501147 96963 -33897 613951 1315047
37852 1315047 1110082 197881 -413231 -333135 -78198 -71148 -155365 -161417 -227736 -359833 -277807
37841 -277807 46527 212920 12205 -233568 -208244 -42343 56999 187734 448405 643726
37831 643726 623108 544006 479408 176958 -405299 -744495 -408913 296293 826860 1152283
37821 1152283 1437261 1379949 639259 -318270 -629804 -224036 177795 217825 247900 471169
37811 471169 595873 541359 661652 961171 876218 237024 -296869 -248338 -70447 -302049
37801 -302049 -623639 -470062 -66643 -48834 -392953 -540187 -381336 -309778 -366313 -128676
37791 -128676 455057 839148 707668 437648 445094 560472 422463 125286 41909 202862
37781 202862 285001 173944 124766 243475 173265 -377842 -1002900 -969397 -268418 221333
37771 221333 -104053 -714819 -735474 -215699 72073 -88810 -100699 372782 880231 987549
37761 987549 898576 925096 978481 979687 1149016 1430353 1256315 463411 -140037 179319
37751 179319 931007 1063584 430984 -194888 -335728 -215832 -77665 104899 209957 -1681
37741 -1681 -326707 -225674 354389 801218 639584 58666 -474423 -687275 -489966 56326
37731 56326 606205 750752 521224 359392 506104 748608 830442 742173 513046 86015
37721 86015 -446936 -790111 -786421 -593482 -421932 -314762 -257727 -289838 -415896 -563090
37711 -563090 -662312 -660046 -498162 -209781 72115 335475 710608 1060486 847535 -178613
37701 -178613 -1347155 -1614079 -737400 469036 1043335 720693 -52632 -581421 -428376
37692 -428376 202061 605344 370714 -80867 -65765 421713 752699 538116 15998 -391628
37682 -391628 -494332 -314482 -10456 188539 230889 310126 451850 324357 -173978 -504046
37672 -504046 -199598 338631 415901 129597 116888 410713 412896 -31760 -409309 -472023
37662 -472023 -564895 -838807 -920251 -624027 -307709 -242711 -229756 -65075 168641 425894
37652 425894 737278 856517 537342 201422 517977 1215443 1248721 387233 -363176 -309214
37642 -309214 -15932 -147734 -367449 -152893 158362 30717 -257710 -184978 -1295 -239050
37632 -239050 -657602 -626021 -241701 -147790 -434143 -574271 -346030 -52165 103353 186273
37622 186273 169781 24112 42633 452609 835501 588929 -130315 -566003 -385129 82158
37612 82158 523786 889872 1010247 685703 216351 180512 593944 891491 814941 685220
37602 685220 683901 539018 154969 -68631 116336 331513 100773 -495164 -977052 -999755
37592 -999755 -543559 123808 534844 404493 46410 38976 373837 408769 -135592 -651211
37582 -651211 -468498 230498 765698 884570 832002 723513 405856 -95999 -481560 -617064
37572 -617064 -711448 -917959 -1042887 -830138 -355131 55141 214878 228133 254129 271657
37562 271657 169544 2496 -6193 217844 418294 311626 14073 -48080 306907 749641
37552 749641 838273 533820 170900 18906 49959 106413 117796 105612 94670 90539 79374
37541 79374 3771 -186558 -394751 -374417 -8362 429381 466770 -22609 -593490 -683025
37531 -683025 -227836 305459 453894 161450 -312695 -655607 -608453 -64830 720200 1146972
37521 1146972 775985 -138355 -809984 -722086 -149774 230032 144339 -57733 22540 302159
37511 302159 418072 264982 38317 -196473 -611742 -1174912 -1426582 -991421 -154005 372796
37501 372796 221935 -308874 -693883 -714594 -516082 -310019 -148259 31570 206470 220850
37491 220850 39083 -61078 186072 521351 343415 -445011 -1144758 -1084312 -412344 246306
37481 246306 575406 583693 192726 -569053 -1147439 -929362 -132042 396556 321685 145803
37471 145803 281813 484119 483668 556157 998234 1485624 1452939 855270 150913 -269761
37461 -269761 -309005 -35412 322120 419442 152120 -155134 -157452 69750 236988 293770
37451 293770 380446 475627 403933 120414 -264938 -667862 -1013451 -1149193 -1020283 -831404
37441 -831404 -772212 -672719 -234373 430478 806829 576216 -49168 -654130 -1027453 -1130735
37431 -1130735 -919200 -436989 26130 136884 -93884 -301224 -205409 70918 201464 49562
37421 49562 -250915 -508205 -623219 -599308 -548748 -613809 -725007 -565339 -16668 501176
37411 501176 502574 157051 72615 377738 596006 544988 689228 1270005 1719053 1460749
37401 1460749 814509 523713 753796 1116268 1355271 1442311 1298789 1002826 965366 1308305
37391 1308305 1413662 765968 -109082 -328091 48935 287036 265815 453655 732340 432206
37381 432206 -341004 -590071 15424 539841 249722 -282837 -216661 204179 138771 -492752
37371 -492752 -907798 -526115 400170 1139784 1174727 650814 252660 446725 885457 892698
37361 892698 424299 27345 -71361 -162830 -311729 -146471 438491 1029276 1312842 1333012
37351 1333012 1044672 342981 -353087 -373952 143584 314373 -151870 -573753 -550215 -574999
37341 -574999 -942705 -1065274 -534322 41923 11005 -295513 -267463 -39831 -30445 -103683
37331 -103683 -2823 -40570 -536724 -1055040 -994033 -520184 -190992 -77059 39538 44994
37321 44994 -191706 -305550 19746 378760 243376 -142588 -198062 38444 144007 160631
37311 160631 419037 779318 816939 568366 395886 319413 151115 57857 288959 551082
37301 551082 367920 -92497 -244375 -19378 104268 -55582 -162713 -396 222075 260868
37291 260868 119761 -80332 -199264 -91107 231819 554343 743770 857209 829979 424368
37281 424368 -303366 -890222 -1055586 -986842 -852698 -565106 -246954 -302202 -701250 -843024
37271 -843024 -483838 -125488 -98381 -4967 460563 896233 913186 726068 524294 90837
37261 90837 -395398 -122856 1061103 2043457 1955076 1390251 1230370 1194843 646192 -20208
37251 -20208 -44245 281441 109952 -511373 -833360 -637843 -242187 285213 906347 1086457
37241 1086457 502610 -189739 -273990 -113642 -374391 -734687 -513067 -2208 35390 -292794
37231 -292794 -364851 -253775 -403160 -605223 -492924 -490122 -1019785 -1368356 -696912 404579
37221 404579 800037 636753 765662 978546 566457 80047 576954 1460837 1141622 -254416
37211 -254416 -929335 -282484 336435 72289 -248627 63469 414057 333048 403380 974276
37201 974276 1350299 1055860 685965 772057 904283 645410 315079 266389 274103 124302
37191 124302 -4731 -73050 -276925 -452465 -253165 49350 -66278 -267379 194743 996688
37181 996688 1039697 301344 -27350 547325 1176128 1201581 971715 822306 585709 413422
37171 413422 763917 1312613 1238967 798448 1081896 1947182 1905542 581136 -447977 -43471
37161 -43471 846249 881610 290190 75422 377328 656118 695988 588553 348024 92803
37151 92803 21179 -23822 -259370 -285786 311012 865210 460018 -307290 -24574 1076585
37141 1076585 1260017 157658 -528229 191359 1103865 990283 446748 397710 452862 9581
37131 9581 -396292 -103250 449729 616208 625915 823050 871532 617979 701900 1432560 2057367
37120 2057367 1960648 1636987 1774143 2325561 3041241 3846277 4224982 3470568 2051803
37111 2051803 1399561 1804741 1953028 1115127 248819 222436 523027 557859 697483 1126686
37101 1126686 1151038 570620 294387 691525 811529 151304 -335361 33595 467635 259430
37091 259430 18902 281042 396829 -51159 -207677 487295 1098116 770495 177970 206392
37081 206392 477730 363786 258539 691095 1269779 1522516 1738053 2144070 2345958 2251622
37071 2251622 2388906 2830340 3117422 3507065 4645950 5800424 5409043 3722467 2689212
37062 2689212 2825220 2644814 1683399 1318673 1842247 1673834 527871 323602 1662112
37053 1662112 2489849 1765058 1299141 2213901 2767399 1732744 803883 1382372 2001131
37044 2001131 1349094 889306 1901964 2804471 2124970 1396286 2317656 3664860 3777359
37035 3777359 3524037 4077437 4390838 3619815 3313797 4427329 5006517 3688525 2487019
37026 2487019 3117541 3740951 2587021 1538712 2597388 4006292 3571651 2674793 3253993
37017 3253993 4022253 3465098 3232385 4684513 5616324 4372526 3418532 4768267 6052005
37008 6052005 5356879 5256315 7444852 8672287 7128607 6979547 10784557 13955145 13346960
36999 13346960 14052935 19994051 25985144 28283626 33678526 46715825 58213516 60960657
36991 60960657 65978676 85143551 110083529 133889667 182074786 282512977 401371003
36984 401371003 451725789 388116912 262808274 163401967 119510081 99685485 77675663
36977 77675663 60458740 56101951 53196441 42095473 30474353 26442027 24565637 18528766
36969 18528766 12847308 12646418 13648687 10842729 7406985 7458143 8215285 6190685 3947332
36960 3947332 4485516 5274960 3531098 1698970 2465405 3530863 2235394 638789 1383330
36951 1383330 2794756 2422864 1554051 2153745 2874713 1899251 558160 681460 1301068
36942 1301068 1049379 940761 1937900 2612401 1921990 1529774 2774345 4016896 3471101
36933 3471101 2092741 1352379 719396 -392106 -746605 367958 1324638 848477 221452
36924 221452 791560 1595283 1424679 970276 986568 609654 -595126 -1185872 -357290 327734
36914 327734 -380764 -1214165 -783690 -6132 -126031 -371514 356230 1313308 1431361 1328106
36904 1328106 1974269 2943828 3597436 4336059 5194859 5019985 3552956 2423866 2540017
36895 2540017 2510806 1295988 255999 650355 1185522 247511 -1242973 -1490471 -787136
36886 -787136 -546287 -694254 -252509 529570 675963 263115 -39933 -314405 -737129 -622088
36876 -622088 359846 1071395 508868 -568250 -1013220 -1093974 -1463431 -1607990 -929196 -191621
36866 -191621 -257789 -474221 84470 841665 782620 236330 14598 -168798 -816048 -1246055
36856 -1246055 -747398 -130880 -433829 -1020029 -700603 140213 319254 -38518 32101 438144
36846 438144 391401 111056 396715 932065 723067 -79167 -403292 -84632 34995 -308855
36836 -308855 -499921 -259645 21750 116224 138304 50624 -174928 -204875 85624 158181
36826 158181 -308056 -691640 -418231 19478 -50362 -302358 -132710 161782 -9005 -408652
36816 -408652 -521087 -555968 -862562 -1041693 -719096 -465135 -805418 -1085241 -572422 51787
36806 51787 -306464 -1269125 -1539274 -895327 -249144 -54612 26454 138953 139657 254768
36796 254768 732404 1123236 928041 555114 579815 571482 -125024 -929282 -723354 306288
36786 306288 908665 667113 308050 205613 -60287 -559735 -681156 -201111 322824 468254
36776 468254 424460 404169 345301 316961 532623 862354 912428 616431 261264 16891
36766 16891 -108894 -53205 101845 -4113 -465063 -773359 -519983 -40703 127421 -11252
36756 -11252 -194127 -388444 -481964 -111665 613448 894762 396469 -108387 43524 331820
36746 331820 39035 -476433 -463674 -26987 312081 614263 1037191 1038719 222309 -617480
36736 -617480 -492625 232373 454756 10410 -434447 -685197 -974773 -1028725 -442674 302279
36726 302279 395448 -4798 -143982 3735 -66708 -250548 -118440 6172 -467732 -1138939
36716 -1138939 -1139896 -640180 -473357 -520859 61728 1115864 1482955 820344 29740 -269874
36706 -269874 -388520 -522422 -357503 24400 21080 -427000 -699777 -617449 -651382 -860241
36696 -860241 -698158 -86199 371138 445387 548733 766025 656916 223229 46575 240043
36686 240043 265253 5992 5471 395085 608414 446166 432937 799455 1060811 929874
36676 929874 738770 643916 311858 -296335 -708252 -794147 -956650 -1205408 -977461 -196229
36666 -196229 427250 515446 536451 812200 929598 599936 260665 331864 614173 838785
36656 838785 1073180 1216288 895816 267372 86350 529738 767586 215173 -577089 -818443
36646 -818443 -495984 46802 749678 1405786 1365834 465841 -362944 -223376 505072 843736
36636 843736 667444 585515 687658 399190 -411807 -1046879 -940727 -411164 -133836 -258009
36626 -258009 -382853 -223128 27545 17558 -298255 -663596 -886140 -979864 -960725 -777348
36616 -777348 -502674 -270069 79819 848219 1752462 1886784 863837 -452553 -921278
36607 -921278 -476890 82708 308506 380488 410487 252265 -23050 -118560 -1981 97981
36597 97981 124709 179098 229704 259951 424895 620956 356026 -362843 -591393 264143
36587 264143 1273816 1152647 154896 -411474 -225910 -118209 -330319 -162565 439455
36578 439455 452479 -539872 -1501604 -1445185 -734726 -223696 -14008 205739 340862 149997
36568 149997 -190732 -365908 -369597 -307587 -187823 -162506 -472612 -939938 -1057371 -748144
36558 -748144 -450220 -344343 -182670 16740 -107567 -485893 -590097 -379124 -416849 -817515
36548 -817515 -978408 -652851 -354039 -337211 -142944 410167 749605 592863 517088 871598
36538 871598 1037109 486804 -238360 -383506 -80150 176648 457490 964445 1252882 775385
36528 775385 -181820 -864435 -1027540 -919797 -672428 -340849 -209582 -442994 -721767 -735283
36518 -735283 -691003 -851968 -977946 -768740 -478393 -510175 -705699 -579656 -28319 628623
36508 628623 1063851 1069038 607466 54451 -22038 365864 542903 180456 -177670 -13636
36498 -13636 331812 251361 -224556 -662744 -896612 -933399 -661981 -181595 49714 -85677
36488 -85677 -40204 458591 724792 95794 -896407 -1163837 -555104 83521 142059 -167871
36478 -167871 -332848 -45449 677363 1388172 1427458 720803 82527 227360 807770 996734
36468 996734 680185 402986 410910 479799 531791 695928 820670 597849 169131 2177
36458 2177 143247 167805 -70128 -199647 11787 246063 114950 -263576 -420731 -140310
36448 -140310 265561 311497 -56149 -332415 -96302 351490 345281 -201294 -680053 -672481
36438 -672481 -405601 -159869 185545 697207 1015397 858063 487755 295288 288812 320938
36428 320938 406569 471606 223487 -348466 -768408 -758107 -698784 -989008 -1338839 -1153677
36418 -1153677 -328438 679849 1280744 1061490 111532 -785244 -838192 -311332 -211962 -721132
36408 -721132 -845483 -41243 829422 849995 415547 373327 617814 551830 294597 364811
36398 364811 634307 607062 365140 324307 425271 414055 472345 711240 601441 -108933
36388 -108933 -525136 160563 1115863 922635 -204593 -753498 -278548 153764 -38648
36379 -38648 -85451 618063 1485708 1777915 1572326 1198656 675742 173735 132888 470954
36369 470954 492004 -38562 -543445 -665388 -748275 -938562 -775483 -149391 273586 142448
36359 142448 37668 376995 588121 113938 -556828 -705226 -553616 -725743 -1086342 -1066874
36349 -1066874 -760609 -744654 -1032695 -1099256 -859201 -801985 -1115519 -1383482 -1265957 -901270
36339 -901270 -506834 -85425 318505 498161 407390 294712 365509 554780 733113 884171
36329 884171 952384 748335 203700 -394331 -607426 -285323 284473 671841 699606 538174
36319 538174 464785 592683 818459 934448 756839 255489 -345505 -671759 -520268 -64033
36309 -64033 309236 316460 -58186 -576677 -871011 -707796 -213058 275471 568351 644339
36299 644339 396540 -232988 -836582 -800715 -198833 131576 -236962 -631337 -283804 483601
36289 483601 777916 474578 248001 443065 698505 675406 472673 270274 136239 195590
36279 195590 446593 470247 -69094 -701605 -628349 80382 512621 234733 -184536 -179630
36269 -179630 19159 -68678 -440875 -771419 -828712 -502200 104500 458815 64142 -693044
36259 -693044 -826886 -104201 619785 709651 563568 655871 628906 58414 -591486 -644689
36249 -644689 -324017 -293499 -489492 -353015 29104 10127 -449772 -666074 -400936 -266512
36239 -266512 -673059 -1132596 -1025693 -481779 -38108 150578 296029 463385 531968 524634
36229 524634 584457 656289 492888 24902 -455289 -549397 -147767 432702 715008 536807
36219 536807 241294 269876 575831 634808 97158 -761469 -1348631 -1350422 -903171 -350841
36209 -350841 -7281 -11199 -192417 -162737 249503 721393 807396 518025 256161 209586
36199 209586 140690 -153154 -502826 -645646 -559771 -342946 -25716 289027 377436 248266
36189 248266 280327 693194 1136884 1186307 996324 985089 1058561 746889 66461 -387381
36179 -387381 -331159 -207792 -478761 -976161 -1255617 -1229143 -1130196 -1092272 -1039961 -868923
36169 -868923 -570578 -259603 -95536 -65816 42911 276911 359633 215266 290176 812353
36159 812353 1114610 517748 -378775 -341758 611558 1151265 630401 -97696 -254243 -255355
36149 -255355 -601376 -852565 -598040 -390124 -708615 -933965 -435702 195225 199173 111824
36139 111824 801655 1712594 1602991 626761 105621 396420 515414 -76455 -739344 -880601
36129 -880601 -638830 -138811 730498 1552154 1548963 809668 300218 405576 497901 165827
36119 165827 -226947 -455860 -768507 -1016021 -645394 78170 103694 -654349 -899084 30241
36109 30241 1002571 859217 162545 73423 452785 352189 -267093 -585543 -334453 -25846
36099 -25846 35871 16802 -51717 -317736 -626516 -695157 -689367 -1001682 -1525663 -1709920 -1294787
36088 -1294787 -554859 106483 436120 352335 37709 -129008 17194 294861 589588 981113
36078 981113 1259201 899549 -87642 -873509 -894125 -668150 -920586 -1407183 -1347927 -634988
36068 -634988 168630 739239 1110135 1102606 487205 -332887 -576395 -98514 470402 631596
36058 631596 453998 88594 -457507 -902786 -735521 -33583 302103 -373537 -1462629
36049 -1462629 -1759561 -987257 -173054 -314695 -1090631 -1348561 -706012 -17243 -41145 -312770
36039 -312770 40628 824040 1015707 348347 -327420 -409245 -313492 -491474 -560444 -37352
36029 -37352 738662 1111258 1036120 844667 513881 -131822 -813442 -1082292 -1007911 -977500
36019 -977500 -992725 -748769 -275324 57561 105716 62550 73344 119460 185156 213107 47955
36008 47955 -284586 -473693 -396568 -386607 -672852 -903357 -676611 -229194 -91883 -317603
35998 -317603 -546959 -615188 -610936 -533743 -344018 -160789 -30422 232102 610921 686794
35988 686794 305771 -445 196860 489136 327139 -41600 -116921 -160820 -700026 -1339029
35978 -1339029 -1160803 -206955 515534 538991 395094 428497 222625 -436540 -984084 -971765
35968 -971765 -769473 -836511 -939044 -660799 -177102 60004 41857 75853 188235 124037
35958 124037 -188627 -527048 -664122 -571313 -408333 -382627 -482949 -389128 82496 505124
35948 505124 253578 -544215 -962928 -415636 580347 1075255 800340 267612 -20509 -81522
35938 -81522 -205775 -475113 -646892 -481789 -104256 107574 33460 -17296 182325 362822
35928 362822 176864 -201366 -335247 -236390 -310895 -639895 -832232 -648323 -296081 -12547
35918 -12547 204829 335718 235278 -56345 -279474 -354369 -447701 -552982 -437454 -142683
35908 -142683 -73620 -369192 -621714 -504114 -280369 -352347 -623809 -689203 -426505 -51326
35898 -51326 249968 416465 370547 90441 -240215 -413155 -483678 -656865 -915024 -973677
35888 -973677 -640843 -67216 416789 621111 599054 495247 391766 331664 389687 582908
35878 582908 755032 743119 663821 778874 1006419 888638 241596 -475185 -735304 -624064
35868 -624064 -574881 -650114 -532322 -119977 319729 574668 671520 635434 432979 176790
35858 176790 58709 66017 63966 120139 387884 682862 578842 -1165 -631921 -906251
35848 -906251 -812291 -537679 -206519 99480 314448 461459 564087 507851 226775 -29342
35838 -29342 75129 463975 671529 387617 -243158 -828109 -1018598 -715092 -246200 -181590
35828 -181590 -639997 -973164 -546451 351361 868163 714950 387979 356117 603109 939920
35818 939920 1180048 1008247 287625 -472559 -582919 -152297 62790 -165028 -282932 -30795
35808 -30795 106519 -134724 -233198 176764 549184 290089 -220450 -227841 209716 419356
35798 419356 227704 108877 333147 657425 854663 955034 920230 613487 186584 28469
35788 28469 200271 328394 202543 83848 198076 280136 -22498 -496077 -533057 33369
35778 33369 647511 762356 551146 557935 825723 857371 465308 116544 181332 338115
35768 338115 162745 -97911 68167 517754 615103 228953 -117227 -143090 -187750 -494428
35758 -494428 -731078 -560977 -228786 -192200 -470966 -711268 -716430 -637393 -718730 -1006087
35748 -1006087 -1263655 -1188145 -795942 -475260 -478517 -576385 -507292 -484690 -781004 -1064110
35738 -1064110 -798070 -171600 105820 -79337 -108490 288511 621972 551918 429143 552108
35728 552108 580377 167056 -379092 -551077 -338083 -52411 154350 252055 177285 15564
35718 15564 -16600 27438 -133787 -427511 -440194 -179305 -152103 -432728 -403330 191621 703009
35707 703009 595254 264837 241854 292202 28620 -239402 -89205 119368 -190299 -747537
35697 -747537 -800217 -261712 304169 599164 732454 678795 361071 104920 285200 649677
35687 649677 653539 308213 54290 -15915 -132570 -237114 -107734 54696 -126233 -492918
35677 -492918 -576354 -389114 -293325 -225407 184408 804634 1077073 867481 543043 280738
35667 280738 14806 -54859 293638 661581 497960 111762 246922 702603 504573 -433128
35657 -433128 -1023178 -704753 -233654 -263346 -301031 190485 704829 635903 443428 817818
35647 817818 1338914 1114044 337033 39634 449599 711997 314997 -210215 -271831 -47678
35637 -47678 81585 265007 794008 1366210 1306035 451070 -562567 -959578 -578769 82418
35627 82418 445795 366287 91247 -147900 -348069 -558086 -685096 -594921 -320471 -74608
35617 -74608 -78656 -374101 -723965 -741072 -280157 297929 448526 62541 -435954 -641197
35607 -641197 -562749 -398039 -208994 -7884 88268 25774 -53091 -72844 -219660 -588982
35597 -588982 -821900 -484273 248356 694028 518405 113147 -22819 85040 139519 138209
35587 138209 268401 406307 229705 -152477 -204238 210048 489934 155337 -365510 -319164
35577 -319164 270867 697037 647963 532744 673810 825520 691773 347424 -91968 -651220
35567 -651220 -1073125 -850666 -98984 239379 -355535 -1093420 -959914 -206249 136533 -93209
35557 -93209 -71671 514601 922641 592596 42675 35346 494977 802436 729422 546141
35547 546141 471017 495143 612138 810779 873021 504166 -264343 -970017 -1101674 -561990
35537 -561990 265736 911940 1237573 1367315 1286933 814309 60725 -461680 -469289 -310224
35527 -310224 -386112 -515198 -353246 -136655 -365463 -908512 -1108402 -748286 -261865 31701
35517 31701 218116 227215 -292840 -1291025 -2119244 -2309734 -2026230 -1533364 -835976 -142593
35507 -142593 -15213 -561021 -1009497 -661759 131245 496534 238841 -48576 124345 665423
35497 665423 1210516 1464396 1274646 726501 159876 -137522 -192456 -163435 -97481 -60704
35487 -60704 -247407 -669828 -961411 -807335 -393877 -130296 -110094 -168306 -284793 -544859
35477 -544859 -805240 -779295 -434363 -13230 299303 465405 419900 111742 -292100 -517861
35467 -517861 -519703 -482275 -490009 -428375 -260268 -193533 -453813 -969316 -1369152 -1324534 -907668
35456 -907668 -553459 -561151 -701943 -525561 -20308 336410 247763 -19266 -85423 19237
35446 19237 27585 -128341 -334191 -551405 -773466 -866761 -723355 -475972 -347843 -391706
35436 -391706 -539765 -738771 -843833 -601039 -15915 446888 360268 -91985 -364302 -273946
35426 -273946 -123053 -135982 -150017 54945 416785 718759 864611 895435 848954 722562
35416 722562 549258 441790 509988 698510 776175 627072 508329 778529 1330004 1577892
35406 1577892 1159562 387881 -184376 -409265 -510178 -618498 -647825 -515144 -228357 156225
35396 156225 458898 407364 -6703 -346512 -202692 256278 518123 437477 366493 571695
35386 571695 856821 861522 482917 -107146 -660761 -954177 -862743 -499288 -207630 -277979
35376 -277979 -654695 -1005541 -1122742 -1179476 -1443724 -1748390 -1528285 -590980 415663 707394
35366 707394 374405 159128 277631 155127 -478046 -972100 -721169 -133447 15657 -240080
35356 -240080 -272865 36440 224555 162326 218197 446045 400770 -26366 -307435 -129283
35346 -129283 100817 5600 -96301 198020 579944 480962 4346 -265725 -215264 -266978
35336 -266978 -512305 -476495 65192 636457 733319 467457 186395 -97836 -435892 -482834
35326 -482834 70499 816080 1034686 705758 435231 384989 87514 -474439 -506764 344412
35316 344412 1160038 937331 32142 -464426 -341937 -248775 -338091 -102542 431930 524697
35306 524697 14446 -271557 149474 632998 526998 201867 254228 420993 106249 -548023
35296 -548023 -928279 -894675 -725238 -463656 -35818 290373 259433 167371 380807 624904
35286 624904 468345 209630 453557 1014461 1123165 651299 268011 353534 578770 662865
35276 662865 756539 877477 674609 25091 -682488 -1061235 -1048598 -644657 112251 816355
35266 816355 928540 482895 36536 -148764 -286188 -391934 -163016 312081 468228 163571
35256 163571 -36265 207066 475179 370878 135912 33067 -222351 -843544 -1364973 -1299993
35246 -1299993 -945683 -875000 -1015043 -930441 -730001 -925853 -1487518 -1750866 -1358164 -733714
35236 -733714 -448053 -498581 -435000 6812 580228 819642 606053 341277 428517 708272
35226 708272 718243 424262 226052 225741 78747 -266009 -324457 89479 412417 188769 -181545
35215 -181545 -126815 171753 224250 181784 539876 1138524 1285231 811768 265914 34668
35205 34668 -48820 -167676 -220217 -153480 -50021 167434 568440 767374 320153 -381322
35195 -381322 -395976 384342 961113 695707 199838 176932 193188 -486069 -1404597 -1399250
35185 -1399250 -417761 269150 -134065 -908320 -1009220 -499654 -162376 -236767 -295093 -121271
35175 -121271 12380 -67195 -153800 -67226 101341 239510 323695 219817 -200481 -647619
35165 -647619 -586261 -2704 465272 409437 176755 190248 269617 109415 -59494 73712
35155 73712 184982 -176095 -647031 -493065 154943 452167 235896 237128 681224 757044
35145 757044 -5517 -795924 -700840 -57157 215350 32830 -30414 91927 -23617 -303652
35135 -303652 -194261 320928 597062 363630 105666 181050 264526 23104 -240728 -85648
35125 -85648 308635 356930 -113441 -630880 -648118 -124788 489370 762467 712182 670209
35115 670209 743725 639024 159047 -377096 -498198 -193598 149273 271686 171837 -134732
35105 -134732 -563305 -772516 -503566 -87744 -137585 -693094 -1151380 -1119945 -826198 -525484
35095 -525484 -64309 625965 1071748 799360 99607 -238846 88623 571957 577481 68015
35085 68015 -489320 -733515 -725017 -681833 -602696 -318684 139676 462964 437706 205799 23959
35074 23959 -33481 28401 273512 611108 648710 127700 -634773 -1096496 -1156949 -1097201 -994811
35063 -994811 -673757 -185875 159539 286740 412987 561361 481822 151125 -117101 -193753
35053 -193753 -303707 -506760 -472873 -17773 528018 735253 546277 156287 -234406 -405494
35043 -405494 -243066 -36240 -232063 -742335 -969229 -696593 -396165 -387190 -321594 73844
35033 73844 347643 -4618 -681454 -994542 -785645 -358138 134988 609978 697395 169684
35023 169684 -499466 -672170 -447649 -367979 -451293 -289690 38189 17893 -327487 -372040
35013 -372040 63940 412677 343964 277978 567232 863471 744369 404110 259076 334660
35003 334660 480568 753234 1113450 1138133 568543 -116923 -189885 415109 1091912 1338475
34993 1338475 1163438 825928 539793 411299 393635 307184 67943 -177539 -272964 -277215
34983 -277215 -340995 -512198 -771443 -1066236 -1211084 -1001236 -542376 -194095 -82986 -9489
34973 -9489 64966 -94558 -430614 -462817 -52033 270918 185894 193218 717143 1171353 775111
34962 775111 -93623 -344250 209180 684764 578253 353906 405521 393180 -2873 -464281
34952 -464281 -607400 -523777 -366219 -33419 351959 321671 -128740 -275123 254480 778655
34942 778655 576493 3939 -147469 106325 191504 93540 301948 811686 1047532 747846
34932 747846 177601 -487572 -1237134 -1716140 -1451007 -681869 -205084 -226999 -123966 427396
34922 427396 846907 578016 -16870 -188134 204896 681214 819868 592594 241676 75436
34912 75436 188728 289905 83292 -190196 -47646 401333 527489 184103 -85025 -53593
34902 -53593 -208070 -736320 -982181 -542533 -112988 -404025 -886771 -629893 107225 261440
34892 261440 -310394 -684761 -440385 -206845 -407374 -524362 -94773 421366 371462 -98113
34882 -98113 -381837 -337048 -323339 -569618 -930428 -1122089 -929233 -344231 321785 680905
34872 680905 737521 829765 1013314 912902 383358 -111343 -97520 267783 494108 424178
34862 424178 271182 215297 290331 505077 787083 931373 827952 611369 434048 287468
34852 287468 183137 236865 396168 399737 235643 291007 738031 1113762 903999 264284
34842 264284 -255676 -447420 -457098 -323137 -39847 104139 -144918 -427637 -161018 483235
34832 483235 661600 66319 -615650 -743625 -590839 -704048 -932405 -759784 -299581 -202402
34822 -202402 -596624 -826454 -444430 127423 282019 99403 44064 122828 -31077 -356897
34812 -356897 -335816 129581 461931 328014 196836 501465 786563 381401 -446751 -836356
34802 -836356 -663411 -641469 -1053895 -1302238 -986008 -575252 -541042 -543927 -88060 572460
34792 572460 814872 535068 94133 -250855 -346482 6967 639248 878581 464201 129436
34782 129436 536202 1110463 883984 111693 -97873 398939 587294 24517 -483798 -301412
34772 -301412 87652 89547 -46827 55540 126019 -68152 -40910 581075 1200096 1088565
34762 1088565 538611 281442 254633 -74327 -545993 -533011 -96344 146032 166326 423132
34752 423132 654462 50302 -1128174 -1414596 -227814 1054203 975836 15559 -357531
34743 -357531 73006 274723 -109170 -238605 348616 875697 596144 6076 25240 542646
34733 542646 615437 -118774 -990706 -1259350 -892478 -259971 401677 931488 1051569 634726
34723 634726 8161 -328599 -234098 45823 297936 534084 776616 907195 822081 592668
34713 592668 392874 345291 449944 564903 467366 72671 -391485 -567390 -351616 26547
34703 26547 307855 414012 347988 119643 -130006 -146959 132655 457956 598890 642701
34693 642701 757265 813909 539687 14642 -276194 1782 595337 922404 713822 285525
34683 285525 143360 386662 631312 570389 427255 612748 1030831 1106526 588441 -65470
34673 -65470 -325058 -255758 -223495 -256442 -164156 -74904 -293336 -681331 -746652 -411801 -153608
34662 -153608 -233619 -330656 -187354 -96213 -359901 -710058 -735884 -553101 -531421 -616594 -487450
34651 -487450 -215258 -159176 -269901 -120682 328930 621537 578977 558047 697352 558953
34641 558953 -76983 -648365 -590647 -202575 -89150 -133633 187141 698058 661448 59348
34631 59348 -181536 428743 1119996 937418 53037 -611251 -674866 -560159 -662792 -878144
34621 -878144 -939116 -752055 -360909 71862 251404 33106 -307464 -388999 -253501 -259175
34611 -259175 -513083 -776790 -885584 -848780 -556317 120464 845875 954039 316762 -333314
34601 -333314 -268154 337470 697530 409242 -152177 -346338 46551 629366 796110 387411
34591 387411 -119261 -249456 -211326 -524718 -1048962 -1017859 -225754 496734 428234 757
34581 757 90746 704270 1099863 963338 673179 466904 132189 -337167 -472013 -16476
34571 -16476 595539 745706 287860 -466904 -1075886 -1149892 -615209 39358 174742 -160777
34561 -160777 -238054 293446 856011 818000 439614 408620 763532 912927 607070 285113
34551 285113 396217 854168 1294498 1500243 1421406 1070681 585538 214708 104531 198617
34541 198617 384078 601737 791366 873333 814178 617243 305701 43425 130154 608843
34531 608843 984636 717056 -3070 -393506 -118679 247408 57048 -501332 -729618 -389881
34521 -389881 134368 526869 864801 1192096 1250477 885298 390364 133002 32692 -243856
34511 -243856 -649543 -695407 -125735 634830 936167 652496 217597 -25052 -181057 -421778
34501 -421778 -578513 -426337 -178802 -272524 -657879 -745712 -240170 364099 447974 155609
34491 155609 179530 768356 1402973 1509208 1098825 563101 167167 -26387 20631 290010
34481 290010 594279 716481 628200 428176 129765 -316198 -786751 -937044 -505770 323259
34471 323259 948670 876939 263209 -228495 -221237 -75058 -290511 -681535 -616464 -40899
34461 -40899 312865 -68318 -764724 -1038325 -752452 -298312 38907 188930 58576 -303586
34451 -303586 -490300 -193350 252011 293504 21595 22673 405462 621478 379542 105206
34441 105206 207456 432333 343947 37009 -87660 5007 -2016 -210814 -369502 -313556
34431 -313556 -233828 -400558 -786758 -1083216 -1055223 -804900 -606126 -498844 -224453 332879
34421 332879 854094 964698 725221 443963 180513 -162374 -399806 -247798 77349 15819
34411 15819 -478089 -792356 -553928 -126201 49489 87226 276833 514168 514184 263123 -87723
34400 -87723 -466670 -720349 -574214 -98262 152355 -154484 -614003 -659042 -302173 93571
34390 93571 403557 625987 548067 100954 -227759 66586 734851 1088881 916942 553781
34380 553781 224450 -96229 -300391 -219657 -18391 21137 16985 247393 511784 357388
34370 357388 -108687 -291761 -29785 189380 22941 -306983 -518810 -653453 -802710 -931108
34360 -931108 -1073096 -1257299 -1211931 -674448 -14440 66971 -451540 -833384 -647459 -253092
34350 -253092 -52055 34030 70794 -179120 -657757 -787249 -318843 178534 176710 -24675
34340 -24675 79178 333063 344767 317374 684748 1197482 1167209 522323 -103952 -338591
34330 -338591 -446632 -652455 -728072 -504410 -270526 -310231 -400283 -164563 282426 469429
34320 469429 307646 273614 670369 1032314 666197 -314772 -986180 -784771 -216318 -50499
34310 -50499 -225967 -115251 367751 614084 273178 -275461 -551641 -546870 -480982 -454534
34300 -454534 -554754 -895229 -1332291 -1489692 -1232981 -792578 -334539 182996 649728 787442
34290 787442 631156 543591 621049 605113 496073 620912 909612 826816 333723 163649
34280 163649 684983 1215476 1053362 541310 424771 697653 814677 620019 351653 86536
34270 86536 -140024 -21764 517823 853999 417131 -371418 -647412 -315547 33980 156230
34260 156230 274743 350591 89506 -360210 -504994 -312380 -211206 -308248 -328672 -321014
34250 -321014 -644314 -1181610 -1327675 -911921 -443556 -280251 -217420 -66645 37025 121892
34240 121892 505827 1140301 1424672 1015238 324225 -93686 -185169 -133803 73710 440955
34230 440955 684464 544857 155456 -165739 -298009 -305475 -247053 -162776 -92064 -13335 108274
34219 108274 230590 329212 432716 352360 -327938 -1567042 -2459344 -2140198 -967373 -136389
34209 -136389 -173426 -513112 -572520 -439891 -322227 -98869 224378 265923 -121413 -494271
34199 -494271 -433788 -93063 155015 197527 64038 -243262 -576743 -713351 -750006 -962084
34189 -962084 -1179655 -924159 -317988 -120993 -565287 -916528 -625306 -163013 -142781 -307307
34179 -307307 -103995 299531 364778 138791 75371 185119 123221 -55617 51323 471859
34169 471859 821552 948353 1049296 1165314 1085818 781595 484123 297691 101915 -144898
34159 -144898 -313118 -292765 -35633 482017 1086171 1372228 1152986 761904 595322 569375
34149 569375 393807 136632 45253 -8489 -363617 -915084 -1142435 -825844 -294119 99675
34139 99675 358885 613937 843821 938448 818633 450278 -82481 -543898 -758075 -772199
34129 -772199 -646730 -272773 338367 794879 735902 381344 278265 569317 891925 938437
34119 938437 704358 211050 -558467 -1368147 -1784991 -1675318 -1335303 -1023234 -692205 -322788
34109 -322788 -160826 -351161 -578222 -405187 108207 422798 204077 -229281 -296361 104527
34099 104527 464766 333886 -92339 -263978 -36447 165189 -43264 -519386 -822483 -706815
34089 -706815 -279532 155338 333753 268236 250556 430682 494083 104328 -425093 -419519
34079 -419519 159779 597044 457249 105851 -81244 -333980 -829633 -1056565 -534102 265136
34069 265136 473353 75788 -114253 370014 1138129 1598449 1583674 1274055 916138 675528
34059 675528 513014 264951 4289 46493 364312 428459 31287 -215774 208989 786190
34049 786190 667805 -256 -331542 -75813 170560 74244 -37029 25536 -11146 -203237
34039 -203237 -178112 139948 300142 90738 -124512 -99169 -81330 -217114 -233600 -43736
34029 -43736 -22485 -308726 -469395 -284570 -221268 -584155 -789648 -168937 933965 1580863
34019 1580863 1479792 1118063 832214 459776 -61507 -377241 -207256 241152 552639
34010 552639 553951 343460 64633 -189745 -340656 -346036 -294102 -383773 -686131 -929680 -716952
33999 -716952 -51247 580508 831211 925599 1178861 1410260 1318838 1156596 1342064 1545647
33989 1545647 996540 -209942 -977220 -688392 -23292 162167 28006 187210 563232
33980 563232 587189 153642 -371626 -829541 -1218196 -1184307 -393345 625516 842053 119288
33970 119288 -483231 -126875 707079 997073 568657 90315 -44059 -108320 -272532 -124515
33960 -124515 638407 1478558 1561555 882648 242854 57285 -144519 -726619 -1123799 -662459
33950 -662459 226131 453856 -185037 -765075 -619799 -176300 -96467 -289667 -267941 12577
33940 12577 194899 104550 -157594 -486576 -755352 -703015 -192165 510430 939214 838866
33930 838866 295006 -338594 -596057 -286237 209154 364003 243312 329389 601691 490937
33920 490937 -59873 -312453 53632 272224 -281046 -921697 -619872 394762 993773
33911 993773 795810 432299 329858 266156 167503 351391 760983 823511 375926 -1911
33901 -1911 101772 345559 293295 40293 -189549 -495928 -912261 -1053043 -636207 6550
33891 6550 392427 547863 756014 915962 677161 117384 -188407 141701 825055 1247861
33881 1247861 1138541 806716 695002 743351 393953 -617524 -1692832 -1941990 -1223918
33872 -1223918 -229387 402470 582914 429104 37911 -245815 46175 793741 1216996
33863 1216996 881448 308626 189911 460242 642325 685205 852701 1058311 928711 387869
33853 387869 -321143 -1008600 -1442159 -1168356 -102801 899183 859089 39953 -312211
33844 -312211 311778 1065765 1113252 757838 695922 857331 713419 295679 143564 417410
33834 417410 720336 766674 687040 623083 449428 8271 -641363 -1255818 -1529178 -1273062
33824 -1273062 -675336 -249129 -291260 -539646 -608793 -546306 -618311 -759225 -686047 -437866
33814 -437866 -326800 -394376 -368285 -149627 91704 301554 578516 823209 801541 560638
33804 560638 317319 -23765 -664416 -1245695 -1110263 -357559 141959 52230 69595 672141
33794 672141 1201472 897884 183299 35423 507349 780987 490082 125646 141588 395175
33784 395175 568279 568566 414657 175118 72350 270908 576583 676002 574113 465571
33774 465571 368098 264660 342340 620505 647388 147752 -328732 -101183 556546 817276
33764 817276 602030 591730 1003382 1284094 1093843 700069 276667 -289990 -738139 -523895
33754 -523895 164961 434217 42889 -236709 -17830 -5949 -705581 -1438878 -1462242 -1178191
33744 -1178191 -1297278 -1535778 -1200821 -525009 -323182 -655506 -863447 -721323 -574108
33735 -574108 -463726 -83805 411618 470956 110413 -12159 351733 675736 562720 308574
33725 308574 256500 213415 -75855 -345036 -170934 348068 710361 699879 603982 729200
33715 729200 972295 1022997 854481 754486 819998 723799 248418 -209039 -122060 328209
33705 328209 492535 300154 356517 858030 1188917 943415 588785 594275 605419 165785
33695 165785 -327640 -193486 412512 747960 593142 362689 297628 246063 124673 -19046
33685 -19046 -279809 -677326 -839067 -439374 247177 740318 1006088 1167252 973673 287151
33675 287151 -278197 -55426 602647 834919 620853 642255 948524 844133 163160 -386573
33665 -386573 -360517 -133770 -64658 49549 373398 629827 604886 446389 268123 53386
33655 53386 24962 418435 844727 673850 112299 -5472 382727 403939 -235138 -646203
33645 -646203 -169291 586988 732702 284996 -273683 -842695 -1390337 -1478511 -891082 -233770
33635 -233770 -170678 -456154 -381528 168302 722415 989895 1046155 972290 787584 593511
33625 593511 481275 476985 692607 1166628 1489509 1135790 292577 -274137 -304860 -240440
33615 -240440 -196266 274764 1071139 1292033 656692 94329 214618 297416 -309366 -921870
33605 -921870 -799691 -632237 -1318569 -2130242 -1752354 -584303 -221524 -897734 -1244576
33596 -1244576 -641185 -29375 -38420 35386 724656 1306879 1090320 639365 756390 1106645
33586 1106645 851479 74777 -359789 -73102 462078 671397 451102 82580 -62946
33577 -62946 166381 490646 475484 124671 -99055 56941 314873 346362 180142 -26768
33567 -26768 -234188 -367455 -296632 -116501 -77674 -142742 -41323 156744 59923 -310088
33557 -310088 -407557 -53043 165489 -227093 -830041 -946352 -528250 -99858 -58910 -446596
33547 -446596 -1092050 -1596184 -1479741 -752038 -74098 8951 -262656 -295867 57809 505501
33537 505501 796366 785546 323508 -436336 -865878 -506399 280442 759578 735813 553563
33527 553563 399272 177961 -35931 -32047 62431 -98806 -470601 -669212 -662479 -811064
33517 -811064 -1123821 -1117183 -651879 -287733 -438180 -723760 -639141 -390989 -482193 -792196
33507 -792196 -736759 -206897 289356 423850 396032 374092 145392 -407280 -898936 -861723
33497 -861723 -343969 189490 401859 316953 155807 139931 340146 568858 551589 312594
33487 312594 184586 299399 345460 61326 -316731 -421851 -303086 -198897 -8886 482328
33477 482328 1005449 1045669 667996 472611 636482 657085 270377 -38144 175100 582581
33467 582581 635042 373721 165288 28053 -193572 -319612 -150125 -42977 -468343 -1114975
33457 -1114975 -1178102 -543437 40268 85257 -54702 26097 106228 -114012 -328844 -65904
33447 -65904 494840 698156 301166 -260392 -467127 -223420 235710 633524 781249 658663
33437 658663 470136 475831 691877 874455 864274 814969 949213 1169762 1114437 646178
33427 646178 106742 -69580 125034 342610 381025 331401 245937 27411 -239696 -234375
33417 -234375 82616 251338 -31333 -341105 -85769 558552 837697 526577 266451 611702
33407 611702 1211825 1281472 628593 -124357 -277042 219700 795366 908463 581220 242013
33397 242013 104827 -63284 -463389 -841778 -825329 -474331 -141728 85954 389518 703138
33387 703138 652048 102489 -584081 -975767 -974370 -712683 -335289 14503 246622 461435
33377 461435 806952 1147101 1145318 760359 382696 353178 570469 689745 526382 185236
33367 185236 -50263 63710 461368 753274 657459 325810 24625 -264345 -549386 -447811
33357 -447811 271790 978160 832380 120112 -26120 585512 761951 -226658 -1381111
33348 -1381111 -1406950 -612602 -293857 -715239 -893337 -260815 573855 893573 782680 660477
33338 660477 615370 561442 527118 459749 159306 -327610 -621516 -538033 -334839 -238488 -131001
33327 -131001 61690 104534 -97114 -177305 156547 591996 667382 499489 536488 750740
33317 750740 664442 166225 -282931 -379541 -351736 -362224 -94666 619425 1200417 962091
33307 962091 133915 -397287 -291784 -39316 2150 98868 400552 445195 -63397 -568001
33297 -568001 -433533 5154 -62576 -659177 -1093562 -1165384 -1358731 -1745541 -1647361 -747001
33287 -747001 259933 599817 359761 8618 -389663 -878651 -1058321 -554591 276449
33278 276449 765019 811610 774937 742806 557971 366621 453976 635882 479674 78158
33268 78158 -62933 102033 101589 -158156 -163111 332304 868094 1032263 1051092 1227698 1317871
33257 1317871 971531 419981 179634 278486 275536 -35607 -368360 -387952 -81850 356901
33247 356901 763047 1036788 1102846 917317 492661 -57633 -482876 -511600 -105290 438078
33237 438078 686587 380616 -385496 -1161419 -1393958 -917925 -221246 1137 -387196 -855925
33227 -855925 -904156 -588665 -256507 -68894 -18535 -164359 -538126 -949900 -1170853 -1233236
33217 -1233236 -1295734 -1283829 -960160 -361722 123770 227136 125799 144501 280048 244221
33207 244221 -49183 -267463 -53576 480163 833656 683882 198558 -248000 -476884 -516192
33197 -516192 -414852 -251403 -188006 -276517 -310029 -118669 83564 -49818 -465192 -775267
33187 -775267 -832448 -841205 -870591 -706820 -323889 -47479 -26612 29916 308194 508600 377838
33176 377838 206608 312052 379816 -65033 -748847 -891269 -317200 311222 439197 200044
33166 200044 -77809 -350012 -598947 -634994 -485955 -528065 -860830 -977722 -505806 106984
33156 106984 203101 -56576 58634 653255 968375 518689 -139846 -166257 434821 904040
33146 904040 766157 315887 60962 86569 157383 180039 257876 354630 220761 -210604
33136 -210604 -558555 -369669 282649 800867 722294 209404 -196558 -169594 151963 392061
33126 392061 300784 -27506 -216751 28209 567944 948571 904360 559167 92861 -482270
33116 -482270 -1038976 -1179592 -730008 -155982 -45872 -304560 -329909 58760 379040 240900
33106 240900 -143223 -368037 -329609 -109301 242975 569115 598223 337112 148007 208155
33096 208155 257726 147626 193003 570717 787947 322828 -492123 -850221 -554092 -71695
33086 -71695 370539 989022 1659977 1721752 918449 -44359 -341451 -33433 199349 17526
33076 17526 -345785 -622998 -801346 -888946 -777205 -447101 -100092 23893 -120418 -358589
33066 -358589 -458661 -337185 -133546 -39522 -60379 -38398 94583 238136 327754 449521
33056 449521 668291 880469 935997 812365 605545 444968 453385 667175 945600 1068255
33046 1068255 959521 723079 468699 233276 34091 -166435 -488279 -909605 -1101198
33037 -1101198 -801826 -314471 -225282 -579440 -773277 -411407 161419 408740 271494 -2139
33027 -2139 -307920 -592693 -634910 -353794 -113211 -281878 -642654 -654770 -202905 296362
33017 296362 454291 225024 -243276 -703111 -831001 -537161 -201779 -230291 -439139 -317526
33007 -317526 125385 289727 -117901 -598677 -527072 57902 615652 792658 649468 387817
32997 387817 168326 126065 288001 451693 345477 -17684 -267410 -54816 544276 1112793
32987 1112793 1382236 1483740 1593232 1502812 863938 -164541 -900683 -914480 -470483 -7136
32977 -7136 413567 800877 820601 280382 -221527 149427 1260305 2033626 1827114 1172711
32967 1172711 859128 848373 572173 -81657 -642597 -786053 -703290 -696977 -741632 -575852
32957 -575852 -77611 539457 857736 599752 -85638 -693703 -790611 -398158 42516 91318
32947 91318 -261332 -556824 -333480 327759 847222 817938 450026 177489 37220 -251811
32937 -251811 -722168 -1042183 -955238 -534555 -29856 248186 -12422 -775466 -1416402 -1305960
32927 -1305960 -648321 -220595 -229073 -68174 570401 1053173 736946 -30614 -456109 -431006
32917 -431006 -427285 -520579 -273305 415931 999666 973178 429601 -202429 -609915 -693153
32907 -693153 -554345 -483297 -664629 -858107 -682895 -236895 -49057 -335604 -707207 -766386
32897 -766386 -599678 -454817 -305411 -48161 167480 165743 88226 155387 252089 121813
32887 121813 -155207 -285842 -289655 -435911 -631083 -384859 408538 1114566 1133708 688916
32877 688916 411900 402822 241404 -171934 -405393 -242035 -57710 -156745 -227603 84472
32867 84472 438687 229391 -421824 -745142 -407279 101992 329544 495255 906771 1253341
32857 1253341 1049245 497291 276836 517348 583185 44518 -625444 -650748 33223 715556
32847 715556 740564 111881 -677097 -1129325 -1026062 -482438 133635 476688 549433 662090
32837 662090 966582 1170116 904437 287423 -150540 -108463 195115 457890 716615 1112159
32827 1112159 1463259 1395159 815090 2845 -706305 -1090887 -1012095 -565492 -230545 -457623
32817 -457623 -1008706 -1095892 -366931 588425 975797 746338 476655 522362 711826 814982
32807 814982 894041 1078545 1282399 1311199 1097616 713658 268311 -105141 -263163 -177152
32797 -177152 -1898 78631 55770 65692 167962 262967 278321 337244 613436 1042268 1315098
32786 1315098 1189743 688614 -18985 -732073 -1143688 -933428 -193936 424147 340690 -246418
32776 -246418 -612627 -426446 -36615 194148 401241 848965 1384223 1563993 1177029 436863
32766 436863 -221792 -425494 -133556 245369 224293 -145636 -299316 30406 360535 127605
32756 127605 -474118 -734596 -343260 347374 868179 1024934 800951 331005 31893 315249
32746 315249 987190 1286883 773325 -77329 -440781 -159611 116242 -201473 -894057 -1214460
32736 -1214460 -806238 -128522 119770 -175392 -533038 -614893 -597976 -689944 -676411 -305250
32726 -305250 150000 187822 -155083 -317371 -23104 381422 524908 504734 551342 584592
32716 584592 441326 266774 290792 380658 214912 -173948 -429820 -445668 -490211 -658868
32706 -658868 -629454 -237204 72781 -189271 -744871 -840895 -342118 55040 -106193 -348208
32696 -348208 -89016 312851 53345 -785494 -1210120 -712390 66134 359247 269508 250448
32686 250448 195174 -247569 -798009 -776539 -135554 439841 529532 455309 587664 725516
32676 725516 470135 -155652 -760903 -1024884 -880423 -478632 -130963 -72692 -160824 -42790
32666 -42790 278552 359799 -42399 -573645 -766925 -635755 -491202 -411491 -229197 122968
32656 122968 576688 1097019 1568754 1663728 1211239 620499 496571 802917 839431 207407
32646 207407 -585128 -753734 -221265 346199 380431 -5499 -296308 -228626 -50737 -167386
32636 -167386 -593351 -854459 -540893 93909 326967 -144388 -761656 -808448 -366219 -165979
32626 -165979 -510714 -832073 -551784 30359 167793 -220078 -438392 -82191 341069 184998
32616 184998 -325490 -371190 283956 922814 844131 307755 173817 770680 1498442 1599049
32606 1599049 1014783 300585 -107210 -232903 -222905 -26363 396591 779210 770130 417257
32596 417257 176800 383920 878602 1202262 1030862 395934 -362842 -819147 -775967 -410917
32586 -410917 -20843 312906 621792 727897 398677 -149104 -335609 8700 359426 265197
32576 265197 9799 102033 420127 399734 -71343 -503099 -560897 -469262 -528619 -649410
32566 -649410 -591067 -381315 -258947 -338730 -489304 -474188 -171331 260088 466840 303573
32556 303573 84494 218471 645858 915424 815276 610457 580918 630906 513426 215856
32546 215856 -45764 -70651 196791 638655 984842 1006164 747959 437321 158922 -166058
32536 -166058 -467294 -485620 -168623 146301 116663 -223283 -615127 -917679 -1109334 -1114164
32526 -1114164 -867850 -507453 -301758 -362362 -509210 -447781 -75130 378363 560957 406673
32516 406673 229111 284843 382557 170663 -281826 -530144 -390051 -177487 -212134 -413945
32506 -413945 -568962 -701668 -931011 -1162311 -1204676 -1095651 -1053319 -1120548 -1066828 -711109
32496 -711109 -214463 81783 103309 166168 509455 852296 749076 352690 335345 883017
32486 883017 1319935 1104177 637110 510396 490428 71084 -389360 -132180 603555 816718
32476 816718 409343 380894 1086223 1559572 1129721 534129 639097 1075914 1088090 852791
32466 852791 889725 872072 200440 -737390 -1045128 -711694 -420396 -268710 164105 678558
32456 678558 616926 147843 185859 876617 1280048 829803 88768 -281463 -361284 -396595
32446 -396595 -251486 110184 336651 309317 391934 706232 847261 671483 631916 910456
32436 910456 962656 440422 -132463 -194793 -26048 -147125 -394937 -290414 99997 358571
32426 358571 449621 622236 831600 835485 671947 547345 435539 198088 -123475 -482382
32416 -482382 -971503 -1436731 -1367749 -641355 45211 35404 -361820 -393267 35023 408753
32406 408753 471420 381345 226495 21057 -15539 201744 234351 -262632 -777578 -568684
32396 -568684 125919 367962 -49117 -363023 -138791 107191 -131489 -562388 -678133 -497149
32386 -497149 -285861 -49419 259112 407362 182056 -227671 -458494 -405932 -245228 -204773
32376 -204773 -402769 -688147 -652279 -109937 485054 528933 131738 -33650 252209 525214
32366 525214 532382 642777 1071295 1358400 1060501 429272 -38541 -255042 -309912 -71445
32356 -71445 463075 833625 687795 345544 261752 280744 38103 -218801 38650 622795
32346 622795 748666 201785 -326555 -277644 2243 -133426 -674355 -1003233 -720119 -101006
32336 -101006 240475 -20591 -655778 -1181638 -1352572 -1278713 -1120335 -921328 -815001 -1052283
32326 -1052283 -1555742 -1715491 -1016971 246226 1233150 1454026 1098225 566876 66604
32317 66604 -321419 -518517 -501614 -296923 72147 465459 580523 305063 4770 113489
32307 113489 502179 635825 335218 -27633 -125866 -43256 55830 201799 388088 430209
32297 430209 263763 65768 -110838 -467692 -970593 -1103781 -521577 308120 588925 226377
32287 226377 -90684 136335 597117 690437 317998 -107852 -254989 -179663 -104989 -145729
32277 -145729 -278689 -380645 -231227 319243 1042506 1364249 940242 136159 -314808 -141705
32267 -141705 213199 224569 -79511 -243362 34049 589192 958089 779935 173775 -269651
32257 -269651 -95835 392816 454900 -66380 -472173 -187842 457036 819393 863220 920670
32247 920670 886533 392028 -346784 -617840 -226678 238355 294493 103311 -62595 -267836
32237 -267836 -534340 -581117 -322349 -140878 -256635 -274313 161873 662865 619541 157953
32227 157953 -54737 160903 278626 -81070 -617839 -839438 -684531 -444413 -329850 -320686
32217 -320686 -291592 -146050 68558 113678 -228657 -817553 -1183109 -1031534 -615584 -433757
32207 -433757 -602218 -724683 -455280 -8205 104234 -213312 -454691 -147361 542348 1027189
32197 1027189 973950 537747 28062 -385292 -636961 -675161 -483747 -106090 328271 554560
32187 554560 341193 -119907 -227084 317715 1006791 1132749 739600 482895 617566 688794
32177 688794 308086 -286499 -625038 -551085 -216809 107313 114451 -284955 -732593 -815254
32167 -815254 -646490 -576894 -451263 109311 707333 416061 -721285 -1447702 -1044965 -357178
32157 -357178 -361800 -650664 -302932 482998 794844 554798 437510 489594 70041 -825307
32147 -825307 -1339853 -1073022 -621166 -492544 -385636 17823 320217 44606 -531828 -769585
32137 -769585 -589609 -489804 -749167 -1009565 -730529 89205 776524 681397 -26993 -524313
32127 -524313 -351690 112746 372945 493311 687919 753230 455250 43011 -209839 -519145
32117 -519145 -992649 -1056435 -338355 372795 107999 -718581 -918777 -445659 -354008 -905320
32107 -905320 -1158252 -658623 -129605 -73114 -12942 340072 446293 106909 55702 625715
32097 625715 981385 535900 21542 161016 320401 -351413 -1320306 -1476170 -885504 -463780
32087 -463780 -385474 -74127 537900 916961 918219 850101 723821 368784 82809 243405
32077 243405 488230 209526 -350346 -443221 -54839 171165 85079 113399 298052 246209
32067 246209 -10427 -59805 32618 -156022 -501452 -512529 -320297 -441621 -634042 -151718
32057 -151718 826868 1255245 856248 465992 508655 428782 30160 41584 734956 1227964
32047 1227964 939962 615432 999896 1497272 1165525 244483 -360557 -496567 -648169
32038 -648169 -897766 -970351 -943733 -1032451 -984304 -497342 82336 250992 194694 358564
32028 358564 522124 184207 -392008 -451660 40812 335026 30209 -496969 -809636 -830009
32018 -830009 -516955 167841 889470 1167989 1055701 1007911 1053927 737700 -23043 -655992
32008 -655992 -696640 -298091 180747 580864 762140 515963 -98595 -693431 -976822 -910223
31998 -910223 -425767 520999 1510287 1808675 1219082 374574 -48696 -41243 26282 2547
31988 2547 -20180 25781 175000 461730 743011 716327 321067 -81027 -112530 203559 559001
31977 559001 694261 512376 81117 -360283 -586518 -639282 -688000 -662493 -363515 50099
31967 50099 132434 -164846 -341313 -102181 185355 94780 -216303 -346602 -278852 -231306
31957 -231306 -171046 42223 226520 91552 -217191 -255991 70574 429197 617832 772044
31947 772044 938365 850313 323727 -385268 -807632 -716157 -268935 167933 288248 70726
31937 70726 -207171 -261857 -103071 42184 39292 -51683 -117483 -89821 33102 138084 90946
31926 90946 18686 276806 871377 1164999 604424 -405623 -903096 -622702 -239676 -243884
31916 -243884 -254824 167177 631637 456896 -249157 -712928 -577924 -259052 -200551 -323097
31906 -323097 -348829 -245664 -150366 -154843 -330253 -692396 -997284 -852882 -235092 337106
31896 337106 366596 -40835 -354756 -236820 207861 659052 850657 703859 389107 199428
31886 199428 217646 210693 13581 -138427 67585 466136 535827 121289 -301758 -245230
31876 -245230 156643 358603 115710 -238613 -188981 438482 1320104 1879518 1727081 1000447
31866 1000447 278799 46165 221707 320330 86950 -178000 -30962 474395 747576 323167
31856 323167 -552774 -1131316 -947315 -283180 188771 106618 -338291 -741756 -854558 -615331
31846 -615331 -78457 528143 840984 689234 336122 197828 351411 516219 477688 254928
31836 254928 -149726 -778850 -1343394 -1245195 -352259 563688 668493 150539 -124646 64173
31826 64173 82727 -323631 -464767 114437 652784 205327 -827196 -1200988 -678686 -312745
31816 -312745 -748119 -1268687 -987706 -148671 410204 481374 450117 440818 269532 56273
31806 56273 159103 505228 588247 212649 -231148 -325235 -70820 293441 573929 656757
31796 656757 554564 454523 476134 448556 226092 79053 321698 650136 431621 -296731
31786 -296731 -725905 -365427 322171 655330 579438 412058 216989 -85380 -320350 -276317
31776 -276317 -106221 -60162 -5077 325930 754395 834720 565524 420229 598842 697765
31766 697765 300899 -426268 -939323 -918422 -522824 -177961 -196062 -493198 -643513 -329689
31756 -329689 263166 639606 547902 165432 -226937 -506828 -628819 -558020 -400032 -385963
31746 -385963 -591670 -823357 -885980 -810510 -713941 -604896 -462680 -354691 -319737 -264726
31736 -264726 -131426 -27313 -7571 122065 516203 893923 770183 121486 -499329 -650485
31726 -650485 -526849 -578606 -828326 -898734 -646345 -410303 -524239 -832695 -883864 -482999
31716 -482999 125279 579576 741534 695012 550078 356941 166685 40838 -57988 -276216
31706 -276216 -627811 -806507 -476074 208773 653709 560505 315000 345566 400170 -24985
31696 -24985 -714403 -884263 -376412 32162 -170554 -419934 -25174 633772 639029 -43495
31686 -43495 -530816 -371018 -107768 -302133 -676667 -616679 -83615 372339 298524 -225988
31676 -225988 -710722 -678012 -108108 484725 568162 153473 -334309 -595096 -548787 -94758
31666 -94758 701996 1278855 1064911 355230 43935 349357 517580 66360 -431222 -293285
31656 -293285 196154 303510 -32517 -269321 -139490 157503 406942 466617 135469 -523265
31646 -523265 -963306 -810449 -482548 -557213 -801769 -573484 15829 216863 -85180 -142493
$$ [...]
##END NTUPLES=NMR SPECTRUM
##END=
