##TITLE=31Pdec_47-2021
 DMSO-d6, 24 sc
 30.06.2021
##JCAMPDX= 6.0         $$ Bruker NMR JCAMP-DX V2.0
##DATA TYPE= NMR SPECTRUM
##DATA CLASS= NTUPLES
##ORIGIN= UXNMR, Bruker Analytische Messtechnik GmbH
##OWNER= root
$$ XWIN-NMR		Version 3.5
$$ Wed Jun 30 09:09:22 2021 Russian Standard Time (UT+4h)  she@DPX200
##.OBSERVE FREQUENCY= 81.013821
##.OBSERVE NUCLEUS= ^31P
##.ACQUISITION MODE= SIMULTANEOUS
##.ACQUISITION SCHEME= undefined
##.AVERAGES= 26
##.DIGITISER RES= 16
##SPECTROMETER/DATA SYSTEM= spect
##.PULSE SEQUENCE= zgpg30
##.SOLVENT NAME= DMSO
##.SHIFT REFERENCE= (INTERNAL, DMSO, 0, 248.564)
##AUDIT TRAIL= $$ (NUMBER, WHEN, WHO, WHERE, WHAT)
$$ ##TITLE= Audit trail, XWIN-NMR		Version 3.5
$$ ##JCAMPDX= 5.01
$$ ##ORIGIN= Bruker BioSpin GmbH
$$ ##OWNER= she
$$ F:/spectra/data/she/nmr/P31/1/pdata/1/auditp.txt
$$ ##AUDIT TRAIL=  $$ (NUMBER, WHEN, WHO, WHERE, WHAT)
(   1,<2021-06-30 09:06:17.07 +0400>,<she>,<DPX200>,
      <created by zg, POWCHK disabled, PULCHK disabled
       terminated by command 'halt'
       configuration hash MD5:
       00 E9 B6 7A A2 85 ED C7 34 08 36 98 17 FE 4E 26
       data hash MD5: 32K
       8B A6 EE 79 AE 51 62 7A B8 EF 37 96 E7 62 5B B1>)
(   2,<2021-06-30 09:06:21.31 +0400>,<she>,<DPX200>,
      <Start of raw data processing
       efp BC_mod = 2 LB = 1 FT_mod = 6 PKNL = 1 PHC0 = -7432.694 PHC1 = 1115.286 SI = 64K 
       data hash MD5: 64K
       F1 5C 71 27 B6 C3 85 4F 8F F5 28 9B 06 74 AC A5>)
(   3,<2021-06-30 09:06:51.75 +0400>,<she>,<DPX200>,
      <pk PHC0 = 404.0031 PHC1 = -1048.8 
       data hash MD5: 64K
       2B FA 03 11 72 7C 42 A7 08 80 89 12 2F FA FE EB>)
(   4,<2021-06-30 09:06:56.23 +0400>,<she>,<DPX200>,
      <abs ABSG = 5 
       data hash MD5: 64K
       D8 A7 69 9D 98 F5 26 04 EE 84 51 16 CA 39 FE C4>)
(   5,<2021-06-30 09:07:13.09 +0400>,<she>,<DPX200>,
      <pk PHC0 = -3.600513 PHC1 = 0 
       data hash MD5: 64K
       7C 22 7E ED 36 D5 EE E4 44 A8 F2 1F 03 59 45 C9>)
$$ ##END=
$$ 
$$ hash MD5
$$ 76 2B 5E 7A C7 43 AC EF 53 1C 1B FA 63 98 53 78
##$RELAX= 
##$RELAX= 
##$RELAX= 
##$RELAX= 
##$RELAX= 
##$RELAX= 
##$RELAX= 
##$RELAX= 
$$ Bruker specific parameters
$$ --------------------------
##$DU= <F:/spectra>
##$EXPNO= 1
##$NAME= <P31>
##$PROCNO= 1
##$TYPE= <nmr>
##$USER= <she>
##$AMP= (0..31)
100 100 100 100 100 100 100 100 100 100 100 100 100 100 100 100 100 100 
100 100 100 100 100 100 100 100 100 100 100 100 100 100 
##$AQSEQ= 0
##$AQ_mod= 1
##$AUNM= <au_zg>
##$AUTOPOS= <>
##$BF1= 81.014009
##$BF2= 200.13
##$BF3= 200.13
##$BF4= 200.13
##$BF5= 200.13
##$BF6= 200.13
##$BF7= 200.13
##$BF8= 200.13
##$BYTORDA= 1
##$CFDGTYP= 0
##$CFRGTYP= 5
##$CHEMSTR= <none>
##$CNST= (0..31)
1 1 145 1 1 1 1 1 1 1 1 1 1 1 1 1 1 1 1 1 1 1 1 1 1 1 1 1 1 1 1 1 
##$CPDPRG= <waltz16>
##$CPDPRG1= <>
##$CPDPRG2= <waltz16>
##$CPDPRG3= <>
##$CPDPRG4= <mlev>
##$CPDPRG5= <mlev>
##$CPDPRG6= <mlev>
##$CPDPRG7= <mlev>
##$CPDPRG8= <mlev>
##$CPDPRGB= <>
##$CPDPRGT= <>
##$D= (0..31)
$$ [...]
##$SUBNAM3= <"">
##$SUBNAM4= <"">
##$SUBNAM5= <"">
##$SUBNAM6= <"">
##$SUBNAM7= <"">
##$SUBNAM8= <"">
##$SUBNAM9= <"">
##$SW= 501.771253377433
##$SWIBOX= (0..15)
0 1 3 0 0 0 0 0 0 0 0 0 0 0 0 0 
##$SW_h= 40650.406504065
##$TD= 32768
##$TD0= 1
##$TE= 0
##$TE2= 300
##$TE3= 300
##$TEG= 300
##$TL= (0..7)
0 120 53 12 22 120 120 120 
##$TP= (0..7)
150 150 150 150 150 150 150 150 
##$TP07= 0
##$TPNAME0= <>
##$TPNAME1= <>
##$TPNAME2= <>
##$TPNAME3= <>
##$TPNAME4= <>
##$TPNAME5= <>
##$TPNAME6= <>
##$TPNAME7= <>
##$TPOAL= (0..7)
0.5 0.5 0.5 0.5 0.5 0.5 0.5 0.5 
##$TPOFFS= (0..7)
0 0 0 0 0 0 0 0 
##$TUNHIN= 0
##$TUNHOUT= 0
##$TUNXOUT= 0
##$USERA1= <user>
##$USERA2= <user>
##$USERA3= <user>
##$USERA4= <user>
##$USERA5= <user>
##$V9= 5
##$VALIST= <valist>
##$VCLIST= <CCCCCCCCCCCCCCC>
##$VD= 0
##$VDLIST= <DDDDDDDDDDDDDDD>
##$VPLIST= <PPPPPPPPPPPPPPP>
##$VTLIST= <TTTTTTTTTTTTTTT>
##$WBST= 1024
##$WBSW= 4
##$XGAIN= (0..3)
0 0 0 0 
##$XL= 0
##$YL= 0
##$YMAX_a= 16499
##$YMIN_a= -16882
##$ZGOPTNS= <>
##$ZL1= 120
##$ZL2= 120
##$ZL3= 120
##$ZL4= 120
##$ABSF1= 248.5645
##$ABSF2= -253.2056
##$ABSG= 5
##$ABSL= 3
##$ALPHA= 0
##$AQORDER= 0
##$ASSFAC= 0
##$ASSFACI= 0
##$ASSFACX= 0
##$ASSWID= 0
##$AUNMP= <proc_1d>
##$AZFE= 0.1
##$AZFW= 0.5
##$BCFW= 0
##$BC_mod= 2
##$BYTORDP= 0
##$COROFFS= 0
##$CY= -3
##$DATMOD= 1
##$DC= 0
##$DFILT= <>
##$DTYPP= 0
##$F1P= 0
##$F2P= 0
##$FCOR= 1
##$FTSIZE= 65536
##$FT_mod= 6
##$GAMMA= 0
##$GB= 0
##$INTBC= 1
##$INTSCL= 5.30512e-09
##$ISEN= 30
##$LB= 1
##$LEV0= 0
##$LPBIN= 0
##$MAXI= 10000
##$MC2= 0
##$MEAN= 0
##$ME_mod= 0
##$MI= 50
##$NCOEF= 0
##$NC_proc= -3
##$NLEV= 6
##$NOISF1= 182.463
##$NOISF2= 159.3651
##$NSP= 0
##$NTH_PI= 0
##$NZP= 0
##$OFFSET= 248.5645
##$PC= 4
##$PHC0= -7032.292
##$PHC1= 66.48596
##$PH_mod= 1
##$PKNL= yes
##$PPARMOD= 0
##$PSCAL= 0
##$PSIGN= 0
##$REVERSE= no
##$SF= 81.014009
##$SI= 65536
##$SIGF1= 159.3651
##$SIGF2= -187.1042
##$SINO= 113.3802
##$SIOLD= 16384
##$SREGLST= <1H.CDCl3>
##$SSB= 0
##$STSI= 65536
##$STSR= 0
##$SW_p= 40650.406504065
##$SYMM= 0
##$S_DEV= 0
##$TDeff= 32768
##$TDoff= 0
##$TI= <>
##$TILT= no
##$TM1= 0
##$TM2= 0
##$TOPLEV= 0
##$USERP1= <user>
##$USERP2= <user>
##$USERP3= <user>
##$USERP4= <user>
##$USERP5= <user>
##$WDW= 1
##$XDIM= 65536
##$YMAX_p= 540733348
##$YMIN_p= -2002698
$$ End of Bruker specific parameters
$$ ---------------------------------
##NTUPLES= NMR SPECTRUM
##VAR_NAME=  FREQUENCY,     SPECTRUM/REAL,   SPECTRUM/IMAG
##SYMBOL=    X,             R,               I
##VAR_TYPE=  INDEPENDENT,   DEPENDENT,       DEPENDENT
##VAR_FORM=  AFFN,          ASDF,            ASDF
##VAR_DIM=   65536,         65536,           65536
##UNITS=     HZ,            ARBITRARY UNITS, ARBITRARY UNITS
##FACTOR=    0.620285442955139, 1,           1
##FIRST=     20137.2065510759, 0,            0
##LAST=      -20513.1999529892, 0,           0
##MIN=       -20513.1999529892, -2002698,    0
##MAX=       20137.2065510759, 540733348,    0
$$ Real data points
##PAGE= N=1
##DATA TABLE= (X++(R..R)), XYDATA
$$ [...]
38574g460q9913m6611m1734k8351R952N2288O0103O402p2933r0555k0751N0715
38562b18848N3689M2039Q3424J15664M6844n5918m9480K7830j6915j97922k54370
38551d23963k2664K66106K67828P686j60660n9348J06520J11779L3011M7373J05319
38540B78987L4552j36465k02983r7603M0274J02253J10769P5946l0952j33714
38530D1064j02007J0297J0591r1584n8803J54434K53636O0332j67288j27255N5500
38519C8917O6891p4891r7803L1359O9830o4141j64288r0770M1496R6544Q9516
38508e7340N4355l4432j29750j04702L7962J25173O2172l6251l8292K6396N8574
38497c6135L6865j119l2401m8005m2728k2094K7772J32168K19442J22537j71367
$$ plain form
38574 -7460 -97373 -143984 -185718 -214069 -204117 -151829 -91726 -85324 -158257 -248812 -269563 -218848
38562 -218848 -165159 -123120 -39696 75968 122812 66894 17414 45244 28329 -169593 -423963
38551 -423963 -446627 -180521 87307 94993 -65667 -125015 -18495 93284 126295 173668 278987
38540 278987 313539 177074 -25909 -123512 -83238 19015 129784 205730 174778 41064
38530 41064 -60943 -50646 -40055 -131639 -190442 -36008 217628 277960 110672 -16583 38917
38519 38917 105808 30917 -66886 -35527 34303 -29838 -194126 -284896 -243400 -146856 -57340
38508 -57340 -2985 -37417 -167167 -271869 -233907 -108734 -46562 -82813 -121105 -94709 -36135
38497 -36135 730 -389 -32790 -80795 -123523 -145617 -117845 14323 233765 356302 184935
38486A84935l79052k34322J24469L07663J77603l9818j27721j01268l6037O3903
38476e9645J53790J28514K548p2742l6970P771m58M134M8796N5402k664n2083
38464A76393p1751j12712j36319l8524J23882J55697L4071l2507N9289J40590
38454B98109N3678j05145j57160q2663L0194J22887J45381M4580j25955k12144
38444A1762j47093j2682J08422J85664J48199m8171k48225k33943o0549J1066
38434b85550n5175l1542J20235J40005m2499j13025R5755K61910Q8809j73305
38424E618j22376J35934J79053l7719j49897l972J36370N9933r4149j26240o4968
38413h2413k0788K0758J02082J49304P7126n6039j20581r0093m7967m7257m7477
$$ plain form
38486 184935 -194117 -428439 -303970 3693 181296 141478 13757 -87511 -123548 -59645
38476 -59645 94145 222659 225207 152465 115495 123266 122808 126942 175738 231140 228476 176393
38464 176393 104642 -8070 -144389 -182913 -59031 96666 130737 98230 157519 298109
38454 298109 351787 246642 89482 6819 37013 159900 305281 349861 223906 11762
38444 11762 -135331 -148013 -39591 146073 294272 246101 -2124 -236067 -296616 -285550
38434 -285550 -340725 -372267 -252032 -112027 -154526 -267551 -171796 90114 178923 5618
38424 5618 -116758 19176 198229 160510 10613 6641 143011 202944 108795 -17445 -82413
38413 -82413 -103201 -82443 19639 168943 246069 190030 69449 -20644 -68611 -115868 -163345
38402a63345m488L6723J302p3388m8257J08669K20889J31153m7999q2968L0402
38391A08693P8175j8640j05048q3618m8969m9911J9128J62305J81191N791j22140
38380A26957j9188J13797J0408k02461j89130O0483K19819J23733l8959p3237
38370A32222m0325o9788j23977r3508j81L5186k3294p8673l5756P6140J41805
38359h0149J04340K9114K388J5962J4003N842L0508M0426m7865j88290k28555
38348c02276j18939L0658J19788J49818J32836N7635k6001l4058J7183M2691M7253
38337A16588Q3811Q1481o0269k19985j69737M0589J21935J8629o970J33896J65227
38326C05195n9430k45409j18830J21211J40917l708m0924K6028j5446j64652k18238
$$ plain form
38402 -163345 -167833 -131110 -129808 -203196 -251453 -142784 78105 209258 161259 78291 108693
38391 108693 186868 168228 63180 -20438 -69407 -119318 -100190 62115 243306 249097 126957
38380 126957 107769 221566 231974 29513 -159617 -99134 120685 244418 205459 132222
38370 132222 91897 22109 -101868 -195376 -195557 -160371 -183665 -262338 -298094 -221954 -80149
38359 -80149 24191 53305 55693 71655 85658 91500 122008 162434 114569 -73721 -302276
38348 -302276 -421215 -390557 -270769 -120951 11885 69520 43519 9461 26644 69335 116588
38337 116588 200399 281880 221611 1626 -168111 -127522 -5587 13042 6072 139968 305195
38326 305195 245765 356 -118474 2737 143654 139946 99022 125050 109604 -55048 -273286
38315b73286j30587m0583J0519R7353J90482J85741J14267Q1752N4027n6222j58208
38304G5255r9593M2254N6541n1260p9994J4827O6618Q107l1284J7009M6173j6587
38292D8066q7387q0353k0186M8916J16837J37079N2397p5392j03122j0279O3368
38281H9944K0589o7766q0753j638Q2983Q5080M551n9894k1447O1526M9707n3861
38269A09021q2267K5102R5656j0037j64074j69107n4420J4728J3324M0286J05611
38258g6177J28961R4731M0130m5657j51487j60146j0969J40325J16385p607k9683
38247C8806M9478M6680r1188k11133j85677m2120J26897K26472J70040j3503j32129
38236a7377n7607O0616k019j86844k19493j8550J88453J89077L7613p0972l8312
$$ plain form
38315 -273286 -403873 -444456 -433937 -336584 -146102 39639 153906 235658 289685 233463 75255
38304 75255 -24338 17916 74457 23197 -56797 -41970 24648 32755 1471 18480 64653 48066
38292 48066 -39321 -119674 -139860 -90944 25893 162972 215369 139977 36855 26576 89944
38281 89944 110533 42767 -37986 -39624 43359 128439 132990 73096 51649 113175 162882 109021
38269 109021 26754 51856 147512 137475 -26599 -195706 -250126 -235398 -222074 -181788 -76177
38258 -76177 52784 147515 187645 141988 -9499 -169645 -180614 -40289 76096 68489 38806
38247 38806 88284 134964 43776 -167357 -353034 -395154 -268257 -41785 128255 114752 -17377
38236 -17377 -74984 -14368 -16387 -203231 -422724 -441274 -252821 -63744 -26131 -97103 -135415
38225a35415P7123J44936Q5331l6733o7907K9311J04541K9962j14341j69089j08048
38214a60329n088J01904J81874J53691L258j37706j60571j19421q3286J038J48214
38203g6422K02645O2298j10908j11718P336O1391K7932J003k0529p6531r8732
38192a32235l6098L483n0445n3152R7360K03812N9963j65172j57559N5943J84281
38181A0181J29889L7678k0795p9563p9402L3030R7387l2021j59464k5756J97650
38170A08814J31011j64398k45048k298J74851M6103j37903j03007M4414Q5092
38160f2369L1588Q5p654k1057m450L5182K9083j622K8051P1637J2960q1382m3196
38147a3144O9322L4805j29958j68894k1565R1279P2072P1369J29314P3279j04337
$$ plain form
38225 -135415 -58292 86644 171975 135242 67335 96646 201187 231149 116808 -52281 -160329
38214 -160329 -165417 -63513 118361 272052 275310 137604 -22967 -142388 -225674 -224636 -76422
38203 -76422 126223 188521 77613 -34105 -26769 34622 62554 63557 43028 -33503 -132235
38192 -132235 -168333 -164850 -215295 -268447 -171087 32725 92688 -72484 -230043 -174100 10181
38181 10181 140070 177748 156953 77390 -2012 31018 128405 96384 -63080 -88836 108814
38170 108814 239825 75427 -169621 -171919 2932 49035 -88868 -191875 -147461 -62369
38160 -62369 -30781 -30696 -38350 -59407 -63857 -28675 408 -1214 26837 98474 111434 30052 -13144
38147 -13144 56178 90983 -38975 -207869 -229434 -138155 -66083 5286 134600 207879 103542
38136A03542j42759M6702J86425P1549j13022j22505j7355J7059k3515m2457l3251
38125f9587k0691J8824N9848K4679m9967l9874L7909N6014M0124J10195J65318
38114C32792n382k73153k60478L7891J89848K1598j14701J7260J34368j7126j81402
38103a18485n5444J67684J52756o270j5375Q2898M6284r9318j49706j10321j06095
38092b11392p0192R6544K20934J03068q7040n9822Q8984N0129j37727j55624K4757
38081a37381J02608j3414p6997K2594Q0187j7030q0172K3507J28525P2163l0344
38070G4246r622P2090O0926k0178l8505J5030L4298j3453n0303k5261J2645p261
38058A04652p8162j17467o3277M2578R7637O9625K8790K3360o17q9771j63269
$$ plain form
38136 103542 -39217 7485 193910 265459 152437 29932 12577 29636 6121 -36336 -69587
38125 -69587 -90278 -71454 -11606 13073 -36894 -76768 -38859 17155 57279 167474 332792
38114 332792 327410 54257 -206221 -168330 21518 43116 -71585 -54325 80043 62917 -118485
38103 -118485 -173929 -6245 146511 140241 124866 207764 254048 154730 5024 -105297 -211392
38092 -211392 -281584 -185040 35894 138962 51922 -7900 81084 131213 -6514 -162138 -137381
38081 -137381 -34773 -48187 -125184 -102590 -22403 -39433 -119605 -96098 32427 104590 74246
38070 74246 64624 136714 197640 177462 138957 153987 188285 174832 124529 99268 111913 104652
38058 104652 26490 -90977 -154254 -111676 -14039 55586 84376 107736 107119 17348 -145921
38047a45921j02454O8287J88226J55254M3213k199N2342Q7870p359j67858k13220
38036d3819r4924K9444L7706K2936R1623J23747l4194k33102j78733R3084K22186
38025C5954N9538j24842q6975M4416M3974n3093q7787o0491n0817k1574P4158
38014b27539J24005J2518j49890j53384J7641J76889J75147L3325j09666j10421
38004b11375M3437J79464J34093m419k6725L8350l3141k24374k26347N2528K76788
37993a721J87573j5033m8045J0576l5935r9142m293J31547R6993j5971J1067J01985
37981C19601L3239j23266j15960J1444j2501j74772j65193Q4475K53815J28256
37971B39138j06250j91491j28072m1981L2953R7739J04337M9644R807J1489N838
$$ plain form
38047 -145921 -248375 -180088 8138 163392 206605 204406 256748 344618 337259 169401 -43819
38036 -43819 -138743 -109299 -71593 -48657 42966 166713 132519 -100583 -279316 -186232 35954
38025 35954 95492 -29350 -116325 -71909 -27935 -81028 -168815 -229306 -280123 -301697 -227539
38014 -227539 -103534 -91016 -240906 -394290 -376649 -199760 -24613 8712 -100954 -211375
38004 -211375 -167938 11526 145619 141200 114475 152825 119684 -104690 -331037 -278509 -1721
37993 -1721 185852 170819 122774 133350 97415 -1727 -6020 125527 222520 206549 217616 319601
37981 319601 352840 229574 113614 125058 112557 -62215 -227408 -142933 110882 239138
37971 239138 132888 -58603 -186675 -228656 -195703 -97964 6373 56017 65824 77313 83151
37960H3151l037L6457P7393J4163j17745j69882j18814p3779m1927P5541K20498
37949a7981J78388o5845k24195j00533J21687J54948L115j03160m9934O4167J13783
37938G4440P2010k6165j24698j53472p8701M5406J21093J03462L2009k1216k0656
37927B3512O651J4379N852K6176P4306Q4848L4228r546l533j3304r0653j47953
37915D963p5107P3742J40530P8378j6183o1100n7689k0059M1791P3535K3427o2405
37903A43823q8551m3849P907M5189Q5905R1630O479j08559j15451k231P4197L08
37891I6797j32654j47125n357J48309J61893M9832l6489j0009L8307j2219j07340
37880D3945r0845L5896R8267K5209m4960j1537L0807j64o407Q4953J35881K7253
$$ plain form
37960 83151 80114 116571 193964 208127 90382 -79500 -198314 -272093 -314020 -238479 -17981
37949 -17981 160407 94562 -129633 -230166 -108479 46469 49584 -53576 -103510 -39343 74440
37938 74440 146450 120285 -4413 -157885 -236586 -191180 -70087 33375 65384 44168 23512
37927 23512 30163 44542 50394 76570 150876 235724 269952 260406 256873 243569 152916 4963
37915 4963 -70144 3598 144128 222506 206323 145223 87534 67475 109266 182801 206228 143823
37903 143823 55272 11423 19330 64519 150424 242054 248533 139974 24523 22292 96489 96797
37891 96797 -35857 -182982 -188339 -40030 121863 171695 135206 125197 163504 151285 43945
37880 43945 -46900 -11004 87263 112472 67512 55975 86782 86618 80211 165164 301045 328298
37868C28298r1649l2687R0071L6131j41549j71101j6135P4635p445p9024j4824
37857b5279N0594k888o8078l1506J6133k7737o2518L3994J53342J07462n7709
37846H5810j22733l4040K8459n5597j66377j26698N8005K26295K50885J27768
37836B71777o4676k10732j99581k3615J62699J76268K4407r7696o6461J9981K6221
37825A8592o932K7067P4325J996j38204j52105j8454O7937K0021j1378P0961J25294
37813G9120L0234q2825n2269L5940J5263o0658k9637P2412P7257o179j3417O6092
37801A31333O6864m0613p3247M9033J37408J6603j92542k31736n4249J33839J48762
37790I1455K2910q8877j05725o8348l1313J2011P3935J11597Q8349M8360M4733
$$ plain form
37868 328298 236649 203962 294033 330164 188615 17514 1379 76014 68569 -10455 -25279
37857 -25279 25315 22427 -45651 -77157 -61024 -88761 -151279 -117285 36057 143519 85810
37846 85810 -36923 -70963 -42504 -98101 -264478 -391176 -333171 -106876 144009 271777
37836 271777 207101 -3631 -203212 -226827 -64128 112140 136547 38851 -27610 -7629 18592
37825 18592 11660 38727 113052 115048 -23156 -175261 -193715 -125778 -105757 -117135 -46174 79120
37813 79120 109354 26529 -25740 10200 25463 -35195 -64832 7580 84837 78658 65241 131333
37801 131333 198197 157584 84337 133370 270778 287381 94839 -136897 -191146 -57307 91455
37790 91455 114365 25488 -80237 -148585 -179898 -167887 -93952 17645 105994 154354 199087
37779A99087L6316l4556j04449p4793l181k4141r2228l3628J21571J30469n3428
37768F7039j54194j4823J23983J9902j54905r8286J17487J73017J5897j06059
37758a0942p6928l8107p0229o1436M0535J03313L2732p2095p6913J3008R9071
37747a17991J06823L1923m7071k2225R1273J23150j6083j65181j39051k0214j0826
37736a85473p9863j9411J79027K78400J54974l9562j29599j18201p5609j5450
37726e0767M3409M5777m882m2028n2763p5969q6407k4799O3304P4419K2551N172
37714h2983J5684k5572p6060k0192R2623R1508j8801m9261M5534Q6659q585q0970
37702c0416j4704P1076N5381K0736O1072P9410l0673j56312j24122J7355P2439
$$ plain form
37779 199087 235403 200847 96398 21605 18424 -5717 -97945 -131573 -10002 120467 67039
37768 67039 -87155 -101978 22005 41907 -112998 -211284 -93797 79220 95117 -10942
37758 -10942 -87870 -125977 -196206 -257642 -217107 -113794 -81062 -153157 -230070 -217062 -117991
37747 -117991 -11168 20755 -26316 -48541 42732 165882 149799 -15382 -154433 -174647 -185473
37736 -185473 -265336 -284747 -105720 172680 327654 288092 158493 40292 -35317 -50767
37726 -50767 -7358 38419 33537 -8491 -61254 -137223 -223630 -248429 -185125 -110706 -88155 -82983
37714 -82983 -67299 -92871 -168931 -189123 -96500 -4992 -23793 -73054 -27520 59139 50554 -30416
37702 -30416 -45120 25956 81337 102073 163145 242555 211882 55570 -68552 -51197 21242
37691B1242o813q0630n0869K3166M6679J7022J558M0925R2271O7891m8390j45770
37679b1718j11975O342O3768K3612j6685r382j7780o0468n1028L6678Q7566K5091
37667d5979n2972k9916M3285M3162j9948k6248N5582J16842O4057n6868j19359
37656b8362o3597L6659N7923k4731j04138p9701J7611Q9487J00460O4765k7258
37645C9118j47777j60975J5875K13124J74815o4637j91615n8695J13553R5449
37635B8235j7611j3773P8824Q2699k08r411P3742R7737J6144m2480j9704k0144
37623B54050q2606p3650O2226J39091R54j88120j53064P2842J86003N8043j06728
37612A69041j13153l7084k6204m3281J6269R6778P3047j9014l7854K6770N4973
$$ plain form
37691 21242 14429 -66201 -117070 -93904 -47225 -30203 -28645 12280 104551 172442 124052 -21718
37679 -21718 -133693 -127351 -63583 -39971 -56656 -66038 -83818 -144286 -195314 -158636 -71070 -45979
37667 -45979 -98951 -128867 -85582 -42420 -62368 -88616 -33034 83808 147865 90997 -28362
37656 -28362 -91959 -55300 2623 -22108 -126246 -205947 -188336 -98849 1611 66376 39118
37645 39118 -108659 -269634 -253759 -40635 134180 69543 -122072 -180767 -67214 28235
37635 28235 10624 -3149 75675 158374 158166 148755 222497 320234 336378 293898 274194 254050
37623 254050 171444 97794 160020 299111 300065 111945 -41119 31723 217726 275769 169041
37612 169041 55888 18804 -7400 -50681 -34412 62366 135413 116399 78545 105315 160288
37601A60288O580m2722n9297p9478q7338k7776N8635P1236J7058j3533k2385p6256
37589i4988j20932l4502J25310J55643K8468n4854J0396Q3758M2589k9377k1785
37578H9726L4811Q0302J12123Q4726o1553k01528j15840J24937J66548r3594k96044
37567g5386j55101J05082J27247l7148r1316Q438O5167J8068j6752K724K6156
37556b2821O3089J17571P4541j19035k80908k35042r0556l7175k1365R2737J97938
37545b61026J07949p2792q6377N3388J11265M4104K2747P6184N3671n8012r5954
37534a04853j9530L5105J5980J1594M2554M2415L2080P1314P7244m7106j59265
37523b468n1170J67110J84761k3339j68248j20498o1756j05128j08407K0754J31325
$$ plain form
37601 160288 166868 124146 64849 -14629 -101967 -129743 -71108 128 17186 3653 -18732 -94988
37589 -94988 -215920 -250422 -125112 30531 58999 4145 14541 98299 140888 111511 89726
37578 89726 124537 204839 316962 401688 340135 138607 22767 147704 314252 220658 -75386
37567 -75386 -230487 -125405 1842 -35306 -126622 -118184 -53017 -34949 -51701 -48977 -22821
37556 -22821 40268 157839 232380 113345 -167563 -402605 -493161 -530336 -551701 -458964 -261026
37545 -261026 -153077 -225869 -312246 -258858 -147593 -103489 -80742 -4558 49113 -8899 -104853
37534 -104853 -124383 -89278 -73298 -61704 -19150 23265 55345 126659 203903 156797 -2468
37523 -2468 -53638 113472 298233 274894 106646 -13852 -75608 -180736 -289143 -268389 -137064
37512a37064Q1597m5793j03743o9210J1057R1436R4518k1320j37677r6148N6179
37501b76168J31338R5050Q4350J43616J66777J02166O111r2087j76832j48066
37491C6255L8704K00063J38869m6723j32244j36174k04506k46004p4205J67704
37481b58261J64554j9272j3890K13936K87144O7602j21645p2488n275r4904j38869
37470H632K7507J81621R0479q8489r6570P257K2830k1994J9200J03673P9604m2343
37458B91407j24299j20767r2790q0183p4835m5331N8348K16595K69773J08060
37448D05978j05221j33227l9920o3157j60180p1178J56930J68889q4096k07312
37438a32494j2178J74946R5115k2361N9868J30411m4492k19427o5059K22737K07301
$$ plain form
37512 -137064 -55467 -101260 -205003 -274213 -263156 -171720 -77202 -98522 -236199 -332347 -276168
37501 -276168 -144830 -49780 34570 178186 344963 447129 453240 361153 184321 36255
37491 36255 74959 275022 413891 367168 234924 98750 -105756 -351760 -425965 -258261
37481 -258261 -93707 -112979 -126869 87067 374211 441813 320168 247680 242405 147501 8632
37470 8632 36139 217760 308239 219750 123180 130437 153267 131273 150473 254146 333750 291407
37458 291407 167108 46341 -46449 -126632 -201467 -246798 -188450 28145 297918 405978
37448 405978 300757 167530 127610 64453 -95727 -166905 -9975 158914 74818 -132494
37438 -132494 -144672 30274 125389 103028 162896 293307 248815 29388 -35671 187066 394367
37427C94367q4392k34449j09041J0855m3460r8962n452J15046J00317r195p2995
37416c7361m4601J8267M7759K7847L529J9250L8195o189o9843l4392Q4438J20176
37404A67075P854j09934j07146m1581j0850k879J6741K0108K591N619J091p4043
37392a25354j35492k6799J77878K11360L1803q7996m220P7426r699j01568k7456
37381b0117O6996k071j04538l2304J09944P9354p8293j10150R183M5825r1800
37370a27971j97404q0041J60571K68251J44060n5459j20284m0681M877o6802r8151
37359b09034M9185K19667J69885l4507j03639K3650J10393K5061q5559q6573l7698
37348D0831j2081J1679J8832l0645l8023J07232K36625P8433k56962l53603j09491
$$ plain form
37427 394367 309975 75526 -33515 -22660 -66120 -165082 -170534 -55488 44829 35634 -37361
37416 -37361 -81962 -63695 -15936 11911 15440 34690 72885 66696 -3147 -37539 46899 167075
37404 167075 174929 64995 -42151 -83732 -94582 -97461 -80720 -60612 -58021 -52402 -51311 -125354
37392 -125354 -260846 -287645 -109767 101593 133396 45400 41180 118606 108907 7339 -20117
37381 -20117 46879 44808 -59730 -92034 17910 97264 18971 -91179 -81996 -36171 -127971
37370 -127971 -325375 -405416 -244845 23406 167466 112007 -8277 -48958 -44081 -110883 -209034
37359 -209034 -159849 59818 229703 195196 91557 115207 225600 250661 165102 78529 40831
37348 40831 28750 40429 59261 28616 -9407 97825 334450 412883 155921 -197682 -307173
37337c07173J26710J24276M6870L9988p624j18784q9620R4935J37627n4121j58705
37326a65621P014J63269P2698o6624m1452l637q8938q3800J42547K80758Q0915
37315B97129j63671q4856J41530J18577j14983k27154j57321q3254k6244Q4915
37305b15332J42360M3859m4930K4374O8095q4947k01109k0210K29704J67392j04582
37294D674j85228k9348O9547K6055K2257R9533J15968N5262J9240p815p5182p9239
37282C5724L9580J00896n437n7328J02551J98002k9558k96184j99754R3557J37002
37271A19051m3787p4883N7662L9222j34651j57449p68P0749L8861J20588K43335
37260B77930J10229j99274k70929m7565P9879m9333j42470k2452R8145O1207J3981
$$ plain form
37337 -307173 -180463 -56187 -9317 30671 23047 -95737 -185357 -90422 47205 -6916 -165621
37326 -165621 -158607 4662 77360 10736 -30716 -34353 -123291 -207091 -64544 216214 297129
37315 297129 133458 48602 190132 308709 193726 -33428 -190749 -274003 -300247 -215332
37305 -215332 -72972 -29113 -74043 -49669 18426 -66521 -267630 -287840 -58136 109256 4674
37294 4674 -180554 -209902 -140355 -114300 -92043 7490 123458 178720 197960 190145 114963 35724
37282 35724 75304 176200 170763 113435 215986 413988 384430 88246 -111508 -17951 119051
37271 119051 75264 381 58043 97265 -37386 -194835 -195603 -124854 -85993 34595 277930
37260 277930 388159 188885 -82044 -129609 -49730 -99063 -241533 -263985 -165840 -104633 -90652
37249i0652O0085P6255J3837j540K6416n5909j91762j33367J00666J98508P1555
37238G4092k0084M3701N7154p7754j48100k7476R5811O0034k9047n1258o1042
37227h3969r0732n2581M9922Q1955K6486P520K8336k3768r8618l1448J19417J25574
37215E8094j1050o7203p755m888n3697J4152J30384N7435j23489q1179J58488
37204F9292J97536m7425j91552o5243J0411j47521k30662j2235K27524J91910
37194B035M3242L1509M8021p6568j85425r1612M5571J4391n4804M2564J74305
37183f771J03125q1605j29749n2937l2416n4067K3172J46628J39446J7726m1916
37172C0636L781M4279L5964K9985K6228j5564o1188n0161j1002p266k9282l7343
$$ plain form
37249 -90652 -30567 45688 59525 57985 84401 28492 -163270 -296637 -195971 2537 74092
37238 74092 54008 97709 154863 77109 -70991 -98467 -2656 57378 28331 -22927 -83969
37227 -83969 -174701 -227282 -177360 -95405 -68919 -61399 -33063 -56831 -155449 -186897 -67480 58094
37215 58094 47044 -20159 -27914 -32802 -86499 -72347 58037 115472 -8017 -89196 69292
37204 69292 266828 219403 27851 -37392 -26981 -174502 -405164 -417399 -189875 2035
37194 2035 45277 76786 124807 48239 -137186 -228798 -183227 -168836 -223640 -181076 -6771
37183 -6771 96354 14749 -115000 -167937 -200353 -254420 -231248 -84620 54826 72552 30636
37172 30636 34417 78696 114660 144645 170873 155309 94121 43960 32958 25692 -3590 -40933
37160d0933l7327l4399k023M2142L9136J0478L9191R4393M8711q1763j14440J0085
37148b6749J19668Q3949l708k0162N297J2404K9967O4610M1699m4115q8318o5615
37136A08927p4938j24918q5658O0574J44148Q4902J8044L2116J7918q6067j34611
37125c9563k9543Q1041M0595o4240p5315k2242k1474n2544k1214N2288P0063J4157
37113f7991m8968o1565n469Q2248R6551j9671j39114q3793R6708J71790P6428
37102I7154j0658J5522L2805n0081j13745l9678Q6578J19546N5055j9066m5133
37091A28299J130R8041J34269K8470j03017q6124J6028r483j43334j36717N5120
37080a7318J64323M4532r8792o8089K3893L097o4670l4990N2658Q0445O1366O0498
$$ plain form
37160 -40933 -78260 -112659 -114682 -72540 -33404 -22926 16265 110658 159369 77606 -36834 -26749
37148 -26749 92919 176868 173160 152998 158295 170699 200666 265276 306975 262860 174542 108927
37136 108927 33989 -90929 -176587 -116013 28135 113037 131081 163197 181115 95048 -39563
37125 -39563 -69106 11935 52530 -11710 -87025 -109267 -130741 -183285 -204499 -152211 -82148 -67991
37113 -67991 -116959 -178524 -183993 -101745 -5194 -24865 -163979 -247772 -151064 20726 97154
37102 97154 86496 102018 134823 84742 -29003 -68681 17897 137443 192498 173432 128299
37091 128299 129429 227470 361739 390209 287192 201068 217096 207613 64279 -72438 -17318
37080 -17318 147005 191537 92745 24656 48549 51646 -13024 -48014 4644 85089 146455 206953
37068B06953M5270k5956q7989p4054k2455J9482O9809J13695P9220j7058n9420
37057B47497l0511m3747j18552j21113n529Q7997O5562J5842K2695L1177p486
37046A43832l7922l1680m2775o6992k6087N7236O3870o84k915O3119N1980n4254
37034A16728r3229j1267M5574k86m6417l5370m1437o9033j9952Q0585Q9564K2270
37022C7730L5447R8354R243k04277k60845q9635N0535K7634K7701J47801J91561
37011G1249N5017o2335l6052l5372j45382j48937N8267K00410O1551j39037j17022
37000b37643L5383Q6652N8993P0416N2962n3306p9078Q1088K00647P5384r4923
36989A96575l3873J21721M9075k05542k97787j25129O6991Q9859K0152q66N0246
$$ plain form
37068 206953 252223 226267 138278 64224 41769 61251 131060 244755 323975 306917 247497
37057 247497 216986 173239 54687 -66426 -71955 16042 81604 97446 120141 151318 143832
37046 143832 105910 74230 31455 -35537 -61624 -4388 59482 58798 55883 119002 170982 116728
37034 116728 23499 12232 57806 57520 11103 -24267 -65704 -134737 -154689 -74104 15460 37730
37022 37730 73177 171531 180774 -23503 -284348 -373983 -323448 -295814 -268113 -120312 71249
37011 71249 126266 63931 27879 -7493 -152875 -301812 -243545 -43135 18416 -120621 -237643
37000 -237643 -202260 -115608 -56615 13801 66763 13457 -65621 15467 216114 291498 196575
36989 196575 162702 284423 333498 127956 -169831 -294960 -227969 -138110 -117958 -118824 -68578
36978f8578J09628J01547J1287n2850K0197J24572L9179j91591k52219m4359J30144
36967g3043M7668r7039n7791O8088Q6583O0993J12233J22477l5203j93043j42779
36956a00856J002J0820o4407l8784N2938N5801m73j965l880q5608j12797M5916
36944b42293K18196J63743k8765j00056m2322l5890q5636n9174O605k7430r8492
36933c31514k7083J42519J90521P7158k7838m2205m0462n3104l1709R103J6166
36922a18448K2857P5370J07571N5838n124p270l2543j29775j53097L669J78059
36911b893J76488P3916L6084K3156o4621j30799o6729j3263j20855k20918q6191
36900c96625J36369J35497m2925q6873N0339J21284N0439J9683P8541O0366o2420
$$ plain form
36978 -68578 41050 142597 153884 101034 121231 245803 284982 93391 -158828 -203187 -73043
36967 -73043 -25375 -122414 -180205 -112117 -25534 35459 147692 270169 234966 41923 -100856
36956 -100856 -99854 -89034 -153441 -192225 -139287 -83486 -83959 -85924 -89804 -175412 -288209 -242293
36944 -242293 -24097 139646 110881 10825 -31497 -67387 -153023 -212197 -205592 -233022 -331514
36933 -331514 -358597 -216078 -25557 51601 23763 -18442 -58904 -112008 -143717 -134614 -118448
36922 -118448 -95591 -20221 87350 143188 138064 130794 98251 -31524 -184621 -180952 -2893
36911 -2893 173595 247511 283595 306751 242130 111331 44602 31339 -89516 -310434 -396625
36900 -396625 -260256 -124759 -167684 -254557 -204218 -82934 -32495 -12812 65729 126095 63675
36889F3675r9226P279P4409R431m9786j5188O329m7487n9710M1859J35852J01662
36877A69099k740n7603m3005r541L317k4803p5941p6612P095Q7940Q0876M9867
36865A07949R0616J33497M2528j34525k10326j34230l3820J4555O1704J13071
36855E1019P5826n7203j31355l4110J27060J50229n58j43309j00477P5025J62672
36844A74819P0829l7119j533O7445l3384k37012k73322q8786P7468Q0837N0259
36833a49499R1897J01455J1002m2524L4123J05419M4001n7484p4432m5078k5747
36822f867L4088J23487J04608l2465q9226J2460Q0414n057q2168k8204J4360m9378
36810G6052m4869J20394J99644Q450k09728j59436K8482N3585n3841o3833J8755
$$ plain form
36889 63675 -35551 -28272 46137 55568 5782 -9406 -3077 -50564 -110274 -68415 67437 169099
36877 169099 166359 108756 65751 56210 59527 34724 -41217 -117829 -110734 -22794 58082 107949
36865 107949 198565 332062 374590 240065 29739 -104491 -138311 -123756 -62052 51019
36855 51019 126845 69642 -61713 -95823 31237 181466 180908 37599 -62878 12147 174819
36844 174819 245648 208529 206996 274441 241057 4045 -269277 -358063 -280595 -199758 -149499
36833 -149499 -57602 43853 54855 12331 46454 151873 195874 138390 63958 18880 -6867
36822 -6867 27221 150708 255316 222851 133625 146085 226499 221442 139274 111070 125430 76052
36810 76052 31183 151577 351221 359671 149943 -9493 18989 72574 18733 -45100 -26345
36799b6345K5112k9988j8598K5952J7589L7023J42234J56453l3838j86322o5280
36788D3992J23526N9412j38267j25932O2237J06022k1336n4893L7229J6758j32461
36777b3713j37293P4682K26673J34484m6469j19485r9669o7666j6440N6601Q7972
36766F9677M7007k9897j07032j41420o6026R2322J66885O0096j04009j62073j10957
36755b85427r207J33756K37468J50103p1430j41179J5607J03552m6042j66933
36745g9732k8782J47324R7792j2520N8181J38244k7043k45155j80496N3024J12183
36734C3020J9046J9784N8051o8408k08859q1717J55359J29881p9460q6854R7500
36723a2657J16137n2970q3215N6823O6413o7698l2215J78482J96897n2039k02427
$$ plain form
36799 -26345 -1233 -31221 -49819 -23867 -6278 30745 172979 329432 295594 109272 43992
36788 43992 167518 226930 88663 -37269 24968 130990 109654 54761 91990 108748 -23713
36777 -23713 -161006 -86324 140349 274833 228364 108879 9210 -58456 -74896 -18295 69677
36766 69677 116684 86787 -20245 -161665 -227691 -135369 31516 91612 -12397 -174470 -285427
36755 -285427 -294634 -160878 76590 226693 155263 14084 29691 133243 87201 -79732
36745 -79732 -108514 38810 136602 124082 182263 320507 293464 48309 -132187 -79163 33020
36734 33020 52066 71850 129901 61493 -147366 -229083 -73724 56157 -23303 -110157 -12657
36723 -12657 103480 50510 -32705 24118 90531 22833 -9382 169100 365997 313958 111531
36712A11531r0214J2173n0563o8502N4250Q6533o0186j21681M2480J88392J16571
36701B20784k6014o7728p2163r7221m4004Q2819R4695m3604j10466J468J16052
36690E4618R4447K3992j5032p0391j19496n2257P6538Q0858k2176k9783O3923
36679H5241N0583r0165j36002k1416O9904O1628P0455R7240J1451j20586q7359
36668i026N6151M6414r0006n5965J44522J54004j08877k72095j25631P0611R0185
36657i9713Q1323J70662J70662l8013k15595j42841K8132O2407l309k5308j0283
36646b1876o934K0242N4242K357q6186m7978P8658P9812l2931j4751J43168J48648
36634C16471o8585j97768p3754O1487J8882l2049N5047J10846o976j35039j16921
$$ plain form
36712 111531 21317 33490 -17073 -85575 -31325 55208 -4978 -126659 -84179 104213 220784
36701 220784 194770 127042 54879 -42342 -86346 -3527 91168 47564 -62902 -61434 54618
36690 54618 149065 173057 158025 87634 -31862 -84119 -7581 73277 51101 21318 85241
36679 85241 135824 45659 -90343 -111759 -41855 19773 90228 187468 198919 78333 -9026
36668 -9026 47125 93539 3533 -52432 92090 246094 137217 -134878 -260509 -189898 -99713
36657 -99713 -18390 152272 322934 284921 69326 -73515 -45383 17024 13715 -11593 -21876
36646 -21876 -28810 -8568 45674 48031 -38155 -86133 -7475 72337 39406 24655 167823 316471
36634 316471 247886 50118 -23636 37851 56733 24684 79731 190577 183601 48562 -68359
36623f8359o1364o0255Q226J64482J73033m2177j81714m8126J06519J9498j25184
36612a15421l2031J89503K21930N3787o5091m9780l8404r7743j31032n1439J12198
36601c523K43878K10274M954j62785r8632O3024K7543j75677k08761J6210J69260
36590H5765L0984j74466j71056l0967M1467M6998Q1717J17757R8229O0380J7124
36579B03932q2945j76432j10591O0946R0925n3397j09379L3244J40943M7665p9266
36568c4355o5551J948K2095P2166J56566R1513j39044k35264l2553K04694J95126
36557B37341N2000J1205K7994n3223j61115j36959l3441O50j5174J8107O5107
36546A2492M0734j8651m1258m9082o8285n4678r859m584j5259N6826J48706P7006
$$ plain form
36623 -68359 -129723 -189978 -181752 -17270 155763 113586 -68128 -116254 -9735 9763 -115421
36612 -115421 -147452 42051 263981 317768 252677 202897 164493 66750 -64282 -115721 -3523
36601 -3523 240355 450629 455583 292798 194166 257190 284733 109056 -99705 -83495 85765
36590 85765 116749 -57717 -228773 -259740 -218273 -171275 -89558 28199 126428 186808 203932
36579 203932 120987 -55445 -166036 -105090 -14165 -67562 -176941 -143697 -2754 44911 -34355
36568 -34355 -99906 -97958 -75863 -3697 152869 244382 105338 -129926 -162479 42215 237341
36557 237341 289341 300546 328540 275317 114202 -22757 -56198 -55548 -70722 -52615 12492
36546 12492 53226 34575 -6683 -55765 -124050 -178728 -188587 -193171 -208430 -151604 -2898 74108
36534G4108j16657j60814Q579J26357M0218n8295m965O6989K1286l0734J5070
36523a8858M2114l1053n8999N0800J31686M6391o9094n5441J8434M1056M7042
36512A44078M7117n9452k23909j91910Q7001K85138J60979p8461j21003M861Q0751
36501A35190O1327L1881o79m6944m0167J6033n611j12310j19280L1961J38159
36490H9560P6294O105N0743O2858p4808j91274j15257K0830J6099o8874o2065
36479a89789J9998N3001L7011M5052O1969L6204j2468m2840m4484O71P6724P3798
36467A14847m8184j05342M8275K06127R6772j19663q0592J28163Q2385k21834
36457A00954l13618m5326J65931P2311l4031O6259J23692m3782j62276j6327J36370
$$ plain form
36534 74108 -42549 -203363 -194784 -68427 -28209 -86504 -91469 -24480 -3194 -33928 -18858
36523 -18858 23256 -7797 -66796 -15996 115690 162081 92987 37546 55980 97036 144078
36512 144078 191195 131743 -92166 -284076 -197075 88063 249042 170581 49578 54439 135190
36501 135190 196517 228398 227719 180775 140608 156641 151030 38720 -80560 -48599 89560
36490 89560 165854 171959 222702 285560 210752 19478 -95779 -74949 -58850 -127724 -189789
36479 -189789 -169791 -116790 -79779 -34727 27242 63446 50978 8138 -36346 -35675 41049 114847
36467 114847 66663 -38679 9596 215723 312495 192832 112240 240403 322788 100954
36457 100954 -212664 -257990 -92059 -19748 -53779 12480 136172 92390 -69886 -86213 50157
36446E0157M5741q3449j1723Q8819L928r8714j4668Q9519R228r4374j1137J13496
36434H6823O6404m0051k2188J8965n9556j30470n6247K3697k4839n9178L2949
36423a63691P4658m9428j19410K6866J66373Q4003m4919q36Q5661K7964n3046
36412C4195M0O1446j915n1451K4143O7460p452j1134J04045N6522k19994l22593
36400b66688m2576K11009Q2612j30311m1375J42850O3023j09322l3599J34292
36390I915O2777r8181j5152J56941M5988k20276k07532P6141K25883J17276r841
36379A43939m1825o4606n0114P1776J44671J1326j40674o4136J03191R1104k1321
36368A83331j0444L3931q1662k06384q9375J25792J29556j7257m2366L4724K3138
$$ plain form
36446 50157 95898 12449 726 89545 93473 -5241 -19909 69610 78838 -15536 -26673 86823
36434 86823 153227 113176 90988 109953 50397 -80073 -136320 -112623 -137462 -196640 -163691
36423 -163691 -89033 -138461 -257871 -231005 -64632 19371 -25548 -26384 59277 87241 34195
36412 34195 34235 95681 93766 42315 66458 133918 126466 115332 219377 275899 55905 -266688
36400 -266688 -309264 -98255 -15643 -145954 -187329 -44479 18544 -90778 -124377 9915
36390 9915 72692 -25489 -40641 116300 162288 -57988 -265520 -189379 36504 153780 143939
36379 143939 102114 37508 -12606 59170 203841 215167 74493 10357 113548 204652 183331
36368 183331 172887 206818 125156 -81228 -170603 -44811 84745 67488 25122 59846 82984
36357H2984j4973P1210J37386l142j58223o9703Q4224O326j43014l8146J71066
36346A25995J07470j31298j40209O0700Q9365q8302j30817K9561R8604j2198p1708
36335f2837m650J6042k9513J9875J23220P0191r6897j16517L4677J15860M6840
36324A16291j3636N162K4727M1038R5762J05527J1943l9622L4588K6705j88225
36313B20260l15099r3452J85264J07049j65755j72563P3100J74949O9238M4811
36303A27802J32134O9087j40389j88478j2471J06664K9408q2903j05273o9544
36293a33963K1867J55256J62146m0355k00873q2996J18506R9279l6674j9923N9667
36282A01937l1026j51728l3198J57297P1608j59539j18469J67079K77731J06219
$$ plain form
36357 82984 68011 139221 276607 273465 115242 45539 129763 136089 -6925 -45071 125995
36346 125995 233465 102167 -38042 22658 112023 23721 -107096 -77535 21069 8871 -62837
36335 -62837 -67487 -51445 -80958 -61083 62137 132328 35431 -81086 -46409 69451 116291
36324 116291 102655 107817 132544 173582 269344 374871 386814 347192 381780 408485 220260
36313 220260 -94839 -188291 -3027 104022 -61733 -234296 -161196 13753 82991 127802
36303 127802 259936 329023 188634 156 -12315 94349 123757 40854 -64419 -133963
36293 -133963 -112096 43160 205306 164951 -35922 -118918 -412 98867 62193 42270 101937
36282 101937 70911 -80817 -114015 43282 114890 -44649 -163118 3961 281692 387911
36272C87911o3524j09613j53140j60703q434J37189L6063j31150l0156J93679
36262I8122J36815j28955j72952L3476J17905R099j5113N5295l5957k01956q2542
36251a86763K44042K93074j1894k13031j04441J619p3751q7671Q3007J89027R6055
36240B29273J0938M2100J2664j29060j69523m3888M0551P910J8925Q9442L7434
36229A46766j12715j10328O0802J29537J2988p2729k8463J4251K5901J08062J78037
36218C52109N2883j51894j47173K0691M3005r2895j04233M1174Q3066j9486l6753
36207D0494N2743K8498j05429j09917J5267L0849o4155m2793P2263M7274o4364
36196i9270Q414K01158J82693k5036o8876P6877O6770j49187k14042j6538J19754
$$ plain form
36272 387911 324387 214774 61634 -99069 -107503 29686 65749 -65401 -95557 98122
36262 98122 234937 105982 -66970 -33494 84411 93510 78397 133692 97735 -104221 -186763
36251 -186763 57279 350353 338459 125428 20987 22606 -51145 -138816 -55809 133218 229273
36240 229273 240211 282311 294975 165915 -3608 -47496 -6945 965 19890 109332 146766
36229 146766 34051 -76277 -15475 114062 127050 54321 25858 40109 66010 174072 352109
36218 352109 404992 253098 105925 126616 169621 76726 -27507 13667 96733 77247 40494
36207 40494 93237 121735 16306 -93611 -78344 -47495 -111650 -154443 -82180 -34906 -99270
36196 -99270 -90856 110302 292995 267959 199083 275960 342730 193543 -20499 -37037 82717
36185H2717K7524n9958P053O1910M648l3558j0160l4065n8856O3662K16575J46693
36173D14185o2626j09562j0978k5150j14011k9369J35696P0711j30494q8985J51301
36162B00718J73441o2327j66177l1213M7230j2742R299Q9801j6157j90768p5481
36151c4376K04805J60249j80867k65618K2187J74690k1153j53188K1081J85934
36141A13744J15675K9529N9364O118j53195j39032N9400J07193k8487o287J77153
36130C41175J12406k17733l03004L568K03785K5853j53891n7218M2106o1805j15566
36119a80324K2677O9729q7602j14761J20395K42411M8386j18792j3978R6298J300
36108H5739o6702M5480Q2796q5809j71220k5121O6898l6954m6083J56396K16794
$$ plain form
36185 82717 110241 50283 57336 119246 123894 90336 80176 46111 -12745 50917 267492 414185
36173 414185 351559 241997 231019 205869 91858 62489 198185 268896 138402 49417 200718
36162 200718 374159 311832 145655 114442 161672 148930 158229 248030 231873 41105 -34376
36151 -34376 170429 330678 149811 -115807 -93620 81070 59917 -93271 -72190 113744
36141 113744 229419 258948 318312 324430 171235 32203 91603 198796 170309 164022 341175
36130 341175 453581 235848 -67156 -63588 140197 166050 12159 -45059 -2953 -64758 -180324
36119 -180324 -157647 -87918 -175520 -290281 -169886 72525 120911 2119 -11859 84439 85739
36108 85739 19037 64517 147313 61504 -109716 -134837 -67939 -104893 -150976 5420 222214
36097B22214l4219k16458n6774J49844J04694r508K4901N0350o5692j14927K2115
36086G6540J03093j0703q7648K862M2198o5568q8017L6129L5110j32976j33132
36075b22112J00989J86265r92q0015R9910J54133r2158k35910l7626J37491J7680
36064B7655q7512P4220J99649K7084j57637p8631J9980j12422k31911p8372J26565
36053b71332J06638J0230N1957J03546J9369m3800L3426Q2525J3222j291O9019
36042A73509p25j96268j92332L2007Q9654j04764j54118P4127J93433M1385k1259
36031f5351J61059K22038k06j31891R112O8288j22512k00931m436R1202p5474
36020d9102j13447J34025K38855J3082j11998O5331J20879j12916j47065J92528
$$ plain form
36097 222214 187995 -28463 -85237 64607 169301 159793 184694 235044 169352 54425 76540
36086 76540 179633 168930 81282 84144 126342 60774 -27243 8886 43996 -88980 -222112
36075 -222112 -121123 65142 64150 -15865 84045 238178 146020 -89890 -127516 9975 27655
36064 27655 -59857 14363 214012 241096 83459 4828 24808 -87614 -319525 -397897 -271332
36053 -271332 -164694 -154464 -102507 1039 20408 -23392 10034 92559 105781 104490 173509
36042 173509 172784 -23484 -215816 -183809 -94155 -198919 -353037 -278910 -85477 -44092 -65351
36031 -65351 95708 317746 317540 185649 194761 263049 140537 -60394 -64830 26372 -49102
36020 -49102 -162549 -28524 210331 223413 111415 176746 297625 184709 37644 230172
36010B30172L06271r5142l65343m2364K99291O7387l12764k06981J27357J09743
36000A17627j31990j43353o498k8477o4744J14128K57763J07316n6831M6014J41179
35989C52134k4095j29516Q2901K35432R597k15184p0832J01695n3494j85788N6310
35978A59160K66829J6888k93741j44563J54684P2599j61415o2048J59687M7660
35968B15740j78319n2543K15223J31849j50225j47797O3568Q5294k4314K1555
35958A80031Q3383q5378k33173n2267J65923L7089j76716o5193J42000M5778j24296
35947h2819K0495K17293M4158k16176p1317K33708J56085j35988j07503J27087
35937A85023O3651j95045j37169J73004K14070l6685j21387L2524O2187r0972
$$ plain form
36010 230172 536443 441301 75958 33594 332885 400272 87508 -119473 7884 117627
36000 117627 -14363 -157716 -164214 -192691 -257435 -143307 114456 221772 164941 210955 352134
35989 352134 328039 198523 281424 516856 526453 311269 240437 342132 288638 102850 159160
35978 159160 425989 442877 149136 4573 159257 231856 70441 8393 168080 215740
35968 215740 37421 -15122 200101 331950 181725 33928 97496 182790 158476 180031
35958 180031 263414 178036 -55137 -107404 58519 95608 -81108 -146301 -4301 41477 -82819
35947 -82819 -62324 154969 199127 -17049 -88366 145342 301427 165439 57936 185023
35937 185023 248674 53629 -83540 89464 303534 266849 145462 177986 240173 149201
35927A49201j17143M4626J53358J42413J09331n547k32398l07583q2113J18775
35917b7080K5996q0789P5664J99803q999k18872n0723J96626J06375p0025O4231
35906B12207K32941R6l44112k50337J22246K29271P6323L1766O0596o4443j44191
35895A62363O9164K44107N254k93439j43518J71678O8128k77160k60142O8261
35885a85304J61425k8644q4371N1793Q5649J2003K5958K8517j15541j39734J49458
35874c8791L53031J15660j76305o1693J43251l1803k68820m7089L25827K37612
35864E50880j14445j24792J03413N2351j59672m7134K29833J37846k02011k36205
35854A90064J0246P8697j7689N8272J85038M0752j51432j8549J63199l6704k98958
$$ plain form
35927 149201 32058 76684 230042 372455 481786 476239 243841 -63742 -145855 -27080
35917 -27080 -1084 -81873 -6209 193594 184595 -34277 -85000 111626 218001 147976 212207
35906 212207 445148 445244 101132 -149205 -26959 202312 278635 310401 370997 306554 162363
35895 162363 231527 475634 480888 187449 43931 215609 283737 6577 -253565 -185304
35885 -185304 -23879 -52523 -136894 -85101 548 12551 38509 67026 -48515 -188249 -38791
35874 -38791 314240 429900 253595 191902 335153 303350 34530 -12559 313268 550880
35864 550880 436435 311643 415056 467407 307735 260601 490434 628280 426269 190064
35854 190064 200310 279007 261318 319590 504628 545380 393948 375399 538598 501894 202936
35843B02936r8218K55853J38420k21769j63437J76680J62626j26522j07668J52012
35833C70913J18775j09348j2138K60091J27024k75990l06751m282L1339k07964
35823h331j94417O9227J09274l6311N4846K45958Q0396k21205q3712K90874K23943
35812E30542j82607k26043J05336J69896j01803j57519O9155J04297p2862m2168
35802A96224J34526L7616j88362p3025J91637O6956k37614j05747K69761J95241
35792D87213k01478j92407J73870J91680j28866j11621K32027K12287j88734k73489
35782B00482L7151J01931j60299j49670J83612K30460o4817j01661J75374J76999
35772F29562j36315j58949J60061K08886r1536j58977Q1702P1519k37544k70620
$$ plain form
35843 202936 104718 360571 498991 277222 113785 290465 453091 326569 218901 370913
35833 370913 489688 380340 368202 628293 755317 479327 172576 168294 199633 -8331
35823 -8331 -202748 -133521 -24247 -60558 -5712 240246 320642 99437 15725 306599 530542
35812 530542 347935 121892 227228 397124 295321 137802 206957 311254 238392 196224
35802 196224 330750 368366 180004 106979 298616 365572 127958 22211 291972 487213
35792 487213 285735 93328 267198 458878 330012 218391 450418 662705 473971 200482
35782 200482 237633 339564 179265 29595 213207 443667 378850 277189 452563 629562
35772 629562 493247 334298 494359 703245 611709 452732 534434 605953 368409 97789
35762I7789L3319J15737q3705m3021K40716K13624j11957j46832J18643J05068
35752E39381j87026j78380J10547Q8534k00277j37388K06927J48417k64551k84934
35742a58750J27985K60045K2338K5618K54422Q0354l51761k24073L63797M15867
35732H15842j77240m09237M1549L19839L1162j41051J31472K23359j40378l41192
35722C54125r7456M3093j33948j10077K13716K20762j85978l00742O5567K25822
35712B94884o8921k01849O8799J81621o1254j19533J57023K25037l3452q5985
35702C56370J20192L5550k94830k07422K36490K49442j69114j64142L26984L80555
35692H70075j80443m18701j1774K07319j28863k93485N4628K49566j0852j10690
$$ plain form
35762 97789 131108 246845 163140 120119 360835 574459 462502 315670 434313 539381
35752 539381 352355 173975 284522 373056 172779 35391 242318 390735 126184 -158750
35742 -158750 -30765 229280 251618 277236 531658 612012 260251 36178 399975 815842
35732 815842 638602 229365 270914 590753 621915 480864 612336 835695 695317 354125
35722 354125 256669 299762 165814 55737 269453 490215 304237 3495 69062 294884
35712 294884 225963 24114 92913 274534 213280 93747 250770 475807 442355 356370
35702 356370 476562 512112 217282 9860 246350 495792 326678 162536 489520 870075
35692 870075 689632 270931 259157 466476 337613 44128 98756 348322 337470 226780
35682B26780J67688J88793j93377k55032J63757K72416j53289l09147J02111L20184
35672E30884M071j82112N1213R8532k02012j71775K84873L38289j97807m40955
35662A13201o2305J71636n4114o5191L14190L26848j58463k68720J76396K46061
35652G39539k85930m24348J49137M14910o9619l53947N5813K81160j68481m31177
35642i2943K3998L90880J06928j41405J19451K33701j66692l53399M2649K73134
35632D36302l1892j38007K60696L60845j33871l34315J17287L02871k01265m86443
35622A52208o3898K37874m1512j31888K99449L75158k17494m57179R9218M28752
35612F80688j3073k91286J16619L02910j97200m15643J17226L72934j55173l90524
$$ plain form
35682 226780 394468 583261 389884 134852 298609 571025 417736 108589 210700 530884
35672 530884 534955 352843 404056 502588 300576 128801 413674 751963 554156 113201
35662 113201 50896 222532 168418 103227 417417 744265 585802 317082 493478 739539
35652 739539 453609 29261 178398 593308 523689 169742 225555 506715 338234 -92943
35642 -92943 -68945 321935 428863 287458 406909 640610 473918 120519 163168 436302
35632 436302 404410 266403 527099 887944 754073 419758 537045 839916 638651 152208
35622 152208 88310 326184 284672 152784 452233 827391 609897 152718 251936 680688
35612 680688 667615 376329 492948 795858 598658 183015 300241 673175 518002 127478
35602A27478K18642N25884j36110o05855o0509M42923J7110m01306N3686N03317
35592F85260R7305l38349M165L17055j50325n24923l606N38466K08276k49295
35582E84029m47K81629r8983l91931N5195L91639p9950m62726O208M37838L1376
35571G53877l48100R7735M86461j055m50438L1288N49046J38205l62490O9489
35561I64018O87242M42433k4064L54228J096545J124958N12296j35716q03656
35552D218284j348265j063614r9757K32305l90981o20008J08600M89829j42811
35543A383582m98891J47268M85821k57721o97828P4423O61604J0181n40528J45449
35533I13360P66313J05819n40960K23405J234311Q69430j79919n19583m96013
$$ plain form
35602 127478 346120 872004 735894 130039 69530 512453 529563 128257 181943 685260
35592 685260 782565 444216 448381 765436 615111 90188 86582 625048 833324 584029
35582 584029 583582 865211 766228 374297 429492 821131 741181 278455 284663 722501 753877
35571 753877 405777 503512 989973 988918 538480 569768 1118814 1257019 894529 964018
35561 964018 1651260 2093693 2069629 2423857 3520402 4645360 5157656 5021940 4218284
35552 4218284 2870019 1806405 1706648 1938953 1547972 927964 1036564 1526393 1383582
35543 1383582 884691 1031959 1517780 1260059 562231 636654 1298258 1308439 767911 913360
35533 913360 1679673 1785492 1244532 1467937 2702248 3571678 3391759 2872176 2376163
35524B376163q36831q08675R9720O12564j11563p03063n8363N63664o357n84700
35514E42559o499N68829j683n45276N4580N65687j29008o98500N2717P31225J4387
35503A149018p26873o9401P04826J57989n21093N822N27976j78513p31334J25654
35493D44071Q44689Q190q05532m7279P46347j2029p81959M3510Q62160o121r06712
35482C89335m4062R33445J41381q03586J3289R51989M6613j012953j47214R67286
35472A435523J62305r26307r6023J020529J90086r30642o3576J098622K17427
35463B107944r77605q3256J117559J29422j210241k63364J148780K82310j087686
35454A163863j90974J176145K21569j165003j05520J401496L10058j343272l47692
$$ plain form
35524 2376163 1539332 730657 830377 1442941 1331378 628315 569952 1133616 1127259 542559
35514 542559 536060 1104889 1103206 557930 612510 1178197 1049189 350689 403406 1134631 1149018
35503 1149018 422145 352744 1057570 1215559 694466 700288 1228264 1049751 318417 444071
35493 444071 1288760 1296950 491418 444139 1190486 1178457 396498 440008 1302168 1296047 389335
35482 389335 345273 1278718 1420099 616513 629802 1581791 1628404 615451 468237 1435523
35472 1435523 1597828 671521 575498 1596027 1786113 855471 791895 1890517 2107944
35463 2107944 1130339 1047083 2164642 2294064 1083823 820459 1969239 2251549 1163863
35454 1163863 972889 2149034 2370603 1205600 1100080 2501576 2811634 1468362 1120670
35445A120670J281373K55288j354429j57776J656327M77044j486918m12489J554760
35436B933850M97053j435175k72143J703726L77771j795307m15392K006809P94819
35427D396011j580567l22656K005399M97018k013524l28207K439995O45815k405602
35418C333682n54845K792430R77330k513591n42143L274785J289881k677220l95895
35409D984414M017603J607914l115793k20903N420586K719594l061151N65185
35401A2917449P970571N210536j284170M359866J4176421R087661o03919J0286398
35393F2120813L0225838K7013837J9111568O3002830J44576693J56400640L8281129
35386E40733348j16627074j67733733j02540091k9749261j9071276l3377570k2707468
$$ plain form
35445 1120670 2402043 2657331 1302902 1145126 2801453 3278497 1791579 1379090 2933850
35436 2933850 3430903 1995728 1723585 3427311 3805082 2009775 1594383 3601192 4396011
35427 4396011 2815444 2492788 4498187 4995205 2981681 2653474 5093469 5739284 3333682
35418 3333682 2778837 5571267 6548597 4035006 3492863 6767648 8057529 5380309 4984414
35409 4984414 9002017 10609931 7494138 7273235 12693821 15413415 12352264 12917449
35401 12917449 20888020 26098556 24814386 29174252 43350673 52438334 51834415 62120813
35393 62120813 92346651 119360488 138472056 201474886 346051579 502452219 540733348
35386 540733348 424106274 256372541 153832450 124083189 105011913 71634343 48926875
35379D8926875j535894j938648j3261496j0145894N02595q23526q175216n317295
35371H231501K453974R92910n059149l133261K709505J203051l969169k452043
35363I77319K524213J410911l000631j941206K129424J164602k557629j549959
35355h42956K057169J211965k126032j300433J877450J091666j981338j298377
35347a310886J648105J115837j563921r79502J589333R55055j651741j159082
35339a356802J375296J055716j262127r58453J212460Q82272j243745r93978R90794
35330b98567P51607j086454p41339J141309Q64467r84814q17097Q75254O85077
35321C89443r21897p15743Q04221N37048r48150n86652J031994Q27125p08653
$$ plain form
35379 48926875 47390981 45452333 32190837 22044943 22547538 21724012 13548796 8231501
35371 8231501 10685475 11678385 6619236 3485975 6195480 7398531 3429362 977319
35363 977319 3501532 4912443 1911812 -29394 2100030 3264632 707003 -842956
35355 -842956 1214213 2426178 300146 -1000287 877163 1968829 -12509 -1310886
35347 -1310886 337219 1453056 -110865 -1090367 498966 1454021 -197720 -1356802
35339 -1356802 18494 1074210 -187917 -1146370 66090 948362 -295383 -1289361 -298567
35330 -298567 453040 -633414 -1374753 -233444 631023 -353791 -1170888 -295634 389443
35321 389443 -532454 -1248197 -443976 93072 -855078 -1441730 -409736 417389 -291264
35312b91264n80804P85783N38738q51412n63070R29976P74622o91365p10900M97771
35302a61925L94716p50514n29159O87365N08520o64399m64989O95728M97643o10306
35292c97320l38933P91129M57406p63134m45327Q62445O51919n78910k28545J263047
35282A273777J072038o98693j198855m4526L37918n35481o48055K88885L87513
35273B34521m96700m92807M87657N72144l44425m38623M08955M54483m03636m90296
35263e08727K79336L26083l63688k84799M47680L14656m57135k59526O40031N14790
35253F48701m31353m11669N05839O42648O0594K76442R54776L75596j028302j130229
35243D63043K0865L06044n42543o60134K48333M52098l35296m62910L42586M75375
$$ plain form
35312 -291264 -872068 -86285 452453 -398959 -962029 -32053 742569 51204 -659696 -161925
35302 -161925 232791 -517723 -1046882 -359517 149003 -515396 -980385 -284657 212986 -397320
35292 -397320 -736253 54876 512282 -250852 -696179 166266 818185 239275 10730 1273777
35282 1273777 2345815 1647122 448267 403741 741659 206178 -441877 -152992 234521
35273 234521 -262179 -754986 -267329 304815 -39610 -478233 -69278 385205 -18431 -508727
35263 -508727 -229391 96692 -266996 -551795 -104115 210541 -246594 -506120 133911 648701
35253 648701 217348 -194321 311518 954166 1014760 1291202 2245978 2621574 1593272 463043
35243 463043 483908 789952 247409 -412725 -164392 287706 -47590 -510500 -167914 307461
35233C07461l37462n10425K80797N26701j31490l19655K43938K48042m71616n37618
35223g01327K14408L70388k85785l76678L17107M37821k37535l65592K88810M06479
35213F8096k54155l96155K36583L89604j92717l15623K32155K96086k47529k18952
35203d02607M13766L44300m68232n61999K75170N73635o6097l37243J76665L00732
35193B48090k92427m30053J80158L39158k59521m04964K45680M86284r0948l53673
35183c32216J10430K42936l01618m35230J95076M70937m5263l07283J51302L78447
35173A27518o3388k91885P8140K15507j82062k79646J64340K88452j18811j85525
35163b47360K48641K62751k73632l54141J97283L35090j86900l48768J26293K63759
$$ plain form
35233 307461 -30001 -540426 -259629 267072 135582 -184073 59865 307907 -163709 -701327
35223 -701327 -486919 -116531 -402316 -778994 -461887 -24066 -261601 -627193 -338383 68096
35213 68096 -186059 -582214 -345631 43973 -148744 -464367 -232212 63874 -183655 -402607
35203 -402607 11159 355459 -112773 -674772 -399602 174033 107936 -229307 -52642 248090
35193 248090 -44337 -474390 -294232 44926 -214595 -619559 -373879 112405 21457 -332216
35183 -332216 -221786 21150 -280468 -715698 -520622 -49685 -94948 -402231 -250929 127518
35173 127518 64130 -227755 -149615 65892 -116170 -395816 -231476 56976 -61835 -247360
35163 -247360 1281 264032 -9600 -363741 -166458 168632 -18268 -367036 -240743 23016
35153B3016j87448k57367K67298L61361k15055m03246R7968K62296k14287l13713
35143e79177K51305M15977j49818l59744J80552M00819j40651l94291J27633M01448
35133A54053j19435m70449n6150K70034n0646k32394K06512M56028L0347k73304
35123h5404L9207K18839j77756l84240L5302K97852o4123l05220L7323K60340
35113a27880n6717k23702J22503K59490j37195k73852J91510L97731p6005l62451
35103b86568M4210L38694o154k38676J46939L90374n1418m42206j74911J38068
35093a41648n2812k08438R7971K76930n4799k49338Q1816K59105j13670l24191
35083d29074M4612K47847j70037m25750L4735M59874J89498j70410O321K05133
$$ plain form
35153 23016 -164432 -421799 -154501 206860 -8195 -411441 -313473 -51177 -265464 -579177
35143 -579177 -327872 88105 -61713 -421457 -240905 159914 19263 -375028 -247395 154053
35133 154053 34618 -435831 -491981 -221947 -272593 -504987 -298475 157553 187900 -85404
35123 -85404 -46197 172642 -5114 -389354 -354052 -56200 -120323 -425543 -388220 -127880
35113 -127880 -184597 -408299 -285796 -26306 -163501 -437353 -245843 151888 75883 -286568
35103 -286568 -242358 96336 90182 -148494 -1555 388819 337401 -104805 -279716 -141648
35093 -141648 -194460 -402898 -304927 -27997 -82796 -332134 -250318 8787 -104883 -429074
35083 -429074 -384462 -136615 -306652 -732402 -697667 -237793 -48295 -218705 -212384 -7251
35073g251j00757l69382q5605K09112J779j89824J13070L76104J13873j57035
35063i5916L4000J95135p8931k43161R3611L12732l7342l24159l0207K55136K474
35052H3372k30069O5115L02117n6013l99859j05606K72888N6181k97266j08527
35042d17667K52333J42580j41507k8417K18016R8138j28256k2864J46560M867
35032A23783j47390J0968J16364j29249k77782Q836K36229K120k04812N5241L00705
35021I5013M8304k48984o4688K22082R7484j25974K123J78604R04k17682j01538
35010a14352M3677r5241j73846P1110K12388k3079j47085J31019K46382j53018
35000b045m25255o0541L49283J62208k02310j33522O9097p3587k27993L2606L01596
$$ plain form
35073 -7251 -108008 -477390 -562995 -353883 -352104 -541928 -428858 -52754 61119 -95916
35063 -95916 -61916 133219 54288 -188873 -95262 217470 180128 -144031 -174238 80898 83372
35052 83372 -146697 -81582 220535 164522 -235337 -340943 -68055 -11874 -309140 -417667
35042 -417667 -165334 -22754 -164261 -192678 25338 123476 -4780 -27644 118916 123783
35032 123783 -23607 -12639 103725 -25524 -303306 -294470 -58241 -56121 -260933 -205692 95013
35021 95013 143317 -105667 -170355 51727 149211 23237 25360 203964 204868 -12814 -114352
35010 -114352 -70675 -165916 -339762 -268652 -56264 -79343 -226428 -95409 150973 -2045
35000 -2045 -427300 -487841 -138558 23650 -178660 -312182 -243085 -316672 -544665 -512059 -210463
34989b10463R9771j85497n5492J54238J112j56300R0445L05475K1829k96451p8147
34978c09480K84007J63632j75708j53340P3861O1563l9945O3446J12394j14574
34968c4144j93736J39930L25127m9070l96382j52388J91950L0864k27824q842
34958c74515K82676O6676k38922r673L48727J52914k41452j05812K87034K06617
34948C74270j57117j19993J62781N0381k93110k10576J65017J54313j92326k29189
34938b95549O8926J35468r0306j35973M9309P4858o4687k7204J36558R8043n4251
34927a04808n368J10122k4082k12208p6106J90215J51670o3690m6247J01893J7656
34916C9047j65938p6308J51401J21652q3401j10859j2050m5777j00584M4095J94173
$$ plain form
34989 -210463 -110692 -296189 -351681 -197443 -196331 -352631 -262186 43289 65118 -231333 -309480
34978 -309480 -25473 138159 -37549 -190889 -117028 -55465 -95410 -31964 80430 -34144
34968 -34144 -227880 -87950 237177 188107 -208275 -360663 -168713 -137849 -365673 -374515
34958 -374515 -91839 -25163 -264085 -273758 74969 227883 -13569 -119381 167653 374270
34948 374270 217153 97160 259941 310322 17212 -193364 -28347 125966 -66360 -295549
34938 -295549 -226623 -91155 -181461 -317434 -268125 -193267 -257954 -285158 -148600 -50557 -104808
34927 -104808 -110176 -54 -24136 -236344 -312450 -122235 29435 -34255 -80502 21391 39047
34916 39047 -126891 -203199 -51798 69854 -13547 -124406 -136456 -182233 -282817 -238722 -44549
34905d4549R1204o0752J940P8900m6559j12191Q3377J80711p9645k79769o7895
34894b55228J50911j9792j86983N5328K67031k9818l61818j03154L59501K97719
34884A73697q5536j23823P9407j5678k60344j33776J86054J46856j14637p5958
34874b23738J36544N1150j47214K7833L25770J51402k86111k95547O9327J74124
34864a6460k4364l3465J42312P7184j34691m6372J92402P1582k54147j98710J52057
34853g2672K01498l9112l9515J70194Q0660k25828j72463J79888J80151k13644
34843D9157l44425l7236J55638M682p9948P3560J23019k9759n9071P4754M6657
34832b2972j13067k9220K23709J64609j87056k82540r176J48700J8210k3958J42292
$$ plain form
34905 -44549 46655 -14097 -12157 66743 20184 -92007 -8630 172081 92436 -187333 -255228
34894 -255228 -104317 -124109 -311092 -255764 11267 -18551 -380369 -483523 -124022 173697
34884 173697 88161 -35662 43745 28067 -232277 -366053 -179999 -33143 -147780 -223738
34874 -223738 -87194 -36044 -183258 -155425 170345 321747 35636 -259911 -190584 -16460
34864 -16460 -40824 -74289 68023 145207 10516 -35856 156546 228128 -26019 -224729 -72672
34853 -72672 128826 89714 50199 220393 301053 75225 -97238 82650 262801 49157
34843 49157 -295268 -332504 -176866 -172184 -252132 -178572 -55553 -85312 -144383 -69629 -22972
34832 -22972 -136039 -165259 58450 223059 36003 -246537 -255713 -107013 -88803 -112761 29531
34821B9531J51839r1357j98585k9215P0366n6672j29080k0202L3665l9146j2825
34810b91681J24149J05018p7181j25973Q382P6335L5357O5113J12606j4886j71827
34799a54588p6454J09613K6120j85860j05251J69886J76024n4825n8306J82890
34789B9249K09959n1532j75502l1572M4330n6427o5275M6701n222k01543j96241
34778d53075K2418J01260o104M249J33868P1365j30928p8749J98527K17240j16041
34767c5970l20230j44686Q7974J01423L1598K2540K189j6461Q6001J89110N7216
34756F0704j80457j84361m777J8947r8290l9334J65198J63270n5417j39461j8081
34745c12059L5230k8856O353J20582R2514j1867L4586J04640n9879k44743o1791
$$ plain form
34821 29531 181370 90013 -108572 -137787 -67421 -124093 -253173 -273375 -239710 -278856 -291681
34810 -291681 -167532 -62514 -139695 -265668 -257286 -180951 -145594 -80481 32125 17239 -154588
34799 -154588 -231042 -121429 -95309 -281169 -386420 -216534 -40510 -95335 -153641 29249
34789 29249 239208 187676 12174 -19398 24932 -31495 -96770 -50069 -55291 -256834 -453075
34778 -453075 -430657 -329397 -335501 -331252 -197384 -126019 -256947 -335696 -137169 80071 -35970
34767 -35970 -356200 -500886 -412912 -311489 -279891 -257351 -255162 -271623 -185622 3488 60704
34756 60704 -119753 -304114 -308891 -289944 -388234 -427568 -262370 -99100 -154517 -293978 -312059
34745 -312059 -276829 -305685 -299332 -178750 -86236 -98103 -63517 41123 -18756 -263499 -325290
34734c25290K80815K44165j06121k04337L9407J64147L3608j8922O5452j7874
34724A55050k38275k19489K3745R6457q088O9675K61977J37242k13206k29227
34714a64139J02052J85074j06859k14803N8313K05407k0029j85020l3356Q0950
34704i2410m6975q1841J31252K20850K1480q5718Q1734J50238o2244j69351L0280
34693I7295J43683n9389j87113K5701J91426j0887k24850o3367J98259J33788
34683B44546j09285j45519j5406J860q3417q6926k6972r163J8325R7014J05019
34672i924Q334k1952O2402O7067o1949r9387L5043R8107l5602j38661m5154O9532
34660g2144L1737n3808o2399n8231q0808l7464O1662P3042R186L2559J17569P9689
$$ plain form
34734 -325290 -44475 199690 93569 -110768 -71361 92786 126394 107472 172924 155050
34724 155050 -83225 -302714 -278969 -182512 -190600 -120925 141052 278294 65088 -164139
34714 -164139 -62087 122987 16128 -198675 -140362 65045 45016 -140004 -173360 -92410
34704 -92410 -139385 -221226 -89974 130876 152356 66638 148372 298610 236366 67015 97295
34693 97295 240978 181589 -5524 20177 211603 200716 -24134 -87501 110758 244546
34683 244546 135261 -10258 -25664 -23804 -107221 -194147 -221119 -230282 -211957 -114943 -9924
34672 -9924 -1590 -23542 38860 105927 43978 -55409 -20366 77741 42139 -96522 -141676 -72144
34660 -72144 -40407 -94215 -156614 -214845 -295653 -333117 -271455 -198413 -189227 -156668 -39099 40590
34648D0590m0361k1767R9898P6634p0126q2283J8904l8185k12972j67804J01099
34637b96373K07282L2898j07577n5643r429l9424L6114J83420J25451j01032j28675
34626a52988P8028J25004j05831k40840p5712J15654J15514O3182N0296n2462
34616h0155k05005j59499M9252J00802k0534Q948K10859K36568L9580k8460Q6605
34605B38961K7842k39002k83254p7J63280N758j07252J9350O7889r9063j19844
34594c25412J40063K40200n4028k98712j17160J83499J91426L6878J3065N0116
34584E9935j522j4168R8028J24845l4931j31782j8690Q8145M8108K5236O1461
34573C04665n5304k81761k52806M5449J54681n3470j25751J24967K40620l1672
$$ plain form
34648 40590 229 -21538 78360 154994 84868 2585 21489 -16696 -229668 -397472 -296373
34637 -296373 -89091 -56193 -163770 -219413 -228842 -268266 -232152 -48732 76719 -24313 -152988
34626 -152988 -74960 50044 -55787 -296627 -372339 -256685 -141171 -77989 -27693 -80155
34616 -80155 -285160 -444659 -395407 -294605 -315139 -306191 -95332 141236 180816 152356 238961
34605 238961 266803 27801 -255453 -255530 -92250 -86492 -193744 -174394 -106505 -205568 -325412
34594 -325412 -185349 54851 823 -297889 -415049 -231550 -40124 -3246 9819 59935
34584 59935 58413 44245 142273 267118 232187 100405 81715 169860 217968 243204 304665
34573 304665 249361 -32400 -285206 -239757 -85076 -138546 -264297 -139330 101290 69618
34563F9618k38380l9518J68983k360k19755n6079K36619K18265K8770L0714J14708
34552C11585j2277k08079j62578K0066M6283l9622l7760j7209j04434j38128L0463
34541c11690J83911R7968m5100J85R8938L2648p5459l0583M3586k5299r6804k262
34529a29961J04305L9117o3356l3327J2672m3034m3915J05869J77486J9916j27162
34518A8610n7175L2544o1022j51311l1551J22473R2916J6150O9817J07790k3300
34507A35941j39941o0698L9653k9016j07812j7857P6755j1767j30655q0148L8178
34496b87367P3369R8838J51964O3609j68335k29007o948J51497J9010j22447j0950
34485b66767J28262L2180j13934n2311P8115N2625k6309l940N977p4645n1793
$$ plain form
34563 69618 -168762 -208280 -39297 -41657 -261412 -317491 -80872 137393 166163 196877 311585
34552 311585 299308 91229 -71349 -51283 -5000 -44622 -82382 -99591 -204025 -342153 -311690
34541 -311690 -127779 -29811 -74911 -74726 24212 56860 -18599 -49182 -5596 -30895 -127699 -129961
34529 -129961 -25656 13461 -49895 -83222 -70550 -113584 -157499 -51630 125856 145772 18610
34518 18610 -38565 -6021 -67043 -218354 -249905 -127432 -34516 -18366 51451 159241 135941
34507 135941 -4000 -64698 -25045 -54061 -161873 -179730 -102975 -114742 -245397 -325545 -287367
34496 -287367 -213998 -115160 36804 100413 -67922 -296929 -303877 -152380 -133370 -255817 -266767
34485 -266767 -138505 -106325 -220259 -272570 -194455 -141830 -168139 -172079 -166102 -240747 -292540
34474b92540J35191J89817j9142j58288o828J40619K7460j01812n209Q8415m0272
34463d2589j44736l421J20438q550j17730L6858J53095n5216k69768j22093J30332
34452c23380Q9008o7670J7416J77697P1795j34760q8441Q3379N4483o5819K439
34441a83853J23583L4619r2954J4036J55724L0922j44127k2747J91827J12003
34431B19033j01580n5192J24424N5822j44931r6806R6650N2887j43739j23141
34421a16573L7821o453j41957r26K54912J43329k36473l03657K3651K20378O5747
34410f0201p9423l347M4491p5282j27402R479J16027N9618l521K1555K3780k2967
34398i7193N66Q0940P8650R431j0899l6860j60774k23966m8161J74528J40738
$$ plain form
34474 -292540 -157349 32468 13326 -144962 -151790 -11171 16289 -85523 -90732 -2317 -42589
34463 -42589 -187325 -190746 -70308 -78858 -196588 -159730 -6635 -61851 -331619 -453712 -323380
34452 -323380 -234372 -302042 -284626 -106929 -35134 -169894 -258335 -174956 -120473 -186292 -183853
34441 -183853 -60270 -25651 -118605 -104569 51155 82077 -62050 -84797 107030 219033
34431 219033 117453 62261 186685 242507 97576 770 97420 150307 6568 -116573
34421 -116573 -78752 -85205 -227162 -228088 26824 170153 -66320 -369977 -346326 -125948 -60201
34410 -60201 -139624 -142971 -98480 -173762 -301164 -291685 -175658 -116040 -119561 -98006 -74226 -97193
34398 -97193 -96627 -15687 62963 72394 61495 24635 -136139 -360105 -408266 -233738 -93000
34387i3000n1077q4192K8149M5685n81Q0495J69615J8531k07695j34102J50059
34376g8113J95660n5853j98605n8877Q4079L8315m2783l2386j8007l4036P631
34365a92975O9070K0303p1143k5987J02100J11203J9966p9K5933l8964j13550
34354i4123l6000Q4250M4762n3898L5R7833J3413j26745o0444Q2386o292k07264
34342b62087j44474J32960K15453L2444q0982k580M5134q517J2171J01102N8893
34331I9517o2348j576J96129K03629j2439j31582m5103J424j00636j54325o8036
34320g5346q827n5041p6543k7356r165j5986M8494J12246L3221r0167n5258P3828
34308a45900R0836L4227O6018J00877k3617j54920n6983J20293Q1465p3352o2032
$$ plain form
34387 -93000 -144077 -228269 -200120 -154435 -155016 -74521 95094 113625 -94070 -228172 -78113
34376 -78113 117547 61694 -136911 -195788 -111709 -73394 -116177 -148563 -166570 -200606 -192975
34365 -192975 -123905 -103602 -174745 -200732 -98632 12571 32537 32458 58391 19427 -94123
34354 -94123 -130123 -45873 -1111 -55009 -54974 42859 56272 -70473 -130917 -48531 -54823 -262087
34342 -262087 -406561 -273601 -58148 -25704 -106686 -109266 -64132 -72649 -60478 40624 99517
34331 99517 37169 35593 231722 435351 422912 291330 246227 247651 147015 -7310 -75346
34320 -75346 -84173 -139214 -215757 -243113 -252278 -268264 -219770 -107524 -74303 -164470 -219728 -145900
34308 -145900 -55064 -20837 45181 146058 122441 -32479 -89462 30831 112296 38944 -23088
34297b3088J1781j17973k67571o5224L04289L12130k4632j75606j090R8707k7511
34286B4212p0152O7295Q2123r7180j49938J1204P6021n0955q2363N9290Q5586
34275d4857p1431j18400Q636K3484r7997k4311K50345K95613J6333j39709J7257
34264A14963R4622j19956k57704p9730P2621n7518j50173O8882K85530J63206
34254A34743n8438k9289R9196K8236j22367r8375j1911q0171j72854p7474O3890
34243c24814K2090p2496K0089J82021J40882m7819j15963k9072L7567L7564N0865
34232i9086N9315K656m9186j2213L9555J3121k7509J771M0079R857m2967o7519
34220a32126r9626j30009p1006N5104J01953M3126K976N109l6336n4196J01120
$$ plain form
34297 -23088 -11307 -129280 -396851 -462075 -157786 154344 129712 -45894 -46984 51723 24212
34286 24212 -45940 21355 103478 6298 -143640 -132436 -56415 -107370 -189733 -130443 -44857
34275 -44857 -116288 -234688 -226052 -202568 -300565 -324876 -74531 221082 237415 97706 114963
34264 114963 209585 89629 -168075 -247805 -175184 -232702 -382875 -313993 -28463 134743
34254 134743 76305 47016 146212 174448 52081 -46294 -58205 -138376 -311230 -388704 -324814
34243 -324814 -302724 -375220 -355131 -173110 -32228 -80047 -196010 -225082 -187515 -149951 -99086
34232 -99086 -39771 -37115 -86301 -98514 -58959 -45838 -73347 -71576 -31497 -21640 -64607 -132126
34220 -132126 -231752 -361761 -432767 -377663 -275710 -232584 -229608 -224499 -260835 -315031 -213911
34209b13911K91826J98057j24948k39906j4330J58227K5640j20339K616J70235
34199A33167P7434j23975j22588J7972L1163o9585o3523P6345J75452J33423k3354
34188B41931k18620k84058n5085L16839M10263R5109k35927k26560m1685j5206
34178a2999j17569j16739j9244J5485J1148P4893J19621J9198r8477l8908J00232
34167f3359Q0267o6621r7855K8431J07934L5992o8216q9375m9544j317M1166N9276
34155h3221M5344M0201N5943K0387r7457j82806j14273N5643J67465J48057M9935
34144A05218m6193r3896r2479p9430p1830k9245N3095P4329j7566p8911K8952
34133b47956J67892J08943o4863o3849J05218J16335j18754k62869r4929J22364
$$ plain form
34209 -213911 77915 275972 151024 -88882 -103212 55015 80655 -39684 -37068 133167
34199 133167 210601 86626 -35962 -17990 13173 -56412 -119935 -43590 131862 265285 241931
34188 241931 23311 -260747 -315832 1007 411270 506379 270452 43892 2207 -12999
34178 -12999 -130568 -247307 -266551 -251066 -239918 -165025 -45404 -26206 -124683 -163591 -63359
34167 -63359 16908 -49713 -147568 -119137 -11203 24789 -43427 -132802 -182346 -183663 -142497 -83221
34155 -83221 -37877 2324 58267 78654 -18803 -201609 -315882 -260239 -92774 55283 105218
34144 105218 59025 -34871 -127350 -206780 -278610 -307855 -254760 -180431 -197997 -276908 -247956
34133 -247956 -80064 28879 -35984 -99833 5385 121720 2966 -259903 -354832 -232468
34123b32468O9451j29321j36502O8204K01262J15281m7040j07755n6104J3800
34113b41192L8439L3287N1096R4977R8490L8088j041L2546M1221m7182j00004
34102C8725J5856J54770Q3623j24238j88734o9655J3892r091J2279R7751P3690
34091I8868p1438j20688j1094N0472l8603j06235l1245O1203N9521M3686P7763
34080A2210P9662J0108m0954l4881k4801J0866J17089J55144l5117k76289k29783
34069b56746N5747J84913M5223n5028L6473Q2598m6879j18214J3823J28120M8416
34058A18446o0657m2746k0201q5425q9760K9905P5959l5395r2007N071M0541p9356
34046b35625j07478O7145J56293p280j21299N5348K40225J10330j24959q9726
$$ plain form
34123 -232468 -163017 -292338 -428840 -360636 -159374 -44093 -91133 -198888 -254992 -241192
34113 -241192 -202753 -169466 -118370 -23393 75097 113185 112144 144690 185911 138729 38725
34102 38725 54581 209351 292974 168736 -19998 -89653 -75761 -84852 -72573 25178 98868
34091 98868 27430 -93258 -104352 -53880 -92483 -198718 -229963 -168760 -109239 -65553 12210
34080 12210 91872 101980 61026 26145 1344 12210 129299 284443 249326 -26963 -256746
34069 -256746 -200999 -16086 29137 -25891 10582 93180 46301 -71913 -58090 70030 118446
34058 118446 57789 15043 -5158 -90583 -180343 -150438 -74479 -109874 -201881 -196810 -156269 -235625
34046 -235625 -343103 -275958 -119665 -126945 -248244 -192896 47329 157659 32700 -57026
34036e7026J26051J67108Q126r7650p9953n6213l3614L3558M6711n5395r8612
34025i6909L8608J55071O2584n1140M5616J77200N3600j90638j98859R179R3685
34014I7997l0997j13721l6002L4452r793n3409n113N2925K8095m8015q3745k2453
34002a89779R8596J29919l2490k23631j52846J45413K84330R5393j00325k0918
33992C3662J20153J8386j69563j00725J44189J84676l7744j98412j18970K6360
33982i7988N2244q844n9089o9294l1688L5494M9516j5835l5911P7305J90790J35786
33970B22486k5072j08961q9734o6296n2938k593M5213K6693j5402k2621m1695
33959a30920j05213j18194k2625O4156M3203J7258R8977J86499J29401j4719q6907
$$ plain form
34036 -57026 69025 236133 244259 146609 66656 10443 -23171 10387 57098 1703 -96909
34025 -96909 -58301 96770 159354 108214 153830 331030 384630 193992 -4867 4312 97997
34014 97997 67000 -46721 -82723 -48271 -58064 -111473 -116586 -63661 -35566 -83581 -167326 -189779
34002 -189779 -91183 38736 6246 -217385 -370231 -224818 59512 154905 54580 33662
33992 33662 153815 172201 2638 -98087 46102 230778 193034 -5378 -124348 -97988
33982 -97988 -45744 -54588 -113677 -182971 -214659 -179165 -129649 -145484 -181395 -104090 86700 222486
33970 222486 197414 88453 -1281 -67577 -120515 -123108 -77895 -51202 -66604 -89225 -130920
33959 -130920 -236133 -354327 -376952 -312796 -269593 -252335 -153358 33141 162542 147823 60916
33948F0916p1952n5383n0619l4193l6878n6417j0163J01021J37839M7708l6603
33937d724l3152l1386o5614k3223Q9083P6329q6620j44012j211O7261r8482k11339
33925d67090j3559K48297K13462o121n1450Q5740J22168q028j11198j04290o9209
33914a61278k0071P2498J18950N1365L102Q2973J33133l855j63991j25564k352
33903a5090k2288r7876p548J49904J02920r5906j40608K0515J47278J40263J25393
33892C06957J21722K266j90986k37424r1543M7257O0387M2851P3906R3079M8534
33881B77006k0762p5479j04958q5570k9450r582l1999j523Q2720P7852l2369n3095
33869g209P0653R9369q1702j97632l4445J54059N7787j54130j35902L8646N5470
$$ plain form
33948 60916 -11036 -66419 -117038 -151231 -188109 -244526 -254689 -153668 -15829 31879 -4724
33937 -4724 -37876 -69262 -134876 -158099 -69016 7313 -79307 -223319 -224530 -157269 -255751 -467090
33925 -467090 -480649 -232352 -18890 -25011 -76461 9279 131447 123419 12221 -92069 -161278
33914 -161278 -181349 -108851 10099 61464 64566 147539 280672 276817 112826 -12738 -15090
33903 -15090 -37378 -135254 -142802 7102 110022 14116 -126492 -105977 41301 181564 306957
33892 306957 428679 430945 239959 2535 -89008 -41751 18636 61487 135393 228472 277006
33881 277006 256244 180765 75807 -9763 -39213 -48795 -80794 -82317 403 78255 45886 -7209
33869 -7209 63444 162813 81111 -116521 -150966 3093 60880 -93250 -229152 -190506 -135036
33858a35036n0542J0527K17262K65654J09598J455J4483k9882j58432j92375j12034
33847e9322q0962r4070J1714J82004J70736k4459j29051m1589M4059K0368J3930
33836A3358P6826O9117n0229j15255m1943L3465O18o3906o0174j629N9278Q4065
33824C591K7833q4629j15694r151P3852M029p2438J8210J42957P7512q3629p9873
33812i7430N5137N6110j06876j89012q3409N7675J09824R1662J7437r1420j01125
33801b81427N5515J80276P4958j09496j04122L2426N4105k4143j3466M0649l3414
33790a28139j28513k1186J56340R8106r6305n6226J82985K07852m1103j51694
33780B2117M1847J91539N6831j28669j20158k4451J4382O3107J27506M6142j43271
$$ plain form
33858 -135036 -185578 -175051 42211 307865 417463 418918 433401 403519 245087 52712 -59322
33847 -59322 -140284 -234354 -222640 -40636 130100 105641 -23410 -64999 -20940 -572 13358
33836 13358 90184 159301 109072 -6183 -48126 -14661 -14043 -77949 -138123 -139752 -80474 3591
33824 3591 31424 -53205 -168899 -178050 -104198 -100169 -172607 -154397 -11440 66072 -17557 -97430
33812 -97430 -42293 13817 -93059 -282071 -365480 -307805 -197981 -106319 -88882 -180302 -281427
33801 -281427 -225912 -45636 29322 -80174 -184296 -151870 -97765 -121908 -135374 -94725 -128139
33790 -128139 -256652 -277838 -121498 -23392 -119697 -175923 7062 214914 173811 22117
33780 22117 63964 255503 312334 183665 63507 39056 53438 116545 244051 290193 146922
33769A46922j44662Q1063J63577p4331k80833j32091J56118K02592K7342r3269
33759E2428p9709l4855J6846Q3156O7754o7341j59305q0914M1210M2751j2481
33748a30460J6130Q7119P5037P81k4527J0905L9335M0007K8693k780n4850r7160
33736a1770j09297p0293N8256K20173K20518j5033k31697j54820P9226J20230
33726A05493l6302p3972P5995J27990l2054j55420r6427m6114j22819j33985L3394
33715c54221J62518R7676L1640J23455J65601l8782k56500j56671J44015K44977
33705A63708M7623j66193j79528o5176K3745M8939M5882L9394K4167l0847j23802
33694a72088j53756k8550J42327J37647l8121j12709N7687K57925K27268K1776
$$ plain form
33769 146922 2260 83323 246900 172569 -108264 -240355 -84237 118355 145697 52428
33759 52428 -27281 -62136 -45290 37866 105620 38279 -121026 -201940 -160730 -117979 -130460
33748 -130460 -114330 -27211 47826 48607 24080 34985 74320 114327 143020 140240 85390 -11770
33736 -11770 -121067 -191360 -133104 87069 307587 292554 60857 -93963 -14737 105493
33726 105493 69191 -4781 71214 199204 167150 11730 -84697 -130811 -253630 -387615 -354221
33715 -354221 -191703 -94027 -62387 61068 226669 187887 -68613 -225284 -81269 163708
33705 163708 211331 45138 -134390 -199566 -175821 -126882 -81000 -41606 -17439 -48286 -172088
33694 -172088 -325844 -354394 -212067 -74420 -112541 -225250 -167563 90362 317630 339406
33684C39406j14256j02053o5396r3507j34266j03649J551J00557J08215L4705
33674b8693j9557j1060j6448o5202l9963J01031J57391j7830k02086j01141J48099
33663i5459J58674p6257j70345J4370J66101O9180q3882r2156n5831q1723m9077
33652b96405R8595J62800L5274p4575m283P0685k3648j19742q639J73007J75408
33641A88477M6282j0271j0022r9114k19601j83066l691J18707J01868L9976R267
33630b1188J2780O2912J38175J18901o1355k57982k71715j15401J9328J9756m8816
33619d04605o8382M818J13398J48097O4631m3876o8379m4465n7360m0943J13114
33608b83952K75404J92539q6838k11991m8516J22101O7062n1924q578R8875N5216
$$ plain form
33684 339406 225150 123097 57701 -35806 -170072 -273721 -272170 -171613 -63398 -28693
33674 -28693 -48250 -59310 -75758 -140960 -180923 -79892 77499 59669 -142417 -243558 -95459
33663 -95459 63215 -13042 -183387 -169017 -2916 66264 -17618 -109774 -165605 -247328 -296405
33652 -296405 -197810 -35010 264 -74311 -78594 -7909 -31557 -151299 -159938 13069 188477
33641 188477 234759 224488 214466 115352 -104249 -287315 -291006 -172299 -70431 -30455 -21188
33630 -21188 -8408 54504 192679 311580 250225 -7757 -279472 -394873 -375545 -355789 -404605
33619 -404605 -472987 -468169 -354771 -206674 -142043 -185919 -254298 -298763 -356123 -397066 -283952
33608 -283952 -8548 183991 97153 -114838 -163354 -41253 25809 -26115 -34693 64182 119398
33597A19398r4936j55959j08408o9479n0007J3577Q3045Q3365N8348Q0457R3375
33586E2776J1514j09114j50747j01421j7641P8375J47042R9583n4077j47776p9313
33575b70799L1849L3155l9194n7275k299N9335R4602Q9468K4392m7808k3506P7833
33563c0247J06990K0312n0775l6490l3048q2638p6291O450K302j37091j90518
33552e01044m539K29027K47395Q5826m0192n5876k0517M3624J05950N7379j08059
33541C8974j85787m3906J31462R8567o7352j09454Q935R4717N6556K109J8541
33530D3362N8325N4887O938n5542q9926n0143M6533J10500R6343N5537K8583j0818
33518B94579n9999o4233l4400m0713n2611L0772J47317R9151j07409k03681o4087
$$ plain form
33597 119398 24462 -131497 -239905 -309384 -359391 -345814 -262769 -179404 -121056 -40599 52776
33586 52776 64290 -44824 -195571 -296992 -314633 -236258 -89216 10367 -43710 -191486 -270799
33575 -270799 -238950 -205795 -244989 -302264 -304563 -245228 -150626 -61158 -36766 -84574 -108080 -30247
33563 -30247 76743 97055 46280 9790 -23258 -105896 -182187 -175737 -173435 -310526 -501044
33552 -501044 -505583 -276556 -29161 56665 16473 -39403 -59920 -16296 89654 147033 38974
33541 38974 -146813 -190719 -59257 39310 -28042 -137496 -128561 -33844 22712 24821 43362
33530 43362 101687 156574 163512 107970 18044 -32099 14434 124934 221277 276814 305397 294579
33518 294579 234580 170347 135947 95234 42623 73395 220712 319863 212454 8773 -55314
33507e5314Q9225N1104n1822j7979Q7025Q5332o97l3270j0521j1478j9124L541
33495A16022q611q7459j17054k9069M7417J0430k0894O2595J25899K3128j11972
33484A0432p4042O0842O7322n4000j06543k9337N0848M9780j480o4369j02619
33473a93166n8418L5568L5724p7800j11167K5783J16615j4282j62183n4056J75342
33462b82040J78760m1680j49328j4763J27738R7751P470k908J3243k5782n6069
33451a47608P338J08492J24417K9967p4369p1616L7117J01992k979j66616j43863
33440a97728P5858K03229P2423r4464m6365Q8430L6202j41289j42719O6419J92937
33429A12933P9929p9701p3343M0361Q4142K0560o0301r1066o9256k3137N392p620
$$ plain form
33507 -55314 33911 85015 33193 15214 102239 187571 186874 153604 143083 131605 112481 116022
33495 116022 107411 19952 -97102 -126171 -78754 -68324 -89218 -26623 99276 122404 10432
33484 10432 -63610 -2768 64554 10554 -95989 -125326 -74478 -24698 -26178 -90547 -193166
33473 -193166 -251584 -216016 -180292 -258092 -369259 -343476 -226861 -241143 -403326 -457382 -282040
33462 -282040 -103280 -144960 -294288 -309051 -181313 -83562 -76092 -79000 -65757 -91539 -147608
33451 -147608 -140270 -31778 92639 122606 48237 -23379 13738 115730 112751 -53865 -197728
33440 -197728 -121870 81359 153782 59318 12953 101383 137585 -3704 -146423 -80004 112933
33429 112933 192862 113161 39818 80179 164321 184881 124580 33514 -35742 -58879 -53487 -61107
33417f1107l0988j5109L6976P6124O8159J4738n6013r5653p6786l8100k5483p62
33405b04004Q8134J65229J05017m8582j22178q6148p8437j24025p6642Q8850J86720
33394a06066J29138O2792P2882L0529j08294j47493Q13J02733j6451j53414p2380
33383b05211Q7861P5474l1084K170J23753J02507m6658j02215k2344L9766M6084
33372G0103Q7411J33488O3531q2939j45899r9138l3746M3197J53929J81077J9034
33361C90048j78894j76209j7052N2504k7117q9604n4199j3473k4370m0621l8240
33350b17227k1424M5543J45258J49182K8726k8254Q0849J50965J0934j34253m0431
33339A69868J13855K1275j78014j06953J69048K14292m0094j85116l9075P6931
$$ plain form
33417 -61107 -92095 -107204 -70228 5896 74055 88793 32780 -62873 -139659 -177759 -203242 -204004
33405 -204004 -115870 49359 154376 105794 -16384 -102532 -180969 -304994 -381636 -292786 -106066
33394 -106066 23072 85864 158746 189275 80981 -66512 -65699 37034 20583 -132831 -205211
33383 -205211 -117350 -41876 -72960 -70790 52963 155470 108812 6597 -15747 24019 70103
33372 70103 157514 291002 354533 271594 125695 26557 -7189 36008 189937 371014 390048
33361 390048 211154 34945 17893 70397 43280 -46324 -100523 -113996 -138366 -178987 -217227
33350 -217227 -238651 -193108 -47850 101332 130058 101804 182653 333618 344552 210299 169868
33339 169868 283723 304998 126984 20031 189079 403371 363277 178161 139086 216017
33329B16017n8853j90095o5210J21527Q7125o6657p1347M8710O4387n3123j13220
33318h0739k9675P5888Q4803K4314j9474k4264l0057n3969m8827J6328N8435k6338
33306e3575j52471j01189J26972K28396L4213j89649j33477O7725P0164j06677
33296b09568j40553L2514J36114M4991m0888J1315O2166M81o5022l9649L529J6574
33284a87996O9248J47356J11072m1191j13665k5897N4766K577q0047p9707m6351
33273a89835l0455L1605J43385J71716P1141j7539j1340j5623q5716q6768M6496
33262B7067J27240n799k03422k13642m4224R2073J01505P5499Q3466Q2990L4446
33251A57199k6229m5875j2843M0923N7457j133r2834j18773l5852Q5252J34432
$$ plain form
33329 216017 157164 -32931 -98141 23386 110511 43854 -27493 21217 85604 32481 -80739
33318 -80739 -110414 -34526 50277 74591 55117 30853 796 -53173 -102000 -85672 -27237 -53575
33306 -53575 -206046 -307235 -180263 48133 82346 -107303 -240780 -173055 -102891 -209568
33296 -209568 -350121 -317607 -181493 -136502 -177390 -166075 -103909 -103428 -168450 -208099 -204570 -187996
33284 -187996 -118748 28608 139680 98489 -15176 -41073 13693 16270 -63777 -143484 -189835
33273 -189835 -220290 -188685 -45300 126416 197557 180018 168678 153055 67339 -19429 27067
33262 27067 154307 148508 -54914 -268556 -312780 -220707 -119202 -43703 39763 122753 157199
33251 157199 130970 85095 72252 113175 170632 169499 76665 -42108 -77960 7292 141724
33240A41724P2684l3279p5453k6443P461p4009j77976j11602J01968J96239N5603
33229G6917q2079P62J43370Q5538q1188p5260Q2886J14476k6878q9846K0481Q6128
33217B55307l1630j59238j07874M1715R3267q08j32199j62770j9444K06195K73496
33206B56017P0165j83478k11069p4488k6479o3702K4360K07500K19076L2638p6143
33195A74397j7142j8683j55643j74028K9033J64773L7763j08594k3681J15519
33185B3714L9621j30707j10781N4951J04979J9059j080P9109R7283J6514k3230
33174A69432K4519M5547j1531n3304j4959M3423M2387k4017j03924j23102m1185
33163d6714O6627N7838q0179j79998j20553J0489P2160O1251M0234O474m1777
$$ plain form
33240 141724 214408 181129 105676 79233 86694 12685 -165291 -276893 -174925 21314 76917
33229 76917 -5162 -4400 138970 224508 143320 68060 150946 265422 238544 148698 169179 255307
33217 255307 223677 64439 -43435 -1720 91547 90739 -41460 -204230 -223674 -17479 256017
33206 256017 326182 142704 -68365 -142853 -169332 -233034 -208674 -1174 217902 250540 174397
33195 174397 157255 138572 -17071 -191099 -162066 2707 40470 -68124 -91805 23714
33185 23714 63335 -67372 -178153 -123202 -18223 836 -244 78865 176148 192662 169432
33174 169432 193951 239498 227967 174663 159704 203127 245514 221497 117573 -5529 -46714
33163 -46714 19913 77751 -2428 -182426 -302979 -292490 -220330 -159079 -118845 -112371 -154148
33152a54148l6708L1828N1956j5105k8164Q8180J60226L3539j35198j10081L0149
33141h3526L0088r4012q4297Q9483J46749l5264j98145j07107R5431J50481P6666
33130a3453N3940P2722j4128j64373j63071K4095J71424J29370K1095J3212Q3456
33119B14289J29439J40225J40487J26665J75523M10961O94875N96834m1585p14940
33109A872773q02448l81182o5083j04618j57776n26J02433m7802j79832m6317
33099A89622J04440l5765k68404k13714N0342J47199K6206l8879L2388O0708N511
33088E9654J3571Q5922O9320l0309o5641m8062r3970j25005J3133J84199J15163
33077A77975j08866j32058P5000J52765m2577k14611j36217K5800O2641L3536
$$ plain form
33152 -154148 -190856 -159028 -107072 -122177 -150341 -62161 98065 131604 -3594 -113675 -83526
33141 -83526 -53438 -147450 -231747 -142264 4485 -30779 -228924 -336031 -240600 -90119 -13453
33130 -13453 40487 113209 99081 -65292 -228363 -204268 -32844 96526 117621 130833 214289
33119 214289 343728 483953 624440 751105 926628 1337589 2032464 2629298 2587713 1872773
33109 1872773 1070325 689143 624060 519442 361666 361140 463573 415771 235939 189622
33099 189622 294062 258297 -10107 -223821 -173479 -26280 -74 -38953 -6565 54143 59654
33088 59654 73225 159147 228467 198158 132517 84455 -9515 -134520 -121387 62812 177975
33077 177975 69109 -62949 12051 164816 122239 -92372 -228589 -202789 -140148 -106612
33067a06612L9884J7183n7867m5902Q4707J34109m580j45761j08628J4036M7645
33056a31786q830o3609q2600m8487M8328J08001J5635j21844p9565J09732J74953
33045h0072N1517k3407N4321Q2151n0895j45034n3964N4843J0710q1391q0392
33034b61613n1650o4077j6781J19707J58458J7230p8301M5979J99163J31471o8817
33023A30769j53001r5743l8341j1927L1662M8117j4999p7582n2237J2639N5632
33012a65011J09457J60094J00377m0982o0764P0128Q7254j35785l16188j83866
33002c75286Q1943J44405K2750k0651N5396O7835k2807o6949j5285J5482l8238
32991a51405j04601j05030k5675R6660J61322P1293r8731j43098k3821N9341M576
$$ plain form
33067 -106612 -66728 -49545 -107412 -153314 -68607 65502 60922 -84839 -193467 -179431 -131786
33056 -131786 -140616 -204225 -286825 -335312 -286984 -178983 -163348 -285192 -364757 -255025 -80072
33045 -80072 -28555 -51962 2359 84510 33615 -111419 -165383 -110540 -99830 -181221 -261613
33034 -261613 -313263 -377340 -394121 -274414 -115956 -98726 -177027 -131048 68115 199586 130769
33023 130769 -22232 -117975 -156316 -168243 -136581 -88464 -103463 -181045 -233282 -220643 -165011
33012 -165011 -55554 104540 204917 163935 103171 173299 260553 124768 -191420 -375286
33002 -375286 -293343 -148938 -126188 -146839 -91443 -23608 -46415 -113364 -128649 -113167 -151405
32991 -151405 -256006 -361036 -386711 -290051 -128729 -57436 -156167 -299265 -323086 -263745 -259169
32980b59169k1932R2959J76658P5630n2288j1849Q1380J9311j17676j13026l682
32969a33684N572q0719p1330O4790J58044J22221M1534p387k3367k602M0707L0689
32957A44468m9176q3440j5896J8732p6506j53802n2952J03836R4010m2895q2939
32946a96560J8670R2478M2708n0269r3641o9281J5418J18396J47587P0563k7392
32935F8677p8464j08301j03059J6337J80875J61558p1915k21283q8261J13514
32925a30322J16212J7848M8115J41145Q9061n2514p5059m577k0665q9889l8472
32914H83Q2044O0038q4516j18056P340R3576M2611l1789n1561o1423n6364K2541
32902i4676J11653Q6245l235L992Q6243O2612q4473j62240p9190K3486Q585p2392
$$ plain form
32980 -259169 -281101 -188142 -11484 64146 11858 9 81389 100700 -16976 -130002 -133684
32969 -133684 -128112 -208831 -280161 -215371 -57327 64894 106428 99041 75674 73072 113779 144468
32957 144468 95292 11852 -4044 14688 -61818 -215620 -268572 -164736 -70726 -113621 -196560
32946 -196560 -177890 -85412 -42704 -92973 -186614 -255895 -240477 -122081 25506 96069 68677
32935 68677 -9787 -118088 -221147 -204810 -23935 137623 65708 -155575 -243836 -130322
32925 -130322 -14110 3738 51853 192998 282059 229545 154486 149909 129244 39355 883
32914 883 82927 142965 58449 -59607 -52267 41309 83920 52131 570 -60853 -117217 -94676
32902 -94676 16977 103222 99987 103979 190222 252834 168361 6121 -73069 -49583 -40998 -113390
32890a13390q8627L362J29266J55330J6412j51859j25162P9767J69936Q408j46183
32879f2740m4659J45755J28025m2034j01066l6083k6930o1800N632J10763P2802
32868H7665m2813l7451K6238n1319j64411l8341K26638K35707m8426k26333j15804
32857a48650P942l7706m4047J23533K15575L8927j71692j35955K5606M4335m9086
32846a31218m9334M3649P6745M0862L8731N0228k2463j32512j24994K1942J48715
32835c9649J09998o7047k10775j67165K2225J28565J7063j37406q3154J18177
32825c09168J79710M8864k6478N8409Q9425o4423j95975j15639J7959j7993j26590
32814d61899q7525L6944J9166j08195p6353J76394L78042L00732M3871j41816
$$ plain form
32890 -113390 -202017 -198655 -69389 85941 102353 -49506 -174668 -94901 75035 83443 -62740
32879 -62740 -107399 38356 166381 124347 23281 -12802 -39732 -101532 -95900 14863 87665
32868 87665 44852 7401 33639 -17680 -182091 -220432 6206 241913 193487 -32846 -148650
32857 -148650 -140708 -178414 -222461 -98928 116647 155574 -16118 -152073 -126467 -82132 -131218
32846 -131218 -180552 -136903 -60158 -19296 19435 69663 47200 -85312 -210306 -188364 -39649
32835 -39649 70349 3302 -207473 -374638 -352413 -223848 -206785 -344191 -427345 -309168
32825 -309168 -129458 -80594 -107072 -48663 40762 -23661 -219636 -335275 -317316 -335309 -461899
32814 -461899 -549424 -512480 -493314 -601509 -677862 -501468 -123426 177306 221177 79361
32804G9361j46044l0645R8100J50772P4329r0825k06408j61349J407J23378R8166
32793i758k6051j17814j08430l8549K3640N5692N8272K1155l9878n8045P640R4091
32781a38035R6001j389j01239j04660r122R2645R2361l1193j74818k10360j25807
32770f15616j4827O6364J40727K02783J90584J04955L6008J8793j1622o5697m8798
32759C654N4143J02584K0515o0575j1371Q7609R4836K7362k3961o4386j13965
32748A16445r1054L7232J13852L559j62576j63875j8965P2777L9753k0930m5882
32737a19664m8869j7640N1150P4621M858n3914n475P2016Q1828Q3501J22704O7349
32725C12465j42037k64699q8530J74150J69593m4483j12859L4312J24345M1522
$$ plain form
32804 79361 -66683 -97328 772 151544 225873 135048 -71360 -232709 -231302 -107924 -9758
32793 -9758 -35809 -153623 -262053 -300602 -276962 -221270 -162998 -141843 -181721 -239766 -232126 -138035
32781 -138035 -42034 -43423 -144662 -249322 -258444 -165799 -73438 -104631 -279449 -489809 -615616
32770 -615616 -630443 -564079 -423352 -220569 -29985 74970 110978 129771 118149 52452 3654
32759 3654 57797 160381 180896 120321 108950 196559 291395 318757 294796 230410 116445
32748 116445 25391 62623 176475 180034 17458 -146417 -165382 -92605 -52852 -73782 -119664
32737 -119664 -168533 -186173 -135023 -60402 -55544 -109458 -114933 -42917 38911 122412 245116 312465
32725 312465 170428 -94271 -182801 -8651 160942 116459 3600 37912 162257 203779
32715B03779l2621j0011k8167j16009j00128M6090J00452l1237j45583r0011L670
32704a99776j0071m2448L1648J34948J23978J6965o0426n6277k2713l5874j17720
32693b37766j75814p0733J59466K57510R3301r6938n5914P4594P158j60043q9728
32682b94907J80190K44704o269k02494r0796J12555J37841M5008q681m4733r9190
32671b6772p8472K5687M7943n4573r1408K0691R8232L2096k1817K9717K8026q7651
32659g8301q2638J52745L08676J07853k20431k75272p7630M2465o910k5701O7857
32648h7287J29219P8350O551k5917o7883j27826j29239m3764N8655J02418O5490
32637d1233k7430j04951r3384j2647M3185N1381P9157J30882J19906L2558l8441
$$ plain form
32715 203779 171158 161147 132980 16971 -83157 -37067 63385 32148 -113435 -203446 -199776
32704 -199776 -209847 -252295 -220647 -85699 38279 55244 -5182 -61459 -84172 -120046 -237766
32693 -237766 -413580 -484313 -324847 -67337 25964 -70974 -126888 -52294 -45136 -205179 -294907
32682 -294907 -114717 129987 123718 -78776 -169572 -57017 80824 125832 117151 72418 -26772
32671 -26772 -105244 -79557 -31614 -86187 -177595 -156904 -58672 -26576 -48393 -18676 9350 -78301
32659 -78301 -160939 -8194 300482 408335 187904 -87368 -164998 -122533 -129443 -155144 -87287
32648 -87287 41932 120282 126833 100916 33033 -94793 -224032 -267796 -209141 -106723 -41233
32637 -41233 -68663 -173614 -266998 -279645 -236460 -185079 -105922 24960 144866 177424 138983
32626A38983o5307j11268j48370o5781Q4622R9195l6537q7229L5845J08474j3722
32615f1095j33662o1766N4697J6576o4351P475J30996Q7750n6009o6554M7132
32604i8811P6358j417q797Q1811R6219j9028r6357k8945O9512N8535m5127j37660
32592e3707j50931o5182Q8820K10654K01585P1785q0035j70984j65083o2244O3866
32581a11456Q2717m1177j66741j39819J0152J21740J02125J265o8225k8362R3817
32570a43964J60520O6041r7036j30013q551Q1409L1619m4020l1187O028j8155
32559a27309n0362k6509k404k1066l882Q8423J43409Q9976M1549Q8495J12951
32548C33271q888j72906k07055j25524l4691O5486J78897J66732m7951k52457
$$ plain form
32626 138983 73676 -37592 -185962 -251743 -167121 -67926 -104463 -191692 -155847 -47373 -61095
32615 -61095 -194757 -256523 -201826 -185250 -249601 -242126 -111130 -23380 -79389 -145943 -98811
32604 -98811 -22453 -23870 -32667 49144 145363 126335 29978 1033 70545 129080 83953 -53707
32592 -53707 -204638 -269820 -181000 29654 231239 303024 222989 52005 -113078 -175322 -111456
32581 -111456 -28739 -69916 -236657 -376476 -366324 -244584 -142459 -141194 -209419 -237781 -143964
32570 -143964 16556 82597 -14439 -144452 -153003 -71594 -39975 -83995 -115182 -109154 -127309
32559 -127309 -177671 -204180 -206584 -227650 -231532 -143109 300 90276 131825 220320 333271
32548 333271 324383 151477 -55578 -181102 -215793 -150307 28590 195322 147371 -105086
32538a05086j90980M4755J40809K2135q4062k9497P4514Q7690K7319l1485o9476
32527a13364q5272p0524m8015l5942Q393J06982J72509J24706L4379R365Q154
32516A11371o1354j25945m2627J22785J45140j3996j32968o3189O3370N4587p6004
32505a8830j77150j73020r1829K9711J49131J78706O6303r2569j31076k5387O1714
32494b24296J4881m2661P5085K84894K77020l6341l16714k24301J03557K48558
32484A59682R6557p1527n7169J3860k33j9387L9604O9148k0595j11995q5703l0134
32472a7892n9646r9388m6898J7449r520l5925N7866J66050J11128n1322j22338
32461i0436p6268m7698n7475K517J26471J67697P9117j0181Q27N4933N2913j3361
$$ plain form
32538 -105086 -296066 -251311 -110502 -88367 -172429 -201926 -127412 -39722 -12403 -43888 -113364
32527 -113364 -198636 -269160 -317175 -353117 -344724 -237742 -65233 59473 93852 103217 111371
32516 111371 50017 -75928 -118555 4230 149370 135374 2406 -60783 2587 57174 -18830
32505 -18830 -195980 -369000 -460829 -431118 -281987 -103281 -36978 -129547 -260623 -286010 -224296
32494 -224296 -209415 -252076 -176991 107903 384923 348582 31868 -192433 -88876 159682
32484 159682 256239 184712 127543 141403 141170 121783 161387 230535 209940 97945 12242 -17892
32472 -17892 -77538 -176926 -223824 -206375 -215895 -251820 -193954 -27904 83224 31902 -90436
32461 -90436 -166704 -214402 -271877 -269360 -142889 24808 103925 93744 94571 149504 202417 189056
32449A89056p9427q5633k5216L8697K8715l9019o3570j4578J4455l5595q9298
32438a61413p1622k7257j5821m150M1969P5154O6951O6712P8173K8686n3140j8958
32426E284J26219J52106l4455j85364q4992R2741O9765q5555j08670L282K9052
32415b0587o1492p7926K2325O0874l4388j10637n5021N4693J16300J19015N7377
32404G0533p8919j96728j62474n576J03961R7373O4520O4676N3103J3084m637
32393A8916K988j5478m7348l3525r75k6666p6597m1565O7011J18272O4727r860
32381A9900m7131o5249n6098R055P0971M1055l0835j4088P5766Q9288j238m9848
32369D1548J4055O9862J4838p1816p0967m849K6767O087l925K3759M0275m698
$$ plain form
32449 189056 109629 23996 -1220 37477 66192 27173 -36397 -50975 -36520 -72115 -161413
32438 -161413 -233035 -260292 -276113 -280263 -238294 -163140 -96189 -29477 48696 77382 24242 5284
32426 5284 131503 283609 249154 63790 -21202 71539 141304 55749 -52921 -49639 -20587
32415 -20587 -82079 -160005 -137680 -76806 -111194 -221831 -276852 -222159 -105859 13156 70533
32404 70533 -8386 -205114 -367588 -373164 -269203 -171830 -107310 -42634 10469 23553 18916
32393 18916 21904 6426 -40922 -74447 -75422 -102088 -178685 -220250 -153239 -34967 29760 19900
32381 19900 -27231 -92480 -148578 -139523 -68552 -27497 -58332 -72420 3346 92634 91396 41548
32369 41548 55603 125465 140303 68487 -2480 -7329 19438 25525 21600 45359 85634 80936
32357H0936p9263q4450J4343R4860J7539j34834j18434R9939K29311O7412j66679
32346B0680j50961M6088J02793j6316k8687J44855K09885j4146k64460k19484
32336a69753K4700J31359K9388m6403K9060J00630L4524m9521K727Q9494j499
32325A74706k14667k45848k281J99695P5043j85454j84865Q0423K32924J10524
32315D0200k6279K1994P7084m8287j92073j33387J5592K4440m6450R558J35966
32304a21642J04934o1501j11846J6587J21928Q9309K1304j2276p2997j46112r4765
32293b67077R0869K15595J45705j7730j09304r4275k9651L6079O5979M1787J142
32282G9119j3309k8897p7293j04746o5189l2912p4063q6106M6268K04694J71941
$$ plain form
32357 80936 1673 -82777 -68434 26426 43965 -90869 -209303 -109364 119947 187359 20680
32346 20680 -130281 -84193 18600 2284 -26403 118452 328337 314191 49731 -169753
32336 -169753 -145053 -13694 15694 -30709 -1649 98981 133505 83984 86711 176205 174706
32325 174706 -39961 -285809 -288090 -88395 -13352 -198806 -383671 -303248 -70324 40200
32315 40200 13921 35915 112999 64712 -127361 -260748 -245156 -220716 -267166 -257608 -121642
32304 -121642 -16708 -78209 -190055 -173468 -51540 37769 59073 46797 -26200 -172312 -267077
32293 -267077 -176208 39387 185092 167362 58058 -36217 -65868 -29789 36190 77977 79119
32282 79119 65810 36913 -40380 -145126 -210315 -243227 -317290 -403396 -357128 -152434 19507
32271A9507k2676j31728o2018K1281m733m7805o14Q3000J06527P8578N4079L3280
32259A26678j0835o9829r6846l4789J18222K37736J70160k8586j03605K9692J18855
32248D56853l1653k11094j32071P6761P7948r9814j23928M9527J08654m2731j15234
32237A3218K5429R6395r1793k60009j09692J64683J75407n7192j79865o9168M6634
32226b45953J2507l2974N9785J91592J71274m603j61479j79686j07875m4521M362
32215c37571R0063J87023J90886P1732n7761p9992q877O4994R1059O2144j3595
32204B60105p6794m7571L7554L4349q4235j56388q9302j6193m8768o1223P4094
32193a74372K11539J47565k9391q1339j910L2612Q7J7237N8475L351q3845l9575
$$ plain form
32271 19507 -3169 -134897 -196915 -175634 -180367 -228172 -228786 -145786 -39259 39319 93398 126678
32259 126678 115843 46014 -50832 -85621 32601 270337 440497 411911 308306 337998 456853
32248 456853 425200 214106 82035 158796 236744 136930 13002 62529 171183 128452 13218
32237 13218 38647 135042 43249 -216760 -326452 -161769 13638 -43554 -223419 -292587 -245953
32226 -245953 -233446 -266420 -206635 -15043 156231 151628 -9851 -189537 -297412 -341933 -337571
32215 -337571 -247508 -60485 130401 202133 144372 64380 55503 120497 211556 273700 260105
32204 260105 183311 135740 173294 207643 123408 -32980 -122282 -138475 -187243 -248466 -174372
32193 -174372 37167 184732 155341 74002 72092 104704 104791 122028 180503 183854 100009 60434
$$ [...]
##END NTUPLES=NMR SPECTRUM
##END=
