##TITLE=31Pdec_46-2024
 CDCl3, 64 sc
 27.6.2024
##JCAMPDX= 6.0         $$ Bruker NMR JCAMP-DX V2.0
##DATA TYPE= NMR SPECTRUM
##DATA CLASS= NTUPLES
##ORIGIN= UXNMR, Bruker Analytische Messtechnik GmbH
##OWNER= root
$$ XWIN-NMR		Version 3.5
$$ Thu Jun 27 14:54:25 2024 Russian Standard Time (UT+4h)  she@DPX200
##.OBSERVE FREQUENCY= 81.013821
##.OBSERVE NUCLEUS= ^31P
##.ACQUISITION MODE= SIMULTANEOUS
##.ACQUISITION SCHEME= undefined
##.AVERAGES= 40
##.DIGITISER RES= 17
##SPECTROMETER/DATA SYSTEM= spect
##.PULSE SEQUENCE= zgpg30
##.SOLVENT NAME= CDCl3
##.SHIFT REFERENCE= (INTERNAL, CDCl3, 0, 182.463)
##AUDIT TRAIL= $$ (NUMBER, WHEN, WHO, WHERE, WHAT)
$$ ##TITLE= Audit trail, XWIN-NMR		Version 3.5
$$ ##JCAMPDX= 5.01
$$ ##ORIGIN= Bruker BioSpin GmbH
$$ ##OWNER= she
$$ F:/spectra/data/she/nmr/P31/2/pdata/1/auditp.txt
$$ ##AUDIT TRAIL=  $$ (NUMBER, WHEN, WHO, WHERE, WHAT)
(   1,<2024-06-27 14:51:45.21 +0400>,<she>,<DPX200>,
      <created by zg, POWCHK disabled, PULCHK disabled
       configuration hash MD5:
       00 E9 B6 7A A2 85 ED C7 34 08 36 98 17 FE 4E 26
       data hash MD5: 32K
       88 74 1D 30 1B B8 68 37 32 F7 2A 5A 76 50 E2 89>)
(   2,<2024-06-27 14:51:51.85 +0400>,<she>,<DPX200>,
      <Start of raw data processing
       efp BC_mod = 2 LB = 1.5 FT_mod = 6 PKNL = 1 PHC0 = 2760.182 PHC1 = 206.8863 SI = 64K 
       data hash MD5: 64K
       B3 1E 55 54 B8 9F 2B 83 25 6F FB 63 04 69 97 4A>)
(   3,<2024-06-27 14:52:23.07 +0400>,<she>,<DPX200>,
      <pk PHC0 = 61.41923 PHC1 = -128.4 
       data hash MD5: 64K
       A3 C8 72 5A 86 7A 2C D6 3C 48 08 C2 E0 64 20 8C>)
(   4,<2024-06-27 14:52:42.79 +0400>,<she>,<DPX200>,
      <abs ABSG = 5 
       data hash MD5: 64K
       5F 81 BC 64 4B 7F D2 47 C9 77 90 25 F7 14 C7 0B>)
$$ ##END=
$$ 
$$ hash MD5
$$ 12 6C 7D 6C AF 72 E7 7A E1 C9 03 C1 5F 3F E4 C0
##$RELAX= 
##$RELAX= 
##$RELAX= 
##$RELAX= 
##$RELAX= 
##$RELAX= 
##$RELAX= 
##$RELAX= 
$$ Bruker specific parameters
$$ --------------------------
##$DU= <F:/spectra>
##$EXPNO= 2
##$NAME= <P31>
##$PROCNO= 1
##$TYPE= <nmr>
##$USER= <she>
##$AMP= (0..31)
100 100 100 100 100 100 100 100 100 100 100 100 100 100 100 100 100 100 
100 100 100 100 100 100 100 100 100 100 100 100 100 100 
##$AQSEQ= 0
##$AQ_mod= 1
##$AUNM= <au_zg>
##$AUTOPOS= <>
##$BF1= 81.014009
##$BF2= 200.13
##$BF3= 200.13
##$BF4= 200.13
##$BF5= 200.13
##$BF6= 200.13
##$BF7= 200.13
##$BF8= 200.13
##$BYTORDA= 1
##$CFDGTYP= 0
##$CFRGTYP= 5
##$CHEMSTR= <none>
##$CNST= (0..31)
1 1 145 1 1 1 1 1 1 1 1 1 1 1 1 1 1 1 1 1 1 1 1 1 1 1 1 1 1 1 1 1 
##$CPDPRG= <waltz16>
##$CPDPRG1= <>
##$CPDPRG2= <waltz16>
##$CPDPRG3= <>
##$CPDPRG4= <mlev>
##$CPDPRG5= <mlev>
##$CPDPRG6= <mlev>
##$CPDPRG7= <mlev>
##$CPDPRG8= <mlev>
##$CPDPRGB= <>
##$CPDPRGT= <>
##$D= (0..31)
0 1 0 0 0 0 0 0 0 0 0 0.03 2e-05 3e-06 0 0 0 0 0 0 0 0 0 0 0 0 0 0 0 0 
0 0 
##$DATE= 1719485504
##$DBL= (0..7)
120 120 120 11 120 120 24 19 
##$DBP= (0..7)
150 150 150 150 150 150 150 150 
##$DBP07= 0
##$DBPNAM0= <>
##$DBPNAM1= <>
##$DBPNAM2= <>
$$ [...]
##$SUBNAM3= <"">
##$SUBNAM4= <"">
##$SUBNAM5= <"">
##$SUBNAM6= <"">
##$SUBNAM7= <"">
##$SUBNAM8= <"">
##$SUBNAM9= <"">
##$SW= 369.568048894756
##$SWIBOX= (0..15)
0 1 3 0 0 0 0 0 0 0 0 0 0 0 0 0 
##$SW_h= 29940.119760479
##$TD= 32768
##$TD0= 1
##$TE= 0
##$TE2= 300
##$TE3= 300
##$TEG= 300
##$TL= (0..7)
0 120 53 12 22 120 120 120 
##$TP= (0..7)
150 150 150 150 150 150 150 150 
##$TP07= 0
##$TPNAME0= <>
##$TPNAME1= <>
##$TPNAME2= <>
##$TPNAME3= <>
##$TPNAME4= <>
##$TPNAME5= <>
##$TPNAME6= <>
##$TPNAME7= <>
##$TPOAL= (0..7)
0.5 0.5 0.5 0.5 0.5 0.5 0.5 0.5 
##$TPOFFS= (0..7)
0 0 0 0 0 0 0 0 
##$TUNHIN= 0
##$TUNHOUT= 0
##$TUNXOUT= 0
##$USERA1= <user>
##$USERA2= <user>
##$USERA3= <user>
##$USERA4= <user>
##$USERA5= <user>
##$V9= 5
##$VALIST= <valist>
##$VCLIST= <CCCCCCCCCCCCCCC>
##$VD= 0
##$VDLIST= <DDDDDDDDDDDDDDD>
##$VPLIST= <PPPPPPPPPPPPPPP>
##$VTLIST= <TTTTTTTTTTTTTTT>
##$WBST= 1024
##$WBSW= 4
##$XGAIN= (0..3)
0 0 0 0 
##$XL= 0
##$YL= 0
##$YMAX_a= 109744
##$YMIN_a= -87791
##$ZGOPTNS= <>
##$ZL1= 120
##$ZL2= 120
##$ZL3= 120
##$ZL4= 120
##$ABSF1= 182.463
##$ABSF2= -187.1042
##$ABSG= 5
##$ABSL= 3
##$ALPHA= 0
##$AQORDER= 0
##$ASSFAC= 0
##$ASSFACI= 0
##$ASSFACX= 0
##$ASSWID= 0
##$AUNMP= <proc_1d>
##$AZFE= 0.1
##$AZFW= 0.5
##$BCFW= 0
##$BC_mod= 2
##$BYTORDP= 0
##$COROFFS= 0
##$CY= -3
##$DATMOD= 1
##$DC= 0
##$DFILT= <>
##$DTYPP= 0
##$F1P= 0
##$F2P= 0
##$FCOR= 1
##$FTSIZE= 65536
##$FT_mod= 6
##$GAMMA= 0
##$GB= 0
##$INTBC= 1
##$INTSCL= 9.790993e-09
##$ISEN= 30
##$LB= 1.5
##$LEV0= 0
##$LPBIN= 0
##$MAXI= 10000
##$MC2= 0
##$MEAN= 0
##$ME_mod= 0
##$MI= 50
##$NCOEF= 0
##$NC_proc= -4
##$NLEV= 6
##$NOISF1= 182.463
##$NOISF2= 159.3651
##$NSP= 0
##$NTH_PI= 0
##$NZP= 0
##$OFFSET= 182.463
##$PC= 4
##$PHC0= 2821.601
##$PHC1= 78.48631
##$PH_mod= 1
##$PKNL= yes
##$PPARMOD= 0
##$PSCAL= 0
##$PSIGN= 0
##$REVERSE= no
##$SF= 81.0140089999434
##$SI= 65536
##$SIGF1= 159.3651
##$SIGF2= -187.1042
##$SINO= 113.3802
##$SIOLD= 16384
##$SREGLST= <1H.CDCl3>
##$SSB= 0
##$STSI= 65536
##$STSR= 0
##$SW_p= 29940.119760479
##$SYMM= 0
##$S_DEV= 0
##$TDeff= 32768
##$TDoff= 0
##$TI= <>
##$TILT= no
##$TM1= 0
##$TM2= 0
##$TOPLEV= 0
##$USERP1= <user>
##$USERP2= <user>
##$USERP3= <user>
##$USERP4= <user>
##$USERP5= <user>
##$WDW= 1
##$XDIM= 65536
##$YMAX_p= 453926492
##$YMIN_p= -1184922
$$ End of Bruker specific parameters
$$ ---------------------------------
##NTUPLES= NMR SPECTRUM
##VAR_NAME=  FREQUENCY,     SPECTRUM/REAL,   SPECTRUM/IMAG
##SYMBOL=    X,             R,               I
##VAR_TYPE=  INDEPENDENT,   DEPENDENT,       DEPENDENT
##VAR_FORM=  AFFN,          ASDF,            ASDF
##VAR_DIM=   65536,         65536,           65536
##UNITS=     HZ,            ARBITRARY UNITS, ARBITRARY UNITS
##FACTOR=    0.456856943014862, 1,           1
##FIRST=     14782.0589164792, 0,            0
##LAST=      -15158.0608439998, 0,           0
##MIN=       -15158.0608439998, -1184922,    0
##MAX=       14782.0589164792, 453926492,    0
$$ Real data points
##PAGE= N=1
##DATA TABLE= (X++(R..R)), XYDATA
$$ [...]
$$ plain form
40552 -230845 -122976 -47662 -31083 -19151 40496 114176 116263 14017 -132336 -226690 -210847
40541 -210847 -94388 55998 155878 158227 83087 -8308 -63908 -66956 -34482 -5694 -17926
40530 -17926 -77144 -157056 -230226 -284644 -308074 -283546 -216082 -145658 -119283 -158747 -251931 -353487
40518 -353487 -400601 -363851 -284136 -225472 -197301 -168098 -143473 -160160 -198496 -184754 -106267
40507 -106267 -40715 -32370 -26260 19574 46993 5505 -28697 54376 229562 355970 337607
40496 337607 186979 -30366 -224717 -294493 -214869 -96374 -61271 -85280 -63138 -347 -5610
40485 -5610 -93561 -140688 -76287 13056 31485 14493 44136 116536 183738 254709 351314 407550
40473 407550 324916 131449 -3491 50985 239080 386451 396829 344175 361619 470669
$$ packed form
40552b30845J07869P5314J6579J1932N9647P3680K087j02246j46353r4354J5843
40541b10847J16459J50386R9880K349p5140r1395n5600l048L2474K8788j2232
40530a7926n9218p9912p3170n4418k3430K4528O7464P0424K6375l9464r3184j01556
40518c53487m7114L6750P9715N8664K8171K9203K4625j6687l8336J3742P8487
40507a06267O5552Q345O110M5834K7419m1488l4202Q3073J75186J26408j8363
40496C37607j50628k17345j94351o9776P9624J18495L5103k4009K2142O2791n263
40485e610q7951m7127O4401Q9343J8429j6992K9643P2400O7202P0971R6605N6236
40473D07550q2634j93467j34940N4476J88095J47371J0378n2654J7444J09050
$$ plain form
40463 470669 561607 537499 420864 294619 197574 128207 96852 99012 72766 -32520 -161964
40452 -161964 -208485 -145395 -27698 114467 281163 410082 397242 237054 46543 -74869
40442 -74869 -121796 -110929 -50432 -14100 -117851 -349378 -522467 -484034 -290043 -102870 8740
40431 8740 85519 160923 220890 245749 225672 161368 84253 28058 -39460 -176911 -338691
40420 -338691 -400282 -364524 -399267 -568577 -671082 -506401 -196894 -52074 -168540 -358121
40410 -358121 -448760 -455016 -432527 -362222 -250651 -186335 -201072 -190900 -68371 96611 178691
40399 178691 169409 158428 191661 232623 238580 203341 133192 33266 -79948 -180204 -243748
40388 -243748 -252416 -204441 -131800 -83162 -79136 -103860 -139607 -178425 -198653 -168197 -83265 21434
$$ packed form
40463D70669R0938k4108j16635j26245r7045o9367l1355K160k6246j05286j29444
40452a61964m6521O3090J17697J42165J66696J28919j2840j60188j90511j21412
40442g4869m6927J0867O0497L6332j03751k31527j73089L8433J93991J87173J11610
40431H740P6779P5404N9967K4859k0077o4304p7115n6195o7518j37451j61780
40420c38691o1591L5758l4743j69310j02505J64681L09507J44820j16466j89581
40410c58121r0639o256K2489P0305J11571O4316j4737J0172J22529J64982Q2080
40399A78691r282j0981L3233M0962N957l5239p0149r9926j13214j00256o3544
40388b43748q668M7975P2641M8638M026k4724l5747l8818k0228L0456Q4932J04699
$$ plain form
40376 21434 103826 134380 100308 29016 -5998 46975 146116 195852 151229 39280 -101677
40365 -101677 -239413 -321920 -316646 -275810 -280361 -315352 -293797 -217176 -203432 -314719 -461608
40354 -461608 -538610 -557296 -567155 -535193 -408423 -234106 -109444 -51661 -21633 -42667 -177551
40343 -177551 -392134 -554975 -594002 -560751 -515002 -439362 -313163 -187990 -121314 -89375 -40110
40332 -40110 -3010 -67744 -246545 -417390 -437476 -292560 -107824 -13303 -17895 -28642 17310
40321 17310 73456 54635 -42077 -131935 -153186 -132771 -124465 -129126 -114878 -82097 -55078 -24483
40309 -24483 41924 125479 151732 83997 -26682 -118403 -198636 -299255 -393725 -430234 -423465
40298 -423465 -425683 -404896 -252652 41986 310239 370263 227770 40249 -76205 -120315
$$ packed form
40376B1434Q2392L0554l4072p1292l5014N2973R9141M9736m4623j11949j40957
40365a01677j37736q2507N274M0836m551l4991K1555P6621J3744j11287j46889
40354d61608p7002j8686r859L1962J26770J74317J24662N7783L0028k1034j34884
40343a77551k14583j62841l9027L3251M5749P5640J26199J25173O6676L1939M9265
40332d0110L7100o4734j78801j70845k0086J44916J84736R4521m592j0747M5952
40321A7310N6146j8821r6712q9858k1251K0415Q306m661J4248L2781K7019L0595
40309b4483O6407Q3555K6253o7735j10679r1721q0233j00619r4470l6509O769
40298d23465k218K0787J52244K94638K68253O0024j42493j87521j16454m4110
$$ plain form
40288 -120315 -115838 -58509 26046 62027 14431 -52195 -58776 -23984 -38851 -138519 -246063 -259893
40276 -259893 -173301 -81357 -68429 -114231 -135513 -103426 -71616 -82392 -104287 -97423 -88095 -123609
40264 -123609 -192038 -249189 -292242 -332508 -320168 -189762 15005 150323 132396 20892 -79744
40253 -79744 -134281 -164076 -189387 -228646 -304538 -405782 -475257 -465096 -373338 -216811 -20736
40242 -20736 148034 204376 140746 46137 -8607 -49735 -123194 -198927 -216210 -185358 -179186 -238707
40230 -238707 -329860 -376431 -310171 -123906 94380 223040 239227 246779 335877 468309 547582
40219 547582 542557 479726 370923 226455 93847 888 -100324 -245598 -354484 -319374
40209 -319374 -178337 -86180 -108804 -151158 -108526 6140 113051 156585 114492 302 -103316
$$ packed form
40288a20315M477N7329Q4555L5981m7596o6626o581L4792j4867r9668j07544j3830
40276b59893Q6592R1944J2928m5802k1282L2087L1810j0776k1895O864R328l5514
40264a23609o8429n7151m3053m0266J2340J30406K04767J35318j7927j11504j00636
40253g9744n4537k9795k5311l9259p5892j01244o9475J0161R1758J56527J96075
40242b0736J68770N6342o3630r4609n4744m1128p3459p5733j7283L0852O172n9521
40230b38707r1153m6571O6260J86265K18286J28660J6187P552Q9098J32432P9273
40219E47582n025o2831j08803j44468j32608r2959j01212j45274j08886L5110
40209c19374J41037R2157k2624m2354M2632J14666J06911M3534m2093j14190j03618
$$ plain form
40198 -103316 -91283 33734 140423 124048 22774 -64912 -108928 -127962 -102504 -235 133098
40187 133098 193119 136067 22711 -64716 -103848 -122818 -153652 -213524 -300681 -384628 -416771
40176 -416771 -374545 -293584 -239708 -239522 -243546 -172119 -6642 173392 258368 212019 97095
40165 97095 2900 -38747 -69022 -149923 -296217 -447182 -511854 -458871 -355618 -299372 -315753
40154 -315753 -348210 -342184 -308243 -294982 -325295 -373641 -393115 -355782 -273608 -184227 -116871 -81140
40142 -81140 -86773 -144320 -229380 -279700 -262146 -217593 -200809 -201062 -171117 -113151 -75687 -77730
40130 -77730 -102276 -158971 -275523 -417360 -498965 -503583 -511323 -565504 -593448 -529679 -448007 -471789
40118 -471789 -584910 -635934 -536214 -366567 -259110 -243237 -256048 -258936 -278318 -330837 -356978
$$ packed form
40198a03316J2033J25017J06689j6375j01274q7686m4016j9034K5458J02269J33333
40187A33098O0021n7052j13356q7427l9132j8970l0834n9872q7157q3947l2143
40176d16771M2226Q0961N3876J86m024P1427J65477J80034Q4976m6349j14924
40165I7095r4195m1647l0275q0901j46294j50965o4672N2983J03253N6246j6381
40154c15753l2457O026L3941J3261l0313m8346j9474L7333Q2174Q9381O7356L5731
40142h1140n633n7547q5060n0320J7554M4553J6784k53K9945N7966L7464k043
40130g7730k4546n6695j16552j41837q1605m618p740n4181k7944O3769Q1672k3782
40118d71789j13121n1024R9720J69647J07457J5873j2811k888j9382n2519k6141
$$ plain form
40107 -356978 -264967 -40541 209791 346670 328111 233721 158742 113149 42879 -76539 -203628
40096 -203628 -282825 -302722 -296932 -306179 -346715 -403396 -444241 -444778 -404862 -348991 -314074 -326511
40084 -326511 -374355 -406288 -380958 -319055 -279888 -279677 -266712 -198004 -107548 -60491 -57426 -29789
40072 -29789 65719 182695 227174 143695 -44478 -252397 -377039 -355254 -215546 -67654
40062 -67654 -8726 -30216 -37889 29951 132555 191856 192586 173266 137535 41337 -116111 -250507
40050 -250507 -284717 -244818 -219645 -252911 -318807 -374946 -384507 -307319 -134791 66797 201999
40039 201999 237396 204677 129215 18387 -91095 -155040 -197128 -280607 -392965 -452892 -457158
40028 -457158 -507071 -627553 -675568 -537203 -329299 -266222 -371255 -468899 -455195 -418378 -448185
$$ packed form
40107c56978R2011K24426K50332J36879j8559r4390p4979m5593p0270j19418j27089
40096b03628p9197j9897N790r247m0536n6681m0845n37L9916N5871L4917j2437
40084c26511m7844l1933K5330O1903L9167K11J2965O8708R0456M7057L065K7637
40072b9789R5508J16976M4479q3479j88173k07919j24642K1785J39708J47892
40062f7654N8928k1490p673O7840J02604N9301P30j9320l5731r6198j57448j34396
40050b50507l4210L9899K5173l3266o5896n6139r561P7188J72528K01588J35202
40039B01999L5397l2719p5462j10828j09482o3945m2088q3479j12358n9927m266
40028d57158m9913j20482m8015J38365K07904O3077j05033r7644J3704L6817k9807
$$ plain form
40017 -448185 -469089 -363402 -172522 -57721 -89618 -178171 -218001 -218690 -251608 -322166 -360413
40006 -360413 -335271 -320005 -403921 -564444 -683956 -698800 -668220 -659171 -624073 -468510 -210733
39995 -210733 15189 116538 118005 65816 -49400 -222769 -366956 -391258 -304895 -175126
39985 -175126 -29064 123781 218113 196443 134826 179466 330185 408416 302523 134302
39975 134302 85778 150499 183247 137204 98591 99043 55785 -61270 -146310 -119223 -57468 -70797
39963 -70797 -132667 -145665 -110466 -110794 -167199 -223083 -259012 -306765 -350869 -328947 -247695 -194045
39951 -194045 -199658 -191421 -122655 -67218 -119816 -262939 -394084 -444735 -421969 -363678 -297651
39940 -297651 -231625 -164639 -119615 -145058 -235226 -275510 -161613 24784 72155 -94716 -315967
$$ packed form
40017d48185k0904J05687J90880J14801l1897q8553l9830o89l2918p0558l8247
40006c60413K5142J5266q3916j60523j19512j4844L0580R049L5098J55563K57777
39995b10733K25922J01349J467n2189j15216j73369j44187k4302Q6363J29769
39985a75126J46062J52845R4332k1670o1617M4640J50719P8231j05893j68221
39975A34302m8524O4721L2748m6043l8613M52m3258j17055q5040K7087O1755j3329
39963g0797o1870j2998L5199l28n6405n5884l5929m7753m4104K1922Q1252N3650
39951a94045n613Q237O8766N5437n2598j43123j31145n0651K2766N8291O6027
39940b97651O6026O6986M5024k5443r0168m0284J13897J86397M7371j66871k21251
$$ plain form
39929 -315967 -415387 -396665 -339518 -230125 -40697 105431 29720 -242884 -467101 -453098
39919 -453098 -261790 -101368 -116425 -305924 -566898 -769979 -837007 -784644 -682534 -574289
39909 -574289 -462685 -346140 -222663 -80090 63631 134282 81144 -33102 -90580 -55473
39899 -55473 12412 61941 86357 67431 -15616 -107838 -108847 -22289 4563 -154520 -450203
39888 -450203 -712420 -824265 -807525 -763636 -758581 -757576 -674875 -500636 -344273 -304476 -330230
39877 -330230 -286752 -143384 -9172 20549 -34602 -108700 -176665 -241583 -297522 -330740 -312013
39866 -312013 -190917 37178 266722 367371 332168 254832 173392 52831 -79621 -128736
39856 -128736 -93426 -86833 -141515 -149097 -73117 -60234 -216245 -412341 -467738 -414245 -410828 -480177
$$ packed form
39929c15967r9420J8722N7147J09393J89428J46128p5711k72604k24217J4003
39919d53098J91308J60422j5057j89499k60974k03081o7028N2363J02110J08245
39909e74289J11604J16545J23477J42573J43721P0651n3138j14246n7478L5107
39899e5473O7885M9529K4416j8926q3047r2222j009Q6558K6852j59083k95683
39888d50203k62217j11845J6740M3889N055J005Q2701J74239J56363L9797k5754
39877c30230M3478J43368J34212K9721n5151p4098o7965o4918n5939l3218J8727
39866c12013J21096K28095K29544J00649l5203p7336q1440j20561j32452m9115
39856a28736L5310O593n4682p582P5980J2883j56011j96096n5397N3493L417o9349
$$ plain form
39844 -480177 -512813 -480834 -461492 -466724 -426715 -351779 -347591 -437456 -507016 -463752 -335989 -185456
39832 -185456 -37058 73610 97279 54122 17706 -10163 -90484 -179790 -114360 158405 452477
39821 452477 549669 445768 293078 182864 103932 54673 56115 66881 8175 -109486 -181467
39810 -181467 -161671 -144193 -247603 -461378 -648763 -687363 -587994 -483899 -507418 -666267
39800 -666267 -841120 -910035 -860449 -768252 -696388 -648549 -603085 -544520 -458561 -334796 -187404
39789 -187404 -49937 55103 118608 120917 45657 -71453 -151098 -156614 -135674 -136727 -120748
39778 -120748 -24009 105770 127720 -3603 -146279 -134116 21710 173254 236029 244020 218749
39767 218749 110588 -88657 -280231 -372368 -380963 -350522 -257364 -84174 75660 103952 16442
$$ packed form
39844d80177l2636L1979J9342n232M0009P4936M188q9865o9560M3264J27763J50533
39832a85456J48398J10668K3669m3157l6416k7869q0321q9306O5430K72765K94072
39821D52477R7192j03901j52690j10214p8932m9259J442J0766n8706j17661p1981
39810a81467J9796J7478j03410k13775j87385l8600R9369J04095k3519j58849
39800f66267j74853o8915M9586R2197P1864M7839M5464N8565Q5959J23765J47392
39789a87404J37467J05040O3505K309p5260j17110p9645n516K0940j053J5979
39778a20748R6739J29779K1950j31323j42676J2163J55826J51544O2775P991k5271
39767B18749j08161j99245j91574r2137q595L0441R3158J73190J59834K8292q7510
$$ plain form
39756 16442 -72083 -118879 -175232 -246423 -258370 -191363 -131622 -139916 -165372 -149657 -132435 -178529
39744 -178529 -260435 -289782 -231027 -124573 -26644 25524 21577 -1603 20607 95784 142118
39733 142118 85185 -48636 -181555 -284297 -366279 -405952 -371514 -296242 -254379 -256593 -233448
39722 -233448 -133390 15589 148498 215688 188291 71977 -65331 -133593 -117160 -90153
39712 -90153 -112985 -159677 -177761 -170534 -171277 -174900 -158744 -151318 -207888 -311154 -364737 -317486
39700 -317486 -241947 -242308 -319009 -381780 -381525 -364524 -382336 -403086 -350736 -208597 -51377 20487
39688 20487 -30993 -141174 -183313 -78220 118818 265757 282145 215906 147983 87577 8083
39677 8083 -65530 -81491 -51820 -43807 -82460 -120798 -105825 -24203 102507 209874 204161 66520
$$ packed form
39756A6442q8525m6796n6353p1191j1947O7007N9741q294k5456J5715J7222m6094
39744a78529q1906k9347N8755J06454R7929N2168l947k3180K2210P5177M6334
39733A42118n6933j33821j32919j02742q1982l9673L4438P5272M1863k214K3145
39722b33448J00058J48979J32909O7190k7397j16314j37308o8262J6433K7007
39712i0153k2832m6692j8084P227p43l623J6156P426n6570j03266n3583M7251
39700c17486P5539l61p6701o2771K55J7001j7812k0750N2350J42139J57220P1864
39688B0487n1480j10181m2139J05093J97038J46939J6388o6239o7923o0406p9494
39677H083p3613j5961K9671Q013l8653l8338J4973Q1622J26710J07367n713j37641
$$ plain form
39665 66520 -74613 -77065 13463 14718 -122416 -233074 -183926 -66775 -52311 -158266 -276187
39654 -276187 -343835 -366133 -328742 -225453 -134810 -138595 -180695 -127650 38146 199190 269261
39643 269261 260884 186555 21605 -207183 -408927 -539299 -628277 -680218 -659863 -601275 -596393
39632 -596393 -625960 -543796 -309529 -97192 -57987 -102498 -68718 -1649 -73399 -275895 -402396
39621 -402396 -350430 -252744 -243196 -254650 -155363 29917 162477 189907 180374 179066 145676 58703
39609 58703 -2207 63609 241349 390149 377697 206728 -5850 -160623 -250081 -294256 -257312
39598 -257312 -88139 175925 415304 546793 580081 548331 450587 292571 123152 -13047
39588 -13047 -113233 -172969 -165721 -115003 -118403 -218773 -303903 -236982 -59128 51689 21096
$$ packed form
39665F6520j41133k452R0528J255j37134j10658M9148J17151J4464j05955j17921
39654b76187o7648k2298L7391J03289R0643l785m2100N3045J65796J61044P0071
39643B69261q377p4329j64950k28788k01744j30372q8978n1941K0355N8588M882
39632e96393k9567Q2164K34267K12337L9205m4511L3780O7069p1750k02496j26501
39621d02396N1966R7686R548j1454R9287J85280J32560K7430r533j308l3390q6973
39609E8703o0910O5816J77740J48800j2452j70969k12578j54773q9458m4175L6944
39598b57312J69173K64064K39379J31489L3288l1750r7744j58016j69419j36199
39588a3047j00186n9736P248N0718l400j00370q5130O6921J77854J10817l0593
$$ plain form
39577 21096 -42109 -31957 11749 10392 -10821 11258 38670 -19366 -137762 -166778 -17750
39566 -17750 214648 351192 310789 171636 76021 91275 154227 150883 53329 -44761 -44209 40419
39554 40419 108424 87928 -15798 -150121 -236260 -193157 -17863 166499 217665 130736 20687
39543 20687 -43434 -97736 -170586 -217875 -212660 -200742 -202086 -143070 27590 221148 304881 275770
39531 275770 242898 263628 298009 318995 362885 442807 494369 452021 329144 187285 67364
39520 67364 -14546 -38450 7753 93081 145712 97820 -67235 -298074 -501271 -595135 -549820
39509 -549820 -393697 -208549 -113252 -193979 -408113 -590858 -607514 -485227 -358161 -309579
39499 -309579 -317101 -326755 -312942 -271433 -217497 -193729 -221259 -242133 -174792 -34578 70626
$$ packed form
39577B1096o3205J0152M3706j357k1213K2079K7412n8036j18396k9016J49028
39566a7750K32398J36544m0403j39153r5615J5254O2952l344r7554r8090N52Q4628
39554D0419O8005k0496j03726j34323q6139M3103J75294J84362N1166q6929j10049
39543B0687o4121n4302p2850m7289N215J1918j344N9016J70660J93558Q3733k9111
39531B75770l2872K0730L4381K0986M3890P9922N1562m2348j22877j41859j19921
39520F7364q1910k3904M6203Q5328N2631m7892j65055k30839k03197r3864M5315
39509e49820J56123J85148R5297q0727k14134j82745j6656J22287J27066M8582
39499c09579p522r654J3813M1509N3936K3768k7530k0874O7341J40214J05204
$$ plain form
39488 70626 84356 70312 102678 154050 147679 77343 15206 18452 73731 126952 138433 115590
39476 115590 109036 163150 256499 309340 265332 149380 33375 -36237 -64839 -79685 -83759
39465 -83759 -36951 98392 272255 340361 198386 -88765 -346400 -465000 -454063 -351568
39455 -351568 -189989 -56871 -55730 -149339 -158437 -675 170536 172694 55133 19696 131775
39444 131775 259302 294717 296114 365249 485274 538165 434782 200709 -26185 -80896 86416
39433 86416 338754 472605 418899 280218 178369 133536 96705 22659 -114104 -307871
39423 -307871 -491750 -571186 -516989 -384635 -231594 -73517 65657 136130 131669 112850 121244
39412 121244 131435 130480 175903 308659 459679 516120 448677 307969 127080 -92716 -307772
$$ packed form
39488G0626J3730j4044L2366N1372o371p0336o2137L246N5279N3221J1481k2843
39476A15590o554N4114R3349N2841m4008j15952j16005o9612k8602j4846m074
39465h3759M6808J35343J73863O8106j41975k87151k57635j18600J0937J02495
39455c51568J61579J33118J141r3609r098J57762J71211K158j17561l5437J12079
39444A31775J27527L5415J397O9135J20025N2891j03383k34073k26894n4711J67312
39433H6416K52338J33851n3706j38681j01849m4833l6831p4046j36763j93767
39423c07871j83879p9436N4197J32354J53041J58077J39174P0473m461j8819Q394
39412A21244J0191r55M5423J32756J51020N6441o7443j40708j80889k19796k15056
$$ plain form
39401 -307772 -421219 -372087 -202468 -27551 43807 -22912 -161853 -253977 -227816 -109134
39391 -109134 34157 156269 218999 171127 4212 -206503 -380561 -519542 -647263 -705380
39381 -705380 -615567 -434111 -322960 -340383 -372854 -321184 -239325 -207049 -169686 -32041 146687
39370 146687 197887 81279 -50334 -53977 42449 126799 150632 118349 10338 -178671 -361109
39359 -361109 -421050 -358016 -281413 -250764 -204849 -79833 80527 186855 217817 207376 161640
39348 161640 64096 -58136 -151330 -215209 -291639 -366778 -366097 -277670 -202205 -220049 -264745 -208358
39336 -208358 -49468 65055 18100 -137430 -244953 -216227 -105643 -25629 -16715 -16916 40973
39325 40973 123476 121261 -15621 -205895 -325632 -336341 -288878 -230924 -169382 -117241 -110494
$$ packed form
39401c07772j13447M9132J69619J74917P1358o6719j38941r2124K6161J18682
39391a09134J43291J22112O2730m7872j66915k10715j74058j38981j27721n8117
39381g05380Q9813J81456J11151j7423l2471N1670Q1859L2276L7363J37645J78728
39370A46687N1200j16608j31613l643R6426Q4350K3833l2283j08011j89009j82438
39359c61109n9941O3034P6603L0649M5915J25016J60360J06328L0962j0441m5736
39348A61640r7544j22232r3194o3879p6430p5139O81Q8427P5465j7844m4696N6387
39336b08358J58890J14523m6955j55530j07523K8726J10584Q0014Q914k01N7889
39325D0973Q2503k215j36882j90274j19737j0709M7463N7954O1542N2141O747
$$ plain form
39314 -110494 -150073 -170689 -109445 9268 92387 85107 36589 44471 143400 271309 351463
39303 351463 375777 375585 341612 240842 109167 41187 56070 58231 -12661 -79954 -66848 -52692
39291 -52692 -159230 -328285 -374056 -258062 -148572 -163339 -207273 -146577 -13559 66014 45857
39280 45857 -51358 -224975 -446642 -588213 -545922 -408491 -365930 -453542 -504483 -368062 -78522
39269 -78522 202125 325008 242315 47767 -69763 -6054 123195 119154 -36053 -165043
39259 -165043 -145873 -43152 38256 88357 120198 93807 -584 -86824 -118405 -157097 -248557
39248 -248557 -315223 -278934 -205017 -202208 -244318 -219436 -109521 7568 101209 201904 290118
39237 290118 302478 251226 219230 227767 220716 188163 186556 212528 174805 34033 -132465 -249838
$$ packed form
39314a10494l9579k0616O1244J18713Q3119p280m8518P882R8929J27909Q0154
39303C51463K4314j92l3973j00770j31675o7980J4883K161p0892o7293J3106J4156
39291e2692j06538j69055m5771J15994J09490j4767m3934O0696J33018P9573k0157
39280D5857r7215j73617k21667j41571M2291J37431M2561q7612n0941J36421K89540
39269g8522K80647J22883q2693j94548j17530O3709J29249m041j55207j28990
39259a65043J9170J02721Q1408N0101L1841k6391r4391q6240l1581l8692r1460
39248b48557o6666L6289P3917K809m2110K4882J09915J17089R3641J00695Q8214
39237B90118J2360n1252l1996Q537p051l2553j607K5972l7723j40772j66498j17373
$$ plain form
39225 -249838 -327248 -364071 -277643 -18100 300105 468365 375056 93967 -188386 -317045
39215 -317045 -291159 -265716 -381526 -583825 -679022 -580795 -404328 -289008 -243159 -225152 -257457
39204 -257457 -354046 -426614 -390210 -305025 -289025 -330160 -312358 -205572 -100035 -50638 -11204
39193 -11204 53563 100967 94465 65809 49226 25781 -22713 -62895 -56194 -14351 23466 37820
39181 37820 39008 62954 153482 298440 392035 335441 184766 118007 225460 403869 489528
39170 489528 423886 253044 48152 -114656 -171702 -146921 -153348 -243270 -311391 -237073 -76971
39159 -76971 -4206 -70423 -142805 -95611 36188 134345 147825 113601 86151 104106 190467
39148 190467 330904 465970 539434 540321 477679 347964 165880 81 -73935 -52845 -708
$$ packed form
39225b49838p7410l6823Q6428K59543L18205J68260r3309k81089k82353j28659
39215c17045K5886K5443j15810k02299r5197R8227J76467J15320M5849J8007l2305
39204b57457r6589p2568L6404Q5185J6000m1135J7802J06786J05537M9397L9434
39193a1204O4767M7404o502k8656j6583k3445m8494m0182O701M1843L7817J4354
39181C7820J188K3946R0528J44958R3595n6594j50675o6759J07453J78409Q5659
39170D89528o5642j70842k04892j62808n7046K4781o427q9922o8121P4318J60102
39159g6971P2765o6217p2382M7194J31799R8157J3480l4224k7450J7955Q6361
39148A90467J40437J35066P3464Q87o2642j29715j82084j65799p4016K1090N2137
$$ plain form
39137 -708 27167 17381 -32932 -122898 -210996 -228480 -168157 -124577 -200839 -389410 -578658 -663132
39125 -663132 -616318 -478751 -329211 -262628 -331716 -484164 -601794 -631476 -640486 -709427 -806166
39114 -806166 -815660 -682610 -481879 -345626 -345051 -438246 -512001 -482362 -372066 -275282 -233608
39103 -233608 -184362 -68372 51696 50193 -95698 -271463 -368264 -396151 -428484 -487301 -523091
39092 -523091 -477507 -335502 -137440 39904 137206 164185 178359 210338 243806 268403 295618
39081 295618 303366 228844 62683 -98155 -148302 -94711 -27878 -1774 -3774 -25435 -90081
39070 -90081 -197686 -297569 -341325 -332588 -308263 -294648 -294976 -300656 -301280 -291298 -269551 -228300 -155107
39057 -155107 -61610 494 -25263 -148690 -324730 -484974 -570614 -561539 -495789 -436891 -397070
$$ packed form
39137g08K7875r786n0313q9966q8098j7484O0323M3580p6262j88571j89248q4474
39125f63132M6814J37567J49540O6583o9088j52448j17630k9682r010o8941r6739
39114h06166r494J33050K00731J36253N75r3195p3755K9639J10296R6784M1674
39103b33608M9246J15990J20068j503j45891j75765r6801k7887l2333n8817l5790
39092e23091M5584J42005J98062J77344R7302K6979J4174L1979L3468K4597K7215
39081B95618P748p4522j66161j60838n0147N3591O6833K6104k000k1661o4646
39070i0081j07605r9883m3756Q737K4325J3615l28n680o24R982K1747M1251P3193
39057a55107R3497O2104k5757j23427j76040j60244q5640R075O5750N8898L9821
$$ plain form
39046 -397070 -322723 -190298 -77931 -79688 -170011 -228587 -199251 -145446 -132037 -139025 -139222 -180383
39034 -180383 -305369 -438383 -453325 -349685 -263144 -276203 -306615 -240096 -103650 -20701 -28659
39023 -28659 -41035 3442 49421 21599 -66694 -163760 -275453 -426828 -564537 -593309 -507246
39012 -507246 -403277 -357723 -364270 -397362 -445923 -462873 -379679 -219043 -105634 -105196 -134699
39001 -134699 -100314 -38432 -28692 -48769 -36700 -36901 -137450 -284793 -314666 -187503 -56863
38990 -56863 -59067 -150797 -213590 -218377 -212442 -219232 -228907 -238353 -235289 -182563 -75466 17991 24510
38977 24510 -49397 -132757 -163224 -122932 -40786 17006 410 -59803 -86229 -63450 -46899 -51729
38965 -51729 -26419 27501 19224 -76591 -134135 -47956 98809 160402 146853 167900 211817 158631
$$ packed form
39046c97070P4347J32425J12367j757r0323n8576K9336N3805J3409o988j97m1161
39034a80383j24986j33014j4942J03640Q6541j3059l0412O6519J36446Q2949p958
39023b8659j2376M4477M5979k7822q8293r7066j11693j51375j37709k8772Q6063
39012e07246J03969M5554o547l3092m8561j6950Q3194J60636J13409M38k9503
39001a34699L4385O1882R740k0077J2069k01j00549j47343k9873J27163J30640
38990e6863k204r1730o2793m787N935o790r675r446L064N2726J07097R3457O519
38977B4510p3907q3360l0467M0292Q2146N7792j6596o0213k6426K2779J6551m830
38965e1729K5310N3920q277r5815n7544Q6179J46765O1593j3549K1047M3917n3186
$$ plain form
38953 158631 9496 -79785 -40116 -1970 -87621 -226986 -284043 -256586 -225291 -182543 -56433
38942 -56433 124030 225840 188498 93286 22876 -53997 -199600 -377100 -482149 -478530 -428784
38931 -428784 -387212 -330742 -230677 -140973 -146407 -230515 -265048 -161513 15698 132490 147523
38920 147523 136511 173448 251172 319739 338127 268802 83684 -180286 -410117 -509392 -485096
38909 -485096 -408270 -311546 -173984 -270 141291 185783 146227 90629 60211 45137 37273
38898 37273 57616 100720 92607 -30651 -208300 -291510 -217487 -77681 27854 125417 278181
38887 278181 428715 452324 345855 234013 175329 93178 -56246 -180412 -202041 -201196 -281276
38876 -281276 -369986 -303667 -84347 94923 99352 579 -65638 -78662 -101558 -153718 -199482
$$ packed form
38953A58631j49135q9281L9669L8146q5651j39365n7057K7457L1295M2748J26110
38942e6433J80463J01810l7342r5212p0410p6873j45603j77500j05049L619M9746
38931d28784M1572N6470J00065Q9704n434q4108l4533J03535J77211J16792J5033
38920A47523j1012L6937P7724O8567J8388o9325j85118k63970k29831r9275K4296
38909d85096P6826R6724J37562J73714J41561M4492l9556n5598l0418j5074p864
38898C7273K0343M3104q113j23258j77649q3210P4023J39806J05535R7563J52764
38887B78181J50534K3609j06469j11842n8684q2151j49424j24166k1629Q45q0080
38876b81276q8710O6319K19320J79270M429r8773o6217j3024k2896n2160m5764
$$ plain form
38865 -199482 -219276 -218423 -191251 -137593 -92825 -82414 -65746 9416 105056 118351 22865 -82277
38853 -82277 -96838 -39930 -3236 -27119 -80864 -141850 -225592 -329305 -402233 -401063 -343892 -284410
38841 -284410 -254014 -249495 -256971 -263819 -259201 -242410 -222233 -197206 -152490 -87940 -28444 7283
38829 7283 22929 15936 -28869 -91836 -115159 -96724 -135824 -301376 -483647 -486590 -282053 -68172
38817 -68172 -28041 -116611 -155400 -72687 36596 55767 -35638 -183938 -326288 -412352 -410437
38806 -410437 -329575 -230435 -197629 -280042 -433532 -531396 -477596 -321043 -209978 -215337 -257760
38795 -257760 -241043 -187307 -177497 -217737 -250383 -261797 -287485 -325375 -331424 -297234 -249084 -173076
38783 -173076 -36935 98701 94913 -86075 -292692 -343647 -232561 -113846 -111618 -197245 -250664
$$ packed form
38865a99482j9794Q53K7172N3658M4768J0411J6668P5162R5640J3295r5486j05142
38853h2277j4561N6908L6694k3883n3745o0986q3742j03713p2928J170N7171N9482
38841b84410L0396M519p476o848M618J6791K0177K5027M4716O4550N9496L5727
38829G283J5646o993m4805o2967k3323J8435l9100j65552j82271k943K04537K13881
38817f8172M0131q8570l8789Q2713J09283J9171r1405j48300j42350q6064J915
38806d10437Q0862R9140L2806q2413j53490r7864N3800J56553J11065n359m2423
38795b57760J6717N3736R810m0240l2646j1414k5688l7890o049L4190M8150P6008
38783a73076J36141J35636l788j80988k06617n0955J11086J18715K228q5627n3419
$$ plain form
38772 -250664 -205224 -120678 -115086 -223412 -346050 -367199 -297803 -243257 -244251 -228838 -131921 19940
38760 19940 168676 284992 326204 223980 -6241 -204798 -209562 -35449 155616 237989
38750 237989 208585 119641 12786 -77540 -128197 -154417 -187387 -218677 -209977 -157912 -99868
38739 -99868 -49539 23498 134282 244530 306751 319887 323780 354163 408219 437972 380341
38728 380341 217624 11026 -142865 -188892 -141261 -58140 -8780 -34652 -102053 -112459 -2931
38717 -2931 179850 346225 472907 578759 616407 491890 218188 -43884 -160661 -183963
38707 -183963 -267671 -460912 -652491 -709772 -612542 -442641 -290070 -193392 -145795 -126777 -119407
38696 -119407 -104661 -54711 50434 193836 317042 351848 262857 73985 -137790 -293075
$$ packed form
38772b50664M5440Q4546N592j08326j22638k1149O9396N4546r94J5413R6917J51861
38760A9940J48736J16316M1212j02224k30221j98557m764J74113J91065Q2373
38750B37989k9404q8944j06855r0326n0657k6220l2970l1290Q700N2065N8044
38739i9868N0329P3037J10784J10248O2221J3136L893L0383N4056K9753n7631
38728C80341j62717k06598j53891m6027M7631Q3121M9360k5872o7401j0406J09528
38717b931J82781J66375J26682J05852L7648j24517k73702k62072j16777k3302
38707a83963q3708j93241j91579n7281R7230J69901J52571R6678M7597J9018P370
38696a19407J4746M9950J05145J43402J23206L4806q8991j88872k11775j55285
$$ plain form
38686 -293075 -375879 -435760 -503587 -531146 -460087 -335696 -286471 -373005 -508011 -551554 -445042
38675 -445042 -231292 2900 160469 160030 3081 -189781 -269542 -202043 -87257 -27332 -11680
38664 -11680 45387 179380 323495 381974 328407 214415 96810 -11363 -110414 -168904 -143900
38653 -143900 -40286 76075 125603 64416 -94610 -279985 -392177 -375067 -263818 -142634
38643 -142634 -63709 -28195 -19492 -12429 24033 74883 56486 -74563 -211779 -209841 -110523 -120072
38631 -120072 -307753 -468314 -396311 -186262 -105202 -224539 -346717 -296821 -135258 -40584
38621 -40584 -99787 -271171 -462261 -575323 -536360 -350286 -111420 70593 142922 119327
38611 119327 68582 86295 206000 328115 312880 160757 17169 -25639 -30143 -69935 -98152
$$ packed form
38686b93075q2804n9881o7827k7559P1059J24391M9225q6534j35006m3543J06512
38675d45042K13750K34192J57569m39j56949j92862p9761O7499J14786N9925J5652
38664a1680N7067J33993J44115N8479n3567j13992j17605j08173r9051n8490K5004
38653a43900J03614J16361M9528o1187j59026j85375j12192J7110J11249J21184
38643a42634P8925L5514Q703P063L6462N0850j8397j31049j37216J938R9318r549
38631a20072j87681j60561P2003K10049Q1060j19337j22178M9896J61563R4674
38621d0584n9203j71384j91090j13062L8963J86074K38866J82013P2329k3595
38611A19327n0745J7713J19705J22115j5235j52123j43588m2808m504l9792k8217
$$ plain form
38600 -98152 -52551 -2103 -66426 -238259 -403781 -506791 -573127 -593452 -516620 -371057 -264292
38589 -264292 -225209 -160179 -13790 134242 194840 191425 177863 128283 11078 -100259 -110916
38578 -110916 -58003 -59083 -125146 -143061 -49449 85792 168630 178154 133479 59918 21268 91005
38566 91005 240976 339020 309783 222563 165197 112317 -6853 -179025 -329344 -420789 -453388
38555 -453388 -419481 -344254 -314102 -365311 -395256 -297159 -139160 -77717 -122775 -142022 -96489
38544 -96489 -103182 -220954 -332598 -321183 -237387 -197543 -215391 -231036 -226448 -218965 -204830 -190826
38532 -190826 -217643 -275428 -268380 -149155 -18065 4110 -65928 -138972 -198550 -261749 -267441
38521 -267441 -155341 -18079 -16041 -148017 -255547 -261485 -251147 -284418 -278178 -149143 36778
$$ packed form
38600i8152M5601N0448o4323j71833j65522j03010o6336k0325P6832J45563J06765
38589b64292L9083O5030J46389J48032O0598l415j3562m9580j17205j11337j0657
38578a10916N2913j080o6063j7915R3612J35241Q2838R524m4675p3561l8650O9737
38566I1005J49971R8044k9237q7220n7366n2880j19170j72172j50319r1445l2599
38555d53388L3907P5227L0152n1209k9945R8097J57999O1443m5058j9247M5533
38544i6489o693j17772j11644J1415Q3796L9844j7848j5645M588P483J4135J4004
38532a90826k6817n7785P048J19225J31090K2175p0038p3044n9578o3199n692
38521b67441J12100J37262K038j31976j07530n938J0338l3271O240J29035J85921
$$ plain form
38510 36778 139837 103748 -17576 -131151 -162852 -101407 -13063 41082 104385 258809 454573
38499 454573 515849 353751 73786 -169928 -323117 -386766 -345643 -225303 -117866 -53257
38489 -53257 66850 300502 514271 532397 384529 265327 266315 282020 195086 36998 -76885
38478 -76885 -91053 -41755 7596 26453 31947 56684 98361 123971 136156 184292 269170 294608
38466 294608 183583 -3448 -150547 -249477 -377913 -531940 -599990 -527143 -401344 -328698
38456 -328698 -302755 -252712 -160906 -73380 -31615 -42638 -89070 -129297 -113825 -40555 24204
38445 24204 13006 -68053 -157897 -217278 -256891 -297129 -328295 -315064 -228563 -76817 87023
38434 87023 192909 203363 136694 40074 -50627 -116739 -138198 -99899 -29608 -4044 -76327
$$ packed form
38510C6778J03059l6089j21324j13575l1701O1445Q8344N4145O3303J54424J95764
38499D54573O1276j62098k79965k43714j53189o3649M1123J20340J07437O4609
38489e3257J20107K33652K13769J8126j47868j19202R88J5705q6934j58088j13883
38478g6885j4168M9298M9351J8857N494K4737M1677K5610J2185M8136Q4878K5438
38466B94608j11025j87031j47099r8930j28436j54027o8050P2847J25799P2646
38456c28698K5943N0043R1806Q7526M1765j1023m6432m0227J5472P3270O4759
38445B4204j1198q1059q9844n9381l9613m0238l1166J3231Q6501J51746J63840
38434H7023J05886J0454o6669r6620r0701o6112k1459L8299P0291K5564p2283
$$ plain form
38423 -76327 -192584 -223922 -112035 49754 124873 95365 51105 31009 -34129 -188090 -337291
38412 -337291 -341167 -182085 9739 87625 13532 -125954 -199963 -151066 -53270 -29117 -105811
38401 -105811 -200255 -246519 -258224 -245313 -176246 -82978 -92810 -252099 -406472 -382573 -222034
38390 -222034 -95462 -40597 44555 173536 229985 181708 149505 190561 181098 26613 -146285
38379 -146285 -149946 -1533 115743 112276 76278 107130 182542 215227 160883 40208 -96066
38368 -96066 -201462 -261789 -296049 -313029 -285558 -200159 -110441 -91190 -141584 -177415 -127188
38357 -127188 -5109 117605 188526 214173 242487 308518 385214 395614 297111 151709 80635
38346 80635 128814 191598 109162 -155150 -450336 -573038 -461251 -235360 -60180 -3903
$$ packed form
38423g6327j16257l1338J11887J61789P5119k9508m4260k0096o5138j53961j49201
38412c37291l876J59082J91824P7886p4093j39486p4009M8897R7796K4153p6694
38401a05811r4444m6264j1705J2911O9067R3268r832j59289j54373K3899J60539
38390b22034J26572N4865Q5152J28981N6449m8277l2203M1056r463j54485j72898
38379a46285l661J48413J17276l467l5998L0852P5412L2685n4344j20675j36274
38368i6066j05396o0327l4260j6980K7471Q5399Q9718J9251n0394l5831N0227
38357a27188J22079J22714P0921K5647K8314O6031P6696J0400r8503j45402p1074
38346H0635M8179O2784q2436k64312k95186j22702J11787K25891J75180N6277
$$ plain form
38336 -3903 -30956 -78689 -111257 -136182 -201970 -353129 -565336 -759177 -892389 -982136 -1017792
38325 -1017792 -944713 -793384 -720188 -808733 -911321 -828247 -590441 -405484 -356023 -334848
38315 -334848 -281947 -284422 -381723 -454633 -404579 -293376 -201840 -91711 69532 178022 138800
38304 138800 42063 32246 71802 5785 -173452 -294420 -246038 -111069 -34640 -65527 -156287
38293 -156287 -239677 -276140 -272270 -256007 -210387 -83262 84900 123265 -73135 -368839 -539404
38282 -539404 -558806 -590452 -709113 -795773 -734078 -559807 -366366 -199379 -106825 -156514 -308506
38271 -308506 -381158 -258039 -52242 44982 15729 -5124 39199 54525 -35044 -161125 -204067
38260 -204067 -140650 -47128 508 -20053 -94515 -186910 -239902 -208443 -112584 -25040 19767
$$ packed form
38336c903k7053m7733l2568k4925o5788j51159k12207j93841j33212q9747l5656
38325a017792P3079J51329P3196q8545j02588Q3074K37806J84957M9461K1175
38315c34848N2901k475r7301p2910N0054J11203R1536J10129J61243J08490l9222
38304A38800r6737r817L9556o6017j79237j20968M8382J34969P6429l0887r0760
38293a56287q3390l6463L870J6263M5620J27125J68162L8365j96400k95704j70565
38282e39404j9402l1646j18661q6660O1695J74271J93441J66987R2554m9689j51992
38271c08506p2652J23119K05797R7224k9253k0853M4323J5326q9569j26081m2942
38260b04067O3417R3522M7636k0561p4462r2395n2992L1459R5859Q7544M4807
$$ plain form
38249 19767 77051 212609 392768 513486 541406 554707 612529 654492 593598 458580 360928
38238 360928 342030 336725 287580 212924 140242 46361 -88970 -215552 -254019 -194514 -115653
38227 -115653 -96064 -124960 -120392 -42169 36193 3414 -148914 -313391 -405153 -450029 -501776
38216 -501776 -538823 -505202 -403573 -276451 -134768 18352 125685 123548 34480 -65363 -151290
38205 -151290 -239240 -292876 -246622 -122980 -24553 6601 26401 67475 81413 35161 -34700
38194 -34700 -114282 -265913 -516397 -758527 -844678 -748783 -581044 -466029 -440867 -441371 -357663
38183 -357663 -138218 134119 306672 319849 263341 249683 284992 296344 236052 121611 17906
38172 17906 13806 162310 393344 528567 443470 200211 -18292 -88422 -31853 48927 76862
$$ packed form
38249A9767N7284J35558J80159J20718K7920J3301N7822M1963o0894j35018r7652
38238C60928j8898n305m9145p4656p2682r3881j35331j26582l8467N9505P8861
38227a15653J9589k8896M568P8223P8362l2779j52328j64477r1762m4876n1747
38216e01776l7047L3621J01629J27122J41683J53120J07333k137q9068r9843q5927
38205a51290q7950n3636M6254J23642R8427L1154J9800M1074J3938m6252o9861
38194c4700p9582j51631k50484k42130q6151R5895J67739J15015K5162n04Q3708
38183c57663K19445K72337J72553J3177n6508j3658L5309J1352o0292j14441j03705
38172A7906m100J48504K31034J35223q5097k43259k18503p0130N6569Q0780K7935
$$ plain form
38161 76862 48220 6291 -18903 -37167 -61134 -73041 -63113 -71894 -137143 -216961 -233736 -184400
38149 -184400 -132969 -101735 -56587 256 22221 14924 34297 65322 19851 -102161 -171968
38138 -171968 -120150 -50373 -79201 -168194 -218047 -232824 -264981 -271997 -172891 -13195 66116
38127 66116 27626 -5713 86678 280334 443394 467940 363599 255234 267276 377851 425460
38116 425460 295299 45053 -192071 -348312 -404735 -336888 -188912 -119693 -231892 -400448
38106 -400448 -417095 -279737 -183804 -224578 -267863 -162929 45997 191025 178971 60448
38096 60448 -42242 -41669 32450 48268 -74293 -232269 -241089 -64802 144365 238319 204473
38085 204473 96435 -47601 -179456 -246340 -279155 -379644 -560366 -692769 -684203 -609317
$$ packed form
38161G6862k8642m1929k5194j8264k3967j1907R928q781o5249p9818j6775M9336
38149a84400N1431L1234M5148N6843K1965p297J9373L1025m5471j22012o9807
38138a71968N1818O9777k8828q8993m9853j4777l2157p016R9106J59696P9311
38127F6116l8490l3339R2391J93656J63060K4546j04341j08365J2042J10575M7609
38116D25460j30161k50246k37124j56241n6423O7847J47976O9219j12199j68556
38106d00448j6647J37358R5933m0774m3285J04934K08926J45028j2054j18523
38096F0448j02690N73P4119J5818j22561j57976q820J76287K09167R3954l3846
38085B04473j08038j44036j31855o6884l2815j00489j80722j32403Q566P4886
$$ plain form
38075 -609317 -570260 -512029 -308019 8328 233948 237825 112516 40075 71545 100140 32492
38064 32492 -74928 -84864 34457 147059 102305 -91047 -293422 -400427 -405302 -322436 -161899
38053 -161899 -1981 27028 -98598 -230344 -215442 -74439 60587 129493 175510 227879
38043 227879 253048 222253 145359 27556 -135360 -302574 -399629 -416379 -435492 -520355 -618936
38032 -618936 -630201 -536899 -415539 -328266 -268257 -219539 -201935 -214079 -184567 -51780 124493
38021 124493 207186 149889 52917 23749 48062 50886 29181 45030 109645 153455 121231 42827
38009 42827 -4824 26939 120791 199629 182061 71460 -24826 -13490 62456 80244 7812
37998 7812 -58577 -41846 7016 -11354 -111637 -221485 -279169 -282525 -251446 -186435 -83057
$$ packed form
38075f09317L9057N8231K04010L16347K25620L877j25309p2441L1470K8595o7648
38064C2492j07420r936J19321J12602m4754j93352k02375j07005m875Q2866J60537
38053a61899J59918K9009j25626j31746J4902J41003J35026O8906M6017N2369
38043B27879K5169l0795p6894j17803j62916j67214r7055j6750j9113q4863r8581
38032f18936j1265R3302J21360Q7273O0009M8718J7604j2144K9512J32787J76273
38021A24493Q2693n7297r6972k9168K4313K824k1705J5849O4615M3810l2224p8404
38009D2827m7651L1763R3852P8838j7568j10601r6286J1336P5946J7788p2432
37998G812o6389J6731M8862j8370j00283j09848n7684l356L1079O5011J03378
$$ plain form
37987 -83057 25211 67488 11802 -61414 -19011 153533 291250 226220 -6918 -216019 -277494
37976 -277494 -231519 -169780 -138760 -167192 -273101 -394931 -414354 -312939 -223697 -251917 -317237
37965 -317237 -266673 -96218 41306 32945 -78492 -176016 -188658 -113862 16870 159763 274227
37954 274227 337670 335173 244312 65171 -133447 -245302 -238372 -212346 -298752 -496106 -644657
37943 -644657 -598741 -401004 -236799 -222679 -302698 -366149 -386087 -385527 -338134 -199239 -7336
37932 -7336 140066 207830 238112 246185 192092 74979 -26951 -45729 7134 86560 171408
37921 171408 250207 301363 313017 285611 212577 105951 28501 30577 65305 50274 446
37910 446 -10077 -13748 -129033 -334258 -418168 -251885 10308 113656 -4747 -212655 -381412
$$ packed form
37987h3057J08268M2277n5686p3216M2403J72544J37717o5030k33138k09101o1475
37976b77494M5975O1739L1020k8432j05909j21830j9423J01415Q9242k8220o5320
37965c17237N0564J70455J37524q361j11437r7524j2642P4796J30732J42893J14464
37954B74227O3443k497r0861j79141j98618j11855O930K6026q6406j97354j48551
37943f44657M5916J97737J64205J4120q0019o3451j9938N60M7393J38895J91903
37932g336J47402O7764L0282Q073n4093j17113j01930j8778N2863P9426Q4848
37921A71408P8799N1156J1654k7406p3034j06626p7450K076L4728j5031m9828
37910D46j0523l671j15285k05225q3910J66283K62193J03348j18403k07908j68757
$$ plain form
37899 -381412 -461311 -428807 -303308 -189370 -178713 -223946 -213349 -147549 -127884 -182923 -230602
37888 -230602 -224824 -221633 -261603 -284302 -216964 -85189 17423 33716 -16367 -68258 -59011 34094
37876 34094 174099 285549 301000 197046 16113 -137269 -169428 -102732 -66190 -137789 -243465
37865 -243465 -271978 -237559 -235000 -262559 -208163 -32360 138405 156830 26813 -127222 -215506
37854 -215506 -242159 -234575 -189068 -106651 -32659 -16656 -48636 -79091 -104881 -185478 -347275
37843 -347275 -518005 -603914 -595486 -538160 -438469 -289604 -169677 -199215 -378617 -567200 -654338
37832 -654338 -653492 -592827 -433015 -171509 70089 163572 120399 41253 -20889 -69659 -98660
37821 -98660 -103303 -114806 -148857 -168269 -161579 -193240 -296585 -384673 -361285 -262519 -193855 -183859
$$ packed form
37899c81412p9899L2504J25499J13938J0657m5233J0597O5800J9665n5039m7679
37888b30602N778L191l9970k2699O7338J31775J02612J6293n0083n1891R247R3105
37876C4094J40005J11450J5451j03954j80933j53382l2159O6696L6542p1599j05676
37865b43465k8513L4419K559k7559N4396J75803J70765J8425j30017j54035q8284
37854b15506k6653P584M5507Q2417P3992J6003l1980l0455k5790q0597j61797
37843c47275j70730q5909Q428N7326R9691J48865J19927k9538j79402j88583q7138
37832f54338Q46O0665J59812K61506K41598R3483m3173p9146o2142m8770k9001
37821i8660m643j1503l4051j9412O690l1661j03345q8088K3388R8766O8664R996
$$ plain form
37809 -183859 -196240 -222822 -254254 -220484 -86949 38787 28249 -78456 -136008 -108875 -79839
37798 -79839 -75026 -43338 -7004 -66532 -224723 -348161 -345654 -265207 -178190 -83244 32371
37787 32371 137126 201259 217315 160424 19963 -123044 -154283 -69059 49959 190725 407820
37776 407820 649276 749629 649005 473477 331937 176996 -44536 -240584 -297536 -261293
37766 -261293 -268620 -352222 -421724 -406160 -327288 -245764 -194287 -157502 -96322 -14924 5778 -93217
37754 -93217 -221707 -211306 -40120 115148 98367 -48058 -178674 -226586 -218917 -187001 -142477
37743 -142477 -99796 -64032 -27638 -4807 -19433 -45987 -32985 1636 -14097 -76760 -92755
37732 -92755 -19678 82991 169223 244079 249156 70879 -248559 -457841 -379851 -133716 52088
$$ packed form
37809a83859j2381k6582l1432L3770J33535J25736j0538j06705n7552K7133K9036
37798g9839M813L1688L6334n9528j58191j23438K507Q0447Q7017R4946J15615
37787C2371J04755O4133J6056n6891j40461j43007l1239Q5224J19018J40766K17095
37776D07820K41456J00353j00624j75528j41540j54941k21532j96048n6952L6243
37766b61293p327q3602o9502J5564P8872Q1524N1477L6785O1180Q1398K0702r8995
37754i3217j28490J0401J71186J55268j6781j46425j30616m7912P669L1916M4524
37743a42477M2681L5764L6394K2831j4626k6554J3002L4621j5733o2663j5995
37732i2755P3077J02669Q6232P4856N077j78277l19438k09282P7990K46135J85804
$$ plain form
37721 52088 137079 230196 347959 392551 335610 258977 209800 145470 38048 -64945 -96823
37710 -96823 -20001 169600 415785 599661 637528 565343 467661 361062 220475 77006
37700 77006 -4021 -17898 -6108 31513 122977 237895 301159 288392 236734 171226 86617
37689 86617 -16426 -144362 -330526 -560968 -711914 -666062 -485403 -364032 -396150 -486978
37679 -486978 -513764 -472443 -416666 -344234 -227735 -106725 -56846 -72726 -57600 46722 174568
37668 174568 223432 189537 153846 145104 98176 -24759 -151382 -195530 -170171 -133094 -87923
37657 -87923 -34205 -47210 -174004 -296091 -255590 -102219 -42151 -133459 -220684 -210102 -207391
37646 -207391 -297395 -380597 -352351 -275682 -231652 -152135 25515 164030 85686 -148722 -309133
$$ packed form
37721E2088Q4991R3117J17763M4592n6941p6633m9177o4330j07422j02993l1878
37710i6823P6822J89601K46185J83876L7867p2185r7682j06599j40587j43469
37700G7006q1027j3877J1790L7621R1464J14918O3264j2767n1658o5508q4609
37689H6617j03043j27936j86164k30442j50946M5852J80659J21371l2118r0828
37679d86978k6786M1321N5777P2432J16499J21010M9879j5880J5126J04322J27846
37668A74568M8864l3895l5691q742m6928j22935j26623m4148K5359L7077M5171
37657h7923N3718j3005j26794j22087M0501J53371O0068r1308q7225J0582K711
37646b07391r0004q3202K8246P6669M4030P9517J77650J38515p8344k34408j60411
$$ plain form
37635 -309133 -303368 -245723 -241794 -260956 -224363 -96652 110509 327973 436244 375569 233030
37624 233030 143305 134194 142251 131272 110965 85577 64614 74908 95589 54408 -42254 -75282
37612 -75282 4532 77242 47766 7115 53767 89199 -15921 -161969 -150380 -217 97195
37601 97195 91927 99338 126829 33553 -197649 -378218 -378131 -286737 -235291 -220817 -182740 -115056
37589 -115056 -28687 82137 180433 203007 178628 217905 346969 466063 518088 590425 798024
37578 798024 1150217 1568212 1958219 2250861 2444714 2611344 2779863 2841566 2670083 2306417
37568 2306417 1907249 1543786 1191071 883568 706755 628152 505734 297067 119578 78714
37558 78714 164709 322363 478939 506684 329200 85544 20242 178560 367468 435200
$$ packed form
37635c09133N765N7645L929j9162L6593J27711K07161K17464J08271o0675j42539
37624B33030q9725r111Q057j0979k0307k5388k0963J0294K0681m1181r6662l3028
37612g5282P9814P2710k9476m0651M6652L5432j05120j46048J1589J50163R7412
37601I7195n268P411K7491r3276k31202j80569Q7R1394N1446J4474L8077O7684
37589a15056Q6369J10824R8296K2574k4379L9277J29064J19094N2025P2337K07599
37578G98024L52193M17995L90007K92642J93853J66630J68519O1703j71483l63666
37568B306417l99168l63463l52715l07503j76813p8603j22418k08667j77489m0864
37558G8714Q5995J57654J56576K7745j77484k43656o5302J58318J88908O7732
$$ plain form
37548 435200 410649 341795 202774 26709 -65269 -57963 -91874 -227715 -331281 -298864 -234362
37537 -234362 -272418 -361721 -365248 -275002 -192084 -161475 -140379 -84316 20376 172190 346650
37526 346650 509260 657759 796441 868700 801878 625967 452290 327422 210586 99044
37516 99044 58501 112204 207035 299680 375957 397660 348738 315925 392198 519322 561318
37505 561318 502775 429024 361645 288686 297601 463507 651845 670511 582334 604511 726097
37494 726097 728159 591769 559379 731699 918985 978017 991249 1012123 941611 785343 737343
37483 737343 859835 950090 867459 728698 645454 545716 399752 340635 405568 438426 399491
37472 399491 467176 664463 716052 494929 292207 390444 659898 839704 936748 1062559
$$ packed form
37548D35200k4551o8854j39021j76065r1978P306l3911j35841j03566L2417O4502
37537b34362l8056q9303l527R0246Q2918L0609K1096N6063J04692J51814J74460
37526C46650J62610J48499J38682P2259o6822j75911j73677j24868j16836j11542
37516I9044m0543N3703R4831R2645P6277K1703m8922l2813P6273J27124M1996
37505E61318n8543p3751o7379p2959Q915J65906J88338J8666q8177K2177J21586
37494G26097K062j36390l2390J72320J87286N9032J3232K0874p0512j56268m8000
37483G37343J22492R0255q2631j38761q3244r9738j45964n9117O4933L2858l8935
37472C99491O7685J97287N1589k21123k02722R8237K69454J79806R7044J25811
$$ plain form
37462 1062559 1140282 1082010 1035821 1160144 1344239 1415652 1426781 1488349 1533578 1497959 1511213
37451 1511213 1658664 1779380 1749191 1718547 1815246 1882087 1794505 1765080 2018641 2417761
37441 2417761 2720328 2953088 3225038 3452529 3600294 3906079 4509969 5138919 5505453
37432 5505453 5707337 5865487 5730667 5108662 4346375 3897419 3695290 3449122 3245075
37423 3245075 3302723 3428741 3314553 3136613 3256489 3541714 3598407 3480795 3546387 3785812
37413 3785812 3927121 4043838 4425944 4989012 5424209 5780685 6301139 6879369 7305346
37404 7305346 7816618 8747639 9893097 10912010 12052783 13721128 15691721 17607599
37396 17607599 19874463 23085647 26946625 30851334 35136825 40575432 47046905 54095673
$$ packed form
37462A062559P7723n8272m6189J24323J84095P1413J1129O1568M5229l5619J3254
37451A511213J47451J20716l0189l0644R6699O6841q7582k9425K53561L99120
37441B417761L02567K32760K71950K27491J47765L05785O03890O28950L66534
37432E505453K01884J58150j34820o22005p62287m48956k02129k46168k04047
37423C245075N7648J26018j14188j77940J19876K85225N6693j17612O5592K39425
37413C785812J41309J16717L82106N63068M35197L56476N20454N78230M25977
37404G305346N11272R31021J145458J018913J140773J668345J970593J915878
37396A7607599K266864L211184L860978L904709M285491N438607O471473P048768
$$ plain form
37388 54095673 62415471 73220817 86477413 101466486 118812563 140210701 166842040
37381 166842040 200404949 244480564 300333015 360468193 410863890 441975257 453926492
37374 453926492 448639261 422254006 371462094 304795974 240369611 191133352 156788708
37367 156788708 130713323 109441974 92928653 80185689 69208205 59648671 52311615
37360 52311615 46711943 41433748 36270477 32049846 28813296 25834196 23033229 20884461
37352 20884461 19230459 17497870 15800264 14638161 13784529 12600741 11217948 10314357
37344 10314357 9899459 9355579 8560318 7975848 7683184 7262861 6643937 6217508 6055027
37335 6055027 5785297 5317130 4978800 4861021 4674687 4350743 4173549 4212776 4178599 3954455
$$ packed form
37388E4095673Q319798J0805346J3256596J4989073J7346077K1398138K6631339
37381A66842040L3562909M4075615N5852451O0135178N0395697L1111367J1951235
37374D53926492n287231k6385255n0791912o6666120o4426363m9236259l4344644
37367A56788708k6075385k1271349j6513321j2742964j0977484r559534p337056
37360E2311615n599672n278195n163271m220631l236550k979100k800967k148768
37352B0884461j654002j732589j697606j162103q53632j183788j382793r03591
37344A0314357m14898n43880p95261n84470k92664m20323o18924m26429j62481
37335F055027k69730m68167l38330j17779j86334l23944j77194L9227l4177k24144
$$ plain form
37325 3954455 3769546 3734778 3675843 3534882 3499687 3612832 3641896 3459928 3223337 3078212
37315 3078212 2986931 2910670 2884249 2859781 2728144 2522707 2379873 2315259 2252254 2203107 2186537
37304 2186537 2070764 1773854 1508560 1519985 1685424 1706600 1599331 1626846 1818854 1942114
37294 1942114 1918645 1897540 1917317 1858490 1736549 1688683 1659618 1457320 1144551 1013691
37284 1013691 1122091 1201205 1094348 948573 892980 854812 792543 801360 878671 873819 777925
37273 777925 784418 954416 1099075 1108682 1119699 1219327 1254935 1105088 906525 834830 851258
37262 851258 829379 766009 723955 718667 779937 965289 1200755 1278123 1129858 942266 877138
37251 877138 853481 742288 607671 581076 622290 583556 435881 285791 220042 243273 316913
$$ packed form
37325C954455j84909l4768n8935j40961l5195J13145K9064j81968k36591j45125
37315C078212r1281p6261k6421k4468j31637k05437j42834o4614o3005m9147j6570
37304B186537j15773k96910k65294J1425J65439K1176j07269K7515J92008J23260
37294A942114k3469k1105J9777n8827j21941m7866k9065k02298l12769j30860
37284A013691J08400P9114j06857j45775n5593l8168o2269Q817P7311m852r5894
37273G77925O493J69998J44659R607J1017R9628L5608j49847j98563p1695J6428
37262H51258k1879o3370m2054n288O1270J85352K35466P7368j48265j87592o5128
37251H77138k3657j11193j34617k6595M1214l8734j47675j50090o5749K3231P3640
$$ plain form
37240 316913 373578 348180 259951 200769 200322 193149 159378 178289 277612 356426 349267 349347 454235
37227 454235 585658 594662 484246 395872 402043 431560 403186 332105 270140 212956 133357
37216 133357 87195 203003 507153 807512 864563 691449 556494 626761 743577 666825
37206 666825 421451 234997 208690 240355 246451 275104 379319 522833 639685 685824 637708
37195 637708 535984 493609 550975 586263 509985 469853 671158 1049776 1344707 1468687
37185 1468687 1571598 1741616 1902896 2045812 2290475 2630941 2856268 2841473 2703761 2549542
37175 2549542 2283352 1830911 1366946 1124219 1094157 1092921 1037556 997038 1030008 1112858 1197954
37164 1197954 1243034 1210131 1100713 958935 811436 662541 551465 510527 460458 290352
$$ packed form
37240C16913N6665k5398q8229n9182m47p173l3771J8911R9323P8814p159Q0J04888
37227D54235J31423R004j10416q8374O171K9517k8374p1081o1965n7184p9599
37216A33357m6162J15808L04150L00359N7051j73114j34955P0267J16816p6752
37206F66825k45374j86454k6307L1665O096K8653J04215J43514J16852M6139m8116
37195F37708j01724m2375N7366L5288p6278m0132K01305L78618K94931J23980
37185A468687J02911J70018J61280J42916K44663L40466K25327j4795j37712j54219
37175B549542k66190m52441m63965k42727l0062j236n5365m0518L2970Q2850Q5096
37164A197954M5080l2903j09418j41778j47499j48895j11076m0938n0069j70106
$$ plain form
37154 290352 71476 21702 188624 342076 289010 135068 95872 185043 252815 238942 217556
37143 217556 235330 247781 206115 114627 14358 -39468 -25083 -15185 -118743 -318142 -448979
37132 -448979 -395309 -220294 -54967 43303 67588 11443 -80067 -109574 -55307 -9208 -26220
37121 -26220 -44215 -19598 -15788 -67828 -83243 14196 148475 204580 177755 112644 5638
37110 5638 -122217 -167501 -85210 10896 11597 -22461 13005 74084 49628 -45959 -108929 -114002
37098 -114002 -109295 -98400 -55640 -9603 2020 6608 28188 24140 -6954 39739 197251 290681
37086 290681 148501 -132370 -310689 -321404 -284077 -250114 -158855 -32932 -264 -80296 -123569
37075 -123569 -23437 145229 251063 261600 227441 194315 166220 104647 -32617 -205261
$$ packed form
37154B90352k18876m9774J66922J53452n3066j53942l9196Q9171O7772j3873k1386
37143B17556J7774J2451m1666r1488j00269n3826J4385R898j03558j99399j30837
37132d48979N3670J75015J65327R8270K4285n6145r1510k9507N4267M6099j7012
37121b6220j7995K4617L810n2040j5415R7439J34279N6105k6825o5111j07006
37110E638j27855m5284Q2291R6106P01l4058L5466O1079k4456r5587o2970n073
37098a14002M707J0895M2760M6037J1623M588K1580m048l1094M6693J57512R3430
37086B90681j42180k80871j78319j0715L7327L3963R1259J25923L2668q0032m3273
37075a23569J00132J68666J05834J0537l4159l3126k8095o1573j37264j72644
$$ plain form
37065 -205261 -288144 -227644 -137730 -140769 -183576 -145545 -66359 -92454 -217214 -253832 -91294
37054 -91294 174379 401662 561968 686154 764323 763859 683703 553271 418066 325456 279084
37043 279084 230007 160709 124891 135951 91706 -83794 -291370 -374935 -329925 -259845 -187927
37032 -187927 -72196 42278 69192 56239 131464 281844 367432 356119 355816 404464 428107
37021 428107 429927 503436 608289 564663 365497 268396 429326 634562 580712 285838 31204
37010 31204 -17427 57023 125011 170333 230673 293502 289972 155273 -97240 -342758 -431219
36999 -431219 -339858 -192830 -107480 -90099 -109398 -175936 -285837 -369174 -373393 -336074 -300638
36988 -300638 -219046 -24210 238138 433246 483298 435586 395790 431174 524871 594770 565448
$$ packed form
37065b05261q2883O0500Q9914l039m2807L8031P9186k6095j24760l6618J62538
37054i1294K65673K27283J60306J24186P8169m64q0156j30432j35205r2610m6372
37043B79084m9077o9298l5818J1060m4245j75500k07576q3565M5010P0080P1918
37032a87927J15731J14474K6914j2953P5225J50380Q5588j1313l03M8648K3643
37021D28107J820P3509J04853m3626j99166r7101J60930K05236n3850k94874k54634
37010C1204m8631P4450O7988M5322O0340O2829l530j34699k52513k45518q8461
36999d31219R1361J47028Q5350J7381j9299o6538j09901q3337m219L7319L5436
36988c00638Q1592J94836K62348J95108N0052m7712l9796L5384R3697O9899k9322
$$ plain form
36977 565448 431744 241823 38930 -140391 -241719 -242314 -210985 -229323 -255784 -169546 37634
36966 37634 222472 275118 237589 193904 149233 85952 49404 92288 184287 239422 196330
36955 196330 42623 -178361 -351955 -355027 -183860 29914 157483 172357 109516 17592
36945 17592 -26848 37550 153918 180657 73957 -56138 -116014 -147828 -215679 -277557 -256161
36934 -256161 -159083 -51663 21574 25537 -79273 -271173 -451976 -548588 -563922 -504568 -367264
36923 -367264 -233296 -235488 -359264 -418920 -324632 -223377 -252734 -308704 -226419 -62797 2455
36912 2455 -41240 -57062 -23350 -53157 -156805 -195455 -110568 -22317 -37141 -99003 -103283 -49960
36900 -49960 -12809 -32214 -93825 -157585 -171563 -104493 13716 123463 206507 276896 314650
$$ packed form
36977E65448j33704j89921k02893j79321j01328n95L1329j8338k6461Q6238K07180
36966C7634J84838N2646l7529m3685m4671o3281l6548M2884R1999N5135m3092
36955A96330j53707k20984j73594l072J71167K13774J27569J4874o2841r1924
36945A7592m4440O4398J16368K6739j06700j30095n9876l1814o7851o1878K1396
36934b56161R7078J07420P3237L963j04810j91900j80803r6612j5334N9354J37304
36923c67264J33968k192j23776n9656R4288J01255k9357n5970Q2285J63622O5252
36912B455m3695j5822L3712k9807j03648l8650Q4887Q8251j4824o1862m280N3323
36900d9960L7151j9405o1611o3760j3978O7070J18209J09747Q3044P0389L7754
$$ plain form
36889 314650 279521 195103 151356 202071 301438 354870 308684 195516 108652 109591 150850 135639
36877 135639 61168 22134 47998 50717 -3276 2548 148208 309893 323517 223383 153898
36866 153898 118732 9146 -158678 -239044 -191800 -131283 -113155 -49817 112194 286681 378460
36855 378460 386594 327643 188405 9410 -111057 -151932 -187018 -220886 -149144 46095 204209
36844 204209 191690 79603 2685 -52161 -181400 -360908 -449765 -377867 -221383 -93854
36834 -93854 -38286 -24737 7 57919 106895 83073 -8806 -89573 -106631 -84598 -56905 -21985
36822 -21985 -2396 -63884 -214635 -352588 -378823 -310889 -228658 -169685 -143297 -185606 -313393
36811 -313393 -456340 -511404 -448428 -313307 -161830 -45573 -24013 -118927 -268695 -376002
$$ packed form
36889C14650l5129q4418m3747N0715R9367N3432m6186j13168q6864R39M1259j5211
36877A35639p4471l9034K5864K719n3993N824J45660J61685J3624j00134o9485
36866A53898l5166j09586j67824q0366M7244O0517J8128O3338J62011J74487R1779
36855C78460Q134n8951j39238j78995j20467m0875l5086l3868P1742J95239J58114
36844B04209j2519j12087p6918n4846j29239j79508q8857P1898J56484J27529
36834i3854N5568J3549K4744N7912M8976k3822r1879q0767j7058K2033K7693L4920
36822b1985J9589o1488j50751j37953k6235O7934Q2231N8973K6388m2309j27787
36811c13393j42947n5064O2976J35121J51477J16257K1560r4914j49768j07307
$$ plain form
36801 -376002 -388215 -307933 -170267 -48800 -26276 -94386 -125059 -12283 185956 314406
36791 314406 306993 240293 213677 239511 255386 200679 74544 -61991 -149905 -201931 -272562
36780 -272562 -351666 -349814 -218394 -20357 153914 265872 279412 134392 -136076 -345420
36770 -345420 -337816 -188794 -99251 -122362 -132461 -56009 18055 -1955 -68947 -87719 -61488
36759 -61488 -71524 -158183 -280277 -363221 -350162 -234213 -71723 54328 99394 73593 7734
36748 7734 -58979 -73438 -6798 107452 228174 380591 593629 771855 743944 479597 163239
36737 163239 -6714 -15908 23274 40223 34049 5795 -28974 806 140419 302548 348591
36726 348591 280763 246813 323332 392538 297100 51760 -171943 -240372 -176897 -104747 -126457
$$ packed form
36801c76002j2213Q0282J37666J21467K2524o8110l0673J12776J98239J28450
36791C14406p413o6700k6616K5834J5875n4707j26135j36535q7914n2026p0631
36780b72562p9104J852J31420J98037J74271J11958J3540j45020k70468k09344
36770c45420P604J49022Q9543k3111j0099P6452P4064k0010o6992j8772K6231
36759f1488j0036q6659j22094q2944J3059J15949J62490J26051M5066k5801o5859
36748G734o6713j4459O6640J14250J20722J52417K13038J78226k7911k64347l16358
36737A63239j69953r194L9182J6949o174k8254l4769K9780J39613J62129M6043
36726C48591o7828l3950P6519O9206r5438k45340k23703o8429O3475P2150k1710
$$ plain form
36715 -126457 -256197 -421612 -516129 -476968 -332830 -175659 -86174 -81399 -110189 -87373 38614
36704 38614 219899 328418 278800 124644 -2891 -42067 -40499 -56144 -86217 -115858 -168716
36693 -168716 -256400 -325062 -317562 -262318 -233932 -239954 -218535 -151207 -105071 -137658 -217474 -271895
36681 -271895 -269187 -220746 -143838 -61669 -10184 -7263 -36074 -82628 -155052 -235756 -261431 -205036
36669 -205036 -141558 -161942 -238699 -252350 -152448 -17201 64376 96573 126885 155873 152858
36658 152858 119706 79428 28170 -39105 -69199 12278 189574 339227 356540 266001 174049
36647 174049 135942 107324 22988 -109735 -212772 -223501 -161975 -97396 -51777 28193 175946
36636 175946 317961 348545 283886 252721 301642 304349 144086 -89398 -204201 -170323 -141757
$$ packed form
36715a26457j29740j65415r4517L9161J44138J57171Q9485M775k8790K2816J25987
36704C8614J81285J08519m9618j54156j27535l9176J568j5645l0073k9641n2858
36693a68716q7684o8662P500N5244K8386o022K1419O7328M6136l2587p9816n4421
36681b71895K708M8441P6908Q2169N1485K921k8811m6554p2424q0704k5675N6395
36669b05036O3478k0384p6757j3651R9902J35247Q1577L2197L0312K8988l015
36658A52858l3152m0278n1258o7275l0094Q1477J77296J49653J7313r0539r1952
36647A74049l8107k8618q4336j32723j03037j0729O1526O4579M5619P9970J47753
36636A75946J42015L0584o4659l1165M8921K707j60263k33484j14803L3878K8566
$$ plain form
36625 -141757 -211755 -292512 -288008 -248062 -255441 -269894 -210733 -123896 -128713 -228446 -301902 -275486
36613 -275486 -186525 -76760 52340 156497 146285 22784 -84612 -81543 -29239 -34655 -94286
36602 -94286 -130032 -126575 -139562 -187467 -217674 -187091 -124161 -99969 -161017 -282016 -367678 -326691
36590 -326691 -170528 -13124 53062 47249 37749 35423 1991 -69578 -145217 -200736 -222943 -179002
36578 -179002 -58702 55112 43926 -84080 -155890 -16900 279418 521715 570713 487373
36568 487373 424471 441433 464822 405903 262434 95498 -45539 -139508 -165403 -108605 4677
36557 4677 115387 181895 201791 187965 151376 108265 78092 68289 71555 67258 17560 -101679
36545 -101679 -240645 -297902 -253775 -222182 -287380 -349684 -260980 -77750 -13048 -125753 -241052
$$ packed form
36625a41757o9998q0757M504L9946p379j4453N9161Q6837m817r9733p3456K6416
36613b75486Q8961J09765J29100J04157j0212j23501j07396L069N2304n416n9631
36602i4286l5746L457j2987m7905l0207L0583O2930K4192o1048j20999q5662M0987
36590c26691J56163J57404O6186n813r500k326l3432p1569p5639n5519k2207M3941
36578a79002J20300J13814j1186j28006p1810J38990K96318K42297M8998q3340
36568D87373o2902J6962K3389n8919j43469j66936j41037r3969k5895N6798J13282
36557D677J10710O6508J9896j3826l6589m3111l0173r803L266m297m9698j19239
36545a01679j38966n7257M4127L1593o5198o2304Q8704J83230O4702j12705j15299
$$ plain form
36534 -241052 -241669 -246815 -371169 -470908 -328281 -2536 210648 150954 -54191 -216841 -298391
36523 -298391 -344227 -352160 -295763 -203098 -139403 -145151 -219590 -323771 -385891 -356452 -276139 -241166
36511 -241166 -287422 -354229 -370761 -332023 -284980 -285220 -363727 -485713 -553806 -515054 -449719 -470158
36499 -470158 -536569 -479224 -232803 52497 190698 171747 126065 138829 178595 180368 126509
36488 126509 45597 -24463 -66754 -96643 -134428 -157822 -105648 50861 255842 406013 438251
36477 438251 382659 335475 362592 416068 380607 233936 109822 133243 235928 238421 101003
36466 101003 -28148 -36232 6912 -14490 -86185 -120611 -118809 -163579 -271794 -347712 -295974
36455 -295974 -123320 87055 265957 406142 531932 631279 636183 496908 265137 60703
$$ packed form
36534b41052o17n146j24354r9739J42627L25745K13184n9694k05145j62650q1550
36523b98391m5836p933N6397R2665O3695n748p4439j04181o2120K9439Q0313L4973
36511b41166m6256o6807j6532L8738M7043k40p8507j21986o8093L8752O5335k0439
36499d70158o6411N7345K46421K85300J38201j8951m5682J2764L9766J773n3859
36488A26509q0912p0060m2291k9889l7785k3394N2174J56509K04981J50171L2238
36477D38251n5592m7184K7117N3476l5461j46671j24114K3421J02685K493j37418
36466A01003j29151q084M3144k1402p1695l4426J802m4770j08215p5918N1738
36455b95974J72654K10375J78902J40185J25790R9347M904j39275k31771k04434
$$ plain form
36445 60703 -43691 -58342 -4510 117552 266650 345706 303312 200135 123247 76166 5837
36434 5837 -95740 -174260 -184749 -140834 -99429 -115385 -193191 -269350 -264319 -158063 10955
36423 10955 206835 400001 519549 487724 327548 164219 92353 109804 194504 343826
36413 343826 497690 535031 422112 274093 192466 131283 10596 -130617 -201258 -196471 -156073
36402 -156073 -64520 78603 164774 110406 33022 122777 361973 547307 590580 616718 732218
36391 732218 872407 944288 968204 992630 995086 959300 944987 988105 1019955 972841 885462
36380 885462 819351 754384 664190 616342 676505 761758 716249 521145 321746 240947 256513
36369 256513 277415 260171 217360 169854 134233 134459 195587 322196 479892 596405 602768
$$ packed form
36445F0703j04394j4651N3832J22062J49098P9056m2394j03177p6888m7081p0329
36434E837j01577p8520j0489M3915M1405j5956p7806p6159N031J06256J69018
36423A0955J95880J93166J19548l1825j60176j63329p1866J7451Q4700J49322
36413C43826J53864L7341j12919j48019q1627o1183j20687j41213p0641M787M0398
36402a56073R1553J43123Q6171n4368p7384Q9755K39196J85334M3273K6138J15500
36391G32218J40189P1881K3916K4426K456l5786j4313M3118L1850m7114q7379
36380H85462o6111o4967r0194m7848O0163Q5253m5509j95104j99399q0799J5566
36369B56513K0902j7244m2811m7506l5621K26O1128J26609J57696J16513O363
$$ plain form
36358 602768 493704 334004 188486 60828 -82612 -245377 -375236 -399047 -285696 -94686
36348 -94686 51473 87752 93070 197684 408104 611127 771877 1014579 1427466 1876837
36338 1876837 2133224 2143867 2067123 2048599 2071938 2044875 1932872 1763431 1566290 1361494
36328 1361494 1172178 1011953 876911 764197 674000 585316 465874 329755 260154 339488
36318 339488 547973 743787 768251 595137 368119 254914 267895 283687 243703 242009 359500
36307 359500 504010 523353 422682 343110 346387 356027 321845 303936 343504 370458 316610
36296 316610 231837 205776 239548 270720 269852 241902 186354 127893 131487 207253 253544 185762
36284 185762 74592 52783 124491 190076 237670 362134 570845 716055 690859 580301
$$ packed form
36358F02768j09064j59700j45518j27658j43440j62765j29859k3811J13351J91010
36348i4686J46159L6279N318J04614K10420K03023J60750K42702M12887M49371
36338A876837K56387J0643p6744j8524K3339k7063j12003j69441j97141k04796
36328A361494j89316j60225j35042j12714r0197q8684j19442j36119o9601P9334
36318C39488K08485J95814K4464j73114k27018j13205J2981J5792l9984j694J17491
36307C59500J44510J9343j00671p9572L277R640l4182j7909L9568K6954n3848
36296C16610q4773k6061L3772L1172q68k7950n5548n8461L594P5766M6291o7782
36284A85762j11170k1809P1708O5585M7594J24464K08711J45210k5196j10558
$$ plain form
36274 580301 526123 522255 449642 270760 86337 3084 21285 64757 73968 59360 88146
36263 88146 212434 391411 511000 515056 488804 561297 740319 899974 931231 850405 744888
36252 744888 659581 569996 447422 321242 268366 336363 476435 575656 578307 555476 619805
36241 619805 784897 953306 1039105 1048030 1022059 962498 854711 737573 687271 723226 772138
36230 772138 754837 693435 699406 846717 1080040 1270411 1348686 1355381 1366320 1411740 1480123
36219 1480123 1557222 1628737 1673560 1689435 1706091 1744603 1787528 1820709 1877124 1998490 2174128
36208 2174128 2355742 2508133 2608570 2637696 2628866 2682097 2845669 3016531 3060456 3014452
36198 3014452 3050387 3230398 3428428 3530657 3581075 3660274 3746740 3802628 3895235 4105008
$$ packed form
36274E80301n4178l868p2613j78882j84423q3253J8201M3472R211j4608K8786
36263H8146J24288J78977J19589M056k6252P2493J79022J59655L1257q0826j05517
36252G44888q5307q9585j22574j26180n2876O7997J40072R9221K651k2831O4329
36241F19805J65092J68409Q5799Q925k5971n9561j07787j17138n0302L5955M8912
36230G72138j7301o1402N971J47311K33323J90371P8275O695J0939M5420O8383
36219A480123P7099P1515M4823J5875J6656L8512M2925L3181N6415J21366J75638
36208B174128J81614J52391J00437K9126q830N3231J63572J70862M3925m6004
36198C014452L5935J80011J98030J02229N0418P9199Q6466N5888R2607K09773
$$ plain form
36188 4105008 4378473 4600103 4764044 4944465 5127303 5217018 5218122 5276473 5501337 5848774
36178 5848774 6222779 6603778 7030112 7524223 8082332 8676776 9229639 9644067 9907605
36169 9907605 10121162 10392490 10741811 11128472 11508194 11839744 12113095 12420071 12926884
36160 12926884 13716787 14724386 15890187 17305068 19106620 21297809 23799215 26653961
36152 26653961 30041070 34084994 38809728 44336311 50981078 59058600 68700285 79990863
36144 79990863 93210711 108879373 127811212 151470472 182052219 221201583 267496011
36137 267496011 314834741 354129098 378144194 386131816 384225132 380531567 378340670
36130 378340670 373072614 356033239 322177404 275129597 225021004 181474075 148316298
$$ packed form
36188D105008K73465K21630J63941J80421J82838Q9715J104N8351K24864L47437
36178E848774L74005L80999M26334M94111N58109N94444N52863M14428K63538
36169I907605K13557K71328L49321L86661L79722L31550K73351L06976N06813
36160A2926884P89903J007599J165801J414881J801552K191189K501406K854746
36152B6653961L387109M043924M724734N526583O644767Q077522R641685J1290578
36144G9990863J3219848J5668662J8931839K3659260L0581747L9149364M6294428
36137B67496011M7338730L9294357K4015096P987622j906684l693565k190897
36130C78340670n268056j7039375l3855835m7047807n0108593m3546929l3157777
$$ plain form
36123 148316298 123934600 105131066 89894556 77400634 67036470 58223907 50738900
36116 50738900 44595152 39631041 35461635 31771522 28455353 25515639 22978649 20874714
36108 20874714 19169682 17728514 16418893 15202444 14069422 12981118 11963715 11145536
36100 11145536 10570664 10070935 9475611 8868077 8456363 8242933 8023263 7697334 7373791
36091 7373791 7136554 6913315 6652186 6451377 6406389 6468421 6563364 6721009 6957957 7146940
36081 7146940 7158868 7058050 6993449 6943661 6742369 6349151 5926541 5614291 5369624 5083424
36071 5083424 4730318 4340238 3940186 3611411 3497159 3631559 3826273 3852805 3701389 3540185
36061 3540185 3450523 3352196 3201924 3104578 3149524 3255583 3282890 3222909 3175757 3197263 3275688
$$ packed form
36123A48316298k4381698j8803534j5236510j2493922j0364164q812563p485007
36116E0738900o143748m964111m169406l690113l316169k939714k536990k103935
36108B0874714j705032j441168j309621j216449j133022j088304j017403q18179
36100A1145536n74872m99729n95324o07534m11714k13430k19670l25929l23543
36091G373791k37237k23239k61129k00809m4988O2032R4943J57645K36948J88983
36081G146940J1928j00818o4601m9788k01292l93218m22610l12250k44667k86200
36071E083424l53106l90080m00052l28775j14252J34400J94714K6532j51416j61204
36061C540185q9662r8327j50272r7346M4946J06059K7307n9981m7152K1506P8425
$$ plain form
36050 3275688 3416055 3626786 3841490 3978964 4084090 4278845 4545255 4698136 4651292 4588631
36040 4588631 4745748 5093763 5382308 5478509 5529438 5759428 6212768 6761425 7312176 7947112
36030 7947112 8879721 10298920 12211391 14366504 16325735 17669065 18224371 18163713 17883557
36021 17883557 17729382 17749042 17661366 17068238 15744481 13797441 11613545 9650634 8202911
36012 8202911 7281827 6697148 6256770 5882725 5555536 5225512 4840343 4424141 4056078
36003 4056078 3771483 3536470 3316479 3111572 2917724 2714610 2515656 2379025 2335265 2339911
35993 2339911 2326988 2275285 2192553 2075470 1934218 1828148 1812389 1849236 1833188 1728345
35983 1728345 1634956 1675493 1833107 1949715 1892509 1689288 1480371 1365132 1335114 1350108
$$ packed form
36050C275688J40367K10731K14704J37474J05126J94755K66410J52881m6844o2661
36040D588631J57117L48015K88545R6201N0929K29990M53340N48657N50751O34936
36030G947112R32609J419199J912471K155113J959231J343330N55306o0658k80156
36021A7883557j54175J9660q7676n93128j323757j947040k183896j962911j447723
36012H202911r21084n84679m40378l74045l27189l30024l85169m16202l68063
36003D056078k84595k35013k19991k04907j93848k03114j98954j36631m3760M646
35993B339911j2923n1703q2732j17083j41252j06070j5759L6847j6048j04843
35983A728345r3389M0537J57614J16608n7206k03221k08917j15239l0018J4994
$$ plain form
35973 1350108 1422515 1583774 1789801 1917711 1880818 1720804 1559525 1472918 1439845 1407190
35963 1407190 1364352 1334748 1325401 1322660 1327695 1358772 1417850 1490163 1576664 1677312 1730756 1640266
35951 1640266 1410722 1202031 1166175 1262216 1321168 1276372 1222789 1240625 1283961 1296382 1320725
35940 1320725 1399215 1454437 1399276 1324454 1440651 1823320 2320006 2730806 2982856 3094026
35930 3094026 3071481 2933205 2772733 2700771 2716381 2697119 2536121 2255492 1967209 1746530
35920 1746530 1572070 1388731 1198576 1055512 970802 868812 676171 436399 285910 308350
35910 308350 453271 615016 748546 865863 945785 918261 767519 604860 575261 687363
35900 687363 791071 755850 628452 559239 597193 633935 561953 416040 315801 316489 368767
$$ packed form
35973A350108P2407J61259K06027J27910l6893j60014j61279q6607l3073l2655
35963A407190m2838k9604r347k741N035L1077N9078P2313Q6501J00648N3444r0490
35951A640266k29544k08691l5856R6041N8952m4796n3583J7836M3336J2421K4343
35940A320725P8490N5222n5161p4822J16197L82669M96686M10800K52050J11170
35930C094026k2545j38276j60472p1962J5610j9262j60998k80629k88283k20679
35920A746530j74460j83339j90155j43064q4710j01990j92641k39772j50489K2440
35910C08350J44921J61745J33530J17317P9922k7524j50742j62659k9599J12102
35900F87363J03708l5221j27398o9213L7954L6742p1982j45913j00239O88N2278
$$ plain form
35889 368767 400784 390691 363426 350498 359055 372027 381829 411887 475813 529010 514283 451667
35877 451667 410827 385339 289247 118039 9755 66768 202600 267752 262267 306932 446411
35866 446411 602585 700824 723635 651447 475357 276967 176206 175979 165225 99621 66799
35855 66799 132221 228515 258945 226260 198249 214601 282337 401220 541475 646051 692416
35844 692416 704545 687549 618017 512437 419061 326241 188437 72317 137187 394383 620227
35833 620227 622093 481054 398711 400051 352075 219108 120852 140619 228520 313182 379829
35822 379829 412412 378196 308772 294925 358720 416986 408270 368494 336890 275126 146197
35811 146197 9210 -36701 32146 157058 271251 331551 307922 200293 60426 -39992
$$ packed form
35889C68767L2017j0093k7265j2928Q557J2972R802L0058O3926N3197j4727o2616
35877D51667m0840k5488r6092j71208j08284N7013J35832O5152n485M4665J39479
35866D46411J56174R8239K2811p2188j76090j98390j00761k27j0754o5604l2822
35855F6799O5422R6294L0430l2685k8011J6352O7736J18883J40255J04576M6365
35844F92416J2129j6996o9532j05580r3376r2820j37804j16120O4870K57196K25844
35833F20227J866j41039q2343J340m7976j32967r8256J9767Q7901Q4662O6647
35822C79829L2583l4216o9424j3847O3795N8266q716l9776l1604o1764j28929
35811A46197j36987m5911O8847J24912J14193O0300k3629j07629j39867j00418
$$ plain form
35801 -39992 -60529 3845 142155 314744 437886 428748 282853 90569 -35574 -50711 872
35790 872 48602 78140 142386 278406 424140 452714 311400 109641 33889 159273 363514
35779 363514 456979 397241 331839 399728 537561 560061 421784 294746 336174 466099 471383
35768 471383 287430 63903 -53546 -97746 -183351 -312215 -363696 -265396 -98065 92
35758 92 -6738 -35039 -16261 8238 -40841 -153799 -238172 -243212 -212683 -199039 -185983 -127094
35746 -127094 -12374 135540 285554 390362 410998 384826 401681 461468 435331 254217
35736 254217 66379 86434 317977 545145 588338 450680 217250 -45883 -252107 -292387
35726 -292387 -163676 -13394 30621 14076 66065 214401 374139 473148 497138 439004 302805
$$ packed form
35801c9992k0537O4374J38310J72589J23142r138j45895j92284j26143j5137N1583
35790H72M7730K9538O4246J36020J45734K8574j41314k01759p5752J25384K04241
35779C63514R3465n9738o5402O7889J37833K2500j38277j27038M1428J29925N284
35768D71383j83953k23527j17449m4200q5605j28864n1481R8300J67331R8157
35758I2o830k8301J8778K4499m9079j12958q4373n040L0529J3644J3056N8889
35746a27094J14720J47914J50014J04808K0636k6172J6855N9787k6137j81114
35736B54217j87838K0055K31543K27168M3193j37658k33430k63133k06224m0280
35726b92387J28711J50282M4015j6545N1989J48336J59738R9009K3990n8134j36199
$$ plain form
35715 302805 156408 86274 75491 5762 -172801 -330539 -283144 -14276 281490 394828
35705 394828 312429 208203 235712 362961 432406 362551 244087 220483 312736 410611 429567
35694 429567 416120 460657 545540 552818 435581 314303 345244 523446 683070 689978 569398
35683 569398 429037 322229 229092 128766 39597 3453 57763 201109 365346 453344
35673 453344 431056 353541 282078 219833 152772 94012 43992 -33595 -138972 -197598 -164049
35662 -164049 -109214 -120285 -163973 -148456 -81839 -55065 -89217 -121039 -134850 -180331 -241074
35651 -241074 -212954 -60872 105759 166296 114910 14356 -87628 -150725 -139271 -83195 -67874
35640 -67874 -115309 -150687 -129145 -106076 -127792 -149532 -133685 -132665 -182548 -203010 -114632 14374
$$ packed form
35715C02805j46397p0134j0783o9729j78563j57738M7395K68868K95766J13338
35705C94828q2399j04226K7509J27249O9445o9855j18464k3604R2253R7875J8956
35694D29567j3447M4537Q4883P278j17237j21278L0941J78202J59624O908j20580
35683E69398j40361j06808r3137j00326q9169l6144N4310J43346J64237Q7998
35673D53344k2288p7515p1463o2245o7061n8760n0020p7587j05377n8626L3549
35662a64049N4835j1071m3688J5517O6617K6774l4152l1822j3811m5481o0743
35651b41074K8120J52082J66631O0537n1386j00554j01984o3097J1454N6076J5321
35640f7874m7435l5378K1542K3069k1716k1740J5847J020m9883k0462Q8378J29006
$$ plain form
35628 14374 60901 37048 63341 184852 338717 485285 641012 777766 816383 747092 647277
35617 647277 551142 415165 259249 221051 372792 563904 567056 359733 156364 146497 284798
35606 284798 382724 349255 270164 260707 313993 337081 298041 271065 328124 437099 497636
35595 497636 453045 344660 275168 330371 503660 672783 683763 497728 241524 83308
35585 83308 69148 104363 76541 -33388 -148841 -175201 -83850 62923 177022 239814 309422
35574 309422 424247 535816 563358 486438 357767 251922 223361 277191 348899 349715 269064
35563 269064 194454 189450 199433 140503 41881 14602 88402 164532 150157 75068 42353 103892
35551 103892 217891 312062 365156 421543 520707 619864 624543 514928 395521 373704 426951
$$ packed form
35628A4374M6527k3853K6293J21511J53865J46568J55727J36754L8617o9291r9815
35617F47277r6135j35977j55916l8198J51741J91112L152k07323k03369r867J38301
35606B84798R7926l3469p9091r457N3286K3088l9040k6976N7059J08975O0537
35595D97636m4591j08385o9492N5203J73289J69123J0980j86035k56204j58216
35585H3308j4160L5215k7822j09929j15453k6360R1351J46773J14099O2792O9608
35574C09422J14825J11569K7542p6920j28671j05845k8561N3830P1708Q16q0651
35563B69064p4610n004R983n8930r8622k7279P3800P6130j4375p5089l2715O1539
35551A03892J13999R4171N3094N6387R9164R9157M679j09615j19407k1817N3247
$$ plain form
35540 426951 453941 432998 451831 578261 774133 955146 1070358 1092691 995316 799704
35530 799704 620191 594815 754934 994521 1186314 1305034 1405302 1493873 1490914 1359132
35520 1359132 1215341 1221086 1368143 1473350 1419999 1309062 1303377 1399940 1452403 1374782 1221098
35509 1221098 1076935 965011 866909 764757 644618 511880 413536 399986 459245 526764
35499 526764 557033 550439 525287 506743 523544 564457 558435 455551 307085 201598 144618
35488 144618 79435 8512 -4182 40748 47358 -49072 -204729 -352788 -492653 -643981 -765986
35477 -765986 -778677 -644778 -405953 -158231 7091 78297 140994 273045 423653 461857
35467 461857 353218 210612 140657 117278 61560 -12969 -7375 129873 329497 461189 448159
$$ packed form
35540D26951K6990k0943J8833J26430J95872J81013J15212K2333r7375j95612
35530G99704j79513k5376J60119K39587J91793J18720J00268Q8571k959j31782
35520A359132j43791N745J47057J05207n3351j10937n685R6563N2463p7621j53684
35509A221098j44163j11924r8102j02152j20139j32738r8344j3550N9259O7519
35499E26764L0269o594k5152j8544J6801M0913o022j02884j48466j05487n6980
35488A44618o5183p0923j2694M4930O610r6430j55657j48059j39865j51328j22005
35477g65986j2691J33899K38825K47722J65322P1206O2697J32051J50608L8204
35467D61857j08639j42606o9955k3379n5718p4529N594J37248J99624J31692j3030
$$ plain form
35456 448159 334808 250429 286193 402625 478597 442583 322989 188425 95018 79116 124564
35445 124564 132552 10801 -182468 -271528 -184009 -54779 -44575 -128367 -152190 -54600 65723
35434 65723 92114 16502 -83703 -126988 -66522 94325 285674 401166 389283 314475 296381
35423 296381 376684 471174 476682 400602 337348 327665 313294 253080 207025 248361 351923 439725
35411 439725 489190 519228 513544 449453 371684 341110 330880 268308 158371 65559 -621
35400 -621 -65731 -83746 3173 103179 38525 -198618 -414517 -485596 -496448 -534078 -516894
35389 -516894 -351227 -119974 30935 99499 182015 292724 364645 383829 400693 433154 453437
35378 453437 448411 424783 391659 389513 471060 595409 626418 510698 363822 291486 230245
$$ packed form
35456D48159j13351q4379L5764J16432P5972l6014j19594j34564r3407j5902M5448
35445A24564P988j21751j93269q9060Q7519J29230J0204q3792k3823R7590J20323
35434F5723K6391p5612j00205m3285O0466J60847J91349J15492j1883p4808j8094
35423B96381Q0303R4490N508p6080o3254r683j4371o0214m6055M1336J03562Q7802
35411D39725M9465L0038n684o4091p7769l0574j0230o2572j09937r2812o6180
35400f21o5110j8015Q6919J00006o4654k37143k15899p1079j0852l7630J7184
35389e16894J65667K31253J50909O8564Q2516J10709P1921J9184J6864L2461K0283
35378D53437n026k3628l3124k146Q1547J24349L1009j15720j46876p2336o1241
$$ plain form
35367 230245 81895 -96834 -184850 -194245 -215396 -227406 -140970 1625 51551 -15971 -59102
35356 -59102 15066 130477 172740 123778 32105 -50602 -70508 5490 137251 242124 284519
35345 284519 281962 244789 176963 103547 23840 -111854 -289734 -367773 -249763 -60817 2299
35334 2299 -57004 -87193 -67383 -119016 -240782 -265217 -136229 -16014 -23353 -53746 26236
35323 26236 169851 265284 321279 395066 440925 377739 242955 154007 156566 202131 231979
35312 231979 209166 119570 9274 -34432 839 19490 -41194 -111064 -94856 -8483 61476
35301 61476 66562 1249 -123337 -237973 -226816 -66839 108635 168167 144355 161308 264119
35290 264119 403039 528087 613891 638591 613664 589784 576749 523383 432300 401631 471589
$$ packed form
35367B30245j48350j78729q8016r395k1151j2010Q6436J42595M9926o7522m3131
35356e9102P4168J15411M2263m8962r1673q2707j9906P5998J31761J04873M2395
35345B84519k557l7173o7826p3416p9707j35694j77880p8039J18010J88946O3116
35334B299n9303l0189J9810n1633j21766k4435J28988J20215p339l0393P9982
35323B6236J43615R5433N5995P3787M5859o3186j34784q8948K559M5565K9848
35312B31979k2813q9596j10296m3706L5271J8651o0684o9870J6208Q6373O9959
35301F1476N086o5313j24586j14636J1157J59977J75474N9532k3812J6953J02811
35290B64119J38920J25048Q5804K4700k4927k3880j3035n3366r1083l0669O9958
$$ plain form
35279 471589 526758 456154 322764 257536 269953 297064 359483 505683 652758 657445 531570
35268 531570 428255 417672 433769 452950 558956 780256 1002158 1108518 1106329 1052380 957794
35257 957794 835659 757449 772226 810187 741263 526289 278209 174943 309432 603485
35247 603485 874686 1009902 1053206 1099918 1154456 1154125 1091682 1029357 1005791 1002057 986447 928742
35235 928742 800441 639288 576180 696390 902768 1035741 1113039 1311030 1695627 2117937
35225 2117937 2426141 2650267 2903995 3214307 3543130 3903744 4362189 4961272 5708510
35216 5708510 6608380 7663301 8878458 10287702 11901161 13564433 14918228 15575042
35208 15575042 15349669 14325890 12761506 10964347 9200461 7641369 6370656 5421085
$$ packed form
35279D71589N5169p0604j33390o5228J2417K7111O2419J46200J47075M687j25875
35268E31570j03315j0583J6097J9181J06006K21300K21902J06360k189n3949r4586
35257I57794j22135p8210J4777L7961o8924k14974k48080j03266J34489K94053
35247F03485K71201J35216M3304M6712N4538l31o2443o2325k3566l734j5610n7705
35235I28742j28301j61153o3108J20210K06378J32973P7298J97991L84597M22310
35225B117937L08204K24126K53728L10312L28823L60614M58445N99083P47238
35216E708510Q99870J054921J215157J409244J613459J663272J353795O56814
35208A5575042k25373j023779j564384j797159j763886j559092j270713r49571
$$ plain form
35200 5421085 4772767 4340324 4038012 3864484 3852469 3934619 3961377 3887917 3847729 3983696
35190 3983696 4287052 4666308 5095976 5609144 6188472 6742090 7159818 7338963 7196924
35181 7196924 6728658 6036386 5259979 4500679 3833468 3328113 2992795 2736293 2452037
35172 2452037 2124681 1819118 1599078 1491933 1488488 1532353 1548394 1517987 1481610 1445397 1364802
35161 1364802 1264437 1273657 1455205 1679352 1774394 1742079 1715235 1755529 1812261 1836919 1805589
35150 1805589 1657042 1357116 1026264 857735 879693 925498 874078 790555 773408 787502
35140 787502 738883 626285 520225 444301 363779 263994 174221 130453 156661 258789 401380
35129 401380 513038 541013 479904 348329 192055 113938 211594 437842 598091 552169
$$ packed form
35200E421085o48318m32443l02312j73528j2015Q2150K6758p3460m0188J35967
35190C983696L03356L79256M29668N13168N79328N53618M17728J79145j42039
35181G196924m68266o92272p76407p59300o67211n05355l35318k56502k84256
35172B452037l27356l05563k20040j07145l445M3865J6041l0407l6377l6213q0595
35161A364802j00365R220J81548K24147R5042l2315k6844M0294N6732K4658l1330
35150A805589j48547k99926l30852j68529K1958M5805n1420q3523j7147J4094
35140G87502m8619j12598j06060p5924q0522r9785q9773m3768K6208J02128J42591
35129D01380J11658K7975o1109j31575j56274p8117R7656K26248J60249m5922
$$ plain form
35119 552169 364514 196038 112569 80672 92398 179041 316975 426530 476585 506303 530588
35108 530588 508462 431721 364991 353502 356507 326642 302059 351892 461974 548003 573119
35097 573119 579791 593036 565679 465326 359832 340474 380450 358847 244077 161307 211662
35086 211662 300707 262543 124716 103727 299548 534768 598146 541635 584061 767945 890171
35075 890171 805195 641544 625472 792458 987002 1094229 1155407 1260601 1419800 1561105
35065 1561105 1600825 1502217 1305906 1105309 956423 822977 654677 496150 444483 503643
35055 503643 567668 566568 541584 541912 540722 515044 518891 583970 617887 518445 351192 290312
35043 290312 394611 560610 695093 800751 867496 824260 667782 514654 432408 325872
$$ packed form
35119E52169j87655j68476q3469l1897J1726Q6643J37934J09555N0055K9718K4285
35108E30588k2126p6741o6730j1489L005k9865k4583M9833J10082Q6029K5116
35097E73119O672J3245k7357j00353j05494j9358L9976k1603j14770q2770N0355
35086B11662Q9045l8164j37827k0989J95821K35220O3378n6511M2426J83884J22226
35075H90171q4976j63651j6072J66986J94544J07227O1178J05194J59199J41305
35065A561105L9720r8608j96311k00597j48886j33446j68300j58527n1667N9160
35055E03643O4025j100k4984L28j190k5678L847O5079L3917r9442j67253o0880
35043B90312J04299J65999J34483J05658O6745m3236j56478j53128q2246j06536
$$ plain form
35033 325872 105243 -123010 -174708 -46954 83079 93760 15167 -98898 -241090 -364023
35023 -364023 -369312 -252195 -148994 -167399 -257718 -323332 -370606 -457406 -559399 -590811 -526618
35012 -526618 -420668 -326238 -268148 -263929 -299481 -309692 -256237 -198573 -210391 -253054 -224502
35001 -224502 -117895 -27270 8682 60160 175736 297291 349560 328850 253580 113126 -65440
34990 -65440 -176324 -151364 -68406 -51357 -95088 -89146 -3816 55961 11588 -62528 -32811 120510
34978 120510 284546 352180 332295 318144 375146 473142 521360 464061 342263 257829 269149
34967 269149 321956 298009 149621 -23645 -69891 31111 127959 87616 -20135 -15709 126159
34956 126159 219717 116872 -91104 -202796 -163198 -89680 -88938 -160169 -260727 -352139 -372779
$$ packed form
35033C25872k20629k28253n1698J27754J30033J0681p8593j14065j42192j22933
35023c64023n289J17117J03201j8405r0319o5614m7274q6800j01993l1412O4193
35012e26618J05950R4430N8090M219l5552j0211N3455N7664j1818m2663K8552
35001b24502J06607R0625L5952N1478J15576J21555N2269k0710p5270j40454j78566
34990f5440j10884K4960Q2958J7049m3731N942Q5330N9777m4373p4116K9717J53321
34978A20510J64036O7634j9885j4151N7002R7996M8218n7299j21798q4434J1320
34967B69149N2807k3947j48388j73266m6246J01002R6848m0343j07751M426J41868
34956A26159R3558j02845k07976j11692L9598P3518P42p1231j00558r1412k0640
$$ plain form
34945 -372779 -275566 -126781 -74304 -172027 -312342 -376605 -374041 -375399 -388002 -380943 -380023 -438812
34933 -438812 -532138 -565121 -495263 -381316 -299037 -259332 -224371 -164101 -78955 6417 58412
34922 58412 63102 51423 84879 205275 391096 555236 598902 501884 362744 309744 359880
34911 359880 410392 383143 312822 256890 196334 101793 34042 66451 133415 82324 -102347
34900 -102347 -239777 -174679 22649 149681 113919 6728 -41907 -9781 27704 6016 -62419
34889 -62419 -121442 -142232 -133716 -82164 71726 346100 630681 757361 676091 508357 400682
34878 400682 370627 331084 227549 103295 40521 72008 153927 217445 253244 332687 506730
34867 506730 687142 697906 486136 223691 125363 192810 225468 94270 -84426 -105263
$$ packed form
34945c72779R7213J48785N2477r7723j40315o4263K564j358j2603P059R20n8789
34933d38812r3326l2983O9858J13947Q2279L9705L4961O0270Q5146Q5372N1995
34922E8412M690j1679L3456J20396J85821J64140M3666r7018j39140n3000N0136
34911C59880N0512k7249p0321n5932o0556r4541o7751L2409O6964n1091j84671
34900a02347j37430O5098J97328J27032l5762j07191m8635L2126L7485k1688o8435
34889f2419n9023k0790Q516N1552J53890K74374K84581J26680q1270j67734j07675
34878D00682l0055l9543j03535j24254o2774L1487Q1919O3518L5799P9443J74043
34867E06730J80412J0764k11770k62445r8328O7447L2658j31198j78696k0837
$$ plain form
34857 -105263 51384 189118 139344 -47299 -195987 -229784 -214976 -211992 -189848 -120617 -62618
34846 -62618 -74811 -112673 -99060 -55397 -58883 -92268 -56515 56541 127696 94038 60115 147935
34834 147935 317329 427530 423645 365906 303666 219725 103973 2001 -36393 -11010 46767
34823 46767 115397 190788 269295 335619 373848 402356 482279 642785 791806 768715 526536
34812 526536 205422 -27101 -153833 -258980 -359467 -391288 -345597 -303781 -310574 -301837 -203099
34801 -203099 -36078 119050 218876 267623 271206 234946 193469 196641 256814 328574 345497
34790 345497 273434 135464 -8093 -107519 -153036 -157054 -124801 -64234 -14638 -29367 -115483
34779 -115483 -209898 -234574 -174335 -92901 -69407 -119126 -182232 -195329 -159590 -119078 -92126
$$ packed form
34857a05263J56647J37734m9774j86643j48688l3797J4808K984K2144O9231N7999
34846f2618j2193l7862J3613M3663l486l3385L5753J13056P1155l3658l3923Q7820
34834A47935J69394J10201l885n7739o2240q3941j15752j01972l8394K5383N7777
34823D6767O8630P5391P8507O6324L8229K8508P9923J60506J49021k3091k42179
34812E26536l21114k32523j26732j05147j00487l1821M5691M1816o793Q737R8738
34801b03099J67021J55128R9826M8747L583l6260m1477L172O0173P1760J6923
34790C45497p2063j37970j43557r9426m5517m018L2253O0567M9596j4729q6116
34779a15483r4415k4676O0239Q1434K3494m9719o3106j3097L5739M0512K6952
$$ plain form
34768 -92126 -71283 -86208 -197354 -395629 -566750 -605025 -520976 -388701 -235690 -54819
34758 -54819 110360 181266 143890 62912 -5643 -52682 -68101 -29028 43177 74637 18187
34747 18187 -94055 -187279 -196405 -89936 94794 230895 188171 -22743 -239035 -309694 -233916
34736 -233916 -120544 -65325 -100802 -212159 -344694 -417206 -373245 -218131 2418 231651
34726 231651 400804 450437 393289 323812 323579 377540 417345 421144 424132 443550 446229 404519
34714 404519 350304 345209 399883 441121 378585 211735 52844 19838 113048 223637 257947
34703 257947 218567 158553 96233 4408 -128804 -252120 -278592 -175976 -28062 31785 -26116
34692 -26116 -78775 1344 184050 328857 368176 363616 386632 431782 470215 512865 580059
$$ packed form
34768i2126K0843j4925j11146j98275j71121l8275Q4049J32275J53011J80871
34758e4819J65179P0906l7376q0978o8555m7039j5419L9073P2205L1460n6450
34747A8187j12242r3224r126J06469J84730J36101m2724k10914k16292p0659P5778
34736b33916J13372N5219l5477j11357j32535p2512M3961J55114K20549K29233
34726B31651J69153M9633n7148o9477k33N3961L9805L799K988J9418K679m1710
34714D04519n4215n095N4674M1238o2536j66850j58891l3006R3210J10589L4310
34703B57947l9380o0014o2320r1825j33212j23316k6472J02616J47914N9847n7901
34692b6116n2659Q0119J82706J44807L9319m560K3016M5150L8433M2650O7194
$$ plain form
34681 580059 655048 694820 653871 500174 265058 74194 50506 170813 294701 350617
34671 350617 404047 513587 619948 634799 557996 446429 337795 259927 240001 246182 199487
34660 199487 107437 99600 250995 452119 541373 485648 338851 121729 -125395 -256373
34650 -256373 -157006 63319 174855 111385 10422 -14173 17016 68358 151423 229505 214052
34639 214052 117567 75685 146173 209161 151859 44733 35583 148572 282411 345576 309375
34628 309375 185031 33305 -48592 -27616 16334 8318 -3297 78224 248808 413275 512958
34617 512958 561035 575070 560321 547379 561021 553386 452335 286231 175994 173531 185631
34606 185631 112462 5530 12454 179312 379198 459762 412073 347803 337738 344692 328984
$$ packed form
34681E80059P4989L9772m0949j53697k35116j90864k3688J20307J23888N5916
34671C50617N3430J09540J06361J4851p6803j11567j08634p7868j9926O181m6695
34660A99487r2050p837J51395K01124Q9254n5725j46797k17122k47124j30978
34650b56373R9367K20325J11536o3470j00963k4595L1189N1342Q3065P8082j5453
34639B14052r6485m1882P0488O2988n7302j07126r150J12989J33839O3165l6201
34628C09375j24344j51726q1897K0976M3950q016j1615Q1521J70584J64467R9683
34617E12958M8077J4035j4749j2942J3642p635j01051j66104j10237k463J2100
34606A85631p3169j06932O924J66858J99886Q0564m7689o4270j0065O954j5708
$$ plain form
34595 328984 339399 431458 545466 561337 462376 347095 271590 189659 87285 63629 196955
34584 196955 412379 574713 647845 664494 600628 410340 162847 13483 24500 119242
34574 119242 222859 332076 418806 396338 260249 163070 240921 417211 483727 363353
34564 363353 203842 196672 363966 551528 600497 497672 358145 276185 224092 122965
34554 122965 -19296 -109607 -109851 -93744 -130677 -188780 -206609 -190525 -168771 -111005 15200
34543 15200 153880 228923 269490 352466 439481 408816 266310 182067 257438 377159 378279
34532 378279 267599 168897 128644 92962 42316 35262 111314 222053 268211 174425 -43920
34521 -43920 -253293 -295723 -167362 -45901 -70472 -162206 -159324 -63298 -20793 -102000 -237788
$$ packed form
34595C28984J0415R2059J14008J5871r8961j15281p5505q1931j02374k3656J33326
34584A96955K15424J62334P3132J6649o3866j90288k47493j49364J1017R4742
34574A19242J03617J09217Q6730k2468j36089r7179P7851J76290O6516j20374
34564C63353j59511p170J67294J87562M8969j02825j39527q1960n2093j01127
34554A22965j42261r0311k44J6107l6933n8103j7829J6084K1754N7766J26205
34543A5200J38680P5043M0567Q2976Q7015l0665j42506q4243P5371J19721J120
34532C78279j10680r8702m0253l5682n0646p054P6052J10739M6158r3786k18345
34521d3920k09373m2430J28361J21461k4571r1734K882R6026M2505q1207j35788
$$ plain form
34510 -237788 -354559 -422356 -379194 -177510 70424 163980 84828 40360 173829 388857
34500 388857 540131 628495 691998 669603 534402 429582 486197 599386 574164 420949
34490 420949 306337 260255 154264 -29234 -126831 -48703 77298 93373 -2005 -135693
34480 -135693 -295036 -476988 -596361 -556859 -372656 -145511 45326 177256 246709 254869
34470 254869 218426 163017 111599 81668 74378 71164 58996 36209 -24081 -157674 -309536
34459 -309536 -328607 -151649 78862 196906 244213 367396 538667 575652 432489 261970
34449 261970 152261 12721 -199250 -336043 -265608 -64655 112228 217127 251499 179644
34439 179644 42288 12146 163102 300874 212396 -6903 -76571 77392 260392 313321
$$ packed form
34510b37788j16771o7797M3162K01684K47934R3556p9152m4468J33469K15028
34500C88857J51274Q8364O3503k2395j35201j04820N6615J13189k5222j53215
34490D20949j14612m6082j05991j83498r7597P8128J26001J6075r5378j33688
34480a35693j59343j81952j19373L9502J84203K27145J90837J31930O9453Q160
34470B54869l6443n5409n1418k9931p290l214j2168k2787o0290j33593j51862
34459c09536j9071J76958K30511J18044M7307J23183J71271L6985j43163j70519
34449B61970j09709j39540k11971j36793P0435K00953J76883J04899L4372p1855
34439A79644j37356l0142J50956J37772q8478k19299o9668J53963J83000N2929
$$ plain form
34429 313321 277134 244676 234675 252559 316627 366554 277482 31501 -223090 -339415 -318954
34418 -318954 -249112 -173897 -78736 51936 207569 352159 436344 439757 400070 367384 348017
34407 348017 332515 341621 382353 396051 328805 224497 164864 145293 101377 32512 -4240
34396 -4240 -7305 -29286 -68651 -71147 -39585 -33035 -51411 -31842 30864 76352 107144 201699
34384 201699 367747 503189 545664 543214 525316 427890 226413 38216 -7691 64498 127965
34373 127965 116086 61252 16710 9244 42917 103589 180718 294371 449633 564794 534685
34362 534685 388252 280586 283249 288032 183244 19300 -89110 -128487 -144828 -118646 -14235
34351 -14235 96349 102312 40910 85201 312424 577003 662196 509984 267954 135969 184707
$$ packed form
34429C13321l6187l2458j0001J7884O4068M9927q9072k45981k54591j16325K0461
34418c18954O9842P5215R5161J30672J55633J44590Q4185L413l9687l2686j9367
34407C48017j5502R106M0732J3698o7246j04308n9633j9571m3916o8865l6752
34396d240l065k1981l9365k496L1562O550j8376J9569O2706M5488L0792R4555
34384B01699J66048J35442M2475k450j7898r7426k01477j88197m5907P2189O3467
34373A27965j1879n4834m4542p466L3673O0672P7129J13653J55262J15161l0109
34362E34685j46433j07666K663M783j04788j63944j08410l9377j6341K6182J04411
34351a4235J10584N963o1402M4291K27223K64579Q5193j52212k42030j31985M8738
$$ plain form
34340 184707 309989 355026 270833 139962 57029 40226 68414 132475 205822 221748 138595
34329 138595 -6143 -150818 -281256 -402449 -476948 -446939 -302983 -98237 89316 196354
34319 196354 208265 160153 68455 -111557 -377854 -563469 -479201 -202141 -50925 -189596
34309 -189596 -418177 -476471 -392064 -351061 -363325 -291297 -138623 -58368 -79545 -59072 55621
34298 55621 124715 43766 -106670 -218184 -295371 -342992 -267989 -30018 215920 268487 118463
34287 118463 -68928 -165947 -182290 -188346 -226429 -283006 -287496 -159073 93251 339041 439486
$$ packed form
34340A84707J25282M5037q4193j30871q2933j6803K8188O4061P3347J5926q3153
34329A38595j44738j44675j30438j21193p4499L0009J43956K04746J87553J07038
34319A96354J1911m8112r1698j80012k66297j85615Q4268K77060J51216j38671
34309a89596k28581n8294Q4407M1003j2264P2028J52674Q0255k1177K0473J14693
34298E5621O9094q0949j50436j11514p7187m7621P5003K37971K45938N2567j50024
34287A18463j87391r7019j6343o056l8083n6577m490J28423K52324K45790J00445
$$ [...]
##END NTUPLES=NMR SPECTRUM
##END=
