##TITLE=31Pdec_43-2021
 CDCl3, 24 sc
 11.06.2021
##JCAMPDX= 6.0         $$ Bruker NMR JCAMP-DX V2.0
##DATA TYPE= NMR SPECTRUM
##DATA CLASS= NTUPLES
##ORIGIN= UXNMR, Bruker Analytische Messtechnik GmbH
##OWNER= root
$$ XWIN-NMR		Version 3.5
$$ Fri Jun 11 11:24:36 2021 Russian Standard Time (UT+4h)  she@DPX200
##.OBSERVE FREQUENCY= 81.013821
##.OBSERVE NUCLEUS= ^31P
##.ACQUISITION MODE= SIMULTANEOUS
##.ACQUISITION SCHEME= undefined
##.AVERAGES= 24
##.DIGITISER RES= 16
##SPECTROMETER/DATA SYSTEM= spect
##.PULSE SEQUENCE= zgpg30
##.SOLVENT NAME= CDCl3
##.SHIFT REFERENCE= (INTERNAL, CDCl3, 0, 248.564)
##AUDIT TRAIL= $$ (NUMBER, WHEN, WHO, WHERE, WHAT)
$$ ##TITLE= Audit trail, XWIN-NMR		Version 3.5
$$ ##JCAMPDX= 5.01
$$ ##ORIGIN= Bruker BioSpin GmbH
$$ ##OWNER= she
$$ F:/spectra/data/she/nmr/P31/1/pdata/1/auditp.txt
$$ ##AUDIT TRAIL=  $$ (NUMBER, WHEN, WHO, WHERE, WHAT)
(   1,<2021-06-11 11:22:30.51 +0400>,<she>,<DPX200>,
      <created by zg, POWCHK disabled, PULCHK disabled
       configuration hash MD5:
       00 E9 B6 7A A2 85 ED C7 34 08 36 98 17 FE 4E 26
       data hash MD5: 32K
       4F 08 6D A4 A9 D0 00 9E B3 B1 15 CE 65 B0 D6 6E>)
(   2,<2021-06-11 11:22:33.51 +0400>,<she>,<DPX200>,
      <Start of raw data processing
       efp BC_mod = 2 LB = 1 FT_mod = 6 PKNL = 1 PHC0 = -5865.931 PHC1 = -261.9251 SI = 64K 
       data hash MD5: 64K
       3E 7B 6F 78 A0 5C CA 99 1E ED E0 D2 56 A5 22 A1>)
(   3,<2021-06-11 11:23:11.71 +0400>,<she>,<DPX200>,
      <pk PHC0 = 102.9689 PHC1 = -61.99999 
       data hash MD5: 64K
       DA 6B 74 D2 4F 57 31 4F AF 13 3E 45 25 F3 27 44>)
(   4,<2021-06-11 11:23:15.21 +0400>,<she>,<DPX200>,
      <abs ABSG = 5 
       data hash MD5: 64K
       0D 1F B7 53 FE 65 26 97 51 94 95 11 26 C5 58 7D>)
(   5,<2021-06-11 11:24:01.32 +0400>,<she>,<DPX200>,
      <pk PHC0 = -1455.648 PHC1 = 2939.809 
       data hash MD5: 64K
       FB FC 18 36 E3 D6 80 CA FD 3B 9F A4 13 40 E4 28>)
$$ ##END=
$$ 
$$ hash MD5
$$ 81 6A 49 A0 7B 0F 7F 20 5A 8D 29 23 11 4F 1C BC
##$RELAX= 
##$RELAX= 
##$RELAX= 
##$RELAX= 
##$RELAX= 
##$RELAX= 
##$RELAX= 
##$RELAX= 
$$ Bruker specific parameters
$$ --------------------------
##$DU= <F:/spectra>
##$EXPNO= 1
##$NAME= <P31>
##$PROCNO= 1
##$TYPE= <nmr>
##$USER= <she>
##$AMP= (0..31)
100 100 100 100 100 100 100 100 100 100 100 100 100 100 100 100 100 100 
100 100 100 100 100 100 100 100 100 100 100 100 100 100 
##$AQSEQ= 0
##$AQ_mod= 1
##$AUNM= <au_zg>
##$AUTOPOS= <>
##$BF1= 81.014009
##$BF2= 200.13
##$BF3= 200.13
##$BF4= 200.13
##$BF5= 200.13
##$BF6= 200.13
##$BF7= 200.13
##$BF8= 200.13
##$BYTORDA= 1
##$CFDGTYP= 0
##$CFRGTYP= 5
##$CHEMSTR= <none>
##$CNST= (0..31)
1 1 145 1 1 1 1 1 1 1 1 1 1 1 1 1 1 1 1 1 1 1 1 1 1 1 1 1 1 1 1 1 
##$CPDPRG= <waltz16>
##$CPDPRG1= <>
##$CPDPRG2= <waltz16>
##$CPDPRG3= <>
##$CPDPRG4= <mlev>
##$CPDPRG5= <mlev>
##$CPDPRG6= <mlev>
##$CPDPRG7= <mlev>
##$CPDPRG8= <mlev>
##$CPDPRGB= <>
##$CPDPRGT= <>
##$D= (0..31)
$$ [...]
##$SUBNAM2= <"">
##$SUBNAM3= <"">
##$SUBNAM4= <"">
##$SUBNAM5= <"">
##$SUBNAM6= <"">
##$SUBNAM7= <"">
##$SUBNAM8= <"">
##$SUBNAM9= <"">
##$SW= 501.771253377433
##$SWIBOX= (0..15)
0 1 3 0 0 0 0 0 0 0 0 0 0 0 0 0 
##$SW_h= 40650.406504065
##$TD= 32768
##$TD0= 1
##$TE= 0
##$TE2= 300
##$TE3= 300
##$TEG= 300
##$TL= (0..7)
0 120 53 12 22 120 120 120 
##$TP= (0..7)
150 150 150 150 150 150 150 150 
##$TP07= 0
##$TPNAME0= <>
##$TPNAME1= <>
##$TPNAME2= <>
##$TPNAME3= <>
##$TPNAME4= <>
##$TPNAME5= <>
##$TPNAME6= <>
##$TPNAME7= <>
##$TPOAL= (0..7)
0.5 0.5 0.5 0.5 0.5 0.5 0.5 0.5 
##$TPOFFS= (0..7)
0 0 0 0 0 0 0 0 
##$TUNHIN= 0
##$TUNHOUT= 0
##$TUNXOUT= 0
##$USERA1= <user>
##$USERA2= <user>
##$USERA3= <user>
##$USERA4= <user>
##$USERA5= <user>
##$V9= 5
##$VALIST= <valist>
##$VCLIST= <CCCCCCCCCCCCCCC>
##$VD= 0
##$VDLIST= <DDDDDDDDDDDDDDD>
##$VPLIST= <PPPPPPPPPPPPPPP>
##$VTLIST= <TTTTTTTTTTTTTTT>
##$WBST= 1024
##$WBSW= 4
##$XGAIN= (0..3)
0 0 0 0 
##$XL= 0
##$YL= 0
##$YMAX_a= 189
##$YMIN_a= -192
##$ZGOPTNS= <>
##$ZL1= 120
##$ZL2= 120
##$ZL3= 120
##$ZL4= 120
##$ABSF1= 248.5645
##$ABSF2= -253.2056
##$ABSG= 5
##$ABSL= 3
##$ALPHA= 0
##$AQORDER= 0
##$ASSFAC= 0
##$ASSFACI= 0
##$ASSFACX= 0
##$ASSWID= 0
##$AUNMP= <proc_1d>
##$AZFE= 0.1
##$AZFW= 0.5
##$BCFW= 0
##$BC_mod= 2
##$BYTORDP= 0
##$COROFFS= 0
##$CY= -3
##$DATMOD= 1
##$DC= 0
##$DFILT= <>
##$DTYPP= 0
##$F1P= 0
##$F2P= 0
##$FCOR= 1
##$FTSIZE= 65536
##$FT_mod= 6
##$GAMMA= 0
##$GB= 0
##$INTBC= 1
##$INTSCL= 5.30512e-09
##$ISEN= 30
##$LB= 1
##$LEV0= 0
##$LPBIN= 0
##$MAXI= 10000
##$MC2= 0
##$MEAN= 0
##$ME_mod= 0
##$MI= 50
##$NCOEF= 0
##$NC_proc= -9
##$NLEV= 6
##$NOISF1= 182.463
##$NOISF2= 159.3651
##$NSP= 0
##$NTH_PI= 0
##$NZP= 0
##$OFFSET= 248.5645
##$PC= 4
##$PHC0= -7218.61
##$PHC1= 2615.884
##$PH_mod= 1
##$PKNL= yes
##$PPARMOD= 0
##$PSCAL= 0
##$PSIGN= 0
##$REVERSE= no
##$SF= 81.014009
##$SI= 65536
##$SIGF1= 159.3651
##$SIGF2= -187.1042
##$SINO= 113.3802
##$SIOLD= 16384
##$SREGLST= <1H.CDCl3>
##$SSB= 0
##$STSI= 65536
##$STSR= 0
##$SW_p= 40650.406504065
##$SYMM= 0
##$S_DEV= 0
##$TDeff= 32768
##$TDoff= 0
##$TI= <>
##$TILT= no
##$TM1= 0
##$TM2= 0
##$TOPLEV= 0
##$USERP1= <user>
##$USERP2= <user>
##$USERP3= <user>
##$USERP4= <user>
##$USERP5= <user>
##$WDW= 1
##$XDIM= 65536
##$YMAX_p= 421597121
##$YMIN_p= -7055111
$$ End of Bruker specific parameters
$$ ---------------------------------
##NTUPLES= NMR SPECTRUM
##VAR_NAME=  FREQUENCY,     SPECTRUM/REAL,   SPECTRUM/IMAG
##SYMBOL=    X,             R,               I
##VAR_TYPE=  INDEPENDENT,   DEPENDENT,       DEPENDENT
##VAR_FORM=  AFFN,          ASDF,            ASDF
##VAR_DIM=   65536,         65536,           65536
##UNITS=     HZ,            ARBITRARY UNITS, ARBITRARY UNITS
##FACTOR=    0.620285442955139, 1,           1
##FIRST=     20137.2065510759, 0,            0
##LAST=      -20513.1999529892, 0,           0
##MIN=       -20513.1999529892, -7055111,    0
##MAX=       20137.2065510759, 421597121,    0
$$ Real data points
##PAGE= N=1
##DATA TABLE= (X++(R..R)), XYDATA
$$ [...]
$$ plain form
36206 -230462 -20467 171488 297799 330358 193485 -76789 -261015 -228981 -124650 -104993
36196 -104993 -96916 -20923 -26493 -233492 -441283 -396629 -186417 -70220 -89527 -151313 -319956
36185 -319956 -658731 -918872 -791711 -407080 -196332 -288410 -410853 -376857 -283767 -189627
36175 -189627 18515 313896 418801 174535 -215543 -462396 -511302 -448876 -280226 20179
36165 20179 345455 521982 520737 488627 540318 573453 361475 -132939 -600351 -659925 -287615
36154 -287615 162295 366655 299751 84241 -186344 -396428 -424643 -344528 -387870 -574242
36144 -574242 -618621 -359341 -7297 213316 363890 493695 392287 -10550 -314492 -162093
36134 -162093 158724 114918 -241301 -365115 -49148 364691 575107 606059 485207 166687
$$ packed form
36206b30462K09995J91955J26311L2559j36873k70274j84226L2034J04331J9657
36196a04993Q077P5993n570k06999k07791M4654K10212J16197j9307o1786j68643
36185c19956l38775k60141J27161L84631K10748r2078j22443L3996R3090R4140
36175a89627K08142K95381J04905k44266l90078k46853m8906O2426J68650L00405
36165B0179L25276J76527j245l2110N1691L3135k11978m94414m67412n9574L72310
36154b87615M49910K04360o6904k15510k70585k10084k8215Q0115m3342j86372
36144e74242m4379K59280L52044K20613J50574J29805j01408m02837l03942J52399
36134a62093L20817m3806l56219j23814L15967M13839K10416L0952j20852l18520
$$ plain form
36124 166687 -134475 -42415 382725 609417 389811 113070 167406 365004 317109 45062
36114 45062 -140560 -137837 -82881 -27156 98315 255482 277389 72163 -267924 -523366 -482798
36103 -482798 -153533 133180 24645 -387301 -636604 -500894 -265486 -231038 -281642 -191498
36093 -191498 -64647 -117041 -227304 -107635 178273 272032 83208 -87807 -51571 3346
36083 3346 -112099 -248349 -173014 49219 177968 169065 177017 240917 209868 10956 -202455
36072 -202455 -250635 -147310 -40834 -37042 -156576 -365181 -541379 -502425 -201023 153625
36062 153625 313619 297064 316164 420128 412144 171184 -139074 -288389 -250235 -131148
36052 -131148 32499 256973 486780 635645 689513 655255 492153 224364 32110 65978
$$ packed form
36124A66687l01162R2060M25140K26692k19606k76741N4336J97598m7895k72047
36114D5062j85622K723N4956N5725J25471J57167K1907k05226l40087k55442M0568
36103d82798L29265K86713j08535m11946k49303J35710K35408L4448n0604R0144
36093a91498J26851n2394j10263J19669K85908R3759j88824j71015L6236N4917
36083C346j15445j36250P5335K22233J28749q903P952O3900l1049j98912k13411
36072b02455m8180J03325J06476L792j19534k08605j76198L8954L01402L54648
36062A53625J59994j6555J9100J03964p984k40960l10258j49315L8154J19087
36052a31148J63647K24474K29807J48865N3868l4258j63102k67789j92254L3868
$$ plain form
36042 65978 222455 268927 167562 115776 256525 484934 583403 468487 268217 178146
36032 178146 239139 282194 169987 55039 213998 594495 773177 508214 109610 44809
36022 44809 355961 718149 920120 983199 899888 600056 193903 -38591 27660 236285
36012 236285 369955 331885 133348 -104686 -165507 39080 287553 308399 174993 183488
36002 183488 370767 457320 288454 26831 -147152 -228964 -219018 -71020 92658 34926
35992 34926 -194769 -240955 3132 165184 -30322 -284923 -179090 147406 199238 -106813
35982 -106813 -316832 -104491 311582 528942 467615 367305 448021 697806 899470 807798
35972 807798 400165 -23525 -123650 62408 147632 -87698 -383204 -349118 9718 328151
$$ packed form
36042F5978J56477M6472j01365n1786J40749K28409R8469j14916k00270r0071
36032A78146O0993M3055j12207j14948J58959L80497J78682k64963l98604o4801
36022D4809L11152L62188K01971O3079q3311k99832m06153k32494O6251K08625
36012B36285J33670l8070j98537k38034o0821K04587K48473K0846j33406Q495
36002A83488J87279Q6553j68866k61623j73983q1812R946J47998J63678n7732
35992C4926k29695m6186K44087J62052j95506k54601J05833L26496N1832l06051
35982a06813k10019K12341M16073K17360o1327j00310Q0716K49785K01664r1672
35972H07798m07633m23690j00125J86058Q5224k35330k95506L4086L58836L18433
$$ plain form
35962 328151 373473 270955 221541 227686 206533 186679 221315 224801 84326 -130600 -250503
35951 -250503 -251103 -230114 -184117 -40221 95179 -7299 -321915 -508141 -357532 -62951
35941 -62951 114275 204680 342623 439192 336177 151301 159707 379936 550844 514495 390832
35930 390832 361716 473872 660335 791132 721190 455063 233228 276836 477811 531149
35920 531149 352718 168211 185139 358419 500077 478823 312031 172951 256590 521732
35910 521732 667370 512210 251680 138135 91226 -75665 -215340 -42996 311933 409659
35900 409659 172668 -4565 91533 193682 85788 -10564 128451 275808 114386 -185500
35890 -185500 -152349 305865 748116 754626 404322 122660 165661 337675 240123 -215638
$$ packed form
35962C28151M5322j02518m9414O145k1153j9854L4636L486j40475k14926j19903
35951b50503o00K0989M5997J43896J35400j02478l14616j86226J50609K94581
35941f2951J77226R0405J37943R6569j03015j84876Q406K20229J70908l6349j23663
35930C90832k9116J12156J86463J30797o9942k66127k21835M3608K00975N3338
35920E31149j78431j84507J6928J73280J41658k1254j66792j39080Q3639K65142
35910E21732J45638j55160k60530j13545m6909j66891j39675J72344L54929R7726
35900D09659k36991j77233R6098J02149j07894r6352J39015J47357j61422k99886
35890a85500L3151M58214M42251O510l50304k81662M3001J72014r7552m55761
$$ plain form
35880 -215638 -651485 -670739 -332493 9913 210311 368823 451907 275770 -82454 -254928
35870 -254928 -102698 84297 64388 -25680 -10458 4090 -99164 -179674 -128353 -125344 -279230
35859 -279230 -288362 136111 712291 889850 605746 320156 335426 475882 473949 310290
35849 310290 71707 -227618 -528472 -631993 -391820 70036 426856 418659 85568 -231428
35839 -231428 -195127 159666 459627 457688 304597 245384 255917 196494 141439 255390 444493
35828 444493 449753 255281 101392 86512 54295 -71908 -125827 23819 261831 418175
35818 418175 491621 557783 593890 516223 307379 37183 -166885 -158537 87679 350974 336276
35807 336276 35208 -225445 -169909 119203 353188 369303 222486 61159 13299 112686
$$ packed form
35880b15638m35847j9254L38246L42406K00398J58512Q3084j76137l58224j72474
35870b54928J52230J86995j9909r0068J5222J4548j03254q0510N1321L009j53886
35859b79230r132M24473N76180J77559k84104k85590J5270J40456j933j63659
35849C10290k38583k99325l00854j03521K40173M61856L56820q197l33091l16996
35839b31428L6301L54793K99961j939j53091n9213J0533n9423n5055J13951J89103
35828D44493N260j94472j53889j4880l2217j26203n3919J49646K38012J56344
35818D18175P3446O6162L6107p7667k08844k70196k04068Q348K46216K63295j4698
35807C36276l01068k60653N5536K89112K33985J6115j46817j61327m7860R9387
$$ plain form
35797 112686 257223 311845 290017 313393 354454 210786 -150837 -430007 -373340 -150024
35787 -150024 -81908 -127915 13381 321982 389707 58766 -254270 -135658 212822 291131
35777 291131 60184 -21377 299637 706896 761939 441110 75973 -56859 59135 264480
35767 264480 390593 400455 406142 488448 541680 432234 247037 171081 171451 92843 44595 309881
35755 309881 797812 1013628 758207 437528 412369 462640 264520 68 7394 144936
35745 144936 70621 -70731 137744 595890 757581 495752 270590 337553 393130 207049
35735 207049 52425 212716 510313 648727 662804 708310 704329 512909 256407 159602
35725 159602 222362 272063 213589 68083 -101201 -191853 -144090 -77792 -152742 -272760 -194079
$$ packed form
35797A12686J44537N4622k1828K3376M1061j43668l61623k79170N6667K23316
35787a50024O8116m6007J41296L08601O7725l30941l13036J18612L48480P8309
35777B91131k30947q1561L21014M07259N5043l20829l65137j32832J15994K05345
35767B64480J26113R862N687Q2306N3232j09446j85197p5956L70p8608m8248K65286
35755C09881M87931K15816k55421l20679k5159N0271j98120k64452P326J37542
35745A44936p4315j41352K08475M58146J61691k61829k25162O6963N5577j86081
35735B07049j54624J60291K97597J38414J4077M5506l981j91420k56502r6805
35725A59602O2760M9701n8474j45506j69284r0652M7763O6298p4950j20018P8681
$$ plain form
35714 -194079 56487 210092 238533 391418 650249 623399 202174 -142672 -28545 282749
35704 282749 346578 189207 116393 185118 270210 392287 579075 634549 438553 254297
35694 254297 347791 531551 505571 415889 579006 829433 702823 216101 -76666 137356
35684 137356 559183 788001 801969 784832 793676 776412 721630 660315 623690 627434 611440
35673 611440 458314 183630 -15863 -50254 -97203 -274997 -369446 -172607 109731 147909
35663 147909 22526 60994 258675 322365 250458 382085 795046 1097026 971056 577625
35653 577625 252102 100189 58711 97950 178401 191748 101867 16923 26714 91150 147007
35642 147007 193710 227880 216227 165741 120054 90251 78547 114047 161612 102851 -50923
$$ packed form
35714a94079K50566J53605K8441J52885K58831k6850m21225l44846J14127L11294
35704B82749O3829j57371p2814O8725Q5092J22077J86788N5474j95996j84256
35694B54297R3494J83760k5980q9682J63117K50427j26610m86722k92767K14022
35684A37356M21827K28818J3968j7137Q844j7264n4782o1315l6625L744j5994
35673F11440j53126k74684j99493l4391m6949j77794r4449J96839K82338L8178
35663A47909j25383L8468J97681O3690p1907J31627M12961L01980j25970l93431
35653E77625l25523j51913m1478L9239Q0451J3347q9881q4944R791O4436N5857
35642A47007M6703L4170j1653n0486m5687k9803j1704L5500M7565n8761j53774
$$ plain form
35631 -50923 -71746 163069 420147 430447 298356 280420 310903 146517 -102319 -40156 385565
35620 385565 748240 730268 484515 303357 269325 358505 569198 799445 871821 806068
35610 806068 804226 873090 770400 444760 191680 198599 268090 215128 205210 388607 484043
35599 484043 132403 -481614 -769406 -482736 20684 295429 290323 203213 111494 -39858
35589 -39858 -204105 -220541 -55260 111725 116796 14690 -51495 -77578 -138812 -180127 -84542
35578 -84542 68086 66947 -64392 -50493 181787 325904 154852 -113209 -142312 65386
35568 65386 293363 460067 561103 486263 222849 52474 202911 476976 576974 604928
35558 604928 829013 1123939 1121347 819903 561129 445876 259915 -24210 -149665 -19928
$$ packed form
35631e0923k0823K34815K57078J0300j32091j7936L0483j64386k48836O2163M25721
35620C85565L62675j7972k45753j81158l4032Q9180K10693K30247P2376o5753
35610H06068j842O8864j02690l25640k53080O919O9491n2962r918J83397R5436
35599D84043l51640o14017k87792K86670N03420K74745n106q7110r1719j51352
35589c9858j64247j6436J65281J66985N071j02106o6185k6083o1234m1315R5585
35578h4542J52628j139j31339J3899K32280J44117j71052k68061k9103K07698
35568F5386K27977J66704J01036p4840k63414j70375J50437K74065R9998K7954
35558F04928K24085K94926k592l01444k58774j15253j85961k84125j25455J29737
$$ plain form
35548 -19928 191840 404098 669371 850836 724596 436283 377543 564946 637230 511071
35538 511071 483902 596566 496288 105845 -166452 -109476 -15464 -48689 77016 457153
35528 457153 648760 386209 68227 57114 68864 -170057 -226555 343805 1045627 1033109
35518 1033109 400812 29757 244059 480885 366678 283161 578416 911851 818775 442957
35508 442957 243638 283203 255689 63477 -44433 103301 340720 396427 202821 -97037
35498 -97037 -325371 -364350 -163658 204043 493065 442792 85239 -210375 -134749 201589
35488 201589 459886 527796 557380 617951 605218 504751 447519 452041 404316 353489 501224
35477 501224 801147 920115 740510 537326 476061 337387 5694 -184884 18498 264457
$$ packed form
35548a9928K11768K12258K65273J81465j26240k88313n8740J87403P2284j26159
35538E11071k7169J12664j00278l90443k72297N6976R4012l3225J25705L80137
35528D57153J91607k62551l17982j1113J1750k38921n6498N70360P01822j2518
35518A033109o32297l71055K14302K36826j14207q3517K95255L33435r3076l75818
35508D42957j99319L9565k7514j92212j07910J47734K37419N5707j93606k99858
35498i7037k28334l8979K00692L67701K89022n0273l57553k95614P5626L36338
35488B01589K58297O7910K9584O0571j2733j00467n7232M522m7725n0827J47735
35477E01224K99923J18968j79605k03184o1265j38674l31693j90578K03382K45959
$$ plain form
35467 264457 92618 -290141 -267033 259043 719766 692669 402717 293384 449033 615854
35457 615854 576754 355228 157109 176556 389766 555471 494499 292708 119670 -37693
35447 -37693 -286492 -559805 -645635 -475950 -235609 -162879 -303309 -441865 -285904 179636
35437 179636 550840 426183 -33619 -259262 -36876 247449 262227 209254 379631 624285
35427 624285 641035 478893 355815 241278 41544 -42141 200571 541301 617620 512603
35417 512603 548960 674145 589471 365956 339126 442380 266419 -182855 -407245 -210289
35407 -210289 32501 70627 146958 405772 504334 194846 -173576 -165072 90814 186922 85721
35396 85721 37022 70305 24243 -46818 62792 277562 272622 -17999 -258605 -180028 67001
$$ packed form
35467B64457j71839l82759K3108N26076M60723k7097k89952j09333J55649J66821
35457F15854l9100k21526j98119J9447K13210J65705o0972k01791j73038j57363
35447c7693k48799k73313q5830J69685K40341P2730j40430j38556J55961M65540
35437A79636L71204j24657m59802k25643K22386K84325J4778n2973J70377K44654
35427F24285J6750j62142j23078j14537j99734q3685K42712L40730P6319j05017
35417E12603L6357J25185q4674k23515k6830J03254j75961m49274k24390J96956
35407b10289K42790L8126P6331K58814R8562l09488l68422Q504K55886R6108j01201
35396H5721m8699L3283m6062p1061J09610K14770m940k90621k40606P8577K47029
$$ plain form
35385 67001 169659 87282 52418 210888 436338 544907 563180 640540 746712 678858 436655
35374 436655 332680 524288 673876 415463 -5065 -8850 433936 711590 477106 143675
35364 143675 208673 519250 600952 402246 258213 289639 292230 171894 88488 138443 226300
35353 226300 309536 479777 711463 785792 598274 355623 326814 522041 735961 813627
35343 813627 761385 655876 550237 463758 408102 412270 513902 696703 853113 868050 741916
35332 741916 576763 445292 341745 263256 250038 309891 382984 438562 538693 723719
35322 723719 877974 818599 530781 222831 101992 165271 276383 386052 560700 799027
35312 799027 954930 923002 818838 856384 1060455 1216018 1143540 933135 817657 860873
$$ packed form
35385F7001J02658q2377l4864J58470K25450J08569J8273P7360J06172o7854k42203
35374D36655j03975J91608J49588k58413m20528l785M42786K77654k34484l33431
35364A43675O4998L10577Q1702j98706j44033L1426K591j20336q3406M9955Q7857
35353B26300Q3236J70241K31686P4329j87518k42651k8809J95227K13920P7666
35343H13627n2242j05509j05639q6479n5656M168J01632J82801J56410J4937j26134
35332G41916j65153j31471j03547p8489j3218N9853P3093N5578J00131J85026
35322G23719J54255n9375k87818l07950j20839O3279J11112J09669J74648K38327
35312G99027J55903l1928j04164L7546K04071J55563p2478k10405j15478M3216
$$ plain form
35302 860873 895154 792010 664618 686752 788354 713797 403008 127558 139870 337744
35292 337744 440866 390759 364348 439356 480756 385198 228551 107572 17246 -40189 -285
35281 -285 115450 160391 80542 19882 91315 188725 155577 1727 -176464 -336170 -396323
35270 -396323 -187471 278058 626786 497678 34398 -271118 -209591 -51779 -85761 -242180
35260 -242180 -298286 -222279 -133280 -60140 68175 243533 345762 300850 185152 148532 264907
35249 264907 459348 571358 509216 351275 262785 295310 313308 174374 -37798 -55831
35239 -55831 232144 559208 546870 211124 14528 282550 726295 776577 317153 -189921
35229 -189921 -318042 -124606 107156 292722 513353 751007 888661 885792 778972 588589
$$ packed form
35302H60873L4281j03144j27392K2134J01602p4557l10789k75450J2312J97874
35292C37744J03122n0107k6411P5008M1400r5558j56647j20979r0326n7435L9904
35281b85J15735M4941p9849o0660P1433R7410l3148j53850j78191j59706o0153
35270c96323K08852M65529L48728j29108m63280l05516O1527J57812l3982j56419
35260b42180n6106P6007Q8999P3140J28315J75358J02229m4912j15698l6620J16375
35249B64907J94441J12010o2142j57941q8490L2525J7998j38934k12172j8033
35239e5831K87975L27064j2338l35746j96596K68022M43745N0282m59424n07074
35229a89921j28121J93436K31762J85566K20631K37654J37654k869j06820j90383
$$ plain form
35219 588589 379922 324155 511348 749692 732596 407076 34892 -129257 -107102 -107253 -238526
35208 -238526 -376466 -332931 -127879 8188 -37712 -63312 151886 462867 532788 343245
35198 343245 214329 288328 342517 228673 149110 293070 495352 499229 322568 134452
35188 134452 -6826 -71401 45344 301125 425706 322298 291322 554294 829424 757753
35178 757753 506052 495379 705338 741252 507327 318424 346459 421407 436428 517450 683001
35167 683001 720731 551087 398768 447566 574468 559990 361946 91881 -93425 -30586
35157 -30586 311526 685287 764595 539584 320145 320679 446178 521841 527208 543108 619536
35146 619536 726164 730392 486754 78614 -163002 -76254 71387 13833 -26272 313628
$$ packed form
35219E88589k08667n5767J87193K38344j7096l25520l72184j64149K2155j51j31273
35208b38526j37940M3535K05052J36067m5900k5600K15198L10981O9921j89543
35198C43245j28916P3999N4189j13844p9563J43960K02282L877j76661j88116
35188A34452j41278o4575J16745K55781J24581j03408l0976K62972K75130p1671
35178G57753k51701j0673K09959L5914k33925j88903K8035P4948J5021Q1022J65551
35167F83001L7730j69644j52319M8798J26902j4478j98044k70065j85306O2839
35157c0586L42112L73761P9308k25011k19439N34J25499P5663N367J5900P6428
35146F19536J06628M228k43638m08140k41616Q6748J47641n7554m0105L39900
$$ plain form
35136 313628 840566 964497 546433 92644 24506 220780 407602 536770 582973 402790
35126 402790 60959 -70088 173614 438781 354579 69519 -24047 123150 245426 231408
35116 231408 231636 352701 522555 661738 775455 841345 753956 445370 15927 -283610
35106 -283610 -228002 171574 641806 886067 824638 565075 246931 21397 44760 304689
35096 304689 554523 610460 594187 669052 707038 525805 300510 339346 535077 485146 149098
35085 149098 -68163 52693 268961 331396 298856 266370 177936 67846 115544 297361
35075 297361 345747 219360 241709 579358 940926 1007944 834041 615687 404184 251594
35065 251594 296374 478949 508729 329634 254749 409509 456422 181270 -61616 113186
$$ packed form
35136C13628N26938J23931m18064m53789o8138J96274J86822J29168M6203j80183
35126D02790l41831j31047K43702K65167q4202k85060r3566J47197J22276j4018
35116B31408K28J21065J69854J39183J13717O5890q7389l08586m29443k99537
35106b83610N5608L99576M70232K44261o1429k59563l18144k25534K3363K59929
35096C04689K49834N5937j6273P4865L7986j81233k25295L8836J95731m9931l36048
35085A49098k17261J20856K16268O2435l2540l2486q8434j10090M7698J81817
35075B97361M8386j26387K2349L37649L61568O7018j73903k18354k11503j52590
35065B51594M4780J82575K9780j79095p4885J54760M6913k75152k42886J74802
$$ plain form
35055 113186 491684 606612 429351 264868 192976 90745 47325 273406 659660 840967
35045 840967 688499 412622 212517 119684 143384 284960 428684 447045 374014 298611
35035 298611 195812 48076 -21192 46273 79508 -30181 -61686 216204 630489 839765
35025 839765 836603 858197 919208 833385 643710 617875 782830 832519 591762 274779 171007
35014 171007 305588 515299 672876 733758 696712 607869 534053 502707 514019 577455 670230
35003 670230 719155 702521 702972 785619 905103 998468 1067177 1105175 1067021 963034 850768
34992 850768 706932 492090 344918 436243 592867 424293 -56874 -332857 -99802 306124
34982 306124 467467 465547 549990 618408 482555 342664 484617 724084 671191 392920
$$ packed form
35055A13186L78498J14928j77261j64483p1892j02231m3420K26081L86254J81307
35045H40967j52468k75877k00105r2833K3700J41576J43724J8361p3031p5403
35035B98611j02799j47736o9268O7465L3235j09689l1505K77890M14285K09276
35025H39765l162K1594O1011q5823j89675k5835J64955M9689k40757l16983j03772
35014A71007J34581K09711J57577O0882l7046q8843p3816l1346J1312O3436R2775
35003F70230M8925j6634M51Q2647J19484R3365O8709L7998l8154j03987j12266
34992H50768j43836k14842j47172R1325J56624j68574m81167k75983K33055M05926
34982C06124J61343j920Q4443O8418j35853j39891J41953K39467n2893k78271
$$ plain form
34972 392920 290038 411375 412417 172738 -30914 3705 179353 370315 532111 532288 261890
34961 261890 -59786 -68048 224580 439801 388407 261245 250351 344757 531319 826119
34951 826119 1058138 990370 719766 599779 704136 737641 557438 395922 440182 554030
34941 554030 574370 560530 594832 634225 697904 898041 1144727 1139102 823665 519370 426475
34930 426475 324531 26544 -181757 85878 692787 1094066 1014016 710992 562745 627247
34920 627247 683138 558709 322675 177058 214082 323152 352135 291877 233444 210503 183737
34909 183737 126101 27353 -112238 -197685 -70837 240889 460045 424299 342355 448246
34899 448246 595121 522932 360862 441985 712232 794617 629991 560302 700944 727106
$$ packed form
34972C92920j02882J21337J042k39679k03652L4619J75648J90962J61796J77k70398
34961B61890l21676q262K92628K15221n1394j27162j0894R4406J86562K94800
34951H26119K32019o7768k70604j19987J04357L3505j80203j61516M4260J13848
34941E54030K0340j3840L4302L9393O3679K00137K46686n625l15437l04295r2895
34930D26475j01944k97987k08301K67635O06909M01279q0050l03024j48247O4502
34920F27247N5891j24429k36034j45617L7024J09070K8983o0258n8433k2941k6766
34909A83737n7636r8748j39591q5447J26848L11726K19156l5746q1944J05891
34899D48246J46875p2189j62070Q1123K70247Q2385j64626o9689J40642K6162
$$ plain form
34889 727106 453408 168181 148419 235777 178013 64915 122688 327879 504337 595821
34879 595821 608259 497252 337170 371646 654872 873032 783125 595306 615549 731328
34869 731328 631776 395323 436176 877648 1345421 1456229 1237041 968024 820988 762318
34859 762318 683438 534368 373100 296509 300111 274657 193578 183048 304111 414762 414370
34848 414370 466318 720922 934641 717231 160584 -155396 77876 464959 474608 173882
34838 173882 48313 238072 373554 200317 -31076 14190 246454 339066 230936 123103
34828 123103 67907 -94221 -363022 -454477 -172474 304027 624259 604147 293862 -106696
34818 -106696 -309819 -110909 371166 767208 863241 778772 687203 597180 524557 610679 869439
$$ packed form
34889G27106k73698k85227j9762Q7358n7764j13098N7773K05191J76458R1484
34879E95821J2438j11007j60082L4476K83226K18160q9907j87819K0243J15779
34869G31328r9552k36453M0853M41472M67773J10808k19188k69017j47036n8670
34859G62318p8880j49070j61268p6591L602k5454q1079j0530J21063J10651l92
34848D14370N1948K54604K13719k17410n56647l15980K33272L87083R649l00726
34838A73882j25569J89759J35482j73237k31393M5266K32264R2612j08130j07833
34828A23103n5196j62128k68801r1455K82003M76501L20232k0112l10285m00558
34818a06696k03123J98910M82075L96042R6033q4469r1569r0023p2623Q6122K58760
$$ plain form
34807 869439 1040850 917190 627321 398460 249743 141087 184286 427441 649640 673848
34797 673848 671415 827799 934110 712266 354018 277619 475041 577240 488038 456072
34787 456072 544630 545472 461452 564960 863647 983818 751916 470752 433964 548590 626252
34776 626252 678106 709582 572942 271405 109720 282120 552039 581687 372654 160300
34766 160300 60752 39100 75214 161402 236314 258642 260555 265738 271867 325951 447151 487452
34754 487452 301212 50404 61309 351033 596379 614037 543859 496938 393374 265778
34744 265778 343108 651769 876308 816742 668681 655438 712737 761628 953733 1353031
34734 1353031 1658022 1559917 1172739 832855 663794 594393 608912 701372 736184 613341
$$ packed form
34807H69439J71411j23660k89869k28861j48717j08656M3199K43155K22199K4208
34797F73848k433J56384J06311k21844l58248p6399J97422J02199q9202l1966
34787D56072Q8558Q42q4020J03508K98687J20171k31902k81164l6788J14626P7662
34776F26252N1854L1476j36640l01537j61685J72400K69919K9648k09033k12354
34766A60300r9548k1652L6114Q6188P4912K2328J913N183O129N4084J21200M0301
34754D87452j86240k50808J0905K89724K45346J7658p0178m6921j03564j27596
34744B65778P7330L08661K24539n9566j48061j3243N7299M8891J92105L99298
34734A353031L04991r8105l87178l39884j69061o9401J4519R2460L4812j22843
$$ plain form
34724 613341 457913 443002 544138 625528 618858 488995 226449 8584 114537 503814
34714 503814 751107 617981 410312 496060 734526 730952 471008 327086 501744 776162
34704 776162 822863 581308 318839 386445 833571 1258353 1230580 864816 674060 816296
34694 816296 897056 666674 446623 562311 767295 635802 225393 -57813 -25319 225017
34684 225017 580798 901005 949119 690774 450466 455321 482597 299593 138451 307798
34674 307798 634460 780417 836818 1053535 1225307 978239 509509 375959 605606 678685
34664 678685 409555 196434 288830 417266 337755 217648 261036 382665 443611 433056
34654 433056 287872 -73000 -426505 -384551 20569 321732 310801 280933 429281 533620
$$ packed form
34724F13341j55428j4911J01136Q1390o670j29863k62546k17865J05953L89277
34714E03814K47293j33126k07669Q5748K38466l574k59944j43922J74658K74418
34704G76162M6701k41555k62469O7606M47126M24782k7773l65764j90756J42236
34694H16296Q0760k30382k20051J15688K04984j31493m10409k83206L2494K50336
34684B25017L55781L20207M8114k58345k40308M855K7276j83004j61142J69347
34674C07798L26662J45957N6401K16717J71772k47068m68730j33550K29647P3079
34664F78685k69130k13121R2396J28436p9511j20107M3388J21629O0946j0555
34654D33056j45184l60872l53505M1954M05120L01163j0931k9868J48348J04339
$$ plain form
34644 533620 451465 423422 570470 578812 264617 6944 177821 529019 631067 581762
34634 581762 723497 917167 732803 260580 94578 442061 803796 722174 398936 311523
34624 311523 539618 762247 729204 471341 147317 -91376 -118353 100682 430605 656737
34614 656737 677271 558620 416810 319391 307211 415233 600667 705841 598992 358412
34604 358412 220244 304626 476829 530925 424477 260875 130087 65330 77183 119574
34594 119574 101775 53434 169068 512661 784232 636438 186318 -73029 96439 418362
34584 418362 557322 540397 555464 591009 535768 469666 565804 766295 815895 621922 373877
34573 373877 284327 387448 611861 860976 968852 780766 402647 203741 393949 712722
$$ packed form
34644E33620q2155k8043J47048Q342l14195k57673J70877L51198J02048m9305
34634E81762J41735J93670j84364m72223j66002L47483L61735q1622l23238q7413
34624C11523K28095K22629l3043k57863l24024k38693k6977K19035L29923K26132
34614F56737K0534j18651j41810r7419j2180J08022J85434J05174j06849k40580
34604C58412j38168Q4382J72203N4096j06448j63602j30788o4757J1853M2391
34594A19574j7799m8341J15634L43593K71571j47794m50120k59347J69468L21923
34584D18362J38960j6925J5067L5545n5241o6102R6138K00491M9600j93973k48045
34573C73877q9550J03121K24413K49115J07876j88086l78119j98906J90208L18773
$$ plain form
34563 712722 748819 499383 348261 479579 621467 515297 353222 472509 809123 1010974
34553 1010974 1003802 1039711 1161684 1056461 612556 234579 306363 626781 723119 522348
34543 522348 337448 315356 301667 228098 249946 432105 614472 686084 727305 778163 716020
34532 716020 498767 320521 370326 583069 756072 788139 705633 582360 525948 612856
34522 612856 752844 761581 650558 664186 896789 1059108 834691 346805 35667 120779
34512 120779 404555 602037 651549 649873 665025 714838 807051 888150 833269 607386 397895
34501 397895 457899 794668 1117091 1158983 985783 882189 968319 1065404 982125 788561
34491 788561 672865 620389 438467 104509 -122455 -40454 206876 333069 286805 243118
$$ packed form
34563G12722L6097k49436j51122J31318J41888j06170j62075J19287L36614K01851
34553A010974p172L5909J21973j05223m43905l77977P1784L20418R6338k00771
34543E22348j84900k2092j3689p3569K1848J82159J82367P1612M1221N0858o2143
34532G16020k17253j78246M9805K12743J73003L2067q2506j23273n6412Q6908
34522F12856J39988Q737j11023J3628K32603J62319k24417m87886l11138Q5112
34512A20779K83776J97482M9512j676J5152M9813R2213Q1099n4881k25883k09491
34501C97895O0004L36769L22423M1892j73200j03594Q6130R7085q3279j93564
34491G88561j15696n2476j81922l33958k26964Q2001K47330J26193m6264m3687
$$ plain form
34481 243118 292055 364195 455658 667666 943119 1019312 812038 628586 758923 1028885
34471 1028885 1066846 894666 865312 1030285 1012112 638742 287266 337339 622571 753112
34461 753112 710386 737508 841313 837465 783993 923554 1204214 1273173 1003992 666458 496793
34450 496793 439522 408753 472059 641421 772941 815036 903780 1095468 1253747 1300226 1312104
34439 1312104 1280645 1070769 733386 545878 609738 725476 790716 942012 1131165 1010551
34429 1010551 536458 249533 535483 972954 930383 548163 536151 1089813 1590865 1470220
34419 1470220 907824 499290 538917 820895 971466 823739 522690 321903 295190 322851
34409 322851 345497 431274 544656 530179 459967 667207 1190015 1513878 1226115 653418
$$ packed form
34481B43118M8937P2140R1463K12008K75453P6193k07274j83452J30337K69962
34471A028885L7961j72180k9354J64973j8173l73370l51476N0073K85232J30541
34461G53112m2726K7122J03805l848n3472J39561K80660O8959k69181l37534j69665
34450D96793n7271l0769O3306J69362J31520M2095Q8744J91688J58279M6479J1878
34439A312104l1459k09876l37383j87508O3860J15738O5240J51296J89153j20614
34429A010551m74093k86925K85950M37471m2571l82220j2012N53662N01052j20645
34419A470220n62396m08534L9627K81978J50571j47727l01049k00787k6713K7661
34409C22851K2646Q5777J13382j4477p0212K07240N22808L23863k87763n72697
$$ plain form
34399 653418 417611 559062 583365 270922 -57295 -80926 154130 462608 735041 863036
34389 863036 780509 639439 654435 747415 642695 321494 54500 -42606 -138322 -307518
34379 -307518 -373148 -242950 -94872 -76670 -71461 87819 365841 606451 708234 649370
34369 649370 496268 421983 543070 722280 716905 516783 328085 244607 186739 160909 290151
34358 290151 535214 651904 507118 228103 4940 -36659 221502 779395 1319789 1439050
34348 1439050 1164549 944930 1024770 1137931 968897 619360 407353 438273 598728 796261
34338 796261 980689 1048417 933992 744695 661185 731703 838335 828381 655468 451452
34328 451452 438468 666815 881406 799480 484174 256073 260274 343881 365481 375282 428667
$$ packed form
34399F53418k35807J41451K4303l12443l28217k3631K35056L08478K72433J27995
34389H63036q2527j41070J4996R2980j04720l21201k66994r7106r5716j69196
34379c07518o5630J30198J48078J8202N209J59280K78022K40610J01783n8864
34369F49370j53102p4285J21087J79210n375k00122j88698q3478n7868k5830J29242
34358B90151K45063J16690j44786k79015k23163m1599K58161N57893N40394J19261
34348A439050k74501k19619P9840J13161j69034l49537k12007L0920J60455J97533
34338G96261J84428O7728j14425j89297q3510P0518J06632r954j72913k04016
34328D51452j2984K28347K14591q1926l15306k28101M201Q3607K1600R801N3385
$$ plain form
34317 428667 454143 406245 362249 365203 323095 157029 -65712 -207906 -181600 13830 267039
34306 267039 401670 383436 420953 681575 970117 919025 475754 -22098 -243865 -127237
34296 -127237 214833 598104 798279 737217 640327 775555 1064717 1203346 1110992 970402
34286 970402 879624 804032 820694 1012466 1137143 853065 318874 89655 301946 456105
34276 456105 206746 -118513 -87597 177731 289747 217336 219211 369577 521160 604568
34266 604568 651157 617487 447814 230255 86551 -86 -81340 -94731 14626 155615
34256 155615 238210 325115 482096 621715 653427 640420 648348 597190 440051 333528 429296
34245 429296 621163 697665 643189 597383 604068 589702 529772 462362 375145 235140 118029
$$ packed form
34317D28667K5476m7898m3996K954m2108j66066k22741j42194K6306J95430K53209
34306B67039J34631j8234L7517K60622K88542n1092m43271m97852k21767J16628
34296a27237L42070L83271K00175o1062r6890J35228K89162J38629r2354j40590
34286I70402r0778p5592J6662J91772J24677k84078n34191k29219K12291J54159
34276D56105k49359l25259L0916K65328J12016p2411J875J50366J51583Q3408
34266F04568M6589l3670j69673k17559j43704q6637q1254j3391J09357J40989
34256A55615Q2595Q6905J56981J39619L1712j3007P928n1158j57139j06523R5768
34245D29296J91867P6502n4476m5806O685j4366n9930o7410q7217j40005j17111
$$ plain form
34234 118029 175076 439394 725680 763353 464503 79086 1616 336114 747682 879760
34224 879760 793552 776819 843706 757847 512587 398772 518656 602603 469247 341455
34214 341455 475127 719550 711426 377194 25692 -11794 283980 609690 634799 366966
34204 366966 172014 314987 598735 672346 560079 549036 641682 551791 262327 133429
34194 133429 331758 562381 545009 400637 372940 475204 593576 663551 607040 385489
34184 385489 219925 415999 855097 1045138 825092 601714 692890 876136 848843 704012
34174 704012 626529 519984 309081 254177 548860 893965 893990 651947 569168 736288 898917
34163 898917 885453 739264 551410 430047 483302 607781 510792 175971 30447 357200
$$ packed form
34234A18029N7047K64318K86286L7673k98850l85417p7470L34498M11568J32078
34224H79760q6208j6733O6887q5859k45260j13815J19884Q3947j33356j27792
34214C41455J33672K44423q124l34232l51502l7486K95774L25710K5109k67833
34204C66966j94952J42973K83748P3611j12267j1043R2646q9891k89464j28898
34194A33429J98329K30623j7372j44372k7697J02264J18372O9975n6511k21551
34184C85489j65564J96074M39098J90041k20046k23378R1176J83246k7293j44831
34174G04012p7483j06545k10903n4904K94683L45105K5k42043q2779J67120J62629
34163H98917j3464j46189j87854j21363N3255J24479r6989l34821j45524L26753
$$ plain form
34153 357200 826565 955520 760023 566051 429488 188316 -98800 -223640 -215470 -236450
34143 -236450 -199120 92461 499908 666243 541408 416707 463830 600705 791037 1099745
34133 1099745 1418897 1483978 1247867 977575 906840 995815 1075142 1049929 932271 807394
34123 807394 769422 806638 815936 794713 864094 1002204 973098 694205 449595 508888 736676
34112 736676 828817 739431 605746 451400 275395 258885 540033 907394 1043100 961061
34102 961061 889948 846890 683728 467749 431959 560276 579267 407095 306179 500155
34092 500155 856610 1039437 852985 404893 6019 -111906 -15569 73555 122213 269530
34082 269530 463070 462404 326325 479301 1028537 1421005 1169851 584128 312784 429907
$$ packed form
34153C57200M69365J28955j95497j93972j36563k41172k87116j24840Q170k0980
34143b36450L7330K91581M07447J66335j24835j24701M7123J36875J90332L08708
34133A099745L19152O5081k36111k70292p0735Q8975P9327k5213j17658j24877
34123H07394l7972L7216R298k1223O9381J38110k9106k78893k44610N9293K27788
34112G36676R2141q9386j33685j54346j76005j6510K81148L67361J35706q2039
34102I61061p1113m3058j63162k15979l5790J28317J8991j72172j00916J93976
34092E00155L56455J82827j86452m48092l98874j17925R6337Q9124M8658J47317
34082B69530J93540o66j36079J52976N49236L92468k51154n85723k71344J17123
$$ plain form
34072 429907 497033 363088 340960 616142 974282 1173464 1203317 1126297 986765 906226
34062 906226 981032 1082406 1021048 869667 836837 872047 720970 369192 115509 153052
34052 153052 328083 377348 234388 72311 140568 501326 855568 794816 337358 -18617
34042 -18617 59780 326782 418680 396744 489037 601390 528860 426142 588393 912076 1040496
34031 1040496 940064 881652 936420 939596 886691 908211 889493 579775 89295 -163133 -45337
34020 -45337 141107 157965 102418 125868 231227 419874 721278 997132 991616 658214 236179
34009 236179 -17959 -8400 224562 509277 615550 519077 454509 516371 453860 141961 -46190
33998 -46190 245863 732616 879312 719152 712874 919834 930401 621897 378059 444042
$$ packed form
34072D29907O7126j33945k2128K75182L58140J99182K9853p7020j39532q0539
34062I06226P4806J01374o1358j51381l2830L5210j51077l51778k53683L7543
34052A53052J75031M9265j42960j62077O8257L60758L54242o0752m57458l55975
34042a8617P8397K67002R1898k1936R2293J12353p2530j02718J62251L23683J28420
34031A040496j00432n8412N4768L176n2905K1520j8718l09718m90480k52428J17796
34020d5337J86444J6858n5547K3450J05359J88647L01404K75854n516l33402m22035
34009B36179k54138R559K32962K84715J06273r6473o4568O1862o2511l11899j88151
33998d6190K92053M86753J46696j60160o278K06960J0567l08504k43838O5983
$$ plain form
33988 444042 579294 509392 299546 132382 78220 204234 573145 1020407 1227972 1112438
33978 1112438 901855 807284 853374 989162 1099569 985698 626901 352585 433377 654170
33968 654170 671327 607451 806082 1142275 1153657 818564 620137 782448 985514 946783
33958 946783 792976 714206 678390 632272 623673 617798 509218 358551 306761 279758 123744
33947 123744 -30671 69312 352309 558402 708497 956417 1100793 826732 366145 284097
33937 284097 604608 793967 662970 614959 872174 1118064 1111677 1053361 1108500 1116076 994594
33926 994594 923157 921793 768006 508644 505896 778395 870456 610425 413638 547809 681000
33915 681000 509852 291283 345038 509329 522998 536276 796162 1149438 1279075 1191582
$$ packed form
33988D44042J35252o9902k09846j67164n4162J26014L68911M47262K07565j15534
33978A112438k10583r4571M6090J35788J10407j13871l58797k74316Q0792K20793
33968F54170J7157o3876J98631L36193J1382l35093j98427J62311K03066l8731
33958I46783j53807p8770l5816m6118q599n875j08580j50667n1790k7003j56014
33947A23744j54415R9983K82997K06093J50095K47920J44376k74061m60587q2048
33937B84097L20511J89359j30997m8011K57215K45890o387n8316N5139P576j21482
33926I94594p1437j364j53787k59362k748K72499R2061k60031j96787J34171J33191
33915F81000j71148k18569N3755J64291J3669J3278K59886L53276J29637q7493
$$ plain form
33905 1191582 1115931 1118297 1098759 993180 781123 483035 265780 307995 489293 514297
33895 514297 391608 422223 663116 830539 817244 845393 990215 1023168 872048 775486
33885 775486 834641 864063 805796 815945 852361 710591 550279 770984 1247433 1369802
33875 1369802 1020747 781414 924747 989370 697008 480065 623326 668377 269910 -67077
33865 -67077 209044 765549 978225 925702 1040800 1223190 1095043 808950 817254 1055529
33855 1055529 1078347 850992 736020 802185 770152 585409 490135 559086 641384 718065 891191
33844 891191 1077570 1096595 984022 883395 757559 536456 369565 371326 312691 -35926
33834 -35926 -434762 -467531 -156161 139062 313615 577325 967521 1203650 1063908 637621
$$ packed form
33905A191582p5651K366j9538j05579k12057k98088k17255M2215J81298K5004
33895E14297j22689L0615K40893J67423j3295K8149J44822L2953j51120r6562
33885G75486N9155K9422n8267J0149L6416j41770j60312K20705M76449J22369
33875A369802l49055k39333J43333O4623k92362k16943J43261M5051l98467l36987
33865f7077K76121N56505K12676n2523J15098J82390j28147k86093Q304K38275
33855A055529K2818k27355j14972O6165l2033j84743r5274O8951Q2298P6681J73126
33844H91191J86379J9025j12573j00627j25836k21103j66891J761n8635l48617
33834c5926l98836l2769L11370K95223J74553K63710L90196K36129j39742m26287
$$ plain form
33824 637621 189199 -60380 -74395 -38768 -129359 -176469 176640 872041 1344536 1234375
33814 1234375 846628 661436 742880 903293 1075116 1188110 1033971 618470 330057 407907
33804 407907 568765 510840 420192 568217 770461 722340 567005 632697 852855 928637
33794 928637 852963 811941 766754 583923 394871 391873 447671 355884 254816 378607 570052
33783 570052 494132 206729 93390 336851 782417 1197409 1367477 1136553 664704 418255
33773 418255 589390 794225 671501 444822 491171 703458 766329 750992 898984 1073585
33763 1073585 984688 759945 749448 928148 1007292 971861 997012 1007381 848625 724884
33753 724884 910001 1176670 1094166 771458 697877 921661 1013336 838140 744282 909748
$$ packed form
33824F37621m48422k49579j4015L5627r0591m7110L53109O95401M72495j10161
33814A234375l87747j85192Q1444J60413J71823J12994j54139m15501k88413P7850
33804D07907J60858n7925r0648J48025K02244m8121j55335O5692K20158P5782
33794I28637p5674m1022m5187j82831j89052k998N5798r1787j01068J23791J91445
33783E70052p5920k87403j13339K43461M45566M14992J70068k30924m71849k46449
33773D18255J71135K04835j22724k26679M6349K12287O2871j5337J47992J74601
33763A073585q8897k24743j0497J78700P9144l5431K5151J0369j58756j23741
33753G24884J85117K66669q2504l22708p3581K23784R1675j75196r3858J65466
$$ plain form
33743 909748 1074351 1056524 1041128 1190577 1374738 1427997 1335962 1083847 658261 270018
33733 270018 238648 565796 908612 1036018 1044586 1089827 1177591 1267673 1342741 1337828 1207652
33722 1207652 1070007 1087929 1219448 1261554 1120353 891587 725002 729089 918794 1150731
33712 1150731 1232064 1169984 1136025 1135912 993695 744816 684872 873266 976760 814861 653703
33701 653703 706043 773103 697058 727640 1054515 1382679 1384363 1190159 1025463 778411 390391
33690 390391 246182 626752 1136264 1235178 1018973 914499 942890 887961 878664 1142469
33680 1142469 1428829 1346696 1074821 1066360 1214651 1014482 472448 167558 379273 748562
33670 748562 871750 739793 532131 386181 406449 582187 725344 728607 728410 786609 711341
$$ packed form
33743I09748J64603j7827j5396J49449J84161N3259r2035k52115m25586l88243
33733B70018l1370L27148L42816J27406Q568M5241Q7764R0082P5068m913j30176
33722A207652j37645J7922J31519M2106j41201k28766j66585M087J89705K31937
33712A150731Q1333o2080l3959j13j42217k48879n9944J88394J03494j61899j61158
33701F53703N2340O7060p6045L0582L26875L28164J684j94204j64696k47052l88020
33690C90391j44209L80570N09512R8914k16205j04474K8391n4929r297K63805
33680A142469K86360q2133k71875q461J48291k00169n42034l04890K11715L69289
33670G48562J23188j31957k07662j45950K0268J75738J43157L263j97N8199p5268
$$ plain form
33659 711341 495345 540165 1024223 1450015 1330093 942229 835302 952526 880148 642681
33649 642681 567011 608456 491284 318462 398861 656093 805486 888457 1041307 1028934
33639 1028934 657664 337426 525282 922193 976537 853989 1056673 1383946 1237121 761391
33629 761391 673401 1033552 1194443 975864 897236 1147010 1280275 1118857 1060600 1269976
33619 1269976 1384330 1266841 1276324 1521025 1564105 1166834 695957 520660 561609 655466
33609 655466 835366 1059725 1148297 1120485 1147171 1138129 878289 551278 553891 801584 825060
33598 825060 560126 417363 548814 675342 675657 728827 840037 824323 765155 892108 1045530
33587 1045530 897387 635139 730659 1078699 1096259 666756 264723 154682 179508 297731
$$ packed form
33659G11341k15996M4820M84058M25792j19922l87864j06927J17224p2378k37467
33649F42681p5670M1445j17172j72822Q0399K57232J49393Q2971J52850j2373
33639A028934l71270l20238J87856L96911N4344j22548K02684L27273j46825m75730
33629G61391q7990L60151J60891k18579p8628K49774J33265j61418n8257K09376
33619A269976J14354j17489R483K44701M3080l97271m70877j75297M0949R3857
33609F55466J79900K24359Q8572k7812K6686r042k59840l27011K613K47693K3476
33598H25060k64934j42763J31451J26528L15N3170J11210j5714n9168J26953J53422
33587A045530j48143k62248R5520L48040J7560m29503m02033j10041K4826J18223
$$ plain form
33577 297731 584883 770426 567359 373553 775399 1437195 1458334 822993 447725 695541
33567 695541 922894 718079 525722 700837 915273 900327 910047 1063709 1036884 759819
33557 759819 644142 798096 801261 558069 556066 940158 1145320 832697 433505 384705
33547 384705 530687 619975 707890 780081 669998 576239 918686 1491343 1579921 1120704
33537 1120704 855390 1108803 1361196 1297815 1262203 1325918 983208 229797 -119085 265101
33527 265101 631415 457638 306790 676112 1018292 766215 428993 717474 1310898 1443866
33517 1443866 1131237 909050 850411 688974 518945 601011 802435 877042 957869 1203852
33507 1203852 1341689 1103342 731800 553803 462457 287896 221993 398709 521941 393195
$$ packed form
33577B97731K87152J85543k03067j93806M01846O61796K1139o35341l75268K47816
33567F95541K27353k04815j92357J75115K14436j4946R720J53662k6825k77065
33557G59819j15677J53954L165k43192k003L84092K05162l12623l99192m8800
33547C84705J45982Q9288Q7915P2191j10083r3759L42447N72657Q8578m59217
33537A120704k65314K53413K52393o3381l5612O3715l42710p53411l48882L84186
33527B65101L66314j73777j50848L69322L42180k52077l37222K88481N93424J32968
33517A443866l12629k22187n8639j61437j70029Q2066K01424P4607Q0827K45983
33507A203852J37837k38347l71542j77997r1346j74561o5903J76716J23232j28746
$$ plain form
33497 393195 349298 702985 1188953 1393201 1286126 974592 457003 -19509 33520 578113
33487 578113 912739 707226 493154 683249 866760 646165 417481 634620 976966 980184
33477 980184 875096 1030286 1130659 741749 222655 218689 582492 623954 211008 -129079
33467 -129079 -68973 211646 497314 768660 999558 1129325 1196951 1246384 1214946 1078487
33457 1078487 909985 705387 435779 290234 454918 651097 427786 -61220 -197903
33448 -197903 128024 388968 349630 349430 510196 493710 260812 221301 386611 264970 -126209
33437 -126209 -96989 525570 1028532 1033673 1062131 1395144 1435258 842730 315044 492310
33427 492310 945899 986743 698174 473980 276389 10512 -73972 69035 64686 -78172
$$ packed form
33497C93195m3897L53687M85968K04248j07075l11534n17589m76512N3029N44593
33487E78113L34626k05513k14072J90095J83511k20595k28684K17139L42346L218
33477I80184j05088J55190J00373l88910n19094l966L63803M1462m12946l40087
33467a29079O0106K80619K85668K71346K30898J29767O7626M9433l1438j36459
33457A078487j68502k04598k69608j45545J64684J96179k23311m89006j36683
33448a97903L25927K60944l9338k00J60766j6486k32898l9511J65310j21641l91179
33437a26209K9220O22559N02962N141K8458L33013M0114n92528n27686J77266
33427D92310M53589M0844k88569k24194j97591k65877q4484J43007m349j42858
$$ plain form
33417 -78172 192624 856085 1050697 497464 110918 499158 965573 821047 576970 869354
33407 869354 1241606 1074592 797158 1045888 1439709 1319258 974121 1022383 1233468 1056691
33397 1056691 715385 725185 885887 747496 528302 624243 773389 626080 543911 901043
33387 901043 1203508 864407 279118 180750 473749 619287 631056 802422 987399 986839
33377 986839 1080871 1405674 1455188 969576 580474 771749 1002309 716882 379135 572988
33367 572988 929411 913947 822206 1005031 1003760 496378 175623 584792 1027311 792694
33357 792694 478914 835054 1294600 1059618 680006 1020364 1525314 1153965 314647 185935
33347 185935 693436 836962 567947 682233 1166679 1233146 802112 539456 596510 566470
$$ packed form
33417g8172K70796O63461J94612n53233l86546L88240M66415j44526k44077K92384
33407H69354L72252j67014k77434K48730L93821j20451l45137M8262K11085j76777
33397A056691l41306R800J60702j38391k19194R5941J49146j47309q2169L57132
33387I01043L02465l39101n85289r8368K92999J45538J1769J71366J84977n60
33377I86839R4032L24803M9514m85612l89102J91275K30560k85427l37747J93853
33367E72988L56423j5464r1741J82825j271n07382l20755M09169M42519k34617
33357G92694l13780L56140M59546k34982l79612L40358N04950l71349q39318j28712
33347A85935N07501J43526k69015J14286M84446O6467m31034k62656N7054l0040
$$ plain form
33337 566470 442442 469268 408163 51197 -43839 527592 997483 569252 -106782 36491
33327 36491 668606 754484 413191 503665 901011 809558 365681 344897 648960 619175 468592
33316 468592 856181 1405475 1212195 512826 318802 684616 828316 665144 741962 955949
33306 955949 797216 550541 838546 1333900 1318948 1069781 1251645 1481375 1030913 399188
33296 399188 539041 1056144 905676 384471 610878 1422988 1652327 1207212 1067499 1417020
33286 1417020 1525647 1298171 1272052 1297465 836798 293329 450348 954123 943536 698576
33276 698576 994388 1408120 1088887 601752 1040136 1883297 1823446 1190084 1335627 2051532
33266 2051532 1926014 990005 651214 1127229 1252991 801995 750288 1215257 1306556 1044368
$$ packed form
33337E66470j24028K6826o1105l56966r5036N71431M69891m28231o76034J43273
33327C6491O32115Q5878l41293R0474L97346r1453m43877k0784L04063k9785j50583
33316D68592L87589N49294j93280o99369j94024L65814J43700j63172P6818K13987
33306I55949j58733k46675K88005M95354j4952k49167J81864K29730m50462o31725
33296C99188J39853N17103j50468n21205K26407Q12110K29339m45115j39713L49521
33286A417020J08627k27476k6119K5413m60667n43469J57019N03775j0587k44960
33276F98576K95812M13732l19233m87135M38384Q43161n9851o33362J45543P15905
33266B051532j25518r36009l38791M76015J25762m50996n1707M64969R1299k62188
$$ plain form
33256 1044368 1298587 1836937 1573198 740471 660844 1342395 1456092 746108 349159 657707
33246 657707 907446 903792 1174282 1481182 1143633 641755 929716 1519517 1322228 869710
33236 869710 1406826 2340110 2103767 1052220 823739 1286119 938948 -14226 40863 989985
33226 989985 1147950 446130 460042 1296638 1466590 873327 920349 1603959 1505628 706941
33216 706941 698478 1408658 1380357 802466 1191831 2206909 2095696 1146781 1226380 2074286
33206 2074286 1737716 529903 654321 1949060 2088322 1056551 1143036 2320507 2127737
33197 2127737 535351 289747 1793603 2341577 1249401 975045 2160885 2406539 1162442
33188 1162442 973293 2466374 2956818 1579490 974259 2200615 2800123 1697434 1212593
$$ packed form
33256A044368K54219N38350k63739q32727p9627O81551J13697p09984l96949L08548
33246F57707K49739l654K70490L06900l37549n01878K87961N89801j97289m52518
33236H69710N37116R33284k36343j051547k28481M62380l47171r53174N5089R49122
33226I89985J57965p01820J3912Q36596J69952n93263M7022O83610r8331p98687
33216G06941q463P10180k8301n77891L89365J015078j11213r48915P9599Q47906
33206B074286l36570j207813J24418J294739J39262j031771Q6485J177471j92770
33197B127737j592386k45604J503856N47974j092176k74356J185840K45654j244097
33188A162442j89149J493081M90444j377328o05231J226356N99508j102689m84841
$$ plain form
33179 1212593 2309257 2640273 1311685 836343 2276287 3089349 1844637 534618 380604
33170 380604 -11937 -735322 221362 2352429 2465463 577553 381177 2417995 2907124
33161 2907124 958978 355607 2246456 3011096 1573342 1576884 3830977 4202362 1773192
33152 1773192 1152538 3646587 4459626 1998244 1173859 3764550 4752148 2333053 1793738
33143 1793738 4904194 5833758 2658450 1890898 5933712 7822126 4744767 4082354 8863754
33134 8863754 11002362 7204861 6643525 13393630 17717478 15704042 18954035 31636867
33126 31636867 39451895 38120149 47625641 75378441 95357344 99401000 138255564 254633802
33118 254633802 389250287 421597121 316576810 171574096 93904839 84828564 79645319
$$ packed form
33179A212593J096664L31016j328588m75342J439944Q13062j244712j310019j54014
33170C80604l92541p23385R56684K131067J13034j887910j96376K036818M89129
33161B907124j948146o03371J890849P64640j437754L542K254093L71385k429170
33152A773192o20654K494049Q13039k461382q24385K590691R87598k419095n39315
33143A793738L110456R29564l175308p67552M042814J888414l077359o62413M781400
33134H863754K138608l797501n61336O750105M323848k013436L249993J2682832
33126C1636867P815028j331746R505492K7752800J9978903M043656L8854564J16378238
33118B54633802J34616485L2346834j05020311j45002714p7669257r076275n183245
$$ plain form
33111 79645319 53382019 32895174 31755091 30948847 20123840 12738049 15436601 16194332
33103 16194332 9240339 4870189 8099424 9921433 5754196 3243533 6087266 7188147
33095 7188147 3286647 1128128 3929724 5503595 2700252 1049124 3361671 4426187
33087 4426187 1598128 -140211 1916910 3260454 1312626 133413 1960670 2879754
33079 2879754 864266 -186806 1741204 2816200 913228 -355195 1216182 2375839
33071 2375839 1052546 231383 1701472 2442615 733084 -328973 1167553 2319740
33063 2319740 1131814 198496 1367448 2153975 784986 -324573 637690 1498076 588027
33054 588027 -87765 862477 1354040 141851 -477118 881191 1894863 971699 176154
$$ packed form
33111G9645319k6263300k0486845j140083q06244j0825007p385791K698552P57731
33103A6194332o953993m370150L229235J822009m167237k510663K843733J100881
33095G188147l901500k158519K801596J573871k803343j651128K312547J064516
33087D426187k828059j738339K057121J343544j947828j179213J827257R19084
33079B879754k015488j051072J928010J074996j902972j268423J571377J159657
33071B375839j323293q21163J470089P41143j709531j062057J496526J152187
33063B319740j187926r33318J168952P86527j368989j109559R62263Q60386r10049
33054E88027o75792R50242M91563j212189o18969J358309J013672r23164p95545
$$ plain form
33045 176154 984773 1408777 163683 -517275 843086 1959123 1027192 50040 894225
33036 894225 1809451 986664 5753 592062 1302512 571921 -125821 729699 1568396 679554
33026 679554 -510617 -142920 723760 418838 -163403 407628 1186380 760190 -34139
33017 -34139 100020 442375 2018 -271889 630767 1638950 1547946 1188015 1584645 1927491
33007 1927491 1371489 854228 1172315 1293717 485402 -4441 695132 1224568 473592
32998 473592 -285351 211164 876831 456812 -74237 499012 1256646 978792 455211 766064
32988 766064 1088812 407089 -343379 10304 692603 581755 332819 865356 1394911 1006029
32978 1006029 553049 984140 1407301 833401 200317 616490 1209482 806173 183973
$$ packed form
33045A76154Q08619M24004j245094o80958J360361J116037r31931r77152Q44185
33036H94225R15226q22787r80911N86309P10450p30591o97742Q55520Q38697q88842
33026F79554j190171L67697Q66680l04922n82241N71031P78752m26190p94329
33017c4139J34159L42355m40357k73907R02656J008183r1004l59931L96630L42846
33007A927491n56002n17261L18087J21402q08315m89843O99573N29436p50976
32998D73592p58943M96515O65667m20019n31049N73249P57634k77854n23581L10853
32988G66064L22748o81723p50468L53683O82299j10848k48936N32537N29555l88882
32978A006029m52980M31091M23161n73900o33084M16173N92992m03309o22200
$$ plain form
32969 183973 539450 1218899 1087686 725513 1154855 1739247 1407489 688217 574017 662238
32959 662238 300078 190088 962765 1585632 1115823 561525 1035287 1599844 1050510 303405
32949 303405 745458 1624303 1432840 624917 587082 1051033 880297 396986 618994 1132294
32939 1132294 950128 557167 927925 1476097 1162195 657487 1165042 2036084 1846883
32930 1846883 965059 752310 1058196 810310 280837 439835 839710 485438 25196
32921 25196 681511 1781376 1816557 1182989 1291374 1756444 1275176 561985 1295770 2672029
32911 2672029 2447658 1280679 2247558 5425222 6714372 3567703 -1254729 -3574048
32903 -3574048 -2919579 -1685427 -1184179 -892916 -452579 -239879 -331523 -383351 -353404 -416844
$$ packed form
32969A83973L55477O79449j31213l62173M29342N84392l31758p19272j14200Q8221
32959F62238l62160j09990P72677O22867m69809n54298M73762N64557n49334p47105
32949C03405M42053Q78845j91463q07923l7835M63951j70736m83311K22008N13300
32939A132294j82166l92961L70758N48172l13902n04708N07555Q71042j89201
32930A846883q81824k12749L05886k47886n29473J58998L99875l54272m60242
32921B5196O56315J099865L5181o33568J08385M65070m81268p13191P33785J376259
32911B672029k24371j166979R66879L177664J289150l146669m822432k319319
32903c574048O54469J234152N01248K91263M40337K12700r1644n1828K9947o3440
$$ plain form
32893 -416844 -452415 -288951 -116817 -145035 -211511 -95905 147130 373855 480281 306301
32883 306301 -113587 -285779 162491 776983 853356 559893 660300 1225631 1529957 1235411
32873 1235411 795889 595968 501384 381272 352290 399597 379670 417956 716217 1038972
32863 1038972 997346 718245 610467 634174 449367 100731 -104136 -188869 -323478 -300063
32853 -300063 116894 580368 606153 358383 293698 340221 174001 -18247 147954 474373
32843 474373 514543 413425 616036 998629 1079364 861079 723278 717920 656510 606558 664333
32832 664333 609602 397119 478062 965789 1125186 503927 -115232 147184 846437 1018416
32822 1018416 781955 916498 1348731 1368760 1014135 949450 1187995 1157112 870311 857521
$$ packed form
32893d16844l5571J63464J72134k8218o6476J15606K43035K26725J06426j73980
32883C06301m19888j72192M48270O14492P6373k93463J00407N65331L04326k94546
32873A235411m39522j99921r4584j20112k8982M7307j9927L8286K98261L22755
32863A038972m1626k79101j07778K3707j84807l48636k04867q4733j34609K3415
32853c00063M16957M63474K5785k47770o4685M6523j66220j92248J66201L26419
32843D74373M0170j01118K02611L82593Q0735k18285j37801n358o1410m9952N7775
32832F64333n4731k12483Q0943M87727J59397o21259o19159K62416O99253J71979
32822A018416k36461J34543M32233K0029l54625o4685K38545l0883k86801j2790
$$ plain form
32812 857521 1053796 891392 413025 224310 413908 524687 493291 639936 847919 715419
32802 715419 396316 370525 540689 447151 165119 108622 220850 241153 408844 961490
32792 961490 1368078 1090169 640530 769814 1102559 835554 311613 489748 1222963 1560608
32782 1560608 1496374 1829313 2403955 2148817 1004765 252208 582935 1194979 1194458 760250
32772 760250 580441 1084526 2372136 3947463 4535431 3239983 906247 -704195 -996857
32763 -996857 -707493 -249354 668243 1813694 2342779 2141579 1911838 1750720 1036578
32754 1036578 -50237 -354175 486685 1401834 1463957 927907 337199 -202072 -473172
32745 -473172 -71499 696372 940059 558771 370623 608857 557256 33361 -120437 459651
$$ packed form
32812H57521J96275j62404m78367j88715J89598J10779l1396J46645K07983j32500
32802G15419l19103k5791J70164r3538k82032n6497J12228K0303J67691N52646
32792I61490M06588k77909m49639J29284L32745k67005n23941J78135P33215L37645
32782A560608o4234L32939N74642k55138j144052p52557L30727O12044n21m34208
32772G60250j79809N04085J287610J575327N87968j295448k333736j610442k92662
32763i96857K89364M58139R17597J145451N29085k01200k29741j61118p14142
32754A036578j086815l03938Q40860R15149O2123n36050n90708n39271k71100
32745d73172M01673P67871K43687l81288j88148K38234n1601n23895j53798N80088
$$ plain form
32735 459651 977451 913599 885528 1363576 1712326 1326085 692752 504087 596860 549714
32725 549714 516539 724349 867611 675861 437382 418401 432845 434071 769548 1393870
32715 1393870 1640883 1268339 916420 1028631 1150496 839362 436733 339451 296627 66728
32705 66728 35692 510953 1040102 1081085 804965 663284 676321 671504 739077 970567 1166280
32694 1166280 1161564 1025431 732795 184926 -285500 -107800 612450 1082050 960715 772074
32684 772074 915051 1055173 857385 587394 573876 689295 713221 671374 586698 428836
32674 428836 410173 741671 1099282 1010528 687695 698420 965091 1002398 936579 1202953
32664 1202953 1449578 1020899 369103 529593 1258057 1295726 545283 240489 737089 982257
$$ packed form
32735D59651N17800o3852k8071M78048L48750l86241o33333j88665R2773m7146
32725E49714l3175K07810J43262j91750k38479j8981J4444J226L35477O24322
32715A393870K47013l72544l51919J12211J21865l11134m02629r7282m2824k29899
32705F6728l1036M75261N29149M0983k76120j41681J3037m817O7573K31490J95713
32694A166280m716j36133k92636n47869m70426J77700P20250M69600j21335j88641
32684G72074J42977J40122j97788k69991j3518J15419K3926m1847q4676j57862
32674D28836j8663L31498L57611q8754l22833J0725K66671L7307o5819K66374
32664A202953K46625m28679o51796J60490P28464L7669p50443l04794M96600K45168
$$ plain form
32654 982257 579965 481195 1034349 1253924 762164 569511 1093844 1314769 816969 694276
32644 694276 1377828 1631173 908706 551642 1247393 1598655 875373 712365 2000675
32635 2000675 2760926 1883945 2308819 6617650 11431559 10883384 5004277 -38420 -388158
32626 -388158 1299817 1263253 -7241 -98870 924015 1355124 1057253 1120234 1492637 1252280
32616 1252280 525576 252019 508132 597051 408705 380762 466844 317862 175228 510100
32606 510100 1036192 1070872 669895 489597 684477 802542 668968 554788 499044 236738
32596 236738 -131588 -97819 453420 972957 1005378 772996 743079 956078 1095158 1024440
32586 1024440 933392 979416 1055074 1003943 887069 861733 889944 794459 596818 544862 727033
$$ packed form
32654I82257m02292r8770N53154K19575m91760j92653N24333K20925m97800j22693
32644F94276O83552K53345p22467l57064O95751L51262p23282j63008J288310
32635B000675P60251q76981M24874M308831M813909n48175n879107n042697l49738
32626c88158J687975l6564j270494r1629J022885M31109k97871O2981L72403k40357
32616A252280p26704k73557K56113Q8919j88346k7943Q6082j48982j42634L34872
32606E10100N26092L4680m00977j80298J94880J18065j33574j14180n5744k62306
32596B36738l68326L3769N51239N19537L2421k32382k9917K12999J39080p0718
32586A024440r1048M6024P5658n1131j16874k5336K8211r5485j97641n1956J82171
$$ plain form
32575 727033 907023 874172 726114 644593 624547 611454 667110 781556 760646 544975 401447
32564 401447 529425 715483 671487 472814 336735 212754 -22412 -168658 70126 578970
32554 578970 940310 973364 832383 653379 430378 195616 57951 98364 371450 856777
32544 856777 1284059 1284147 901796 625642 678384 685614 367693 91227 260682 592523 589011
32533 589011 392097 491271 807815 786374 324708 -53800 8903 301412 489290 485050
32523 485050 313576 34030 -142873 -13587 320103 609409 846034 1156773 1412289 1335196
32513 1335196 948260 550903 301719 162450 165961 366846 593049 611877 494171 488602
32503 488602 611827 681284 652252 598884 478786 247062 78030 144284 314868 393701
$$ packed form
32575G27033J79990l2851j48058q1521k0046j3093N5656J14446k0910k15671j43528
32564D01447J27978J86058m3996j98673j36079j23981k35166j46246K38784N08844
32554E78970L61340L3054j40981j79004k23001k34762j37665M0413K73086M85327
32544H56777M27282Q8l82351k76154N2742P230l17921k76466J69455L31841l512
32533E89011j96914R9174L16544k1441m61666l78508O2703K92509J87878m240
32523D85050j71474k79546j76903J29286L33690K89306K36625L10739K55516p7093
32513A335196l86936l97357k49184j39269L511K00885K26203J8828j17706n569
32503D88602J23225O9457k9032n3368j20098k31724j69032O6254J70584P8833
$$ plain form
32493 393701 478356 734227 1013575 1084779 1043783 1095576 1131703 956074 727263 712395 784966
32482 784966 644345 362555 226529 209051 107049 41649 274765 654874 798112 726195
32472 726195 781044 988986 1057576 939432 856336 819782 671851 550109 749854 1145589
32462 1145589 1299862 1138607 984431 947603 849610 736556 863226 1123191 1095614 754942
32452 754942 563197 727202 898930 766632 457993 210361 92925 182022 563172 1020655
32442 1020655 1138899 843420 481274 305587 260717 294122 444352 581653 501406 313584
32432 313584 305350 418033 348111 166923 280053 704837 967808 859287 732974 864761
32422 864761 1035887 992538 869177 906623 1108853 1360104 1554968 1520502 1178963 836222
$$ packed form
32493C93701Q4655K55871K79348P1204m0996N1793L6127j75629k28811j4868P2571
32482G84966j40621k81790j36026j7478j02002o5400K33116L80109J43238p1917
32472G26195N4849K07942O8590j18144q3096l6554j47931j21742J99745L95735
32462A145589J54273j61255j54176l6828r7993j13054J26670K59965k7577l40672
32452G54942j91745J64005J71728j32298l08639k47632j17436Q9097L81150M57483
32442A020655J18244k95479l62146j75687m4870L3405J50230J37301q0247j87822
32432C13584q234J12683o9922j81188J13130M24784K62971j08521j26313J31787
32422H64761J71126m3349j23361L7446K02230K51251J94864l4466l41539l42741
$$ plain form
32412 836222 880777 1159815 1144246 760687 495461 566952 612351 404127 266732 469512
32402 469512 740286 737925 562298 457810 411048 353913 383589 487224 422565 150837 8962
32391 8962 177554 369659 334392 267188 400807 575756 558780 433479 347329 233287 111857
32380 111857 271052 754108 1054471 773464 243016 18937 79858 62638 -6671 147635
32370 147635 392355 401146 478450 1350393 2892941 3805225 3092761 1437177 458786 790900
32360 790900 1524484 1614678 1178747 1006180 1268792 1398065 1114430 844095 920274 1014323
32350 1014323 772364 504823 680895 1090543 1147735 825902 634916 752878 843350 758679
32340 758679 776908 1010835 1169581 1091348 986937 966604 841151 599462 559010 787074
$$ packed form
32412H36222M4555K79038j5569l83559k65226P1491M5399k08224j37395K02780
32402D69512K70774k361j75627j04488m6762n7135K9676J03635o4659k71728j41875
32391H962J68592J92105l5267o7204J33619J74949j6976j25301q6150j14042j21430
32380A11857J59195M83056L00363k81007n30448k24079O0921j7220o9309J54306
32370A47635K44720Q791P7304Q71943J542548R12284p12464j655584r78391L32114
32360G90900P33584R0194m35931j72567K62612J29273k83635k70335P6179R4049
32350A014323k41959k67541J76072M09648N7192l21833j90986J17962R0472q4671
32340G58679J8229K33927J58746p8233j04411k0333j25453k41689m0452K28064
$$ plain form
32330 787074 886697 658611 473021 630277 842195 774779 651901 805015 992906 754786
32320 754786 208258 -85386 59440 296563 373958 426121 592316 761791 818757 830378
32310 830378 865533 862273 795707 792147 938532 1086695 986407 608047 250623 261545 642634
32299 642634 1015562 1043957 800926 605571 602044 682107 727116 681783 460165 81380 -130809
32288 -130809 164909 800998 1215847 1174631 1007419 1004897 983116 690819 297175 144885
32278 144885 249162 359736 369867 386091 494049 681263 912426 1114195 1179950 1117196
32268 1117196 1065698 1067939 999256 839162 783209 917177 1020190 917581 800569 906504
32258 906504 1069624 938706 537151 240421 215128 240493 154076 130250 331327 547520
$$ packed form
32330G87074R9623k28086j85590J57256K11918o7416j22878J53114J87891k38120
32320G54786n46528k93644J44826K37123P7395N2163J66195J69475N6966J1621
32310H30378L5155l260o6566l560J46385J48163j00288l78360l57424J0922L81089
32299F42634L72928K8395k43031j95355l527Q0063M5009m5333k21618l78785k12189
32288a30809K95718O36089M14849m1216j67212k522k1781k92297l93644j52290
32278A44885J04277J10574J0131J6224J07958J87214K31163K01769O5755o2754
32268A117196n1498K241o8683j60094n5953J33968J03013j02609j17012J05935
32258I06504J63120j30918m01555k96730k5293K5365q6417k3826K01077K16193
$$ plain form
32248 547520 468703 192781 152751 514487 926163 1001650 818846 699734 673032 514965
32238 514965 272828 315243 740257 1133628 1146717 964791 912312 934466 850964 816134 1042978
32227 1042978 1294398 1194004 902607 894346 1117419 1030699 560451 357858 840769 1543307
32217 1543307 1792444 1593188 1411665 1395349 1284020 950682 596155 396660 282463 171544
32207 171544 223291 671848 1402905 1852666 1530191 650720 -1439 30172 382165 492771
32197 492771 398922 515511 854081 988550 739616 393925 210021 147674 144346 248393
32187 248393 401357 457120 471844 619972 807512 758407 497682 333118 342740 322253 252017
32176 252017 324505 472605 406274 195331 250071 600353 789330 664736 654202 984168
$$ packed form
32248E47520p8817k75922m0030L61736M11676P5487j82804j19112k6702j58067
32238E14965k42137M2415M25014L93371J3089j81926n2479K2154q3502l4830K26844
32227A042978K51420j00394k91397q261K23073q6720m70248k02593M82911P02538
32217A543307K49137j99256j81523j6316j11329l33338l54527j99495j14197j10919
32207A71544N1747M48557P31057M49761l22475q79471o52159L1611L51993J10606
32197D92771r3849J16589L38570J34469k48934l45691j83904o2347l328J04047
32187B48393J52964N5763J4724J48128J87540m9105k60725j64564R622k0487p0236
32176B52017P2488J48100o6331k10943N4740L50282J88977j24594j0534L29966
$$ plain form
32166 984168 1236438 1047385 698747 590652 605983 452174 227734 181402 232790 172937
32156 172937 74392 108659 201945 229208 305428 538058 722299 624146 373612 276439 407581
32145 407581 630613 829344 923602 873026 819921 963046 1168898 1058590 622669 330539
32135 330539 433130 611722 570673 498295 613405 723937 627271 522965 611700 683039
32125 683039 537913 438974 666785 963989 912221 587820 379025 396082 490208 609256
32115 609256 724450 666131 438288 414172 796888 1177905 1084176 684180 480633 572289
32105 572289 712160 840942 1032980 1114829 865940 460636 250472 257631 298133 393205
32095 393205 611216 738740 602464 491185 733831 1076528 1046019 741030 648966 810256
$$ packed form
32166I84168K52270j89053l48638j08095J5331j53809k24440m6332N1388n9853
32156A72937r8545L4267R3286K7263P6220K32630J84241r8153k50534r7173J31142
32145D07581K23032J98731R4258n0576n3105J43125K05852j10308m35921k92130
32135C30539J02591J78592m1049p2378J15110J10532r6666j04306Q8735P1339
32125F83039j45126r8939K27811K97204n1768l24401k08795J7057R4126J19048
32115F09256J15194n8319k27843k4116L82716L81017r3729l99996k03547R1656
32105E72289J39871J28782J92038Q1849k48889m05304k10164P159M0502R5072
32095C93205K18011J27524j36276j11279K42646L42697l0509l04989r2064J61290
$$ plain form
32085 810256 809034 544266 374550 459964 541675 465539 407176 455407 421778 207287 2590
32074 2590 6495 214465 522810 796245 863150 699388 552157 638169 839735 948960 1020296
32063 1020296 1176851 1292485 1228548 1156561 1241399 1237998 857389 319649 61571 94061
32053 94061 148132 251922 608247 1060555 1243652 1140199 965502 686372 234049 -18648
32043 -18648 317792 893870 1017471 707111 585310 785841 818598 571331 546795 889560
32033 889560 1031534 656770 268101 364707 694100 790591 729477 855346 1151087 1323372
32023 1323372 1244068 978099 624536 377755 481169 902576 1288997 1378471 1211042 895053
32013 895053 505545 239265 263233 377521 273177 124658 374407 896379 1040169 654578
$$ packed form
32085H10256j222k64768j69716Q5414Q1711p6136n8363M8231l3629k14491k04697
32074B590L905K07970L08345K73435O6905j63762j47231Q6012K01566J09225P1336
32063A020296J56555J15634o3937p1987Q4838l401l80609n37740k58078L2490
32053I4061N4071J03790L56325M52308J83097j03453j74697k79130m52323k52697
32043a8648L36440N76078J23601l10360j21801K00531L2757k47267k4536L42765
32033H89560J41974l74764l88669R6606L29393R6491o1114J25869K95741J72285
32023A323372p9304k65969l53563k46781J03414M21407L86421Q9474j67429l15989
32013H95053l89508k66280K3968J14288j04344j48519K49749N21972J43790l85591
$$ plain form
32003 654578 356654 514601 682097 443804 143064 240403 528252 586212 546088 756999
31993 756999 1043204 961551 586432 424854 656854 981458 1148502 1186519 1145048 1012616
31983 1012616 877135 846597 840558 718675 533963 411055 298215 117542 34119 260418
31973 260418 670689 915966 888879 802251 818755 854036 779196 623051 509136 494215 511330
31962 511330 448979 298977 204060 291959 512780 748553 980286 1157740 1048194 543144
31952 543144 25568 11279 424810 679334 526106 330633 384220 474744 372781 238923
31942 238923 244554 242758 136440 127191 259710 193618 -169262 -323556 70852 524540 430846
31931 430846 44280 48987 449457 660832 538040 518717 763850 920911 830965 763156
$$ packed form
32003F54578k97924J57947J67496k38293l00740R7339K87849N7960m0124K10911
31993G56999K86205q1653l75119j61578K32000L24604J67044L8017m1471j32432
31983A012616j35481l0538o039j21883j84712j22908j12840j80673q3423K26299
31973B60418M10271K45277k7087q6628J6504L5281p4840j56145j13915j4921J7115
31962E11330o2351j50002r4917Q7899K20821K35773K31733J77454j09546n05050
31952E43144n17576j4289M13531K54524j53228j95473N3587R0524j01963j33858
31942B38923N631j796j06318r249J32519o6092l62880j54294L94408M53688r3694
31931D30846l86566M707M00470K11375j22792j9323K45133J57061q9946o7809
$$ plain form
31921 763156 792865 628223 280795 242058 653936 907395 509577 -148658 -392802 -223849
31911 -223849 -111689 -129548 56856 441790 566839 264110 -10114 179667 640905 876001
31901 876001 768096 632753 699329 843042 852588 733492 638346 623173 607634 547816 530985
31890 530985 643771 800500 799085 576989 328476 277997 393036 466822 470304 605001 916639
31879 916639 1093497 871483 465691 300890 423538 537049 560487 702469 924774 845666
31869 845666 404611 139289 429470 873815 893372 628100 658190 1036270 1238066 1039203
31859 1039203 811576 829960 835194 518865 28249 -265986 -221503 43995 334818 463645
31849 463645 384943 321550 522153 870477 1027595 960203 950587 1053406 994507 718395 558920
$$ packed form
31921G63156K9709j64642l47428l8737M11878K53459l97818o58235k44144J68953
31911b23849J12160j7859J86404L84934J25049l02729k74224J89781M61238K35096
31901H76001j07905j35343O6576J43713R546j19096r5146j5173j5539n9818j6831
31890E30985J12786J56729j415k22096k48513n0479J15039P3786L482J34697L11638
31879I16639J76858k22014m05792j64801J22648J13511K3438J41982K22305p9108
31869H45666m41055k65322K90181M44345J9557k65272L0090L78080K01796j98863
31859A039203k27627J8384N234l16329m90616k94235M4483K65498K90823J28827
31849D63645p8702o3393K00603L48324J57118o7392r616J02819n8899k76112j59475
$$ plain form
31838 558920 674347 778934 682449 627486 769022 777128 382642 -67100 -88377 193933
31828 193933 294808 150042 109184 259665 300659 107542 -54555 17416 183424 267648
31818 267648 335232 491557 633604 598798 448567 428449 643474 871131 784372 383684
31808 383684 96168 292467 773112 978007 705861 323205 181744 175580 68558 -68310
31798 -68310 -39476 107504 223533 378656 705137 1058724 1172731 1057063 928150 826448
31788 826448 635155 426093 437284 692397 955072 1099637 1235775 1407514 1455280 1284250
31778 1284250 1028354 823682 628597 409317 315144 479587 763726 897949 839251 804898
31768 804898 928975 1050506 943558 651211 438326 447851 576059 699332 809231 838195
$$ packed form
31838E58920J15427J04587r6485n4963J41536Q106l94486m49742k1277K82310
31828A93933J00875j44766m0858J50481M0994j93117j62097P1971J66008Q4224
31818B67648O7584J56325J42047l4806j50231k0118K15025K27657q6759m00688
31808C83684k87516J96299M80645K04895k72146l82656j41461o164j07022j36868
31798f8310K8834J46980J16029J55123L26481L53587J14007j15668j28913j01702
31788H26448j91293k09062J1191K55113K62675J44565J36138J71739M7766j71030
31778A284250k55896k04672j95085k19280r4173J64443K84139J34223n8698l4353
31768H04898J24077J21531j06948k92347k12885R525J28208J23273J09899K8964
$$ plain form
31758 838195 609398 171951 -41988 288108 870873 1154368 1061111 953770 948056 786310
31748 786310 442413 286347 455318 588795 464932 400184 659893 941347 887911 707100
31738 707100 763118 896868 726161 365820 237245 330892 289091 130745 234542 588880
31728 588880 722038 509017 414990 692800 916223 669894 225770 85852 192688 85131
31718 85131 -346430 -735511 -825603 -771591 -787805 -806158 -629157 -243680 162698 420815
31708 420815 512417 514638 493292 470492 455111 453053 440212 377662 293635 306188 497938 785806
31696 785806 977475 952330 745085 484012 315858 358932 617843 918789 1023161 867105
31686 867105 632128 513349 472876 341880 162428 240984 711182 1175457 1068271 403928
$$ packed form
31758H38195k28797m37447k13939L30096N82765K83495r3257j07341n714j61746
31748G86310l43897j56066J68971J33477j23863o4748K59709K81454n3436j80811
31738G07100N6018J33750j70707l60341j28575R3647m1801j58346J03797L54338
31728E88880J33158k13021r4027K77810K23423k46329m44124j39918J06836j07557
31718H5131m31561l89081r0092N4012j6214j8353J77001L85477M06378K58117
31708D20815R1602K221k1346k2800j5381k058j2841o2550q4027J2553J91750K87868
31696G85806J91669k5145k07245k61073j68154M3074K58911L00946J04372j56056
31686H67105k34977j18779m0473j30996j79452P8556M70198M64275j07186o64343
$$ plain form
31676 403928 -135437 -9937 547224 945465 1030286 1092772 1241263 1231033 953721 681408
31666 681408 674250 841049 933937 848612 628665 395452 344292 565386 814493 746770 437427
31655 437427 328756 555420 709485 474275 121900 93133 369245 571723 488626 234492
31645 234492 42479 101340 436796 803585 893628 759627 754575 942500 953148 616983
31635 616983 312177 371182 553247 496898 324464 342266 458628 401184 259912 293426
31625 293426 389021 241298 -70507 -193709 -80157 45565 192283 544452 946646 988234
31615 988234 638325 312636 254055 295047 286356 303759 335466 202361 -68610 -170352 34479
31604 34479 311423 433338 467219 554617 660713 662890 505478 222139 -31741 -22784 266916
$$ packed form
31676D03928n39365J25500N57161L98241Q4821O2486J48491j0230k77312k72313
31666F81408p158J66799R2888q5325k19947k33213n1160K21094K49107o7723l09343
31655D37427j08671K26664J54065k35210l52375k8767K76112K02478q3097k54134
31645B34492j92013N8861L35456L66789R0043j34001n052J87925J0648l36165
31635F16983l04806N9005J82065n6349j72434J7802J16362n7444j41272L3514
31625B93426R5595j47723l11805j23202J13552J25722J46718L52169M02194M1588
31615I88234l49909l25689n8581M0992q691J7403L1707j33105k70971j01742K04831
31604C4479K76944J21915L3881Q7398J06096K177j57412k83339k53880Q957K89700
$$ plain form
31593 266916 492335 368074 105883 81497 212842 127473 -144909 -187075 93647 328310
31583 328310 355102 461399 764752 888418 563605 129527 78781 400406 695924 739098
31573 739098 653269 667776 864720 1060908 925146 416780 43557 315592 963879 1193599
31563 1193599 798783 457285 684613 1078250 1020210 641326 527428 778274 954892 832199
31553 832199 659777 669316 764526 777541 703913 594502 463532 384959 480050 719727 877315
31542 877315 765375 456647 221295 258635 490905 632123 495508 196566 -18776 -69989
31532 -69989 -21217 142199 460259 743957 689930 331206 81727 198653 465811 564095
31522 564095 482771 358940 175350 -96714 -251175 -76167 261785 374590 183106 24600
$$ packed form
31593B66916K25419j24261k62191k4386J31345q5369k72382m2166K80722K34663
31583C28310K6792J06297L03353J23666l24813m34078n0746L21625K95518M3174
31573G39098q5829J4507J96944J96188j35762n08366l73223K72035O48287K29720
31563A193599l94816l41498K27328L93637n8040l78884j13898K50846J76618j22693
31553H32199j72422R539R5210J3015p3628j09411j30970p8573R5091K39677J57588
31542H77315j11940l08728k35352L7340K32270J41218j36615k98942k15342n1213
31532f9989M8772J63416L18060K83698n4027l58724k49479J16926K67158R8284
31522E64095q1324j23831j83590k72064j54461J75008L37952J12805j91484j58506
$$ plain form
31512 24600 183562 528418 712664 600206 367070 228841 191920 133943 60115 132723
31502 132723 406340 689237 791057 773446 783896 773185 620085 442109 481116 698883
31492 698883 789753 631080 442572 442898 607714 822050 1013074 1080341 965173 841240
31482 841240 947840 1182430 1182796 881660 610520 545819 471261 276626 244026 526353 744338
31471 744338 523584 134738 125594 494975 714208 513604 207444 189019 454651 734673
31461 734673 846746 798468 685722 581909 480359 351048 277748 426154 783634 1066746
31451 1066746 1040598 819127 677795 672627 650808 567405 553515 666409 785758 819253 846521
31440 846521 959488 1064491 970791 660640 364819 315516 487589 674074 768607 819298
$$ packed form
31512B4600J58962L44856J84246j12458k33136j38229l6921n7977p3828P2608
31502A32723K73617K82897J01820j7611J0450j0711j53100j77976L9007K17767
31492F98883R0870j58673j88508L26J64816K14336J91024O7267j15168j23933
31482H41240J06600K34590L66l01136k71140o4701p4558j94635l2600K82327K17985
31471G44338k20754l88846r144L69381K19233k00604l06160j8425K65632K80022
31461G34673J12073m8278j12746j03813j01550j29311p3300J48406L57480K83112
31451A066746k6148k21471j41332n168k1819q3403j3890J12894J19349L3495K7268
31440H46521J12967J05003r3700l10151k95821m9303J72073J86485R4533N0691
$$ plain form
31430 819298 819886 690494 541011 653951 1004324 1101965 641659 48393 -55226 278192
31420 278192 493104 432976 454954 662885 697552 432421 242546 339555 425880 304398
31410 304398 258803 462963 564846 307697 64329 236666 559022 560700 349850 338911
31400 338911 497682 507740 425761 552665 803737 836443 690023 679436 746985 570702
31390 570702 276805 353199 794927 1019243 781714 519486 550972 570721 290605 26381
31380 26381 191139 614220 834938 785735 731860 731005 589729 265472 -53635 -237536 -304934
31369 -304934 -265217 -117285 23162 19429 -72745 -73271 57466 195025 275114 365577 509833
31358 509833 660100 781302 864233 814009 512350 77391 -114035 167145 670856 934107
$$ packed form
31430H19298N88j29392j49483J12940L50373R7641m60306n93266j03619L33418
31420B78192K14912o0128K1978K07931L4667k65131j89875R7009Q6325j21482
31410C04398m5595K04160J01883k57149k43368J72337L22356J678k10850j0939
31400C38911J58771J0058q1979J26904K51072L2706j46420j0587O7549j76283
31390E70702k93897P6394M41728K24316k37529k62228L1486J9749k80116k64224
31380B6381J64758M23081K20718m9203n3875q55j41276l24257l19107j83901o7398
31369c04934L9717J47932J40447l733r2174n26J30737J37559Q0089R0463J44256
31358E09833J50267J21202Q2931n0224l01659m34959j91426K81180N03711K63251
$$ plain form
31348 934107 838402 690344 734742 844593 822823 767614 880773 1061453 1011834 715674
31338 715674 498192 562990 755221 875319 955275 1080384 1173366 1134747 1021417 927782
31328 927782 849705 800287 876750 1059457 1128800 949882 665799 450448 272518 86990
31318 86990 30001 178523 327602 294529 261148 485872 815875 848031 508817 128852
31308 128852 -36183 -30669 59547 259298 518487 649074 575254 470269 538689 772803
31298 772803 986000 1013276 858817 689734 656635 706475 674061 565430 552173 634398 589874
31287 589874 390546 340829 573448 758126 644219 538973 781452 1048581 794384 207821
31277 207821 41952 482099 865446 691798 296561 229123 475173 671098 712329 746209
$$ packed form
31348I34107r5705j48058M4398J09851k1770n5209J13159J80680m9619k96160
31338G15674k17482O4798J92231J20098P9956J25109R2982l8619j13330r3635
31328I27782p8077m9418P6463J82707O9343j78918k84083k15351j77930j85528
31318H6990n6989J48522J49079l3073l3381K24724L30003L2156l39214l79965
31308A28852j65035N514R0216J99751K59189J30587p3820j04985O8420K34114
31298G72803K13197K7276j54459j69083l3099M9840l2414j08631j3257Q2225m4524
31287E89874j99328m9717K32619J84678j13907j05246K42479K67129k54197n86563
31277B07821j65869M40147L83347j73648l95237o7438K46050J95925M1231L3880
$$ plain form
31267 746209 794547 739143 555007 308832 46556 -133137 -51171 308652 664914 734041
31257 734041 551448 351211 257319 252326 323496 451561 525648 433683 212635 11437 -54128
31246 -54128 56351 336134 710192 1027650 1154124 1074476 890343 727169 627491 524003
31236 524003 363863 248232 318169 487181 507793 395847 498950 925052 1201253 859658
31226 859658 143958 -288811 -222409 9056 147944 242615 294495 213712 167009 442983
31216 442983 884785 984429 661062 395221 425569 409503 142707 -1190 252113 515148
31206 515148 347814 -29121 -159169 -89821 -113806 -114340 190619 590383 638271 438608 516492
31195 516492 936086 1192178 1037183 803367 756761 697638 439496 199100 208918 319750
$$ packed form
31267G46209M8338n5404j84136k46175k62276j79693Q1966L59823L56262O9127
31257G34041j82593k00237r3892m993P1170J28065P4087r1965k21048k01198o5565
31246e4128J10479K79783L74058L17458J26474p9648j84133j63174r9678j03488
31236E24003j60140j15631O9937J69012K0612j11946J03103M26102K76201l41595
31226H59658p15700m32769O6402K31465J38888R4671N1880q0783m6703K75974
31216D42983M41802R9644l23367k65841L0348j6066k66796j43897K53303K63035
31206E15148j67334l76935j30048O9348k3985n34L04959L99764M7888j99663P7884
31195E16492M19594K56092j54995k33816m6606n9123k58142k40396R818J10832
$$ plain form
31185 319750 300203 234613 314750 469453 514148 509753 672440 1001381 1242413 1199723 914489
31174 914489 563117 314873 258462 345453 415672 359446 237662 193447 286630 450853 550716
31163 550716 455527 162181 -102548 -40241 340276 623175 444899 -10407 -189004 146804
31153 146804 626902 756345 499234 221755 200075 406628 702592 967866 1033927 790091
31143 790091 469290 536238 1071899 1510333 1294015 632291 257148 504665 1011086 1302501
31133 1302501 1277896 1032635 623475 209836 81880 287627 491050 442812 338068 440732
31123 440732 614759 580468 438478 525695 834634 979398 755254 395084 212607 263561
31113 263561 419319 541737 529478 389639 293428 380494 530628 550717 539416 753641
$$ packed form
31185C19750j9547o5590Q0137J54703M4695m395J62687L28941K41032m2690k85234
31174I14489l51372k48244n6411Q6991P0219n6226j21784m4215R3183J64223R9863
31163E50716r5189k93346k64729O2307L80517K82899j78276m55306j78597L35808
31153A46804M80098J29443k57111k77479k1680K06553K95964K65274O6061k43836
31143G90091l20801O6948N35661M38434k16318o61724l75143K47517N06421K91415
31133A302501k4605k45261m09160m13639j27956K05747K03423m8238j04744J02664
31123D40732J74027l4291j41990Q7217L08939J44764k24144l60170j82477N0954
31113B63561J55758J22418j2259j39839r6211Q7066J50134K0089j1301K14225
$$ plain form
31103 753641 1099594 1123806 643570 63362 -136336 36375 256744 393949 568051 822466
31093 822466 1014387 1015471 852567 666344 620932 772390 941543 855561 534495 358295
31083 358295 559691 830096 709891 252305 -41019 77333 315193 333166 195510 161085
31073 161085 282566 438815 588736 741271 770287 524668 131331 -30631 249049 734408
31063 734408 986507 846521 602917 659298 1068526 1457321 1445129 1066455 674889 482160
31053 482160 375255 211044 67129 68550 150767 189607 236635 405214 612150 670347 583270
31042 583270 497733 400903 153799 -162403 -256147 -67221 122827 169610 323291 757150
31032 757150 1135639 1022188 547706 273239 441195 742945 852220 818499 814620 818639
$$ packed form
31103G53641L45953K4212m80236n80208j99698J72711K20369J37205J74102K54415
31093H22466J91921J084j62904j86223m5412J51458J69153q5982l21066j76200
31083C58295K01396K70405j20205m57586k93324J18352K37860J7973j37656l4425
31073A61085J21481J56249J49921J52535K9016k45619l93337j61962K79680M85359
31063G34408K52099j39986k43604N6381M09228L88795j2192l78674l91566j92729
31053D82160j06905j64211j43915J421Q2217L8840M7028J68579K06936N8197q7077
31042E83270q5537r6830k47104l16202r3744J88926J90048M6783J53681M33859
31032G57150L78489j13451m74482k74467J67956L01750J09275l3721l879M019
$$ plain form
31022 818639 748118 678916 703845 728521 633784 534858 635808 862571 883741 545529 90070
31011 90070 -154065 -140876 -33315 105924 337054 594320 659747 472455 269391 266747
31001 266747 350558 282006 100338 67530 250863 438791 504682 569560 697532 704048 457130
30990 457130 154615 67802 154139 165213 47442 -6637 124356 333440 461584 479455
30980 479455 465535 493797 553157 545985 410950 250100 217899 279614 269951 219131 339722
30969 339722 583272 562522 163068 -109000 222214 852536 1057773 665920 200171 107633
30959 107633 310622 540492 667559 612801 330984 3979 -82254 52108 114994 47016
30949 47016 114841 396016 573755 433099 200751 159499 232420 199044 68400 -10446 -4249
$$ packed form
31022H18639p0521o9202K4929K4676r4737r8926J00950K26763K1170l38212m55459
31011I0070k44135J3189J07561J39239K31130K57266O5427j87292k03064k644
31001B66747Q3811o8552j81668l2808J83333J87928O5891O4878J27972O516k46918
30990D57130l02515q6813Q6337J1074j17771n4079J30993K09084J28144J7871
30980D79455j3920K8262N9360p172j35035j60850l2201O1715r663n0820J20591
30969C39722K43550k0750l99454k72068L31214O30322K05237l91853m65749r2538
30959A07633K02989K29870J27067n4758k81817l27005q6233J34362O2886o7978
30949D7016O7825K81175J77739j40656k32348m1252P2921l3376j30644p8846O197
$$ plain form
30938 -4249 52749 180031 343164 400160 297190 134180 -49623 -297469 -462327 -271500
30928 -271500 170727 344558 50546 -201995 85124 624444 754887 405172 138532 321863
30918 321863 719230 926377 815824 486475 92625 -180616 -201456 -33477 144899 258876
30908 258876 341383 386543 375830 379938 442810 441168 270445 91429 147066 383077 508719
30897 508719 425106 342320 438514 622737 704590 642606 555705 570975 680606 720613 560508
30886 560508 342516 367857 661001 874941 794625 668849 768319 875465 619468 146527
30876 146527 -30849 188145 357376 196581 -23123 22786 222573 277852 153582 35138
30866 35138 45291 209053 514135 818379 877193 657584 460325 530467 707789 695804
$$ packed form
30938d249N6998J27282J63133N6996j02970j63010j83803k47846j64858J90827
30928b71500M42227J73831k94012k52541K87119N39320J30443l49715k66640J83331
30918C21863L97367K07147j10553l29349l93850k73241k0840J67979J78376J13977
30908B58876Q2507M5160j0713M108O2872j642j70723j79016N5637K36011J25642
30897E08719q3613q2786R6194J84223Q1853o1984q6901J5270J09631M0007j60105
30886E60508k17992K5341K93144K13940q0316j25776R9470J07146k55997m72941
30876A46527j77376K18994J69231j60795k19704M5909J99787N5279j24270j18444
30866C5138J0153J63762L05082L04244N8814k19609j97259P0142J77322j1985
$$ plain form
30856 695804 534401 509631 652811 651390 324040 -81133 -210718 -47474 151835 239117
30846 239117 272805 275677 159824 -21611 7497 367134 720330 630754 156042 -221853
30836 -221853 -267729 -253578 -431972 -586139 -358973 191842 651416 742990 535755 260068
30826 260068 128848 253258 533747 705057 644532 524652 516477 522232 400923 251198
30816 251198 202395 124759 -126707 -356394 -285776 -16315 169104 323986 680798 1075482
30806 1075482 1088189 765665 622801 821717 932289 703429 495664 644040 914210 969361
30796 969361 911529 924332 800591 343359 -95720 -50745 301864 385389 82694 -201924
30786 -201924 -254843 -248544 -228136 4242 378507 488164 245611 109855 377236 689947
$$ packed form
30856F95804j61403k4770J43180j421l27350m05173j29585J63244J99309Q7282
30846B39117L3688K872j15853j81435K9108L59637L53196q9576m74712l77895
30836b21853m5876J4151j78394j54167K27166N50815M59574R1574k07235k75687
30826B60068j31220J24410K80489J71310o0525j19880q175N755j21309j49725
30816B51198m8803p7636k51466k29687P0618K69461J85419J54882L56812L94684
30806A075482J2707l22524j42864J98916J10572k28860k07765J48376K70170N5151
30796I69361n7832J2803j23741m57232m39079M4975L52609Q3525l02695k84618
30786b01924n2919O299K0408K32378L74265J09657k42553j35756K67381L12711
$$ plain form
30776 689947 615925 344132 351402 636941 790321 691791 625180 687511 597202 251829 36497
30765 36497 279663 711768 828427 607305 466175 571918 612456 351312 42146 62492
30755 62492 377459 638123 671356 601068 562509 573574 669417 884786 1061316 943996 571464
30744 571464 320296 405067 560951 442258 150247 70784 282545 461861 403043 316322
30734 316322 464658 745917 854124 717209 538250 455090 393944 288605 231142 296747
30724 296747 373374 318605 197448 195102 326009 406771 343401 272736 331451 434409 432787
30713 432787 392983 512080 764451 852468 611002 290833 254358 473304 562855 340158
30703 340158 102573 188820 445285 400996 -74678 -578933 -698897 -460903 -131326 163214
$$ packed form
30776F89947p4022k71793P270K85539J53380r8530o6611O2331r0309l45373k15332
30765C6497K43166M32105J16659k21122j41130J05743M0538k61144l09166K0346
30755F2492L14967K60664L3233p0288l8559J1065R5843K15369J76530j17320l72532
30744E71464k51168Q4771J55884j18693k92011p9463K11761J79316n8818q6721
30734C16322J48336K81259J08207j36915j78959q3160o1146j05339n7463O5605
30724B96747P6627n4769j21157k346J30907Q0762o3370p0665N8715J02958j622
30713D32787l9804J19097K52371Q8017k41466l20169l6475K18946Q9551k22697
30703C40158k37585Q6247K56465m4289m75674n04255j19964K37994L29577K94540
$$ plain form
30693 163214 391446 421172 193543 -25213 89239 439489 624268 526638 427900 492061
30683 492061 522546 366410 201221 222304 353330 471611 614412 741099 627361 279939
30673 279939 109888 330491 530232 317781 72008 417395 1134750 1333215 736407 69672
30663 69672 -36579 147251 98460 -93378 -28409 245148 357353 289358 369883 668881
30653 668881 876312 811855 656641 601348 590466 517552 409453 308570 185915 63499
30643 63499 32379 74600 63394 7746 61994 185603 69109 -387065 -763507 -609115 -90682
30632 -90682 210979 102924 -23379 139488 365167 331950 170724 235059 522059 685648
30622 685648 552246 303810 165848 187577 323669 474299 450297 164155 -144191 -149351
$$ packed form
30693A63214K28232K9726k27629k18756J14452L50250J84779r7630r8738O4161
30683D92061L0485j56136j65189K1083J31026J18281J42801J26687j13738l47422
30673B79939j70051K20603J99741k12451k45773L45387P17355J98465n96808o66735
30663F9672j06251J83830m8791j91838O4969K73557J12205o7995Q0525K98998
30653F68881K07431o4457j55214n5293j0882p2914j08099j00883j22655j22416
30643F3499l1120M2221j1206n5648N4248J23609j16494m56174l76442J54392N18433
30632i0682L01661j08055j26303J62867K25679l3217j61226O4335K87000J63589
30622F85648j33402k48436j37962K1729J36092J50630k4002k86142l08346n160
$$ plain form
30612 -149351 91111 217928 128085 82560 192579 215461 27604 -100858 54915 318491
30602 318491 465592 587074 779700 807192 467878 43734 -39907 180672 344019 345952
30592 345952 383482 542413 729432 907898 1036513 905702 427682 -39341 -75828 203580
30582 203580 365899 337238 373393 465160 344131 64506 717 209597 351012 328000
30572 328000 437427 746421 890216 696619 475746 448083 396672 156979 -44721 -43335
30562 -43335 -49691 -194225 -228658 -34249 52600 -165392 -301463 -34983 222975 -83803
30552 -83803 -717723 -940560 -568677 -111196 74507 177604 446953 804379 1045245 1062197
30542 1062197 807210 335128 -97695 -262541 -263917 -329534 -366765 -97000 387149 607927
$$ packed form
30612a49351K40462J26817q9843m5525J10019K2882j87857j28462J55773K63576
30602C18491J47101J21482J92626K7492l39314m24144q3641K20579J63347J933
30592C45952L7530J58931J87019J78466J28615j30811m78020m67023l6487K79408
30582B03580J62319k8661L6155R1767j21029k79625o3789K08880J41415k3012
30572C28000J09427L08994J43795j93597k20873k7663n1411k39693k01700J386
30562d3335o356j44534l4433J94409Q6849k17992j36071K66480K57958l06778
30552h3803o33920k22837L71883M57481J85703J03097K69349L57426K40866J6952
30542A062197k54987m72082m32823j64846j376o5617l7231K69765M84149K20778
$$ plain form
30532 607927 332566 -127248 -363085 -317832 -154580 43848 255604 395874 414779 425733
30522 425733 582274 855284 1020220 875290 467859 102756 67058 318046 537246 538945
30512 538945 479895 568387 744920 830900 839432 897351 954761 836165 550272 301981 181153
30501 181153 55679 -178996 -417033 -470592 -270207 89224 411198 513441 383291 212947
30491 212947 192201 284615 295329 135346 -71356 -132861 23909 300682 528070 632956
30481 632956 687232 742694 702698 504065 331426 390139 506167 295662 -215761 -520591
30471 -520591 -320022 78454 255749 214088 159775 110150 47225 148497 487166 762271
30461 762271 710713 547685 601632 753481 681079 441154 318601 279226 105324 -57208
$$ packed form
30532F07927k75361m59814k35837M5253J63252J98428K11756J40270J8905J0954
30522D25733J56541K73010J64936j44930m07431l65103l5698K50988K19200J699
30512E38945n9050Q8492J76533Q5980Q532N7919N7410j18596k85893k48291j20828
30501A81153j25474k34675k38037n3559K00385L59431L21974J02243j30150j70344
30491B12947k0746R2414J0714j59983k06702o1505J56770K76773K27388J04886
30481F32956N4276N5462l9996j98633j72639N8713J16028k10505n11423l04830
30471e20591K00569L98476J77295m1661n4313m9625o2925J01272L38669K75105
30461G62271n1558j63028N3947J51849p2402k39925j22553l9375j73902j62532
$$ plain form
30451 -57208 134452 556462 704972 478392 315853 465305 645265 582915 400589 279777
30441 279777 180242 103758 240802 615761 910022 869138 639156 529437 658867 935063
30431 935063 1154840 1088259 730325 452931 568139 792061 599083 87283 -88992 264694
30421 264694 582136 472049 287836 394717 505200 267717 -19341 87685 359591 259692
30411 259692 -134580 -257651 33225 322212 368175 364644 428265 393962 245965 263340 550123
30400 550123 810454 786548 607574 517701 517395 461329 321014 187024 131551 162909 220396
30389 220396 196808 82843 48978 215548 409223 383143 217427 195409 304728 239526
30379 239526 -28941 -92965 274687 696040 684092 317867 84858 201428 433769 531304
$$ packed form
30451e7208J91660M22010J48510k26580j62539J49452J79960o2350j82326j20812
30441B79777r9535p6484J37044L74959K94261m0884k29982j09719J29430K76196
30431I35063K19777o6581l57934k77394J15208K23922j92978n11800j76275L53686
30421B64694L17442j10087j84213J06881J10483k37483k87058J07026K71906r9899
30411B59692l94272j23071K90876K88987M5963l531O3621l4303j47997J7375K86783
30400E50123K60331k3906j78974q9873l06n6066j40315j33990n5473L1358N7487
30389B20396k3588j13965l3865J66570J93675k6080j65716k2018J09319o5202
30379B39526k68467o4024L67652M21353j1948l66225k33009J16570K32341R7535
$$ plain form
30369 531304 506336 458611 407211 385246 482279 675426 777458 675133 500862 442251 472897
30358 472897 421178 266793 208278 393909 698497 854948 763662 588790 547697 671844
30348 671844 805111 790628 606832 340562 94580 -58196 -84498 -4809 118999 236732
30338 236732 321711 309845 107598 -244413 -482457 -370750 -58691 11832 -336480 -727324
30328 -727324 -673994 -179710 321719 527542 502037 397981 262687 175983 269524 468983
30318 468983 477164 183331 -138627 -219579 -151683 -139367 -123930 55315 296145 351033 217896
30307 217896 126893 206914 414991 691735 913020 822715 364486 -21572 158412 751378
30297 751378 1119028 991586 701004 525948 333471 37350 -109132 30904 169081 76885
$$ packed form
30369E31304k4968m7725n1400k1965R7033J93147J02032j02325j74271n8611L0646
30358D72897n1719j54385n8515J85631L04588J56451r1286j74872m1093J24147
30348F71844J33267j4483j83796k66270k45982j52776k6302P9689J23808J17733
30338B36732Q4979j1866k02247l52011k38044J11707L12059P0523l48312l90844
30328g27324N3330M94284N01429K05823k5505j04056j35294q6704R3541J99459
30318D68983Q181k93833l21958q0952O7896J2316J5437J79245K40830N4888j33137
30307B17896r1003Q0021K08077K76744K21285r0305m58229l86058J79984N92966
30297G51378L67650j27442k90582j75056j92477k96121j46482J40036J38177r2196
$$ plain form
30287 76885 -4209 189414 432584 372242 110779 -24076 -44191 -136042 -131436 274313 846676
30276 846676 958501 494879 74102 184766 555702 628274 297120 -86833 -192111 45805
30266 45805 442208 649058 437389 41029 -37667 282486 491673 237396 -128711 -121971
30256 -121971 98851 51317 -200198 -140248 271376 457934 176504 -40262 253605 665064
30246 665064 577849 122614 -59691 209500 526115 662354 823558 1088531 1168003 909729
30236 909729 582107 437839 393705 356220 457290 696858 744659 438443 137760 199982
30226 199982 405369 329893 34135 -95770 -7493 18364 -88408 -149355 -178008 -346065
30216 -346065 -519657 -352780 98630 366850 283439 194734 310711 359596 148558 -15828
$$ packed form
30287G6885q1094J93623K43170o0342k61463j34855k0115r1851M606M05749N72363
30276H46676J11825m63622m20777J10664L70936P2572l31154l83953j05278K37916
30266D5805L96403K06850k11669l96360p8696L20153K09187k54277l66107O740
30256a21971K20822m7534k51515N9950M11624J86558k81430k16766K93867M11459
30246F65064q7215m55235j82305K69191L16615J36239J61204K64973P9472k58274
30236I09729l27622j44268m4134l7485J01070K39568M7801l06216l00683O2222
30226A99982K05387p5476k95758j29905Q8277K5857j06772o0947k8653j68057
30216c46065j73592J66877M51410K68220q3411q8705J15977M8885k11038j64386
$$ plain form
30206 -15828 175390 501798 572482 424051 364934 443282 461145 374034 318218 327462 321430
30195 321430 299888 292601 208074 -17302 -211800 -160421 77034 278472 399690 546410
30185 546410 685117 665084 504942 394382 397941 380772 247930 62089 -90557 -172576
30175 -172576 -132782 40294 189116 105943 -167850 -328444 -172059 152995 336160 259842
30165 259842 86761 41030 180857 401122 609388 813119 995131 1008040 736994 324345
30155 324345 57760 38559 142356 297975 554762 825447 851176 564972 248052 162021
30145 162021 241563 304236 324012 318046 222025 97289 191427 523962 686731 394756 -14972
30134 -14972 -38622 246278 351576 162952 44397 191549 388904 474464 571602 720008
$$ packed form
30206a5828J91218L26408P0684j48431n9117P8348J7863q7111n5816R244o032
30195C21430k1542p287q4527k25376j94498N1379K37455K01438J21218J46720
30185E46410J38707k0033j60142j10560L559j7169j32842j85841j52646q2019
30175a72576L9794J73076J48822q3173k73793j60594J56385L25054J83165p6318
30165B59842j73081m5731J39827K20265K08266K03731J82012J2909k71046m12649
30155C24345k66585j9201J03797J55619K56787K70685K5729k86204l16920q6031
30145A62021P9542O2673J9776n966r6021j24736R4138L32535J62769k91975m09728
30134a4972k3650K84900J05298j88624j18555J47152J97355Q5560R7138J48406
$$ plain form
30124 720008 700710 428688 169299 140337 183957 64474 -138896 -176585 -12051 148129
30114 148129 124583 -63224 -226865 -164098 107679 278814 90426 -256375 -292002 77543
30104 77543 422028 401297 207375 174015 235226 108238 -152685 -168002 206622 646777
30094 646777 779716 620202 453913 429065 441956 397072 395899 557662 752001 703274 388213
30083 388213 139172 229917 505842 593807 373146 54227 -123050 -67583 203838 549172
30073 549172 696328 514667 272091 355368 729468 950938 751477 331306 22654 -50670
30063 -50670 94227 402234 695226 766073 690770 769756 1020392 1040495 583287 -21886
30053 -21886 -276243 -95943 261310 605434 850588 862503 618415 375243 347348 342398
$$ packed form
30124G20008j9298k72022k59389k8962M3620j19483k03370l7689J64534J60180
30114A48129k3546j87807j63641O2767K71777J71135j88388l46801l5627L69545
30104G7543L44485k0731j93922l3360O1211j26988k60923j5317L74624M40155
30094F46777J32939j59514j66289k4848J2891m4884j173J61763J94339m8727l15061
30083C88213k49041R0745K75925Q7965k20661l18919j77277N5467K71421L45334
30073E49172J47156j81661k42576Q3277L74100K21470j99461m20171l08652p3324
30063e0670J44897L08007K92992P0847p5303P8986K50636K0103m57208o05173
30053b1886k54357J80300L57253L44124K45154J1915k44088k43172k7895m950
$$ [...]
##END NTUPLES=NMR SPECTRUM
##END=
