##TITLE=31Pdec_42-2021
 CDCl3, 24 sc
 11.06.2021
##JCAMPDX= 6.0         $$ Bruker NMR JCAMP-DX V2.0
##DATA TYPE= NMR SPECTRUM
##DATA CLASS= NTUPLES
##ORIGIN= UXNMR, Bruker Analytische Messtechnik GmbH
##OWNER= root
$$ XWIN-NMR		Version 3.5
$$ Fri Jun 11 11:10:46 2021 Russian Standard Time (UT+4h)  she@DPX200
##.OBSERVE FREQUENCY= 81.013821
##.OBSERVE NUCLEUS= ^31P
##.ACQUISITION MODE= SIMULTANEOUS
##.ACQUISITION SCHEME= undefined
##.AVERAGES= 24
##.DIGITISER RES= 16
##SPECTROMETER/DATA SYSTEM= spect
##.PULSE SEQUENCE= zgpg30
##.SOLVENT NAME= CDCl3
##.SHIFT REFERENCE= (INTERNAL, CDCl3, 0, 248.564)
##AUDIT TRAIL= $$ (NUMBER, WHEN, WHO, WHERE, WHAT)
$$ ##TITLE= Audit trail, XWIN-NMR		Version 3.5
$$ ##JCAMPDX= 5.01
$$ ##ORIGIN= Bruker BioSpin GmbH
$$ ##OWNER= she
$$ F:/spectra/data/she/nmr/P31/1/pdata/1/auditp.txt
$$ ##AUDIT TRAIL=  $$ (NUMBER, WHEN, WHO, WHERE, WHAT)
(   1,<2021-06-11 11:09:23.84 +0400>,<she>,<DPX200>,
      <created by zg, POWCHK disabled, PULCHK disabled
       configuration hash MD5:
       00 E9 B6 7A A2 85 ED C7 34 08 36 98 17 FE 4E 26
       data hash MD5: 32K
       E1 BD 94 07 19 2F 4C 45 01 6F 9A 87 A4 AE 4C A0>)
(   2,<2021-06-11 11:09:26.50 +0400>,<she>,<DPX200>,
      <Start of raw data processing
       efp BC_mod = 2 LB = 1 FT_mod = 6 PKNL = 1 PHC0 = -5671.501 PHC1 = -355.1251 SI = 64K 
       data hash MD5: 64K
       50 34 B5 3F 0B DB 85 A1 F0 15 03 40 6E D7 FF AD>)
(   3,<2021-06-11 11:10:10.07 +0400>,<she>,<DPX200>,
      <pk PHC0 = -62.9941 PHC1 = 170.3999 
       data hash MD5: 64K
       CD 1C E4 89 FD 68 F1 C4 82 C3 DB 91 5E A9 C6 5F>)
$$ ##END=
$$ 
$$ hash MD5
$$ F3 AE D3 9F 08 7F 03 9C 72 CB DB F7 7F 3D E5 62
##$RELAX= 
##$RELAX= 
##$RELAX= 
##$RELAX= 
##$RELAX= 
##$RELAX= 
##$RELAX= 
##$RELAX= 
$$ Bruker specific parameters
$$ --------------------------
##$DU= <F:/spectra>
##$EXPNO= 1
##$NAME= <P31>
##$PROCNO= 1
##$TYPE= <nmr>
##$USER= <she>
##$AMP= (0..31)
100 100 100 100 100 100 100 100 100 100 100 100 100 100 100 100 100 100 
100 100 100 100 100 100 100 100 100 100 100 100 100 100 
##$AQSEQ= 0
##$AQ_mod= 1
##$AUNM= <au_zg>
##$AUTOPOS= <>
##$BF1= 81.014009
##$BF2= 200.13
##$BF3= 200.13
##$BF4= 200.13
##$BF5= 200.13
##$BF6= 200.13
##$BF7= 200.13
##$BF8= 200.13
##$BYTORDA= 1
##$CFDGTYP= 0
##$CFRGTYP= 5
##$CHEMSTR= <none>
##$CNST= (0..31)
1 1 145 1 1 1 1 1 1 1 1 1 1 1 1 1 1 1 1 1 1 1 1 1 1 1 1 1 1 1 1 1 
##$CPDPRG= <waltz16>
##$CPDPRG1= <>
##$CPDPRG2= <waltz16>
##$CPDPRG3= <>
##$CPDPRG4= <mlev>
##$CPDPRG5= <mlev>
##$CPDPRG6= <mlev>
##$CPDPRG7= <mlev>
##$CPDPRG8= <mlev>
##$CPDPRGB= <>
##$CPDPRGT= <>
##$D= (0..31)
0 1 0 0 0 0 0 0 0 0 0 0.03 2e-05 3e-06 0 0 0 0 0 0 0 0 0 0 0 0 0 0 0 0 
0 0 
##$DATE= 1623395363
##$DBL= (0..7)
120 120 120 11 120 120 24 19 
##$DBP= (0..7)
150 150 150 150 150 150 150 150 
##$DBP07= 0
##$DBPNAM0= <>
##$DBPNAM1= <>
##$DBPNAM2= <>
##$DBPNAM3= <>
##$DBPNAM4= <>
##$DBPNAM5= <>
##$DBPNAM6= <>
##$DBPNAM7= <>
##$DBPOAL= (0..7)
0.5 0.5 0.5 0.5 0.5 0.5 0.5 0.5 
##$DBPOFFS= (0..7)
$$ [...]
##$SUBNAM2= <"">
##$SUBNAM3= <"">
##$SUBNAM4= <"">
##$SUBNAM5= <"">
##$SUBNAM6= <"">
##$SUBNAM7= <"">
##$SUBNAM8= <"">
##$SUBNAM9= <"">
##$SW= 501.771253377433
##$SWIBOX= (0..15)
0 1 3 0 0 0 0 0 0 0 0 0 0 0 0 0 
##$SW_h= 40650.406504065
##$TD= 32768
##$TD0= 1
##$TE= 0
##$TE2= 300
##$TE3= 300
##$TEG= 300
##$TL= (0..7)
0 120 53 12 22 120 120 120 
##$TP= (0..7)
150 150 150 150 150 150 150 150 
##$TP07= 0
##$TPNAME0= <>
##$TPNAME1= <>
##$TPNAME2= <>
##$TPNAME3= <>
##$TPNAME4= <>
##$TPNAME5= <>
##$TPNAME6= <>
##$TPNAME7= <>
##$TPOAL= (0..7)
0.5 0.5 0.5 0.5 0.5 0.5 0.5 0.5 
##$TPOFFS= (0..7)
0 0 0 0 0 0 0 0 
##$TUNHIN= 0
##$TUNHOUT= 0
##$TUNXOUT= 0
##$USERA1= <user>
##$USERA2= <user>
##$USERA3= <user>
##$USERA4= <user>
##$USERA5= <user>
##$V9= 5
##$VALIST= <valist>
##$VCLIST= <CCCCCCCCCCCCCCC>
##$VD= 0
##$VDLIST= <DDDDDDDDDDDDDDD>
##$VPLIST= <PPPPPPPPPPPPPPP>
##$VTLIST= <TTTTTTTTTTTTTTT>
##$WBST= 1024
##$WBSW= 4
##$XGAIN= (0..3)
0 0 0 0 
##$XL= 0
##$YL= 0
##$YMAX_a= 7447
##$YMIN_a= -7584
##$ZGOPTNS= <>
##$ZL1= 120
##$ZL2= 120
##$ZL3= 120
##$ZL4= 120
##$ABSF1= 0
##$ABSF2= 0
##$ABSG= 0
##$ABSL= 0
##$ALPHA= 0
##$AQORDER= 0
##$ASSFAC= 0
##$ASSFACI= 0
##$ASSFACX= 0
##$ASSWID= 0
##$AUNMP= <proc_1d>
##$AZFE= 0.1
##$AZFW= 0.5
##$BCFW= 0
##$BC_mod= 2
##$BYTORDP= 0
##$COROFFS= 0
##$CY= -3
##$DATMOD= 1
##$DC= 0
##$DFILT= <>
##$DTYPP= 0
##$F1P= 0
##$F2P= 0
##$FCOR= 1
##$FTSIZE= 65536
##$FT_mod= 6
##$GAMMA= 0
##$GB= 0
##$INTBC= 1
##$INTSCL= 5.30512e-09
##$ISEN= 30
##$LB= 1
##$LEV0= 0
##$LPBIN= 0
##$MAXI= 10000
##$MC2= 0
##$MEAN= 0
##$ME_mod= 0
##$MI= 50
##$NCOEF= 0
##$NC_proc= -5
##$NLEV= 6
##$NOISF1= 182.463
##$NOISF2= 159.3651
##$NSP= 0
##$NTH_PI= 0
##$NZP= 0
##$OFFSET= 248.5645
##$PC= 4
##$PHC0= -5734.495
##$PHC1= -184.7252
##$PH_mod= 1
##$PKNL= yes
##$PPARMOD= 0
##$PSCAL= 0
##$PSIGN= 0
##$REVERSE= no
##$SF= 81.014009
##$SI= 65536
##$SIGF1= 159.3651
##$SIGF2= -187.1042
##$SINO= 113.3802
##$SIOLD= 16384
##$SREGLST= <1H.CDCl3>
##$SSB= 0
##$STSI= 65536
##$STSR= 0
##$SW_p= 40650.406504065
##$SYMM= 0
##$S_DEV= 0
##$TDeff= 32768
##$TDoff= 0
##$TI= <>
##$TILT= no
##$TM1= 0
##$TM2= 0
##$TOPLEV= 0
##$USERP1= <user>
##$USERP2= <user>
##$USERP3= <user>
##$USERP4= <user>
##$USERP5= <user>
##$WDW= 1
##$XDIM= 65536
##$YMAX_p= 542441442
##$YMIN_p= -24024704
$$ End of Bruker specific parameters
$$ ---------------------------------
##NTUPLES= NMR SPECTRUM
##VAR_NAME=  FREQUENCY,     SPECTRUM/REAL,   SPECTRUM/IMAG
##SYMBOL=    X,             R,               I
##VAR_TYPE=  INDEPENDENT,   DEPENDENT,       DEPENDENT
##VAR_FORM=  AFFN,          ASDF,            ASDF
##VAR_DIM=   65536,         65536,           65536
##UNITS=     HZ,            ARBITRARY UNITS, ARBITRARY UNITS
##FACTOR=    0.620285442955139, 1,           1
##FIRST=     20137.2065510759, 0,            0
##LAST=      -20513.1999529892, 0,           0
##MIN=       -20513.1999529892, -24024704,   0
##MAX=       20137.2065510759, 542441442,    0
$$ Real data points
##PAGE= N=1
##DATA TABLE= (X++(R..R)), XYDATA
$$ [...]
36279A80032j43518m38260l39866o7588O2353J57657L26272K88719j02463m39644
36269e16306l33085Q451J90929K11637K18590J22443j25657k63479j29287L5018
36259e80746M0202P1169K10669J62716j45931k59147L1379K05803j02427l63099
36249g29412j6330M82198L53131k05989l57193L0827L29992K82438K40508L29064
36239G39234K60741K2696n9066J3422o6237k11655n7148K25372Q1087l88053m56582
36228A03811j9499J54133k70698n78631j87612L94286M17916J6133j90571q0557
36218b41289L7126P5214J38910J45540k11j12615m1832O426j39552k52785j33277
36207e18345q454p0675n0820K27341L29529r9184n46289l24146K60413L28350
$$ plain form
36279 180032 36514 -401746 -741612 -809200 -746847 -589190 -262918 25801 -76662 -516306
36269 -516306 -849391 -840940 -650011 -438374 -219784 -97341 -222998 -486477 -615764 -580746
36259 -580746 -540544 -469375 -258706 -95990 -241921 -501068 -469689 -263886 -366313 -729412
36249 -729412 -745742 -263544 89587 -116402 -473595 -442768 -112776 169662 410170 739234
36239 739234 999975 1022671 963605 977027 910790 699135 641987 867359 948446 560393 103811
36228 103811 84312 238445 -32253 -610884 -798496 -404210 13706 29839 -160732 -241289
36218 -241289 -204163 -128949 9961 155501 155290 42675 843 7269 -132283 -385068 -518345
36207 -518345 -526799 -597474 -648294 -420953 -91424 -190608 -736897 -1061043 -800630 -472280
36197d72280j42090k95453J46659M28749O1259l59532j71318K74734K63933q1417
36187c46756n7897M16185O49782K49921l17382m37340j38977J08590Q3394l2636
36177A76884n1216k5240o3397j06025k7644J12317R7427j14497k47870o4162K37609
36166g5814K29997j31812m08486l02480p4591q6077j98006k2920L72263M95874
36156b02052J81843j67754k36322k24932l56745l86226m4448L48506K82868q4672
36146h89934r8100L53405N92471J71230m33614n24839j51320J07440L5096p3732
36136i11897k5049M8153Q6469K47183N10944N49223K11416j54582j45785J22904
36126E38979J88252r8940l80571l09750j8140J00635n5049j82804l0472K43976
$$ plain form
36197 -472280 -614370 -909823 -763164 -334415 -273156 -632688 -804006 -529272 -265339 -346756
36187 -346756 -404653 11532 661314 911235 593853 156513 17536 126126 209520 176884
36177 176884 125668 100428 37031 -68994 -96638 15679 113106 -1391 -249261 -313423 -75814
36166 -75814 154183 22371 -386115 -688595 -763186 -849263 -1047269 -1070189 -697926 -202052
36156 -202052 -20209 -187963 -424285 -649217 -1005962 -1392188 -1436636 -1088130 -805262 -889934
36146 -889934 -988034 -634629 -42158 129072 -304542 -829381 -980701 -873261 -838165 -911897
36136 -911897 -936946 -888793 -802324 -555141 -44197 505026 716442 561860 416075 538979
36126 538979 727231 628291 247720 -62030 -80170 20465 -34584 -217388 -247860 -3884
36116c884K91110J4480l62515n75577m82775n4157N29275Q07902M16715l88976
36106A91598q80444o58006m8502M01429N07263L64171O0436k33910k12640J62317
36096c46288M36100K17442k32242l53069o6135K09686J98279R810j68911k18333
36086c13661M616M71324P39687L61902m39737r23382p11542j59232J89077J39052
36076f41896j75483m62147l80401J31948O10423N32105M3983k07031J5103K85448
36066b47948K41272L4943o6610m1138P6772K66422K86742j03382n72729m76371
36056f02027J33394M33400M6320l89517k73633N9301N4785j12756O62K38588J86474
36045b25009k8686l2673M1824j45673l70303j51468L54815N37958K80905l34j47862
$$ plain form
36116 -3884 287226 301706 -60809 -636386 -1119161 -1173318 -644043 163859 580574 191598
36106 191598 -688846 -1346852 -1395354 -993925 -486662 -122491 -62055 -295965 -508605 -346288
36096 -346288 89812 307254 75012 -278057 -344192 -134506 63773 73583 -95328 -313661
36086 -313661 -309045 162279 901966 1263868 824131 -99251 -810793 -970025 -780948 -641896
36076 -641896 -817379 -1279526 -1659927 -1527979 -917556 -385451 -341468 -548499 -533396 -247948
36066 -247948 -6676 28267 -38343 -79481 -2709 263713 550455 447073 -125656 -602027
36056 -602027 -468633 -35233 11087 -378430 -652063 -592762 -537977 -650733 -650071 -411483 -225009
36045 -225009 -253695 -286368 -244544 -390217 -760520 -911988 -557173 -19215 261690 261356 113494
36034A13494l48353n08296l13859Q4754J90060n286j7110K48776L53986J55165
36024d6669K2698Q9733K9950k25578k91682p6781J6804r9418K8732M81077O21222
36013E50088J34831l52791k59458N6035K0263j75947o3918J78208R3031j68222
36003A2120j31049J30600J88034P7395J43946K60572J2371m39737m92478r5382
35993c33608J64791L9976p7272L1526M0652k14483l32469j2726L98361M14070
35983A18818P1976k38670k97408j32528J24926K38338J373m21089n66076k61101
35973a361441J46336K98545K47582K01421J87257J62638J46344O0468k21056m97743
35963f29649l23894K92432O94299M14665j62794l59577r0724K09643K64255J18867
$$ plain form
36034 113494 -234859 -743155 -1057014 -972260 -782200 -787486 -804596 -555820 -201834 -46669
36024 -46669 -23971 65762 95712 -129866 -421548 -498329 -481525 -580943 -552211 -71134 550088
36013 550088 684919 332128 72670 128705 148968 -26979 -90897 87311 180342 12120
36003 12120 -118929 11671 199705 277100 421046 681618 693989 254252 -238226 -333608
35993 -333608 -168817 -128841 -206113 -174587 -133935 -348418 -680887 -693613 -295252 118818
35983 118818 190794 -47876 -345284 -477812 -352886 -114548 -113175 -534264 -1100340 -1361441
35973 -1361441 -1215105 -916560 -668978 -467557 -280300 -117662 28682 89150 -131906 -629649
35963 -629649 -953543 -661111 33188 447853 285059 -74518 -165242 44401 308656 427523
35953D27523j39919l96603m03987o5812L21170M40787L72447L05682J35021k28680
35943G67629m50215k22268J24457P8922j88148j17519K24912K31220j53820k79041
35933A6129R8025L76182J17054k74021l02901j35636q7107O450K99686L75203
35923D89064j22512o99043o05188M4641M75761L92379J82249Q0964j07257l98237
35913b67179m42692j38384J43595J44231L3793l3733j80963l96100l51142O2030
35903a426544M29396L89840J64011J52014L03189K79865L3084j76457k00150j05405
35893a57157L3930J46746P9480j87024l47507j39134J95205J99044q6780j54654
35883d17851J63819L93123J31146l35341m64583k10021N6983J70433K62163L15583
$$ plain form
35953 427523 287604 -108999 -512986 -578798 -257628 183159 555606 861288 996309 767629
35943 767629 317414 95146 219603 298525 110377 -7142 217770 448990 295170 16129
35933 16129 114154 490336 607390 333369 30468 -105168 -192275 -185825 113861 489064
35923 489064 366552 -332491 -937679 -893038 -417277 -24898 157351 238315 131058 -267179
35913 -267179 -709871 -848255 -704660 -560429 -526636 -560369 -741332 -1137432 -1488574 -1426544
35903 -1426544 -997148 -607308 -443297 -291283 11906 291771 324855 148398 -51752 -157157
35893 -157157 -123227 23519 102999 -84025 -431532 -570666 -375461 -176417 -263197 -417851
35883 -417851 -254032 139091 270237 -65104 -529687 -739708 -682725 -512292 -250129 65454
35873F5454J23956k23271k72196J51629N87949N21293M6363l56606m73644m14394
35863b43467k14460J52096M35220K82176j88565m35343k36568L8945O2139o761
35853c54588M4673L0399k63490n82845n08866n4881M10360O47371O09761K55478
35843B33372k87030n59299k53651K65083L84387R5412p0025J07641K80717J65693
35833C62300q0849k22590k41035j69996k6615L1000j24461k51364l7678K73495
35823d87793J38284l58306n08558q8114K74850J43796n8310J10834L16528J19871
35813c96918j57087J3783M01141L93799K2846j82876j23152j15419j36543R4171
35803a86255L66767J83396k71803k56169K88523N15121Q854n10482l22059J97679
$$ plain form
35873 65454 189410 -33861 -306057 -154428 433521 954814 1001177 644571 170927 -243467
35863 -243467 -457927 -305831 129389 411565 223000 -212343 -448911 -409966 -347827 -354588
35853 -354588 -309915 -279516 -543006 -1125851 -1634717 -1689598 -1279238 -631867 -22106 233372
35843 233372 -53658 -612957 -866608 -601525 -217138 -121726 -191751 -84110 196607 362300
35833 362300 281451 58861 -182174 -352170 -378785 -347785 -472246 -723610 -761288 -487793
35823 -487793 -349509 -707815 -1216373 -1304487 -1029637 -885841 -944151 -833317 -516789 -396918
35813 -396918 -554005 -540222 -139081 254718 277564 94688 -28464 -143883 -280426 -186255
35803 -186255 180512 363908 92105 -164064 124459 639580 648434 137952 -184107 13572
35793A3572K55268j42808l81276k78561j87559k19517p8977K96471N19611L31177
35783A27401k5689j81251q8152O1812J37397J27620N5697l3652q3827r2759j02305
35772i7708j03675m7520L7224M6113m1069j01787k4380J54062L08414L52468K58931
35761G41073M0132k03095k86682j37558M1232k3402k62766k75588R9694M34815
35751A67855K33211l19115n32765j72292K18840J40174j62867j78612N1665J00034
35741d53872p6929j11120P9241J40486o6761j90867K6390L22960L40932J29604
35731A40064m7352j03489n5901J42184L86401L23107j64224o09412n24436j18431
35721f31489K1658j54259j33242K43581M47258R8863l67357l04105K05909M93624
$$ plain form
35793 13572 268840 126032 -255244 -533805 -721364 -940881 -1019858 -723387 -203776 127401
35783 127401 101712 -79539 -167691 -105879 31518 159138 214835 181183 97356 4597 -97708
35772 -97708 -201383 -248903 -211679 -165566 -206635 -308422 -332802 -178740 129674 482142 741073
35761 741073 781205 578110 291428 153870 195102 171700 -91066 -366654 -266960 167855
35751 167855 401066 81951 -450814 -623106 -404266 -264092 -426959 -605571 -553906 -453872
35741 -453872 -530801 -641921 -562680 -422194 -488955 -679822 -653432 -330472 10460 140064
35731 140064 92712 -10777 -66678 75506 461907 785014 620790 11378 -513058 -631489
35721 -631489 -609831 -764090 -897332 -653751 -206493 -107630 -474987 -779092 -573183 -79559
35711g9559K53263j28767k11999m0633J06049J60549K11635K13892M1473k46146
35701B79757m33757m24259k87857o6708K43422N01952M66101J26802k03610k70321
35691f8478j63922q7390l0378J09299K34455J56984o5912j73616p9590K8818p282
35680a47012j29665k17226k34198j74467l5682R9848J21848O7489P3885J35753
35670d39427J08653k0523j01948j11465j96054l32249k48749J22823M15602L13029
35660d90308J5850r5577m5369j10266k39853j18047K11644K95289j6925k69977
35650h63539p8485K87340L43288J15178j2215K9877k5438j88349j42186J34572
35640c99957K03705j12253l12423N6795O04669N73079n6618n25897l74125L0731
$$ plain form
35711 -79559 173704 44937 -167062 -207695 -101646 58903 270538 484430 525903 279757
35701 279757 -154000 -578259 -866116 -932824 -689402 -187450 278651 405453 201843 -68478
35691 -68478 -232400 -319790 -350168 -240869 -6414 150570 84658 -88958 -168548 -139730 -147012
35680 -147012 -276677 -493903 -728101 -902568 -938250 -838402 -716554 -649065 -575180 -439427
35670 -439427 -330774 -351297 -453245 -564710 -760764 -1093013 -1341762 -1218939 -803337 -490308
35660 -490308 -474458 -570035 -615404 -725670 -965523 -1083570 -871926 -576637 -593562 -863539
35650 -863539 -942024 -654684 -311396 -196218 -208433 -178556 -203994 -392343 -534529 -399957
35640 -399957 -196252 -308505 -620928 -564133 40536 613615 556997 31100 -343025 -312294
35630c12294J89733J43356J26874L2488l05800n90664l69708K29799N60184K82736
35620a3296k42832m73551k79252O7101K40848J07381j96452l52219j81974J11004
35610a213242J92295M9469m0893K4764N1110o5287j27200L7787K79766L21379
35600d90052R6840k19271l90511k67375Q0505L40415K55511k1484j00853R0168
35590f26107K17607P7004j20608j52425j28029j91972j96619J5751K49924K21446
35580f34028P230j03145n8471o206N7536K02871K25933j37826o34073o13603P3849
35569a619933P25871O40839K6988l31193j39130J41509R8261n3248N2623K62612
35559a94801J73702j07002m1686M27312O22706J05211n80348o31718j22809K06251
$$ plain form
35630 -312294 -122561 20795 147669 180157 -125643 -716307 -1086015 -856216 -296032 -13296
35620 -13296 -256128 -729679 -1008931 -941830 -700982 -593601 -790053 -1142272 -1324246 -1213242
35610 -1213242 -1020947 -971478 -1012371 -987607 -936497 -1001784 -1128984 -1091197 -811431 -490052
35600 -490052 -393212 -612483 -1002994 -1270369 -1189864 -849449 -593938 -615422 -716275 -626107
35590 -626107 -408500 -331496 -452104 -604529 -732558 -924530 -1121149 -1105398 -855474 -634028
35580 -634028 -626798 -729943 -788414 -794620 -737084 -534213 -308280 -446106 -1080179 -1693782 -1619933
35569 -1619933 -894062 -253223 -226235 -557428 -696558 -555049 -456788 -510036 -457413 -194801
35559 -194801 -21099 -128101 -169787 257525 880231 985442 405094 -226624 -349433 -143182
35549a43182R8792R232J89021K88485O6330j78441k00218k30595m21552m29876
35539i52004l7421L19070J98093r8436m2614K25586K05646n4185r8918P2534O5371
35528a97278q8280L1965L67012L69566j6836j85847R0622K46390r6576m75662
35518D5076l88315q0253J7312M4885K76541M35507J66186k03172j38304J44137
35508C19600J3178m47080n11796j9664L68550K85557J85210M01120M61044q4126
35498I71593p42091p02585l7661M27200K83133q2807k43329k27160j54908M1678
35488d66937L04702L27877M1406j67553l6473J22102o8792l94793l72420k1848
35478g32729J96931J23051M5690J27993K03247J97567K24351J64992k47676p43999
$$ plain form
35549 -143182 -44390 -35158 153863 442348 508678 330237 130019 -100576 -522128 -952004
35539 -952004 -989425 -670355 -472262 -570698 -613312 -387726 -182080 -236265 -335183 -262649 -197278
35528 -197278 -285558 -253593 113419 482985 466149 280302 370924 617314 520738 45076
35518 45076 -343239 -423492 -406180 -361295 -84754 350753 516939 313767 175463 319600
35508 319600 332778 -114302 -626098 -645762 -277212 8345 193555 594675 1055719 971593
35498 971593 229502 -473083 -510744 -83544 199589 116782 -126547 -353707 -508615 -466937
35488 -466937 -162235 165642 207048 39495 3022 125124 56332 -338461 -710881 -732729
35478 -732729 -535798 -412747 -367057 -239064 -35817 161750 386101 551093 303417 -440582
35468d40582n98075K35959P61312K99739m12891k95933M08817N63159l0313l92114
35458I9078m4278K63142p6443m89849k55756K65881K94494q4118k24234j07782
35448c59865k29295m85556k17405N59493R31199M08309l31131m68312j48299K83
35438c40579p8915J4255K67733K43934j07944k87479l5368K49892J54123j15242
35428c5590j02928J61720K44044J0084j88041r0106R5600P6613o3157n5416R6712
35417A49535J58996N8465o6197j56610k69033l24950j60892J14326J53776j07682
35407d50266k98904j65436N2466O3348L2333K57768N60629M72124k8578m24244
35397G1240l73273j15470j9649o8656l1415Q8665P4378j10195k05854r301L09170
$$ plain form
35468 -440582 -1038657 -802698 -41386 258353 -154538 -450471 -41654 521505 491192 99078
35458 99078 54800 317942 241499 -248350 -504106 -238225 56269 -27849 -252083 -359865
35448 -359865 -589160 -1074716 -1292121 -732628 198571 606880 275749 -192563 -340862 -340579
35438 -340579 -419494 -405239 -137506 106428 -1516 -288995 -324363 -74471 79652 -35590
35428 -35590 -138518 23202 267246 277330 89289 -817 94783 171396 108239 52823 149535
35417 149535 308531 366996 300799 144189 -124844 -449794 -610686 -496360 -342584 -450266
35407 -450266 -749170 -914606 -862140 -798792 -766459 -508691 51938 524062 495484 71240
35397 71240 -302033 -417503 -437152 -505808 -537223 -448558 -374180 -484375 -690229 -699530 -390360
35386c90360L86695J56171k4131J22060L03775K2063n93916p78228j86302M95972
35376d86201M49895j23647l62007n0823J58895j28886m63851l37239O5678K83852
35366i94334K64664K16263J69735J07888J92028M31705M35486m7323n96760o25909
35356d46557k14602O2606q741j19444m4953R3535J62890J63039N3283j52622j86954
35345f38520J19381L87548J53348k98227k49152K69971M10387j57873o56047l88295
35335a047479K11931L52803J05398Q7757L26858K75409j84982n29709m08645n4709
35325h65368J97535K73154J61456j46849m22149l43430N82J71358M5601j7020
35315i45130J81839L27484J42547j12140m2548K44622K99747O50k78886j82931
$$ plain form
35386 -390360 -3665 152506 128375 250435 554210 576273 -17643 -795871 -982173 -486201
35376 -486201 -36306 -159953 -521960 -572783 -413888 -542774 -1006625 -1343864 -1278186 -994334
35366 -994334 -729670 -513407 -343672 -235784 -43756 387949 823435 776112 179352 -446557
35356 -446557 -661159 -598553 -607294 -726738 -771691 -678156 -515266 -352227 -298944 -451566 -638520
35345 -638520 -519139 -131591 21757 -276470 -525622 -255651 154736 -3137 -659184 -1047479
35335 -1047479 -835548 -482745 -377347 -289590 37268 312677 127695 -402014 -810659 -865368
35325 -865368 -667833 -394679 -233223 -380072 -802221 -1145651 -1145069 -973711 -928110 -945130
35315 -945130 -763291 -435807 -293260 -405400 -447948 -203326 96421 97071 -181815 -364746
35305c64746J78357L84570K18662q1259j46989J583j8117l25814m88869j48376
35295g90998L43827L78437N076j80925j1469O7713j11431r2623L33768N93677
35285E35052J88194m44633n55671j86213L5793n9403p5202J08486J20919j69190
35275e01868l43623q8442L17393M25761J84941j37398l08943k30142N1611K62112
35265c68598J09548k61490l26214R2702M65818K50152l08581m96548j38086K07027
35255g74270J14237j26916q1629Q1378q9056m33020k52952N63803J111091O24765
35245G37431l50056o22050J0989N66359L65367j03078j34024J32012J69127J594
35235G73671l2785n0695l72774p40431n88240j6743K90634J43976O3583L01327
$$ plain form
35305 -364746 -186389 198181 416843 335584 188595 190178 172061 -153753 -642622 -790998
35295 -790998 -447171 -68734 -63658 -244583 -256052 -188339 -299770 -392393 -58625 535052
35285 535052 723246 278613 -277058 -463271 -427478 -486881 -562083 -453597 -332678 -501868
35275 -501868 -845491 -933933 -616540 -190779 -5838 -143236 -452179 -682321 -630710 -368598
35265 -368598 -259050 -520540 -846754 -754052 -288234 -38082 -346663 -843211 -981297 -774270
35255 -774270 -660033 -786949 -868578 -787200 -876256 -1309276 -1562228 -998425 112666 737431
35245 737431 387375 -234675 -223686 342673 708040 604962 470938 602950 772077 773671
35235 773671 740886 690191 317417 -423014 -1011254 -1027997 -737363 -593387 -529804 -228477
35225b28477M29607J68339j10371q0297j1090j70332k65654j8391K12987l797
35215g7476l81280l38809N1049K15883K6127r1410M4512J01584j13256k83322
35205h46398r7318K52615L44416P5905k46606k55675J11998N13329N06194P7478
35195D35938k66413j30890K22381K60400o1386l25167l25670k40843j47310J10833
35185d68127M67124N52737K72579J6311N3775J36475j7375k45116k92024k70177
35175B06182l56512l56611m5365L06086K63065p5854k38149j18374r048L6618
35165c87962K48408N12102L74245j37989l64445j2843L05837J6122m91689m84545
35155d22759k4653K32239J18482O2554K10214K26578M7256O3103L32810L20848
$$ plain form
35225 -228477 201130 369469 259098 178801 167711 -2621 -268275 -286666 -73679 -77476
35215 -77476 -458756 -797565 -746516 -530633 -504506 -595916 -551404 -449820 -563076 -846398
35205 -846398 -943716 -691101 -346685 -270780 -517386 -773061 -661063 -147734 358460 435938
35195 435938 169525 38635 261016 521416 460030 134863 -190807 -431650 -578960 -468127
35185 -468127 -1003 551734 824313 840624 894399 1030874 1013499 768383 476359 206182
35175 206182 -150330 -506941 -552306 -246220 16845 -59009 -297158 -415532 -424580 -387962
35165 -387962 -139554 372548 746793 608804 244359 231516 537353 553475 61786 -422759
35155 -422759 -447412 -215173 -96691 -34137 176077 402655 449911 513014 845824 1166672
35145A166672k17341p04221n57370m1699K00823O6751r7948j64385k23824j78764
35135g51306P7915K59588O2135j96491L9735O03611P24972J79972l70168l79618
35125B50345j10317l4536j35431j85215k16021k76879j44299K58942N15245K73399
35115A95233j45436k18034k7492k4321j83685o9096L17764M44456J18763j89784
35105B18368j36649k2852j68060k81422K8744M79845M55354m5033m01525l10909
35095a84139j38753k01833k64397n7181J78612J18445j9319J75705N29938M81749
35085F18827J7408k37746K690K52139Q8311j69966q4756R9234j13986n65193o40868
35074g33906k38578J13921Q8921p3279q1987L1330J44349K06652J16847j45420
$$ plain form
35145 1166672 949331 245110 -312260 -353959 -153136 -86385 -184333 -348718 -572542 -751306
35135 -751306 -673391 -413803 -351668 -548159 -508424 95187 820159 1000131 629963 250345
35125 250345 140028 105492 -29939 -215154 -431175 -708054 -852353 -593411 -78166 195233
35115 195233 49797 -168237 -195729 -220050 -403735 -472831 -155067 289389 408152 218368
35105 218368 81719 58867 -109193 -390615 -361871 117974 573328 528295 126770 -184139
35095 -184139 -322892 -524725 -789122 -846303 -667691 -549246 -568565 -392860 137078 618827
35085 618827 636235 398489 401179 653318 741629 571663 486907 586141 472155 -93038 -733906
35074 -733906 -972484 -858563 -769642 -842921 -924908 -893578 -749229 -542577 -425730 -571150
35064e71150k70948K8322M54424M57086R9859n9455M6550p0890m16452l31784
35054f34438L00296O19025J22836m35276k45082K42821J22604m54732o21164k39711
35044a222821O1514P8100J92468M23697L33750o1256k23416m8975m463j73607
35034f45009p9686L24831M20299J0854k47194L3258K77143k9817m02388j84829
35024e22538L01654K88688j70860l29683N2014M23913L38763k9923l15044l70548
35014c33564j96812R7306K02175j07041n26171m63261J62539P20928O33786N7281
35004B47166l81311l18915O0002L41783L04750O1515j07851n7129P6157N5177
34994B81344j35746k45034o6452K76022M36440K26142j89942m98767n57261m24584
$$ plain form
35064 -571150 -842098 -813776 -359352 97734 197593 138138 184688 113798 -302654 -634438
35054 -634438 -334142 284883 407719 -27557 -272639 -29818 92786 -361946 -983110 -1222821
35044 -1222821 -1161307 -1083207 -890739 -467042 -133292 -194548 -417964 -466939 -471402 -645009
35034 -645009 -724695 -399864 20435 31289 -215905 -182647 94496 64679 -337709 -522538
35024 -522538 -220884 67804 -103056 -432739 -380725 43188 381951 352028 36984 -333564
35014 -333564 -530376 -433070 -230895 -337936 -864107 -1327368 -1164829 -443901 189885 247166
35004 247166 -134145 -453060 -393058 -51275 253475 314990 207139 150010 226167 281344
34994 281344 145598 -99436 -165888 110134 546574 772716 582774 84007 -473254 -897838
34984h97838j67139J73719M24814L54550K8508j47125N8643L49666L20991L7327
34974E36116j27156p1039k793R418R4427J95959P1032k58305m47050l27817j18814
34963d46022l5380m0508p2827j56849j81549M6017L97755M71290J89064n9002
34953A11989m0163r19j44127k51882j32609n37m7411m6683K03500M13310K34737
34942B99205j43185k94451j89627p7824Q748J55361K05082P432j72737k6700J92347
34931c6349J8046l92506m17772K5691K94318p546m38420l86882J00750M81804
34921g58866M33404J22853q6552k294K44571L30665J03314k04526k58075n7169
34911a32675J16629J29496J04850J14671N1299j29965k84115k86919j98516j43775
$$ plain form
34984 -897838 -1064977 -891258 -466444 -111894 -83386 -230511 -171868 177798 498789 536116
34974 536116 408960 337921 335128 344546 438973 634932 705964 447659 609 -327208 -446022
34963 -446022 -481402 -521910 -594737 -751586 -933135 -887118 -489363 -18073 170991 111989
34953 111989 71826 70907 -73220 -325102 -457711 -458248 -505659 -552342 -348842 64468 299205
34942 299205 156020 -138431 -328058 -405882 -397134 -241773 -36691 -29259 -201996 -228696 -36349
34931 -36349 -18303 -410809 -828581 -802890 -508572 -516118 -954538 -1341420 -1240670 -758866
34921 -758866 -325462 -202609 -289161 -291455 -46884 283781 387095 182569 -75506 -132675
34911 -132675 -16046 113450 218300 332971 384270 254305 -29810 -316729 -515245 -659020
34901f59020j55795j73212j01065J00785L05866K95511O5317q9536K9678K16031
34891a65440J81944J5364p339P3620k8697l14468m24561j63903K18441L77700
34881b37339K75281J28352R6000R4262r0960m61360o34989k70347L33814M83582
34871b83704P3591k06644M9254L02172J5578l62788j66812K54228R0372m55549
34861f90302m23644K39550N13803L524m12227p7045M08771K96694j29998k57476
34851e28350k12714l71235m49158j6380N56727N91007K09755P0939K24433J29704
34841B04728k87372m63588j46972K26098K50130M9316r4903j19316m9742Q3774
34831c47847J09657j28913m28792m07572o3527K07474J79850L0802j1657Q5335
$$ plain form
34901 -659020 -814815 -988027 -1089092 -988307 -682441 -386930 -321613 -411149 -381471 -165440
34891 -165440 16504 31868 24529 98149 69452 -245016 -669577 -833480 -615039 -237339
34881 -237339 37942 166294 262294 356556 265596 -195764 -830753 -1101100 -767286 -283704
34871 -283704 -210113 -416757 -367503 -65331 -49753 -412541 -579353 -325125 -234753 -690302
34861 -690302 -1113946 -874396 -360593 -357069 -769296 -846341 -437570 -140876 -270874 -528350
34851 -528350 -741064 -1112299 -1561457 -1577837 -1021110 -430103 -220348 -149409 75024 204728
34841 204728 -82644 -546232 -693204 -467106 -216976 -167660 -262563 -381879 -431621 -347847
34831 -347847 -238190 -367103 -795895 -1203467 -1266994 -1059520 -879670 -848868 -860525 -775190
34821g75190K66738M19346L31759l9649l43232k48982J4619p430k38430k05372
34811h25823J07561J91886j00997k70720Q73L35427L03013N0398q9455j37232
34801d35069k00467j07146K16508L83726R8440k40964p9839L76128M34094J796
34791D47207k88100r9644J36841L306k63044k77957j66257k21188k71112K5637
34781i74311M46002M05959r6750l77112q3836K67387J42329j51503q505M35542
34771E202N09747J06788j84523j05421j03496l98491m31598J96035Q33223N85962
34761A013428l23271q13767m49271J11988K33232R5866J12865K02849Q6526j41207
34751A29238k00946j14402r2352j28998o8308O6026J26601J15532J20802R6492
$$ plain form
34821 -775190 -508452 -89106 242653 203004 -140228 -389210 -374591 -382021 -620451 -825823
34811 -825823 -718262 -526376 -627373 -898093 -897220 -561793 -258780 -208382 -297837 -435069
34801 -435069 -635536 -742682 -526174 -142448 -44008 -284972 -364811 11317 445411 447207
34791 447207 159107 59463 196304 199610 -63434 -341391 -507648 -728836 -999948 -974311
34781 -974311 -528309 -122350 -219100 -596212 -680048 -412661 -270332 -421835 -430340 5202
34771 5202 514949 621737 437214 331793 228297 -170194 -601792 -405757 427466 1013428
34761 1013428 690157 -123610 -572881 -460893 -227661 -131795 -18930 183919 270445 129238
34751 129238 -71708 -186110 -278462 -407460 -475768 -409742 -283141 -167609 -46807 49685
34741D9685j9237r3788p318N6532j17776l11106j11999L66994N01303M8297m23587
34730f2000l13138J67643L54780J03164j21940n5178K3368j17162k26713m2691
34720b89867J98108J25307j41959j89883J9309J45545P7392L7359N6318j16530
34710g8901m34959m41572j5771K90079Q1297j85599R1233O24345O20985L1918
34700E83055l59096j50075J22460q7179m81219m39672L7984M12934L90128J53467
34690A82787p5376k88424m80350n15430l13306J3296K80725L82619K98450Q4110
34680d30899j05658j06382O0815J58783R303k28663k01473J60293M63586L30010
34670A09715n9350j80605Q5780K85727R1636k11264k10463j1O3829j0650O1445
$$ plain form
34741 49685 30448 -63340 -70658 -14126 -131902 -443008 -555007 -188013 313290 361587 -62000
34730 -62000 -375138 -207495 147285 250449 128509 73331 96699 -20463 -247176 -289867
34720 -289867 -91759 33548 -108411 -298294 -278985 -133440 -56048 -18689 37629 -78901
34710 -78901 -513860 -955432 -971203 -681124 -599827 -785426 -694193 -69848 551137 583055
34700 583055 223959 73884 196344 109165 -372054 -811726 -773742 -360808 29320 182787
34690 182787 107411 -181013 -661363 -1176793 -1490099 -1476803 -1196078 -813459 -515009 -430899
34680 -430899 -536557 -642939 -582124 -423341 -414038 -642701 -844174 -683881 -220295 109715
34670 109715 50365 -130240 -44460 241267 332903 121639 -88824 -88835 -25006 -35656 25789
34659B5789K70858L22335J54459k5829j95908m93235p26687m88383J15241M17868
34649f23492J24807k31616r0778L49847N42447L93972K13866J35143L9134j04286
34639G49044k01049k28743j92701l8995J52645J13365k03280m04748j80722K00093
34629b35091K78303O1240j11143j47431j93937k04092k1300J89017R8173k01825
34619d88086k62653J8686K28401Q2142j79315k13364m5363Q6368R4684O0045N1325
34608e67130O3668L6403q5596k04601q7094K72912M67180J79422k57702k52224
34598d34762J64718L69635J03436j75911q4950J03771J3718j76925q7106J84703
34588a9673K28994j075j58535r0248l8633k03748m18070l76239j9759L98951N72346
$$ plain form
34659 25789 296647 618982 773441 747612 551704 58469 -668218 -1156601 -1041360 -623492
34649 -623492 -498685 -730301 -821079 -471232 71215 465187 679053 814196 853330 749044
34639 749044 547995 319252 126551 87556 240201 353566 150286 -254462 -435184 -235091
34629 -235091 43212 104452 -6691 -154122 -348059 -552151 -573451 -384434 -286261 -488086
34619 -488086 -750739 -732053 -503652 -421510 -600825 -814189 -859552 -773184 -678500 -618455 -567130
34608 -567130 -503462 -467059 -552655 -757256 -844350 -571438 -104258 75164 -182538 -434762
34598 -434762 -270044 99591 203027 27116 -57834 45937 59655 -117270 -204376 -19673
34588 -19673 209321 208246 49711 -40537 -79170 -282918 -700988 -1077227 -1096986 -698035 -125689
34577a25689M36104K23073J72554K16913J07083j66933l29293k47612j14486o9941
34567A01773L0653K45105K72032r6802n05764m50672k2535K13910L0421k28249
34557d10128k43044j05024J7699J73775L70773L79459R4514j63710m4255K88484
34547C58543L46938M462l46169l65072j94412j56025k37700j39752K21048N12837
34537D698L97878j4378k92263k09177L1663J27227N4975O933O5461J21531Q7309
34526C81857K0498n705l2614j39348k98806l74295k42777Q4265M19444M98284
34516C10803K25522j50913k38732M0362L05915J71525k46592m76382l15904n2646
34506d27042J8222R943J51528L03117J33009k84027m53250j46600K52764K93016
$$ plain form
34577 -125689 310415 533488 706042 922955 1030038 863105 533812 286200 171714 101773
34567 101773 132426 377531 649563 552761 46997 -403675 -426210 -212300 -181879 -410128
34557 -410128 -653172 -758196 -740497 -566722 -195949 183510 278024 114314 70059 358543
34547 358543 705481 709943 363774 -1298 -195710 -351735 -589435 -729187 -508139 4698
34537 4698 402576 388198 95935 -113242 -81579 45648 100623 107556 173017 294548 381857
34526 381857 402355 396650 364036 224688 -74118 -448413 -691190 -606925 -187481 310803
34516 310803 536325 385412 146680 187042 492957 664482 417890 -58492 -374396 -427042
34506 -427042 -408820 -398877 -247349 55768 188777 -95250 -548500 -695100 -442336 -149320
34496a49320M2695j32992j35518j21289r2089Q8710L11722K65286o7559l16960
34486c07314k58204j14377j52561k66145k00208J8716J48244J08588N5544J27796
34476h39921K99362M44244M24453J84296j31865k58247j30722q575j12816k73260
34466d03051j62617J93942M02524K06604k06906m60364l77129o7438K23871K80856
34456c69708O1161k13494j98947K04597O46628O28222Q1606m59317m33037L6398
34446a5891K52672j25300n76576m42193J06145L35134Q2709m9336K25215L44321
34436A36900j04752n11454j09427O96968P80737m5469p34414n22006J07388L33693
34426B8164J44696K1647L5404p8131k57916j93112O9444J67651L5780m0945N562
$$ plain form
34496 -149320 -106625 -239617 -375135 -496424 -588513 -499803 -188081 77205 9646 -307314
34486 -307314 -565518 -679895 -832456 -1098601 -1298809 -1280093 -1131849 -1023261 -967717 -839921
34476 -839921 -540559 -96315 328138 512434 380569 122322 -8400 -16975 -129791 -403051
34466 -403051 -565668 -371726 30798 237402 30496 -429868 -806997 -874435 -650564 -369708
34456 -369708 -308547 -522041 -720988 -516391 130237 758459 840065 380748 -52289 -15891
34446 -15891 236781 111481 -465095 -907288 -801143 -466009 -383300 -432636 -207421 136900
34436 136900 32148 -479306 -588733 108235 888972 843503 109089 -412917 -305529 28164
34426 28164 172860 194507 229911 151780 -106136 -299248 -229804 -62153 -26373 -67318 -61756
34415f1756q8218l59580m26146p0944L63304M50201K63181J62841K05940J38950
34405E77773r1371j98010r114K26526J75056j07491k54130r0132J46028J29418
34395E04553j51259m10816l94567r3597K95557N11080L74146n4804m54258n04231
34385c78196k18050P8470J31752K0427k2966N9514J14037K5659j07247r2522R8353
34374b90769K60881K02337J4514l9249O7908N2308j96809l10047N6308N68771
34364C86153N32143j37229p30446o73447j85873J98869L20720K84667R1126j96637
34354a09954k57956L4945K59090M3455k52078p0484L66891L63490q5426k75589
34344A6384o047R5146k64660m46050L4443N88898M34024j91663m68247k52537
$$ plain form
34415 -61756 -149974 -509554 -935700 -1006644 -643340 -193139 70042 232883 438823 577773
34405 577773 486402 288392 279278 505804 680860 573369 319239 229107 375135 504553
34395 504553 353294 -57522 -452089 -545686 -250129 260951 635097 580293 126035 -378196
34385 -378196 -596246 -517776 -386024 -365597 -388563 -329049 -215012 -189353 -296600 -389122 -290769
34374 -290769 -29888 172449 186963 147714 215622 267930 71121 -238926 -182618 386153
34364 386153 918296 781067 50621 -622826 -808699 -609830 -289110 -4443 86683 -109954
34354 -109954 -367910 -332965 -73875 -30420 -282498 -352982 13909 377399 291973 16384
34344 16384 10337 105483 -159177 -605227 -570784 18114 452138 260475 -207772 -460309
34334d60309q1132j53351j31691J02420K40354J51487O5608P2653J0030q2490
34324b66421K9475K19841N5410m27325n93569j26214M55728N19384J19174k52374
34314b66891l30735j71995Q0552K13687L4289k91344l09698O9218L72447K77631
34304c22839Q2659J20721J82849j4329k28983j25698O6722m2989k53479j04136
34294f39502K58724K83534l9225j80779J443R2024o9238j41825j191J0424k21187
34283f46798l01033k6540K38737K06911J05557J46619J32056l8886m8892K12644
34273a9625K73632j50329n42417l44759J41589K84875J28795J20718J89996l9348
34263D3127l34336r9900M82404N21846j87213p32545m20040K31591L57819k504
$$ plain form
34334 -460309 -541441 -694792 -826483 -724063 -483709 -332222 -266614 -193961 -183931 -266421
34324 -266421 -236946 -17105 38305 -389020 -982589 -1108803 -653075 -133691 -14517 -266891
34314 -266891 -597626 -769621 -689069 -475382 -441093 -732437 -1042135 -972917 -600470 -322839
34304 -322839 -240180 -119459 63390 49061 -179922 -305620 -238898 -281887 -535366 -639502
34294 -639502 -380778 -97244 -136469 -317248 -315805 -223781 -293019 -434844 -436035 -425611 -646798
34283 -646798 -947831 -974371 -735634 -528723 -423166 -276547 -144491 -183377 -232269 -19625
34273 -19625 254007 103678 -438739 -783498 -641909 -357034 -228239 -107521 82475 43127
34263 43127 -291209 -391109 91295 613141 425928 -306617 -726657 -495066 -137247 -139751
34253a39751j68617O4724K56943J30551n6282j8244J11333L3589k42795l86564
34243d15113j74482J86141K71037j9828k97534j94342J31164K56272J31521Q7205
34233c7959K34210K85438P2667j61353j70003n5224l970P558J7914r2893l09067
34222b12682l19902J3834L09802J70710j81721k27399L9325J13919k12503n31355
34212a037972m22942j012L34752M07588L19123J92313P2453l863k726N5123J00875
34201A3712P1282l4113j22571r7922l2209j18982l35734l33131Q9694N46305M71475
34190A17806o5197l84023j32425K43104K06939q5274j21759J20633J81908j01277
34180a9565l35467k05220O0722R6772m2734n0851R7092J29305m6928j78727n0550
$$ plain form
34253 -139751 -308368 -243644 13299 143850 87568 69324 180657 214246 -28549 -415113
34243 -415113 -589595 -403454 -132417 -152245 -449779 -644121 -512957 -256685 -125164 -37959
34233 -37959 196251 481689 554356 393003 223000 167776 163806 171364 189278 96385 -212682
34222 -212682 -532584 -518750 -208948 -38238 -219959 -447358 -408033 -294114 -506617 -1037972
34212 -1037972 -1460914 -1461926 -1127174 -719586 -400463 -208150 -135697 -139560 -142286 -87163 13712
34201 13712 84994 50881 -71690 -169612 -201821 -320803 -656537 -989668 -899974 -353669 117806
34190 117806 52609 -331414 -463839 -220735 -13796 -99070 -220829 -100196 81712 -19565
34180 -19565 -355032 -560252 -499530 -402758 -445492 -496343 -399251 -269946 -316874 -495601 -546151
34169e46151K02561K88994J18464j51040l17020k77054n9760J77748K45610J10325
34159b07323o3946j28186j08087o8839L3357K00445K34229j3496l05305k41686
34149f68837J65618M60132L59570Q5472o7843j49047k82001l01207l3983K67056
34139a65070K13640j00785k27642p5109J72j21418q6683K47581M13179L4336m58377
34128c26176l73705J89386M45540N9241m18490m05843n1476J67364J84464K51096
34118b78599L62057K58436o8021k99822k61996j22136n0976O940J14330J78088
34108a61699J56892J82360K97041L05158R5278j12135j05474o6218k66321n25673
34098b00791m05353P3551L65142J80577r0925N720L14175L61044Q3172j67502
$$ plain form
34169 -546151 -343590 -54596 63868 -87172 -404192 -681246 -741006 -563258 -317648 -207323
34159 -207323 -271269 -399455 -507542 -576381 -543024 -342579 -108350 -121846 -427151 -668837
34149 -668837 -503219 -43087 316483 401955 334112 185065 -96936 -398143 -432126 -165070
34139 -165070 48570 -52215 -279857 -354966 -354794 -476212 -562895 -315314 97865 132201 -326176
34128 -326176 -699881 -510495 -64955 -5714 -424204 -830047 -881523 -714159 -529695 -278599
34118 -278599 83458 341894 273873 -25949 -287945 -410081 -461057 -454117 -339787 -161699
34108 -161699 -4807 177553 474594 779752 875030 762895 657421 591203 324882 -200791
34098 -200791 -606144 -532593 -167451 13126 -77799 -72079 242096 603140 686312 518810
34088E18810k34674l15000m67379m07789J347L95483L56119K4759p8270K05972
34078f22M57328K76490j82966m65329m04811k27050j46797j22942l4181J22195
34068g28685K85859M12040M04482J50882k37202l96245j33362K45039K77501m4871
34058B35438k89235j88456O2355J82885J76012J52464M3867k51958n77500o26553
34048a080681l17806J21073M20027M80840L66392K16971J55906J68421J11468
34039F42611o5981k02642j58882o1586j08209k04675p9291K30476L17288k6785
34029B82324m36905m16285o215K67757R4744k50872l28409r8558J18753J32287
34019f41379P6750J13377J72081J19375J3534K666O2515M6206m1503l9424Q6661
$$ plain form
34088 518810 284136 -30864 -498243 -906032 -904685 -509202 -153083 -128324 -206594 -622
34078 -622 456706 733196 550230 84901 -319910 -546960 -693757 -816699 -850880 -728685
34068 -728685 -442826 -30786 373696 524578 287376 -108869 -242231 2808 280309 235438
34058 235438 -53797 -242253 -179898 2987 178999 331463 375330 123372 -454128 -1080681
34048 -1080681 -1398487 -1277414 -857387 -376547 -10155 206816 362722 531143 642611
34039 642611 576630 373988 215106 153520 45311 -159364 -238655 -8179 309109 282324
34029 282324 -154581 -570866 -577081 -309324 -214580 -465452 -793861 -892419 -773666 -641379
34019 -641379 -564629 -451252 -279171 -159796 -146262 -143596 -81081 -34875 -76378 -115802 -29141
34008b9141J69795J02432k9315j34507k26840k61353j05535J84107L01491J07664
33998G8798j17946q7132N3243l474j86373j65488Q9454K67191K10981P7816q277
33987B08793q2621r0810P5167K23357N806m35385m73003P0173M95132J87293m22775
33976b38873m73497K4565K43706j30802m02824L1407P23635Q10356K11085l75022
33966D23736m85473l29034j94177Q183L56025N03745J08819n07917o13352k2100
33956g51545O07450O20422J61162j76517k09471k26778l24153k27992J13257K72875
33946a41290k6183m05989l35351J14069M12789L12478L7931j54774j96823l7424
33936d20567L03603N04756K28131k80749l64770R5588M08803O1887m91154n03779
$$ plain form
34008 -29141 140654 243086 213771 79264 -147576 -408929 -514464 -330357 -28866 78798
33998 78798 -39148 -126280 -73037 -76511 -262884 -428372 -338918 -71727 139254 217070 208793
33987 208793 126172 35362 110529 333886 339692 -95693 -568696 -498523 -3391 183902 -238873
33976 -238873 -712370 -687805 -444099 -574901 -977725 -946318 -222683 587673 798758 423736
33966 423736 -61737 -390771 -584948 -576765 -220740 283005 391824 -116093 -729445 -751545
33956 -751545 -144095 476327 637489 460972 251501 24723 -299430 -527422 -414165 -141290
33946 -141290 -167473 -573462 -908813 -794744 -381955 -69477 -31546 -186320 -383143 -420567
33936 -420567 -116964 387792 615923 335174 -29596 65992 474795 536682 45528 -458251
33926d58251l3800K36894Q7766j426K78216N76589M76568Q7482k35961l91552
33916F22525m36019l03869J8829K52781J35247j46925j92628R703Q4507j07412
33906f3261k24857J9703L70129L23586k03262p30769p43054k33933L06310M06897
33896g72511R9442j33963P6742N28714O59081K22225l90733n99166k92403J05731
33886d96841J95075M1267j6742J39853K90723K31332M7997n5715n0820m1166m3308
33875B41655j5374l0054j64355k54500p5024K16674J92879j73882l79912j66166
33865f08059L0143j97130m70211k02005L65011M37098r0512m49121j76464K57167
33855a104083K89949P7770M7018J75854K02312J35925Q5359p5967m01303n44120
$$ plain form
33926 -458251 -492051 -255157 -167391 -168817 109399 685988 1162556 1250038 1014077 622525
33916 622525 186506 -117363 -98534 154247 289494 142569 -50059 -40356 44151 -63261
33906 -63261 -288118 -268415 101714 425300 222038 -508731 -1251785 -1485718 -1179408 -772511
33896 -772511 -673069 -807032 -730290 -201576 457505 679730 288997 -310169 -602572 -496841
33886 -496841 -301766 -260499 -277241 -137388 153335 384667 432664 376949 326129 284963 241655
33875 241655 226281 196227 31872 -222628 -297652 -80978 111901 -61981 -441893 -608059
33865 -608059 -577916 -775046 -1245257 -1447262 -1082251 -645153 -735665 -1184786 -1361250 -1104083
33855 -1104083 -814134 -736364 -689346 -513492 -311180 -175255 -89896 -165863 -567166 -1111286
33845a111286k27572K33212L62721K16757J46116J46596J2402j08802M6778K49990
33835c3088Q6613k56293k38155P7638J06935k04836k70572P0291K60640O5545
33825c35282r26L00908L85706r6392m88618j78956L02840J44312l75839l94875
33815g37122O3787K34810Q537K3752L58919L00433l21735o54209j68052M32947
33805d57933L03578k62193l88483M5104L93753K92174J505j65550j64860k738
33795d05643K97294N00956L58034J3314j35987j895J19699M9442n9528q0217j47642
33784E07827l73226n64497m35114j282L73469L40017m4506l17344j15042L17272
33774c12426L58721j31310n13507k21155L95305N57640J94532m2302J19546J73644
$$ plain form
33845 -1111286 -1338858 -1105646 -742925 -526168 -380052 -233456 -221054 -329856 -283078 -33088
33835 -33088 53525 -202768 -440923 -363285 -256350 -461186 -731758 -661467 -400827 -335282
33825 -335282 -336208 -35300 350406 254014 -234604 -413560 -110720 33592 -342247 -737122
33815 -737122 -673335 -438525 -429988 -406236 -47317 253116 -68619 -722828 -890880 -457933
33805 -457933 -154355 -416548 -805031 -759927 -366174 -74000 -72495 -238045 -402905 -405643
33795 -405643 -108349 392607 750641 763955 627968 626073 745772 795214 735686 655469 507827
33784 507827 134601 -429896 -865010 -866292 -492823 -152806 -197312 -514656 -629698 -312426
33774 -312426 46295 -85015 -598522 -819677 -424372 133268 327800 285498 405044 578688
33764E78688k14327n28601j87948M58573N68480K9282m02455k02235K41123K44549
33754E85129k50759o62728n07468O8967M86706L69932n5587k57684o7587J38177
33744a52902J6753k37331k17473P4414K84423K60358J55259L8263j61078l07161
33734b46475j32937K27049K60072j53393m56595k21295J94447K21387m9004j10409
33724d67153P6762P8912j87584k64383P1280L89434K64935o3345p9137K22955
33714D2676L63590J10954k08434k05431O4778K64425K51827J60532O9557j24296
33704G90178m15133n20041k39124J63528K49822L0469n8845J51258L00925J10463
33694E63500j42992p9352J71042K13063J8261j34981j93395l13668l99286j79798
$$ plain form
33764 578688 364361 -164240 -352188 106385 674865 704147 301692 99457 340580 585129
33754 585129 334370 -328358 -835826 -766859 -280153 89779 34192 -223492 -291079 -152902
33744 -152902 -136149 -373480 -590953 -516539 -232116 28242 183501 221764 60686 -246475
33734 -246475 -379412 -152363 107709 -45684 -502279 -723574 -529127 -307740 -356744 -467153
33724 -467153 -390391 -311479 -499063 -763446 -692166 -302732 -37797 -101142 -180279 42676
33714 42676 406266 517220 308786 103355 168133 432558 684385 844917 914474 790178
33704 790178 375045 -144996 -384120 -220592 29230 59699 854 152112 453037 563500
33694 563500 420508 341156 512198 725261 743522 608541 415146 101478 -297808 -477606
33684d77606K22814L26255O422k88137k06666O4566K36881L42971M39069K99806
33674I66375k00650p00280p40593l51745Q3859L49458M42991L25660K1886j78007
33664A8954l0324K28559J59704k15084m28133k43097P8349K35068K30017J58728
33654A92741J6732j27714q3580J51466K87092J36344j11218j97983j55367j40102
33644c1589j28348l5761K9026o5950j64195n084L21086M33468K04737p3447j51652
33633C32291j31064j56709j17368Q3423K09660N847l13750k90030R4012L53331
33623F9643J98361r1554j48669j9552M5727J0394k3309o3528j09297n774K57870
33612A20312L32619j2155l93477k82419J61655K87395l9679k43370K1183L46687
$$ plain form
33684 -477606 -254792 71463 77885 -210252 -416918 -352352 -115471 227500 666569 966375
33674 966375 765725 65445 -675148 -1026893 -943034 -593576 -150585 175075 196961 18954
33664 18954 -11370 217189 376893 161809 -266324 -509421 -431072 -196004 34013 192741
33654 192741 209473 81759 -1821 149645 436737 573081 461863 263880 108513 -31589
33644 -31589 -159937 -195698 -166672 -232622 -396817 -401901 -80815 352653 557390 483943 332291
33633 332291 201227 44518 -72850 10573 220233 226080 -87670 -377700 -283688 69643
33623 69643 268004 176450 27781 8229 53956 64350 41041 -22487 -131784 -137558 120312
33612 120312 452931 440776 47299 -235120 -73465 213930 174251 -69119 -47936 298751
33602B98751K78259O6p7133J4723j901j02710q5619k5407j38035l16951k38611
33591c94568J16028M06339L78434Q5493k75316m75549l02527J97000N90777M88364
33581H14475M4154k54611k24910r0359k1097M5495J21836Q3085o8199j60684j35604
33570A53581q8556j5277J64474L18086K13761k8611l2025J81518J26028l17268
33560F75711n27786m7059N77731M72551k74705p12493m00988M2004J105k21698
33550d15627o2461K56593Q7419m51141m94932K18976Q23103N56521j18017k61076
33540A39358J53630L84890J91782M9268J16163n9320n54702p01310j80063L06986
33530a53318J18567k52126j1725N53574N27354r2352l73896K2125L41401K2444
$$ plain form
33602 298751 577010 577076 499943 514666 512765 410055 324436 299029 160994 -155957 -394568
33591 -394568 -278540 127799 506233 591726 316410 -159139 -461666 -264666 326111 814475
33581 814475 858629 604018 379108 288749 267652 313147 434983 518068 449869 289185 153581
33570 153581 65025 49748 214222 532308 746069 717458 685433 866951 992979 675711
33560 675711 147925 100866 678597 1151148 876443 163950 -237038 -195034 -193929 -415627
33550 -415627 -478088 -221495 -134076 -585217 -1080149 -861173 -38070 518451 400434 139358
33540 139358 292988 677878 869660 918928 1035091 975771 421069 -280241 -460304 -153318
33530 -153318 -34751 -286877 -298602 254972 782326 689974 316078 338203 679604 702048
33520G02048m31002l27338J78277M80451M26187K45819k7572m62908p78543n75930
33510e70511J3966L95225K73705p233m2K68011M20910K64746k1685j99536k70004
33499E67552l40366l30021p4842K74039K91201j15371m52950k84036J59393L66371
33489F0970K94166K50643K28839n0478m90756o26419l37855N084J93120L78887
33479i3799N11519K40249l56953o02002j63044L95360M41346J30276m3482l8492
33469D20978n6022j071K19020K56753j30586m49859j55649L19107J13558o08617
33459g2388p55616K4177P55220N87733l0054k02064Q7936K14048M807j69448j65399
33448B78952j86005k06410L2723M01924L91650p1376l85044j42097K51836K21945
$$ plain form
33520 702048 271046 -56292 121985 602436 1028623 1274442 1246870 783962 5419 -570511
33510 -570511 -556545 -161320 112385 105152 105110 373121 794031 1058777 1037092 837556 567552
33499 567552 227186 -102835 -177677 96362 387563 272192 -180758 -464794 -305401 60970
33489 60970 355136 605779 834618 784140 293384 -333035 -670890 -665806 -472686 -93799
33479 -93799 417720 657969 301016 -300986 -464030 -68670 372676 502952 459470 420978
33469 420978 364956 363885 582905 839658 709072 259213 103564 422671 536229 -72388
33459 -72388 -828004 -803827 -48607 539126 509072 307008 394944 608992 613799 444351 278952
33448 278952 92947 -113463 -80740 321184 712834 641458 256414 114317 366153 588098
33438E88098j20083k53530q8250M0336N2971J81581L55976J77325l43640o19365
33428b8581l28469J08730K37038K25085L69457M39184J17864k82099k40873Q5708
33418G03044J34032p6674j2125L48865L82860j32491o05677n30502j34162J68795
33408B45965L46598M42646K98235k9565j23084J21551K21614n8176j88307K44539
33398A522016O97087M40964k34990m20886K7609L37803M6463l93792m08782q4618
33388A528874J24831M5850j44181k31299j30711J02101K92022K90090J56697Q9580
33378B123854J54497K07787J02567j22448k71102j68164J46998L84861K64898
33369B823748j43240m42561l23133J28926N40195N75139K03817k28427k88145
$$ plain form
33438 588098 468015 214485 126235 166571 219542 401123 757099 934424 590784 -28581
33428 -28581 -357050 -248320 -11282 213803 583260 1022444 1140308 858209 617336 703044
33418 703044 837076 760402 748277 1097142 1480002 1347511 741834 211332 77170 245965
33408 245965 592563 1035209 1333444 1303879 1180795 1302346 1523960 1465784 1277477 1522016
33398 1522016 2219103 2660067 2425077 2004191 2031800 2369603 2416066 2022274 1613492 1528874
33388 1528874 1653705 1699555 1555374 1324075 1193364 1295465 1587487 1877577 2034274 2123854
33378 2123854 2278351 2486138 2588705 2466257 2195155 2026991 2173989 2558850 2823748
33369 2823748 2680508 2237947 1914814 2043740 2583935 3159074 3362891 3134464 2846319
33360B846319M5248L24468K51991P0503N6227K2465j91524j78957L71640Q65712
33350D484092N82332l0904M0379O50207O82316n73k72121K84727O54139K26657
33340G301251j41389K58821P28911N32739K24248M72760P73564N52219L98818
33331A1101942Q94847J340906J066166Q83923J674643K593667K434736J824206
33323B3815036K193571L383275M180226M525718N289922O552080P975891J0080770
33315F7996489J3257553J6608260J9796599K4542716L1915322M0377222M9702820
33308B64196981O3121824P8846680Q1805897N4470060j31555n4191606q0303049
33301D07815232p6396481o0768456m8299116l9859991l1689752k4318503j9659831
$$ plain form
33360 2846319 2891567 3216035 3468026 3538529 3594756 3617221 3425697 3246740 3618380 4484092
33350 4484092 5066424 5035520 5075899 5726106 6408422 6407849 6135728 6420455 7074594 7301251
33340 7301251 7159862 7418683 8147594 8680333 8904581 9377341 10150905 10703124 11101942
33331 11101942 11996789 13337695 14403861 15287784 16962427 19556094 21990830 23815036
33323 23815036 26008607 29391882 33572108 38097826 43387748 49939828 57915719 67996489
33315 67996489 81254042 97862302 117658901 142201617 174116939 214494161 264196981
33308 264196981 327318805 406165485 487971382 542441442 542309887 488118281 407815232
33301 407815232 331418751 270650295 222351179 182491188 150801436 126482933 106823102
33294A06823102j6527055j3106526j0069534q449574p357570n930551m982634
33287D0399658m927976m451762k905586j773325k119831k685037k159754j375711
33279A8000676j498398j838339j299688m93980n67935j147732j179818p88603
33271I186183p01708p54102m64400k37903n61268q21276l32338K49604l5935p32217
33261D794640p36744j67511J7166k39308k06806J29235J10460k57718l29811n2096
33251C061507K6020j50436j57611n5654k12257l26121J76763Q58767O55392l66900
33241C509470q98194l20780L99996K31962m92585p69242l40217K00020L02758
33232A823188j4322l36027k87241O7451K63580O6597j44478J6990K54110O7096
$$ plain form
33294 106823102 90296047 77189521 67119987 58670413 51312843 45382292 40399658
33287 40399658 35471682 31019920 28114334 26341009 24221178 21536141 19376387 18000676
33279 18000676 16502278 14663939 13364251 12870271 12302336 11154604 9974786 9186183
33271 9186183 8484475 7730373 7265973 7028070 6466802 5645526 5313188 5562792 5526857 4794640
33261 4794640 4057896 3890385 3907551 3668243 3461437 3590672 3701132 3443414 3113603 3061507
33251 3061507 3087527 2937091 2779480 2723826 2511569 2185448 2362211 3220978 3876370 3509470
33241 3509470 2611276 2290496 2690492 2922454 2429869 1660627 1320410 1520430 1823188
33232 1823188 1808866 1472839 1185598 1253049 1516629 1583226 1438748 1455738 1709848 1776944
33222A776944l42021l72727o2509J4511j72368o0202L66069L58510l19655q05685
33212C80867l83681L96049N21061n6429n04651l47336N1333J69443l7587k64892
33202g5823k82140j02973J18919K67898L31949K90613N5757l23656n21193k73984
33192e14633J92016L93427K24450J0596o8535j80159l67765l38363M0611M02013
33182b06342L45000j0189k24473j18210J12373K24502J45453m9535j93802j34857
33172a10080Q5474K34991J69608P117n8815R63Q2318J01758L7756p2874j22822
33161C55394m1273M9839m9938k91815l55856o9704L15619M14593J60426j69687
33151C17598l09490k52298j57842r8498L9443L44522N96002L96274k60043p54556
$$ plain form
33222 1776944 1434923 1062196 999687 1014198 841830 781628 1147697 1506207 1186552 380867
33212 380867 -2814 393235 914296 857867 353216 5880 57213 226656 189069 -75823
33202 -75823 -357963 -460936 -342017 -74119 257830 548443 604200 280544 -240649 -514633
33192 -514633 -322617 70810 295260 305856 237321 57162 -310603 -648966 -608355 -206342
33182 -206342 138658 128469 -96004 -214214 -101841 122661 268114 218579 24777 -110080
33172 -110080 -24606 210385 379993 387110 328295 329258 411576 513334 551090 478216 355394
33161 355394 314121 363960 314022 22207 -333649 -403353 -87734 326859 487285 317598
33151 317598 8108 -244190 -402032 -500530 -461087 -116565 479437 875711 615668 -138888
33141a38888n00351K61396O94400M07453j33122l28572j65915K1589J32285K52628
33131E02903K69902k2091m71093o14727k76562J68370K74372P6184l6851J03259
33121b6334K36889J00559j54526j76443M2959J28860j04125l35915k07542J33631
33111c61987K64320J09108k7668J4532Q1871O5406M3036J905j79836l54732j40104
33100d84149M41941P71257M28293j41661k03364K34459M51251L9987n59597o76045
33090C02372k30832K48308K85127m0748k37659p8L95453M08726n1650m65950l82375
33079B30694o148J47550j6142j46877m9290R2685J02674M8959P609q5869k24795
33068A01050k54742j42398n9930o9855j354K01482L02835J58015k2261n9233j51201
$$ plain form
33141 -138888 -639239 -377843 316557 724010 590888 262316 96401 117990 250275 502903
33131 502903 772805 750714 279621 -335106 -611668 -443298 -168926 -92742 -129593 -26334
33121 -26334 210555 311114 156588 -19855 23104 151964 47839 -288076 -495618 -361987
33111 -361987 -97667 11441 -16227 -1695 80176 145582 188618 190523 10687 -344045 -484149
33100 -484149 -42208 729049 1157342 1015681 812317 1046776 1498027 1538014 978417 302372
33090 302372 71540 319848 604975 564227 326568 326490 721943 1130669 1079019 613069 230694
33079 230694 224546 372096 355954 209077 159787 252472 355146 404105 411714 325845 101050
33068 101050 -153692 -296090 -356020 -425875 -427229 -225747 77088 235103 212842 153609 2408
33057B408m54566n93721j17645O69563R21167L65364l20921m42945j11880J49650
33047F6474J95038K22976K46021P9482k33457m06503l25256j53697j8029J15998
33037b10953K22393J65826m4126j89709j36044j868M2438q429m6324R332J52802
33026d4662K62132J62380j29586l05084j40458J12088L8425k73204l03369R2383
33016e28955M08146K31620j49505k05499Q5265L06349K15501m9594k37273j82664
33006a06609J15904M01787L35774k1313j77860O7647K27922j40229o51972o15419
32996e64368r0235K49509J89071J60197L22593K54640j90039m48272j01769M08650
32986A89977M33102M4918k11317j80921j50161k32264k42495j15980K902O5246
$$ plain form
33057 2408 -452158 -1045879 -1163524 -493961 427206 792570 471649 28704 -83176 66474
33047 66474 261512 484488 730509 809991 576534 170031 -155225 -308922 -326951 -210953
33037 -210953 11440 177266 133140 -56569 -192613 -194481 -152043 -160472 -206796 -197464 -44662
33026 -44662 217470 379850 250264 -54820 -195278 -83190 -44765 -317969 -621338 -528955
33016 -528955 -120809 110811 -38694 -244193 -158928 147421 362922 313328 76055 -106609
33006 -106609 9295 411082 746856 725543 547683 615330 843252 703023 51051 -564368
32996 -564368 -654603 -405094 -216023 -55826 266767 521407 331368 -116904 -218673 189977
32986 189977 623079 667997 456680 275759 125598 -106666 -349161 -465141 -462239 -396993
32976c96993J39457J70686P3083K797J53527L23270J27188l23856m32925L3833
32966a29933N39946M92348K3446k76767j72553N3872J34143J19736J28816J14901
32956A027955L1044J4109K10385M96690N62336L14872Q1911K64193P96629J164144
32946D964268J118344J167449J917542K907345K701014O02277k114391l377717
32938I886131k640787j320606q37892j043911j012999n96295l45454l49908j61168
32929A577111K01955J34891m77422r00097o08356j0226K94642L33140L44198J55222
32919A045058l82691q02640n85824j6626K19708O1402q968J21294J25268j000
32909b25019R7188L61037K92481j47123l65548j10748J11208p1617k75738q5051
$$ plain form
32976 -396993 -257536 -86850 -13767 -10970 142557 465827 593015 269159 -163766 -129933
32966 -129933 410013 902361 925807 649040 476487 530359 664502 784238 913054 1027955
32956 1027955 1058999 1073108 1283493 1780183 2342519 2657391 2739302 3003495 3800124 4964268
32946 4964268 6082612 7250061 9167603 12074948 14775962 15378239 13263848 9886131
32938 9886131 7245344 5924738 5086846 4042935 3029936 2433641 2088187 1738279 1577111
32929 1577111 1779066 1913957 1436535 536438 -71918 -82144 212498 545638 889836 1045058
32919 1045058 662367 -140273 -726097 -742723 -523015 -461613 -470581 -349287 -224019 -225019
32909 -225019 -127831 233206 525687 378564 13016 -97732 13476 -58141 -333879 -418930
32899d18930K16041J79107l8954m2180O4380n9672k64929j18636K98962M38569
32889B53758J20673k14947j78710R2550K45711J52411q0463k83370l09846j32993
32879c35226R7776K22295K43595K05895M8266k00755k66995k043K38329J9370
32869B70507m32973m28789J66304O33470L82045k21005m15347j33194J0106k74375
32859d43251n07164j94449L97855N96002K43218j48101j53720O7507J76191J62097
32849A96185J54251L9058k89798m95608j63144M31696N10529j05621o55933m92339
32839h70724M6994K39596J9741j24784m318J26682J50039K31690L80218L58391
32829E53525J18668q5834j21758j43725k42373k67293j32021N422J5247k306O7378
$$ plain form
32899 -418930 -202889 -23782 -62736 -104916 -40536 -100208 -365137 -483773 -184811 253758
32889 253758 374431 159484 -19226 73324 319035 471446 390983 107613 -202233 -335226
32879 -335226 -237450 -15155 228440 434335 482601 281846 14851 12808 251137 270507
32869 270507 -162466 -591255 -424951 208519 590564 369559 -45788 -178982 -168876 -443251
32859 -443251 -950415 -1144864 -747009 -151007 92211 -55890 -209610 -142103 34088 196185
32849 196185 350436 389494 99696 -395912 -559056 -127360 383169 277548 -378385 -870724
32839 -870724 -823730 -584134 -564393 -689177 -693495 -566813 -416774 -185084 195134 553525
32829 553525 672193 586359 464601 320876 78503 -188790 -320811 -315389 -300142 -302448 -235070
32818b35070J50299J38293P5058O3275J13956J69514J67665N1736j62781l34846
32808A97099l42170k41426j39321j234J97101K53975K392k92578j99847K06386
32798c59623L74749P1222k91566l00681r7711j4181k2524Q8663K59224K70920
32788b1508J59103J41377K16746J70927m2230k17191k16489j38721j23278j65474
32778b36738j74004r3191N2348J52622Q2688j25110k33024n5976K58166L48065
32768b4154N8273l63858n23594k72512J69412M43622L87516J49871j3035q625
32758B916O4206Q8254K2869j24919k83356l02428j25257M9830j5276k22761k27531
32747a073453N9213L37387L80951L23616L17190K25607p1184l37213k86850n0453
$$ plain form
32818 -235070 -84771 53522 128580 191855 305811 475325 642990 694726 531945 197099
32808 197099 -145071 -386497 -525818 -527052 -329951 -75976 -73584 -366162 -566009 -359623
32798 -359623 15126 86348 -205218 -505899 -603610 -617791 -640315 -551652 -292428 -21508
32788 -21508 137595 278972 495718 666645 624415 407224 190735 52014 -71264 -236738
32778 -236738 -410742 -503933 -451585 -298963 -216275 -341385 -574409 -630385 -372219 -24154
32768 -24154 34119 -329739 -853333 -1125845 -956433 -512811 -125295 24576 11541 2916
32758 2916 67122 155376 178245 53326 -230030 -532458 -657715 -607885 -623161 -845922 -1073453
32747 -1073453 -1014240 -676853 -295902 27714 344904 570511 499327 162114 -124736 -175189
32737a75189J9461j16387j97761j26385m2831J2396J25710J94676j164l32285
32727f39759l39452R6609M79005L50802p4594k56678p9622R8310L1227j36704
32717d70856j72982l5482K03355M70422O41487N56860K00147k28825m84402m68311
32707B11413k62861n9509k9676j52323k00472l5761J37011J9743k94140l64834
32697a031409j0249M19586N19943L10522L4594k34515m75641m59006l8008M24443
32687e39740M01202l4168k65999l6084K12916Q6153j59927j02003J61373K46681
32677b9596J39752J29695K30304J48012j85849m63928m44744k26494j7981R5773
32667f25056J07936M8798K9909J19389J76023L7987j50108q7176J97345L22828
$$ plain form
32737 -175189 -155728 -272115 -469876 -596261 -639092 -626696 -500986 -306310 -307474 -639759
32727 -639759 -979211 -882602 -403597 -52795 -127389 -384067 -463689 -365379 -334152 -470856
32717 -470856 -643838 -679320 -475965 -5543 635944 1192804 1392951 1164126 679724 211413
32707 211413 -51448 -110957 -140633 -292956 -493428 -529189 -392178 -372435 -666575 -1031409
32697 -1031409 -1041658 -622072 -102129 208393 242987 8472 -467169 -926175 -964183 -539740
32687 -539740 -138538 -172706 -438705 -474789 -261873 -175720 -335647 -437650 -276277 -29596
32677 -29596 110156 239851 470155 618167 432318 -31610 -476354 -702848 -720829 -625056
32667 -625056 -517120 -468322 -438413 -319024 -143001 -105014 -255122 -342298 -144953 177875
32657A77875R7124k17391k91890j36197O859k7044k07230l29911j39356L52225
32647g14936O92290M56438j04307k90252Q6755M29647K39973k01619l74737l04676
32637h5424l29793l97971j78888K36729L27929q1175m88460l54263K05427N76598
32627e69291L69488j71140m57812k01512K81278M55890K05938r6802j47714m8188
32617c79865O375M5247J11963N2377j70308k22175J37414N36378L97383k23344
32607B91445o67860n51128j69242M2073N5724R1077J99577K28752P7699j33508
32597e35391j35861J86212N24274L99470j52212m65184j45721K55110P872o20929
32587f82360o88945N38O07233N25425J50385M7880R1844p0017k82053k07038K8518
$$ plain form
32657 177875 274999 57608 -234282 -370479 -363620 -390664 -597894 -927805 -1067161 -714936
32647 -714936 -22646 433792 329485 39233 125988 555635 795608 593989 219252 -85424
32637 -85424 -415217 -813188 -992076 -755347 -427418 -508593 -997053 -1351316 -1145889 -569291
32627 -569291 -199803 -370943 -828755 -1030267 -748989 -293099 -87161 -183963 -331677 -379865
32617 -379865 -373490 -328243 -216280 -163903 -334211 -556386 -418972 117406 514789 291445
32607 291445 -376415 -927543 -1096785 -1054712 -998988 -907911 -708334 -479582 -401883 -535391
32597 -535391 -671252 -485040 39234 438704 286492 -178692 -324413 -69303 -61431 -682360
32587 -682360 -1371305 -1370767 -763534 -238109 -87724 -39844 52000 -18017 -300070 -507108 -478590
32576d78590R0477K8167Q1802J72459R5333k6540J4573N7332j21086k86959j04867
32565d77899K09063K05948q055J5863J97329L1601m42812n85611k03505J18621
32555i39457o005j85335m606K94526L34055K30860K23337J63140j02682k74862
32545b67029p6372J81053O8320k36413k78587j11667j18485k44267q8552L07116
32535h64883M36570J51063j04505k1972J35645M5089j65792j82386J5700J79831
32525c75640J34940m8377j34581L8869L21250L61738R5207j17621o7526q0896
32515A27363m16923o32235j73323O27976Q97763M73475L3746k8875k7813j60353
32505G20801j46776N4930L8259k12625j51374K56475K47024l87936o82229m7055
$$ plain form
32576 -478590 -388113 -359946 -278144 -105685 -10352 -36892 -22319 35013 -86073 -373032 -477899
32565 -477899 -268836 -62888 -70943 -55080 142249 173850 -268962 -854573 -1058078 -939457
32555 -939457 -945462 -1130797 -1135403 -840877 -506822 -275962 -52625 110515 7833 -267029
32545 -267029 -343401 -162348 -94028 -330441 -609028 -720695 -839180 -1083447 -1171999 -864883
32535 -864883 -428313 -277250 -381755 -403727 -268082 -222993 -388785 -571171 -555471 -375640
32525 -375640 -240700 -289077 -423658 -384789 -63539 298199 393406 275785 208259 127363
32515 127363 -289560 -921795 -1095118 -467142 430621 904096 937842 908967 881154 720801
32505 720801 574025 628955 667214 454589 303215 559690 806714 418778 -263451 -310506
32495c10506N54410Q9232p46367n94961K96165M79588k56198n55095J99003Q56560
32485A1831L97782m89640o03654k919L80904K35186J7141m319j5669j20988j70765
32474c65110q1915O3795J48959K7079l59293o78784m09230L94887R50394P06374
32464C97156N3418l07488k83832k18894j96783q1769K8875l7385j02988R6321
32454f53369L69999L11814k4425j90364k8117J77268K05484J30315M2575o8994
32444B72186j50553j27273r3275j57898j79883J9251K77483K91846J00751j8306
32434B34329l4998j24789k26111j15804J07819J16262o6157q7738P7390O3413
32424e6384j77353j96526J65466L86032M0540m89896n55084j34685K80397M40325
$$ plain form
32495 -310506 243904 333136 -413231 -1008192 -712027 -232439 -488637 -1043732 -844729 11831
32485 11831 409613 -80027 -683681 -686600 -305696 -70510 -53369 -57688 -73357 -194345 -365110
32474 -365110 -447025 -383230 -234271 -207192 -566485 -1245269 -1654499 -1259612 -309218 397156
32464 397156 450574 143086 -140746 -359640 -556423 -638192 -609317 -646702 -749690 -653369
32454 -653369 -283370 28444 4019 -186345 -214462 -37194 168290 298605 341180 272186
32444 272186 121633 -5640 -98915 -256813 -436696 -417445 -139962 151884 252635 234329
32434 234329 199331 74542 -151569 -267373 -159554 -43292 -109449 -197187 -119797 -56384
32424 -56384 -233737 -430263 -264797 121235 161775 -328121 -883205 -1017890 -737493 -297168
32414b97168M58587L58772N2893k57686j90062J98617L41349p7479o26468o56602
32404f95247j10313M59706N50647J53097l75889o44357m65970M40L35958K77566
32394e14362M9800O0968K76287K31288k12444n18545k03239L92045N12883K6214
32384A00895m52201m38070r0872K22417L81546L60064Q1478l07367m10134j27881
32374f80125J12200p783j75754L9297M47614M94500R9549k41152j64177J49072
32364G3241L01318J20101k55238m98011l28727J62965M92315K99865j78740m05619
32354b16530k23390L0666M8715j00440j78161r2326O9923J86107K10681J84459
32344h0296J35882J6364j58990j91479L3582K25866J7997l85594l83233R7144
$$ plain form
32414 -297168 161419 520191 573084 315398 125336 323953 665302 587823 -38645 -695247
32404 -695247 -805560 -345854 204793 357890 -17999 -662356 -1128326 -1127886 -791928 -514362
32394 -514362 -464562 -403594 -127307 103981 -108463 -627008 -830247 -438202 74681 100895
32384 100895 -351306 -789376 -880248 -657831 -276285 83779 165257 -142110 -552244 -680125
32374 -680125 -567925 -575708 -751462 -712165 -264551 229949 329498 88346 -75831 73241
32364 73241 374559 494660 239422 -258589 -587316 -424351 67964 367829 189089 -216530
32354 -216530 -439920 -409254 -360539 -460979 -639140 -731466 -661543 -475436 -264755 -80296
32344 -80296 55586 71950 -87040 -278519 -244937 -19071 -1074 -386668 -769901 -672757
32334f72757M24649K47099Q752J08355J99490j06947m40709k81439J08996J37718
32324b66793j12327j25797J02557J84695J38081K35729K94526j9710l95295k99795
32314b64129J2503p6472l22778J3479O73083N95383k69885p26844k44140K62988
32304c46812Q4080j84909Q1600L91912J67344j47809J3357K55186L6488k70869
32294G9568j64333l8726l41350m97088R4760P24319M31192k05497P5323R52924
32284A111092Q74574l60636j154518o08472J91526Q4626m16000k66714L33770
32275b10752M71849R8361p2436J30284J65426j88168m87223l81984p8380R5534
32265d57489J18581J13222Q5064j683p7845l8725J09013K31091J88099o640j58764
$$ plain form
32334 -672757 -248108 -1009 7743 116098 315588 208641 -232068 -513507 -404511 -266793
32324 -266793 -379120 -504917 -402360 -217665 -79584 156145 450671 430961 35666 -264129
32314 -264129 -251626 -328098 -650876 -637397 35686 631069 361184 -365660 -609800 -346812
32304 -346812 -262732 -447641 -366041 25871 193215 45406 58763 313949 350437 79568
32294 79568 -84765 -123491 -464841 -961929 -867169 -142850 288342 82845 158168 1111092
32284 1111092 1985666 1625030 470512 -137960 53566 138192 -277808 -544522 -210752
32275 -210752 261097 359458 287022 417306 582732 394564 -92659 -474643 -553023 -457489
32265 -457489 -338908 -225686 -140622 -142305 -220150 -258875 -149862 81229 269328 262688 103924
32254A03924j01777O4610P0658j52106l37057k11408J40279L55424K07670j39970
32244B47l18204j63242J00913J35481r9450l11714k53002J1366K46053L20395
32234c31157K75814K25229K25813J78164q4836m70942n50187j06911L82200K91081
32224C4268k04404l19020J43067M88762K71054k2715J35560M16211K42375k45447
32214I39711n14232m99841m62984l58011m2152K13527J24028j3146J66056L31553
32204a15491K3089l73402j69921L56479L17576k65514m43069P4141M56101J65063
32194B5052k48691j95748N6658N7150o9965p0882p1443j44778j7632L34953M48267
32183A02941J58940m2505R8531J03124l07197n56531j83643K60739J01478l03557
$$ plain form
32254 103924 2147 66757 137415 -14691 -351748 -563156 -422877 -67453 140217 247
32244 247 -317957 -481199 -380286 -244805 -344255 -655969 -908971 -897605 -651552 -331157
32234 -331157 -55343 169886 395699 573863 489027 18085 -532102 -639013 -256813 34268
32224 34268 -170136 -489156 -346089 142673 413727 391012 526572 942783 1185158 939711
32214 939711 425479 -74362 -537346 -895357 -937509 -723982 -599954 -613100 -447044 -115491
32204 -115491 -92402 -465804 -635725 -279246 38330 -227184 -670253 -596112 -140011 25052
32194 25052 -223639 -419387 -362729 -305579 -375544 -446426 -517869 -662647 -680279 -345326 102941
32183 102941 261881 219376 317907 421031 113834 -442697 -626340 -365601 -264123 -567680
32173e67680k02765K60987L78189J18572L9962J82283P3712k39371j73734L00572
32163A70727M88228J03058k63267j33570J19535l1841l96999l92849P2522M80905
32153B16449L53329k33469p24672o11714J6817M89867L08333k14478l62510K9529
32143g32519M38948M54406K45940J27424R0606q193j39629k19617k77514k99386
32133c19534j45464J68250L40375J75691r1794j29284N988J3173j21517j02823
32123b06939J39424K58415J8317k70319j62212K25725L38153J9290k27335l3361
32113I9158K15622j1759m84972n15422l8825K84196J08219j44377q5990N8412
32103e15738L9826J03920M03433M72127m6825o05847m57228J66233M01696R2215
$$ plain form
32173 -567680 -770445 -509458 -131269 -12697 27265 209548 283260 43889 -129845 170727
32163 170727 658955 762013 498746 365176 484711 452870 55871 -336978 -264456 216449
32153 216449 569778 336309 -388363 -1000077 -983260 -493393 -185060 -399538 -762048 -732519
32143 -732519 -293571 160835 406775 534199 624805 616612 476983 257366 -20148 -319534
32133 -319534 -464998 -296748 43627 219318 127524 -1760 4228 17401 -104116 -206939
32123 -206939 -67515 190900 209217 -61102 -223314 2411 340564 359854 132519 99158
32113 99158 314780 303021 -181951 -697373 -736198 -452002 -343783 -488160 -574150 -515738
32103 -515738 -475912 -371992 31441 503568 456743 -149104 -606332 -440099 -38403 53812
32093E3812j11546O3104J48093r9274k53435n7987Q4635j13110k57655K161K90121
32082b51081J41688j68578j08856J77822J53328j39167j52620J66164K25184k18718
32072a74834n94929l68927J69501L91837K38164J44038K44328J82355k30145o08387
32062f06999m97753j4948L34521L64143L68784N37530N79862J86256l97172o25092
32052B29132l89659j16646j04980j58395k0097J76179J59765n355k1544J68242
32042h3358K94827J51645j40238k99535j99331J7148R0172p0673k55301j96261
32032f90905O7975K41936K01808J30684J46214R7450q6976j68629k568J30591
32022F7580k5667j96574n173L09564K12055j96983k73673Q7362K30190j48244
$$ plain form
32093 53812 -57734 5370 153463 54189 -199246 -257233 -172598 -285708 -543363 -541202 -251081
32082 -251081 -109393 -277971 -386827 -209005 -55677 -194844 -347464 -181300 43884 -174834
32072 -174834 -769763 -1138690 -969189 -577352 -339188 -195150 49178 231533 1388 -606999
32062 -606999 -1104752 -1119700 -785179 -421036 -52252 485278 1065140 1251396 854224 229132
32052 229132 -160527 -277173 -382153 -540548 -560645 -384466 -224701 -230056 -251600 -83358
32042 -83358 211469 363114 222876 -76659 -275990 -258842 -168670 -239343 -494644 -690905
32032 -690905 -622930 -380994 -179186 -48502 97712 195162 108186 -60443 -63011 67580
32022 67580 41913 -154661 -159834 149730 361785 164802 -108871 -21509 208681 60437
32012F0437m25659p8087L95166K52404k81483l98263j1139J92116o7713k79437
32002f41658p9895J95813J93907J18053K29189K96306J6850l87988m70214k03122
31992g32759Q1178K10836K48838K06348N5267p6211n3012J1101m9637j11361M4207
31981a65205K78697K31629q9025k38824K5991L63972L01647j27277m24762k58555
31971a01712J32531K44698l9508k67128q943M86168N27792r0304p38998p20419
31961e75823j13875M06916M01298K0838l19241l45938q2716J83378J61420q2551
31951c46294j89501n2519O98k08731l18758l636L93402L19918j29726l86820k81298
31940a203265j33718m9998K19535O49955P84770L95190j78169n04659m81382j87343
$$ plain form
32012 60437 -365222 -443309 -48143 204261 -77222 -475485 -486624 -294508 -362221 -641658
32002 -641658 -721553 -525740 -331833 -213780 15409 311715 328565 -59423 -529637 -732759
31992 -732759 -651581 -440745 -191907 14441 69708 -6503 -59515 -48414 -98051 -209412 -165205
31981 -165205 113492 345121 256096 17272 43263 407235 708882 581605 156843 -101712
31971 -101712 30819 275517 236009 -31119 -40062 446106 973898 883594 144596 -575823
31961 -575823 -689698 -282782 118516 139354 -179887 -525825 -608541 -425163 -263743 -346294
31951 -346294 -535795 -588314 -587616 -796347 -1115105 -1118741 -725339 -405421 -535147 -921967 -1203265
31940 -1203265 -1336983 -1386981 -1167446 -517491 267279 662469 484300 -20359 -501741 -689084
31930f89084K36089M71932K60234j50194k40380J2778J23505o9659j68208J6296
31920a96691J13449q4409j87925Q6480L47782J65204j94676k03352J15554L28855
31910B90271K68095P8225j62525m07925m33265r8485L28251M67495K84158l9781
31900E74514m26061p61483p37354k45170L03422M64149L48548L19433L40777J14483
31890B95258k95650m74653k47352J33728L60526L30917J18530o2927N795K31973
31880C96145K37117q2750l34250k43088j05227k32603l61472j34714J98708J92507
31870d69627R021J07323L37828J41912m00433n38475l265N33671M32162o3702
31860H6415k95533j05627Q9498n7246l85321m19296N1956O08538N94273k9020
$$ plain form
31930 -689084 -452995 18937 279171 128977 -111403 -98625 24880 -44779 -212987 -196691
31920 -196691 -83242 -167651 -355576 -269096 78686 243890 49214 -154138 -38584 290271
31910 290271 558366 636591 474066 66141 -367124 -465609 -137358 330137 614295 574514
31900 574514 148453 -613030 -1350384 -1595554 -1292132 -827983 -479435 -160002 180775 295258
31890 295258 -392 -475045 -722397 -588669 -228143 102774 221304 158377 164172 396145
31880 396145 633262 550512 216262 -26826 -132053 -364656 -726128 -860842 -662134 -469627
31870 -469627 -460606 -353283 -15455 126457 -273976 -812451 -815716 -282045 150117 86415
31860 86415 -209118 -314745 -225247 -282493 -667814 -1087110 -1035154 -426616 167657 138637
31850A38637n33430l64362J41127L40367J87823L1073j15404m03726n32845j02329
31840a213069N22678N36224p6346m42527j02554L66119L17107n0331j52036J08836
31830a85899L56689L22200P6575j40058j65083j14258k85002o50251o73144m4131
31820a502362O47817O04615K1678j57346L25115O76068K93652m00017o77001m17801
31810e85582J8170L07351K69923o6931l17490j14127K73654K52379j21184j83659
31800b67496K11396M23817J13231k33795k00229n7028q5253o5602J10454R6633
31790D6128j62689j35396L20954N05429J5945m77520l21454N9282R409k07464
31780c47376m3174K28860O8884k33211r0893K20094N0597l50566k19415L15513
$$ plain form
31850 138637 -394793 -759155 -618028 -277661 -89838 -58765 -174169 -577895 -1110740 -1213069
31840 -1213069 -690391 -154167 -230513 -673040 -775594 -409475 -92368 -142699 -294735 -185899
31830 -185899 170790 492990 569565 429507 264424 150166 -134836 -785087 -1458231 -1502362
31820 -1502362 -854545 -249930 -228252 -385598 -60483 615585 909237 509220 -167781 -585582
31810 -585582 -567412 -260061 9862 -57069 -374559 -488686 -215032 37347 -83837 -267496
31800 -267496 -56100 367717 480948 247153 46924 -10104 -95357 -160959 -50505 46128
31790 46128 -116561 -251957 68997 574426 590371 112851 -208603 -149321 -139912 -347376
31780 -347376 -390550 -161690 -92806 -326017 -416910 -196816 -146219 -496785 -716200 -400687
31770d00687L90349j24426m45677j92531J66660K63011K51940J87303j05424m11062
31760d20544k62610J84946K76877n4880k16352m6766k5009k39427j78139K13673
31750g68231L26350O5252J26285O23220O09289l09734r96090m11844O70788P78034
31740G13319o8175n45969j20231L55662J66386k82267l37443q2240K9732n6731
31730b27957p7022L8360J26400R8020O88j19600k12283j54639J14443L92712L21010
31719C00132j86281o94552o40912l6134M53760L20063j18095j87819J68166L80022
31709b41650J74393n6598L3430J99607Q3089j90348k69298j31300q426J5643Q072
31698c83386j0111K2470K57061O00323O00219L7288o11105p24606l69470j17096
$$ plain form
31770 -400687 -10338 -134764 -580441 -772972 -606312 -343301 -91361 95942 -9482 -420544
31760 -420544 -683154 -498208 -221331 -276211 -492563 -539329 -564338 -803765 -981904 -768231
31750 -768231 -441881 -376629 -250344 372876 982165 672431 -323659 -735503 -64715 713319
31740 713319 645144 99175 -21056 334606 500992 218725 -118718 -200958 -171226 -227957
31730 -227957 -304979 -266619 -140219 -42199 -41511 -161111 -373394 -528033 -413590 -20878 300132
31719 300132 113851 -580701 -1221613 -1257747 -803987 -483924 -602019 -789838 -621672 -241650
31709 -241650 -67257 -123855 -90425 109182 192271 1923 -267375 -398675 -407101 -391458 -383386
31698 -383386 -393497 -371027 -113966 486357 1086576 1123864 512759 -211847 -581317 -698413
31688f98413j82035k56374j45268k0245K7165J67415L98784L88285L843l63123
31678f79966l17937l0375N6960j02679j56855N4286K79517K96943K53395L66887
31668B0176M93083K80064k63274o34770m34135P1885K27757j81518o31964n14581
31658a567277R8967N64457M67675O1308j68213j36735j36685k74110k64275P3988
31648a280900M01188K74348j34618j83952K91312O50761L59866j88834k52423
31639f3252J51159L38574O5891j71556o1186J6512k50445m47239q2911N17517
31629A3064O05295R0366l74678l39197l3890J44582J40536Q5410K1381l8344m6190
31618B68335n5496j77390l06451j71456K04437L91239J19449k84075l07837M9684
$$ plain form
31688 -698413 -880448 -1136822 -1282090 -1302335 -1275170 -1107755 -708971 -320686 -316843 -679966
31678 -679966 -997903 -1028278 -971318 -1073997 -1230852 -1176566 -897049 -600106 -346711 20176
31668 20176 513259 793323 530049 -104721 -538856 -466971 -239214 -420732 -1052696 -1567277
31658 -1567277 -1468310 -903853 -436178 -374870 -543083 -679818 -816503 -1090613 -1354888 -1280900
31648 -1280900 -879712 -605364 -739982 -923934 -632622 18139 378005 189171 -63252
31639 -63252 87907 426481 492372 320816 259630 276142 25697 -421542 -504453 13064
31629 13064 618359 708725 334047 -5150 -39040 105542 246078 331488 352869 314525 268335
31618 268335 212839 35449 -271002 -442458 -238021 153218 272667 -11408 -319245 -269561
31608b69561K96171J09322k76551l89045o0397L99079N02204Q0673m67834n30154
31598f06093P939N27577L71969l08948p03470l42067L63911P08378N05906R3595
31588F18697k14225l33442k35411L8270K25958Q8359j85614j95111J7611q895
31578a83803l44097m22865N4031N02156K83650k44114k23391L65213O63639K63037
31568G13456k34112k28306K0361j8428k67271k90546m1311J73644K29917K18090
31558B75494J36431k8395j05358k1656n3292l59027n30450j58992L72225L36275
31548a36745k04813m58654j28148J99157Q5122j00489O7198L29900K74552O8707
31538d213R3875K46055J91555J7389L3088J46161K7255k51415l22762j72064j03970
$$ plain form
31608 -269561 26610 135932 -140619 -529664 -590061 -190982 311222 391895 -75939 -606093
31598 -606093 -598154 -70577 301392 -7556 -711026 -1053093 -689182 19196 525102 618697
31588 618697 404472 71030 -164381 -126111 99847 188206 2592 -192519 -174908 -183803
31578 -183803 -527900 -950765 -896734 -394578 -110928 -355042 -578433 -213220 450419 713456
31568 713456 479344 251038 271399 252971 -14300 -304846 -346157 -172513 57404 275494
31558 275494 411925 383530 278172 256516 203224 -155803 -686253 -845245 -473020 -136745
31548 -136745 -341558 -800212 -928360 -729203 -644081 -744570 -677372 -347472 -72920 -4213
31538 -4213 89662 335717 527272 544661 577749 723910 751165 499750 176988 4924 -99046
31527i9046j22733N8083L80537M27210J33335p4089j934J9991k07803l78716k59098
31516a24263j16030j92887k37122P888K63195J73982l8770N2170L14831K64630
31506C67624j00803k75169l8739K61699K93811J35287j2440j07403j48526j04013
31496B71328m9291r2003j32211p859J32524q452l18027l22176R5090M60145L77284
31485D06352K9147j94337j86836k3672K43332M20576J86918l90817p05960l69615
31475e84912J78366K58318r2247k55541R798K84370J77191j65471l59577k48993
31465g98698N9006L64289M61883K65736m7327j71479k9338J34172Q1440j03799
31455B15885j14422K01709O12109P06321L91199Q9755K55479P59647J093534J172292
$$ plain form
31527 -99046 -221779 -163696 216841 644051 777386 703297 701363 721354 513551 134835 -124263
31516 -124263 -240293 -433180 -670302 -662414 -399219 -225237 -264007 -211837 102994 367624
31506 367624 266821 -8348 -47087 214612 508423 643710 631270 523867 375341 271328
31496 271328 222037 130034 -2177 -10036 122488 114036 -203991 -526167 -431077 29068 406352
31485 406352 435499 241162 54326 30654 273986 694562 881480 490663 -215297 -584912
31475 -584912 -406546 -148228 -240475 -496016 -486218 -201848 -24657 -190128 -549705 -798698
31465 -798698 -739692 -375403 86480 352216 304889 133410 104072 238244 319684 215885
31455 215885 101463 303172 915281 1621602 2012801 2102556 2358035 3117682 4211216 5383508
31445E383508J418480J832085J589416J43423j688543k491805j967595j139165
31437C079804q54023q74879o73711l49789k55196k60105k0252L13158K57710k14109
31427A48608n63827m01866O9376M03204L95811J28997k16189m36329l64126k7193
31417h63534K97955L10208j6787l90683m64213j52581K87826M91545L11590o5688
31407b54362l10958k45148K9980K51596K44568P4797m6380q914Q9586J03529L4324
31396c7382q88N2271J19039R1433o3961k69412l65069k23830R7651L58090L46634
31385A04576Q9061j79603k14794M7809M08290N15665K05731k52393m10573j80986
31375A32783P3381N0193j27116j78871o3310P6321J46478R7736j06969l31055
$$ plain form
31445 5383508 6801988 8634073 10223489 10366912 8678369 6186564 4218969 3079804
31437 3079804 2225781 1350902 677191 327402 72206 -187899 -208151 105007 362717 148608
31427 148608 -415219 -817085 -747709 -344505 51306 180303 -35886 -472215 -836341 -863534
31417 -863534 -565579 -255371 -272158 -662841 -1127054 -1279635 -991809 -500264 -188674 -254362
31407 -254362 -565320 -810468 -780488 -528892 -284324 -209527 -255907 -264821 -175235 -71706 -37382
31396 -37382 -38270 14001 133040 224473 160512 -108900 -473969 -697799 -600148 -242058 104576
31385 104576 193637 14034 -200760 -152951 255339 771004 976735 724342 313769 132783
31375 132783 206164 256357 129241 -49630 -112940 -36619 109859 207595 100626 -230429
31365b30429l06309m1805Q5758j00707k50670o5963J49624k34k64549j30335K66110
31354h89509L23309k739j13306K12903M53934K25897j42139k38613j78137j88964
31344e37364j21570J67413L68937J57827k35940l57055j73549L5015J95926L93833
31334a06527M90565K67458j40752l59206k64400l6006J77430L10806K32178p8578
31324D92968l07878j72983P7337k2473l85852m38613j4369L55052K47108m8957
31314b18660o3680J25987J30991o2652j21528M3126J74483J51775J45530K19172
31304E24544J75676m2560j63810k8881R5995m7872k38265j21243J59972J49341
31294D62897j85505l90274k34811j3032n204q0202l0064Q1308J17301P9757m6988
$$ plain form
31365 -230429 -536738 -578543 -492785 -593492 -844162 -910125 -760501 -760735 -1025284 -1155619 -889509
31354 -889509 -566200 -568939 -682245 -469342 -15408 210489 68350 -170263 -348400 -537364
31344 -537364 -658934 -491521 -122584 35243 -200697 -557752 -731301 -696286 -500360 -106527
31334 -106527 384038 651496 510744 151538 -112862 -148868 28562 339368 571546 492968
31324 492968 185090 12107 89444 66971 -318881 -757494 -771863 -416811 -169703 -218660
31314 -218660 -282340 -156353 -25362 -88014 -209542 -166416 8067 159842 305372 524544
31304 524544 700220 657660 493850 464969 560964 513092 274827 153584 313556 462897
31294 462897 277392 -112882 -347693 -360725 -365929 -446131 -476195 -394887 -277586 -197829 -244817
31283b44817k88191l80731J2568N86156N22014k87324q29923l67774M23125M86942
31273c67955k4270j81911J34212K35725K885K7009L39187K29295m02694o78121
31263f86638j61884M02949L37724M1470J05533K85762J17668j77469k03010j83599
31253a21494m39623o07970k33345L10092L52313L1692J237K92992L46173K7179
31243d0754k05110j18669L3205P5208R6431Q1504o3325j49787O7224L66473L28846
31232D71246M5717m5060M8973p9835m12152m33611r390L36072K16292j07353k32064
31221b01165j33722L0856J91688K36801L2492k51772k51326K096M8984k33956
31211e29024l25742J45015P07616O10910j35065p31788n86526J3069L31900R3945
$$ plain form
31283 -244817 -533008 -913739 -901171 -315015 206999 -80325 -910248 -1278022 -854897 -367955
31273 -367955 -392225 -574136 -439924 -204199 -201314 -174305 164882 394177 -8517 -686638
31263 -686638 -848522 -445573 -107849 -66379 39154 324916 442584 265115 62105 -121494
31253 -121494 -561117 -1169087 -1402432 -1092340 -740027 -708335 -707098 -414106 -67933 -40754
31243 -40754 -245864 -364533 -331328 -256120 -159689 -78185 -141510 -291297 -224073 142400 471246
31232 471246 516963 471903 520876 441041 28889 -404722 -414112 -78040 138252 30899 -201165
31221 -201165 -334887 -304031 -112343 124458 156950 -94822 -346148 -344052 -295068 -529024
31211 -529024 -854766 -709751 -2135 608775 473710 -258078 -844604 -831535 -499635 -405690
31201d05690k52321j77970K34261M69187L39643J75131J84857J03304k58630n51009
31191a39237l99171k9286J13407P4696J61591K52833r503m71404n81559k33690
31181a261323J27481K42736K56500J84780j46094n15678l68661K97107P35422
31172d47730M63902p9325k40467j7227J71833J70505J13956P2352M7267J04596
31162C59662K04192J09310k52785n42882m10409O752K51515J34672o9016o074
31152b15063L01779M48125J28649l93342n21784j18476K64732J89912k1358J07562
31142A70736L40089J35099l21074l15573J93136M30409J3537m85863m64048p2159
31132c75711K44483L66130L13197K2691l33684l46260j7028J29089j00825k10024
$$ plain form
31201 -405690 -658011 -835981 -601720 -132533 207110 382241 567098 670402 411772 -139237
31191 -139237 -538408 -567694 -454287 -379591 -218000 34833 25330 -446074 -1027633 -1261323
31181 -1261323 -1133842 -891106 -634606 -449826 -595920 -1111598 -1480259 -1183152 -447730
31172 -447730 16172 -63153 -303620 -320847 -149014 21491 135447 207799 255066 359662
31162 359662 563854 673164 420379 -122503 -532912 -526160 -274645 -139973 -208989 -215063
31152 -215063 86716 534841 663490 270148 -251636 -370112 -105380 84532 63174 170736
31142 170736 510825 645924 324850 9277 202413 632822 646359 160496 -303552 -375711
31132 -375711 -131228 234902 548099 570790 237106 -109154 -126182 2907 -97918 -307942
31122c07942J06201L69621J25250k58459k13954R5984J44229m8790n9356J41254
31112I4038J91609M992j33167o0052J04969K06789J36487j62835m90997m55692
31102e63859l6283K59065J37047K378K56189N53072L49215j58309l13942j5176
31092D69397K16284P1666k30042m16514m31133k60009N2386K50758J29506j19976
31082b67677j69602l4202M6012J4679n9516k09240l60451k02810K91541N65882
31072c85384K25496k64671k43544J30531K43894R3184J45966L46540J87762k81379
31062A98395m47104j89565n3367k21787k06356K01607N09535L71636R4796l9978
31052B17812k20481m91766m40619L8252L35128K4565m10134l19338J48528M06852
$$ plain form
31122 -307942 -201741 167880 293130 34671 -179283 -83299 60930 12140 -47216 94038
31112 94038 285647 290639 157472 97420 202389 409178 545665 382830 -108167 -563859
31102 -563859 -600142 -341077 -204030 -201652 54537 607609 956824 798515 484573 469397
31092 469397 685681 757347 527305 110791 -320342 -580351 -527965 -277207 -147701 -267677
31082 -267677 -437279 -471481 -425469 -410790 -470306 -679546 -1039997 -1242807 -951266 -385384
31072 -385384 -159888 -424559 -668103 -537572 -293678 -200494 -54528 292012 479774 198395
31062 198395 -248709 -438274 -491641 -713428 -919784 -718177 -208642 162994 257790 217812
31052 217812 -2669 -494435 -935054 -896802 -561674 -537109 -947243 -1266581 -1118053 -711201
31042g11201L25760J77905M4616j38203k16724n3470R6547n1411k81290j99197
31032a006668J05128K17331O8087m8295k0652j0813n1739J966J34765J68709R5187
31021c46994O2640N6097o5031k23312j71751Q5698K50972J71338L2555L1583J08549
31010g656J09430K1084o2844q4315n8974n2283j29091k52816k73015j10848J00561
30999h00767J79882J38625J16778J28072L2757k30510n04714n35447k01104L39456
30989a336972P16896O68221L14696N925j15920j96953k92674k12459J05854L65005
30979B1619L01329P0036l4163j8352m7638p9252r391q57k33857m56673k65551
30968g52750K13381M25314K03634k5900K5123Q8834j16083l79617l58766r0630
$$ plain form
31042 -711201 -385441 -207536 -162920 -301123 -517847 -571317 -474770 -526181 -807471 -1006668
31032 -1006668 -901540 -684209 -616122 -664417 -685069 -695882 -747621 -745655 -610890 -442181 -346994
31021 -346994 -284354 -228257 -293288 -516600 -688351 -602653 -351681 -180343 -147788 -116205 -7656
31010 -7656 101774 122858 60014 -24301 -83275 -135558 -264649 -517465 -790480 -901328 -800767
30999 -800767 -620885 -482260 -365482 -237410 -204653 -435163 -939877 -1475324 -1676428 -1336972
30989 -1336972 -620076 48145 362841 368766 252846 55893 -236781 -449240 -343386 21619
30979 21619 322948 392984 358821 340469 292831 213579 204188 203331 -30526 -487199 -752750
30968 -752750 -539369 -114055 89579 63679 88802 177636 61553 -318064 -676830 -767460
30958g67460J71878L36730L76289J62001k44677m19408j09760K93061K75445p789
30948F6310J972L37303M52071J15221k61767l38464k97983l32610k34578J22732
30938c69793L73934K01817q9116n3765J48777P0357j97300j75052J12097J09946
30928A31902l06787n38598j90135K94964L20300j084j35873L6894J79087J11193
30918i8137O545K313M951o4026j07805k2205J42204K38298J60992n3685k18825
30907i380j76588l5110o0161k50386k60308Q1169M31631L89266P4914q3479Q07
30896A02375L8716p8863j13517O8041K45978K03975N1837P009N2264N493j77427
30885D05881l36300l15219j41343J3549K7991k9308o596Q0958L6289k08012m10335
$$ plain form
30958 -767460 -595582 -258852 117437 279438 34761 -384647 -494407 -201346 74099 66310
30948 66310 68282 405585 857656 972877 711110 372646 74663 -257947 -492525 -369793
30938 -369793 4141 205958 116842 63077 211854 282211 84911 -90141 21956 131902
30928 131902 -174885 -713483 -903618 -608654 -288354 -289438 -425311 -388417 -209330 -98137
30918 -98137 -91592 -89279 -84328 -148354 -256159 -278364 -136160 102138 263130 209445 -9380
30907 -9380 -185968 -221078 -281239 -531625 -791933 -710764 -279133 110133 185047 101568 102375
30896 102375 141091 62228 -51289 16752 262730 466705 518542 525551 577815 583308 405881
30885 405881 69581 -245638 -386981 -373432 -345441 -374749 -381345 -300387 -264098 -472110 -882445
30874h82445l05795L5079L04336L30403J82367j4897j71575j94709o0308R7978
30864f79566J37281J06233J41585K21662K00316M8000j07553j53209p3955P6435
30854h2771J74810R8595r0537j76028j12830j05462k03264j22921K48998N04569
30844A33159K82069r3447o6407K44529K21128k30693m95931k05939K27761K78619
30834B94848Q868j91956j90050j18040p5182q4705j52195j75806R100L44321N03618
30823A72821K76853j58507m43679l77449l1890K97621K83988q5020m12157l64494
30813h41913j05663L5351J09836L20440M61065J96621k11460j70834K46750L42163
30803C82356o3934l32350j04988J21293p1566k91482q8567K28849J65328j11161
$$ plain form
30874 -882445 -1188240 -1153161 -848825 -518422 -336055 -350952 -522527 -717236 -777544 -679566
30864 -679566 -542285 -436052 -294467 -72805 127511 175511 67958 -85251 -159206 -82771
30854 -82771 92039 190634 100097 -75931 -188761 -294223 -497487 -620408 -371410 133159
30844 133159 415228 321781 255374 499903 721031 490338 -5593 -211532 16229 294848
30834 294848 303716 111760 -78290 -196330 -271512 -356217 -508412 -684218 -675118 -330797 172821
30823 172821 449674 291167 -152512 -529961 -561851 -264230 19758 -65262 -477419 -841913
30813 -841913 -947576 -912225 -802389 -481949 -20884 175737 -35723 -206557 40193 382356
30803 382356 318422 -13928 -118916 2377 -69189 -360671 -449238 -220389 -55061 -166222
30793a66222j40763L6971R2570M6748J05733J73448P7733k7319P058n2402l46213
30782a92658m78804j38967K50746J67621j26927p4067J86286J45373n2210J41806
30772a71801N74105N22173p0640m47025k40620P1235J19204J71848L93288L76994
30762A298761j19470o10781n56802j43513N8935j15020l54799l48233n4825L06036
30752f39711L96870R8382k59562k68288j905J44489R6098J07280J86995Q2620
30742e6732j46854j45771Q1121J50411L1004J10822L84108L24408j62166m22463
30732A47888r3102K69805R8210k99931l33229m7649J50183K09388K61536J52307
30722E15406k34507n39865m01680l3843J97862L72328O01363M99083j76625p57611
$$ plain form
30793 -166222 -306985 -270014 -177444 -130696 -24963 148485 226218 198899 205957 153555 -192658
30782 -192658 -671462 -810429 -559683 -392062 -518989 -593056 -406770 -261397 -313607 -171801
30772 -171801 402304 924477 853837 406812 166192 237427 356631 528479 921767 1298761
30762 1298761 1179291 568510 11708 -131805 -72870 -187890 -542689 -890922 -945747 -639711
30752 -639711 -242841 -144459 -404021 -672309 -674214 -529725 -433627 -326347 -139352 -56732
30742 -56732 -203586 -349357 -268236 -117825 -86821 24001 408109 732517 570351 147888
30732 147888 54786 324591 422801 122870 -210359 -258008 -107825 101563 363099 515406
30722 515406 280899 -258966 -660646 -694489 -496627 -124299 477064 976147 799522 41911
30712D1911m46826L77769O02820L4383l80183p8162L48891K22296k33674m28931
30702F0294k83199p0698J17023K76200K36892n5546k93812k22186m0253n4468
30692c29753j84863j70810l2360M7605J01291K38022K88100K9889l03797k31221
30682e47897K10461L78946p7546o32470n42989J41278O55126N29404R1142j32985
30672G2470j03809j05699j97403j94599o2787L2284K6792L907k4963p3154K2730
30661f04231L63277N85054K15696m88525o52503Q901O68177M96148k08130n56181
30651a72317l38747p9696n8570j5670J89327K93193J34586p4835j38007j16362
30641c77098o8486O7721K22898J96551J7832m4972P1701J32028L8629j9606K7404
$$ plain form
30712 41911 -404915 -27146 575674 610057 229874 151712 500603 722899 489225 60294
30702 60294 -222905 -293603 -176580 99620 336512 280966 -12846 -235032 -275285 -329753
30692 -329753 -514616 -685426 -717786 -670181 -568890 -330868 -42768 -12879 -316676 -547897
30682 -547897 -337436 41510 -36036 -668506 -1211495 -1070217 -415091 114313 205455 72470
30672 72470 -31339 -137038 -334441 -529040 -591827 -559543 -532751 -528844 -553807 -626961 -604231
30661 -604231 -240954 344100 559796 71271 -581232 -572331 95846 591994 383864 -172317
30651 -172317 -511064 -590760 -649330 -665000 -475673 -182480 -47894 -122729 -260736 -377098
30641 -377098 -445584 -377863 -154965 41586 59418 14446 86147 218175 256804 237198 264602
30630B64602k1247k26209l38700k36482j43630j88236j30479J73038L94086J96398
30620b56859j94021k80829J1850L14200L65698K43551Q7069q2679k41637l01579
30610c35236k29159r4953R940L1791j9991l6927J01146L19981L61223J18399j63031
30599F3183j74345N4199J90726L071l79268n83628l47666J82593N25115L56748
30589a09272r5110l37187k38078r0790o2336K2545K30157K78944K1348k02934
30579e82713o2641J99001J24938k11459k93413N5536M14814L65253j174k93453
30569b85311k92669p6220J57921K56220J78927L17j56879j91279n6506J80562
30559b84917L11962J71303j08153j97055r346J71537J21959p177J1786J07452
$$ plain form
30630 264602 243355 17146 -321554 -558036 -701666 -889902 -1020381 -847343 -453257 -256859
30620 -256859 -450880 -731709 -719859 -405659 -39961 203590 290659 207980 -33657 -335236
30610 -335236 -564395 -659348 -649408 -617617 -637608 -674535 -573389 -253408 107815 226214 63183
30599 63183 -111162 -56963 133763 136834 -242434 -826062 -1173728 -991135 -466020 -109272
30589 -109272 -204382 -541569 -779647 -870437 -932773 -910228 -680071 -401127 -379779 -582713
30579 -582713 -645354 -446353 -321415 -532874 -826287 -770751 -355937 9316 8142 -285311
30569 -285311 -577980 -654200 -496279 -240059 -61132 -60815 -217694 -408973 -465479 -284917
30559 -284917 27045 198348 90195 -106860 -116206 55331 177290 170113 181899 289351
30549B89351Q1779l5277q5397q7417j52716k10560j11954P3857J50908J21903
30539C4477J42242J92282Q2924j97811l87529k56549J27095M51431M10881j0085
30529E89358m31247m15989j2363K69900J48287p6359o2029M4800l3486j65936
30519a45064q8506N6814k2874j84077p0769K16132K54153L1557m3053J39648K29144
30508C73105L2540k20444l01607k19527r731K53587K68155j58904o24557n52805
30498a160188o7669J89124P8197O5820K87654L40436J34740P8738J96281p174
30488A35959m82882m51590K35429N84136O465o07721k83793M40542M26074k19160
30478b16541m39767J4835L79657K50523J0491j06666l06407m92869k33045L46390
$$ plain form
30549 289351 371130 335853 250456 163039 10323 -200237 -312191 -238334 -87426 34477
30539 34477 176719 369001 451925 254114 -133415 -389964 -262869 188562 599443 589358
30529 589358 158111 -257878 -270241 -341 147946 71587 9558 54358 20872 -145064
30519 -145064 -233570 -176756 -199630 -383707 -454476 -238344 15809 47366 4313 143961 373105
30508 373105 405645 185201 -116406 -335933 -345664 -92077 176078 17174 -607383 -1160188
30498 -1160188 -1227857 -1038733 -960536 -894716 -607062 -266626 -131886 -53148 143133 135959
30488 135959 -346923 -798513 -563084 21052 27517 -580204 -863997 -423455 2619 -216541
30478 -216541 -656308 -641473 -261816 -11293 -802 -107468 -413875 -906744 -1139789 -793399
30468g93399N20848P6172l45106k73047k7728J2374M5849L28733N93657M54410
30458E92763P240l48044m05480k12470R9966L46441L76102K42531P5236j80335
30448E93950n74375q00943n05415Q0597L34274J14101q9921M6872K81495L22401
30438a96964K19764P8925j17978k54650j33379R4793P1456j04181M0394M66220
30428A64400N23232j05m36771k47526J77932K06996j07270l06859k69268j40029
30418d35268P9026L60029M02376M3293l59760l78019q3738J68818K27811J00613
30408A25181k02643m63908l14253J70313M01119J57850k6788J96460L24440j04345
30398B63426n76971l84478J67256K54720j00148j56674K22599L78717K0368l26280
$$ plain form
30468 -793399 -272551 -196379 -541485 -814532 -842260 -829886 -784037 -455304 138353 592763
30458 592763 600003 251959 -153521 -365991 -266025 80416 456518 699049 774285 593950
30448 593950 19575 -781368 -1286783 -1206186 -871912 -757811 -847732 -800860 -519365 -196964
30438 -196964 22800 101725 -16253 -270903 -404282 -309489 -238033 -342214 -301820 164400
30428 164400 687632 687527 250756 3230 181162 388158 280888 -25971 -295239 -435268
30418 -435268 -356242 3787 406163 449456 89696 -288323 -372061 -203243 24568 125181
30408 125181 -77462 -541370 -855623 -685310 -284191 -126341 -153129 43331 367771 263426
30398 263426 -313545 -698023 -530767 -276047 -376195 -532869 -310270 68447 88815 -237465
30388b37465k17804R6109J93995L5507k02590l75572l29251p120L55545M87200
30378b01446M42397L54582Q0797m04224n86834r4171M76821K68807m64811o68843
30368g96925j29699K55305O526k31258J03465N62341N17796J15413j79613l13738
30358i0387l77523k19171J51155L38862K20171K23320M93575M61375j86685p96958
30348B17734o96347k18386l3012o2408Q5324J75462j65723m78617q8463N97423
30338f67013N66921j55468n25392j56275K21057J60512J41221M06100L49857k82029
30328E9491o46426j19538N21128K69256m26176l50463M77053P88296O1051o93766
30318f0094n01132K23304M80504J25939k05581j75076l3112j7865n5549m8200
$$ plain form
30388 -237465 -455269 -359160 -165165 -129658 -332248 -707820 -1037071 -1044191 -688646 -201446
30378 -201446 240951 595533 676330 272106 -314728 -408899 67922 336729 -128082 -796925
30368 -796925 -926624 -671319 -664793 -896051 -792586 -230245 287551 402964 223351 -90387
30358 -90387 -467910 -687081 -535926 -197064 23107 246427 740002 1201377 1014692 217734
30348 217734 -478613 -696999 -730011 -792419 -707095 -531633 -697356 -1175973 -1264436 -667013
30338 -667013 -100092 -255560 -780952 -937227 -716170 -555658 -414437 -8337 341520 59491
30328 59491 -586935 -706473 -185345 83911 -342265 -692728 -215675 572621 633672 -60094
30318 -60094 -561226 -337922 142582 268521 62940 -112136 -145248 -163113 -218662 -266862
$$ [...]
##END NTUPLES=NMR SPECTRUM
##END=
