##TITLE=31Pdec_41-2025-Bay
 DMSO-d6, 24 sc
 28.3.2025
##JCAMPDX= 6.0         $$ Bruker NMR JCAMP-DX V2.0
##DATA TYPE= NMR SPECTRUM
##DATA CLASS= NTUPLES
##ORIGIN= UXNMR, Bruker Analytische Messtechnik GmbH
##OWNER= root
$$ XWIN-NMR		Version 3.5
$$ Fri Mar 28 14:13:52 2025 Russian Standard Time (UT+4h)  she@DPX200
##.OBSERVE FREQUENCY= 81.013821
##.OBSERVE NUCLEUS= ^31P
##.ACQUISITION MODE= SIMULTANEOUS
##.ACQUISITION SCHEME= undefined
##.AVERAGES= 24
##.DIGITISER RES= 17
##SPECTROMETER/DATA SYSTEM= spect
##.PULSE SEQUENCE= zgpg30
##.SOLVENT NAME= CDCl3
##.SHIFT REFERENCE= (INTERNAL, CDCl3, 0, 198.062)
##AUDIT TRAIL= $$ (NUMBER, WHEN, WHO, WHERE, WHAT)
$$ ##TITLE= Audit trail, XWIN-NMR		Version 3.5
$$ ##JCAMPDX= 5.01
$$ ##ORIGIN= Bruker BioSpin GmbH
$$ ##OWNER= she
$$ F:/spectra/data/she/nmr/P31/2/pdata/1/auditp.txt
$$ ##AUDIT TRAIL=  $$ (NUMBER, WHEN, WHO, WHERE, WHAT)
(   1,<2025-03-28 14:12:32.31 +0400>,<she>,<DPX200>,
      <created by zg, POWCHK disabled, PULCHK disabled
       configuration hash MD5:
       00 E9 B6 7A A2 85 ED C7 34 08 36 98 17 FE 4E 26
       data hash MD5: 32K
       04 FD FD 7E 04 52 0D 72 1F 3B 01 73 37 93 D5 CB>)
(   2,<2025-03-28 14:12:41.56 +0400>,<she>,<DPX200>,
      <Start of raw data processing
       efp BC_mod = 2 LB = 1.5 FT_mod = 6 PKNL = 1 PHC0 = 1425.411 PHC1 = 41.29422 SI = 64K 
       data hash MD5: 64K
       78 7F AB 1F 93 1C DA A1 71 13 04 57 DD 9A 36 E1>)
(   3,<2025-03-28 14:13:12.23 +0400>,<she>,<DPX200>,
      <pk PHC0 = -42.14125 PHC1 = 60.99998 
       data hash MD5: 64K
       08 7D 63 E5 A4 3C 14 99 11 6B 16 53 FE 36 AF 52>)
$$ ##END=
$$ 
$$ hash MD5
$$ 20 17 46 A1 77 F8 48 20 D3 BD 42 31 09 F0 C6 59
##$RELAX= 
##$RELAX= 
##$RELAX= 
##$RELAX= 
##$RELAX= 
##$RELAX= 
##$RELAX= 
##$RELAX= 
$$ Bruker specific parameters
$$ --------------------------
##$DU= <F:/spectra>
##$EXPNO= 2
##$NAME= <P31>
##$PROCNO= 1
##$TYPE= <nmr>
##$USER= <she>
##$AMP= (0..31)
100 100 100 100 100 100 100 100 100 100 100 100 100 100 100 100 100 100 
100 100 100 100 100 100 100 100 100 100 100 100 100 100 
##$AQSEQ= 0
##$AQ_mod= 1
##$AUNM= <au_zg>
##$AUTOPOS= <>
##$BF1= 81.014009
##$BF2= 200.13
##$BF3= 200.13
##$BF4= 200.13
##$BF5= 200.13
##$BF6= 200.13
##$BF7= 200.13
##$BF8= 200.13
##$BYTORDA= 1
##$CFDGTYP= 0
##$CFRGTYP= 5
##$CHEMSTR= <none>
##$CNST= (0..31)
1 1 145 1 1 1 1 1 1 1 1 1 1 1 1 1 1 1 1 1 1 1 1 1 1 1 1 1 1 1 1 1 
##$CPDPRG= <waltz16>
##$CPDPRG1= <>
##$CPDPRG2= <waltz16>
##$CPDPRG3= <>
##$CPDPRG4= <mlev>
##$CPDPRG5= <mlev>
##$CPDPRG6= <mlev>
##$CPDPRG7= <mlev>
##$CPDPRG8= <mlev>
##$CPDPRGB= <>
##$CPDPRGT= <>
##$D= (0..31)
0 1 0 0 0 0 0 0 0 0.06 0 0.03 2e-05 3e-06 0 0 0.0002 0 0 0 0 0 0 0 0 0 
0 0 0 0 0 0 
##$DATE= 1743156751
##$DBL= (0..7)
120 120 120 11 120 120 24 19 
##$DBP= (0..7)
150 150 150 150 150 150 150 150 
##$DBP07= 0
##$DBPNAM0= <>
##$DBPNAM1= <>
##$DBPNAM2= <>
##$DBPNAM3= <>
##$DBPNAM4= <>
##$DBPNAM5= <>
##$DBPNAM6= <>
##$DBPNAM7= <>
##$DBPOAL= (0..7)
0.5 0.5 0.5 0.5 0.5 0.5 0.5 0.5 
$$ [...]
##$SUBNAM2= <"">
##$SUBNAM3= <"">
##$SUBNAM4= <"">
##$SUBNAM5= <"">
##$SUBNAM6= <"">
##$SUBNAM7= <"">
##$SUBNAM8= <"">
##$SUBNAM9= <"">
##$SW= 400.765351723535
##$SWIBOX= (0..15)
0 1 3 0 0 0 0 0 0 0 0 0 0 0 0 0 
##$SW_h= 32467.5324675325
##$TD= 32768
##$TD0= 1
##$TE= 0
##$TE2= 300
##$TE3= 300
##$TEG= 300
##$TL= (0..7)
0 120 53 12 22 120 120 120 
##$TP= (0..7)
150 150 150 150 150 150 150 150 
##$TP07= 0
##$TPNAME0= <>
##$TPNAME1= <>
##$TPNAME2= <>
##$TPNAME3= <>
##$TPNAME4= <>
##$TPNAME5= <>
##$TPNAME6= <>
##$TPNAME7= <>
##$TPOAL= (0..7)
0.5 0.5 0.5 0.5 0.5 0.5 0.5 0.5 
##$TPOFFS= (0..7)
0 0 0 0 0 0 0 0 
##$TUNHIN= 0
##$TUNHOUT= 0
##$TUNXOUT= 0
##$USERA1= <user>
##$USERA2= <user>
##$USERA3= <user>
##$USERA4= <user>
##$USERA5= <user>
##$V9= 5
##$VALIST= <valist>
##$VCLIST= <CCCCCCCCCCCCCCC>
##$VD= 0
##$VDLIST= <DDDDDDDDDDDDDDD>
##$VPLIST= <PPPPPPPPPPPPPPP>
##$VTLIST= <TTTTTTTTTTTTTTT>
##$WBST= 1024
##$WBSW= 4
##$XGAIN= (0..3)
0 0 0 0 
##$XL= 0
##$YL= 0
##$YMAX_a= 3492
##$YMIN_a= -3564
##$ZGOPTNS= <>
##$ZL1= 120
##$ZL2= 120
##$ZL3= 120
##$ZL4= 120
##$ABSF1= 0
##$ABSF2= 0
##$ABSG= 0
##$ABSL= 0
##$ALPHA= 0
##$AQORDER= 0
##$ASSFAC= 0
##$ASSFACI= 0
##$ASSFACX= 0
##$ASSWID= 0
##$AUNMP= <proc_1d>
##$AZFE= 0.1
##$AZFW= 0.5
##$BCFW= 0
##$BC_mod= 2
##$BYTORDP= 0
##$COROFFS= 0
##$CY= -3
##$DATMOD= 1
##$DC= 0
##$DFILT= <>
##$DTYPP= 0
##$F1P= 0
##$F2P= 0
##$FCOR= 1
##$FTSIZE= 65536
##$FT_mod= 6
##$GAMMA= 0
##$GB= 0
##$INTBC= 1
##$INTSCL= 9.790993e-09
##$ISEN= 30
##$LB= 1.5
##$LEV0= 0
##$LPBIN= 0
##$MAXI= 10000
##$MC2= 0
##$MEAN= 0
##$ME_mod= 0
##$MI= 50
##$NCOEF= 0
##$NC_proc= -7
##$NLEV= 6
##$NOISF1= 182.463
##$NOISF2= 159.3651
##$NSP= 0
##$NTH_PI= 0
##$NZP= 0
##$OFFSET= 198.0616
##$PC= 4
##$PHC0= 1383.27
##$PHC1= 102.2942
##$PH_mod= 1
##$PKNL= yes
##$PPARMOD= 0
##$PSCAL= 0
##$PSIGN= 0
##$REVERSE= no
##$SF= 81.0140089999434
##$SI= 65536
##$SIGF1= 159.3651
##$SIGF2= -187.1042
##$SINO= 113.3802
##$SIOLD= 16384
##$SREGLST= <1H.CDCl3>
##$SSB= 0
##$STSI= 65536
##$STSR= 0
##$SW_p= 32467.5324675325
##$SYMM= 0
##$S_DEV= 0
##$TDeff= 32768
##$TDoff= 0
##$TI= <>
##$TILT= no
##$TM1= 0
##$TM2= 0
##$TOPLEV= 0
##$USERP1= <user>
##$USERP2= <user>
##$USERP3= <user>
##$USERP4= <user>
##$USERP5= <user>
##$WDW= 1
##$XDIM= 65536
##$YMAX_p= 394588022
##$YMIN_p= -7579061
$$ End of Bruker specific parameters
$$ ---------------------------------
##NTUPLES= NMR SPECTRUM
##VAR_NAME=  FREQUENCY,     SPECTRUM/REAL,   SPECTRUM/IMAG
##SYMBOL=    X,             R,               I
##VAR_TYPE=  INDEPENDENT,   DEPENDENT,       DEPENDENT
##VAR_FORM=  AFFN,          ASDF,            ASDF
##VAR_DIM=   65536,         65536,           65536
##UNITS=     HZ,            ARBITRARY UNITS, ARBITRARY UNITS
##FACTOR=    0.49542278885378, 1,            1
##FIRST=     16045.7642231865, 0,            0
##LAST=      -16421.768244346, 0,            0
##MIN=       -16421.768244346, -7579061,     0
##MAX=       16045.7642231865, 394588022,    0
$$ Real data points
##PAGE= N=1
##DATA TABLE= (X++(R..R)), XYDATA
$$ [...]
40078 1315055 667098 -61129 -120380 256877 344934 67572 79291 674577 1243473 1134608
40068 1134608 595261 421228 943273 1730854 2102853 1650215 485592 -756564 -1421922
40059 -1421922 -1577741 -1913954 -2629533 -2889732 -1905389 -197308 844613 518870 -591475
40050 -591475 -1452356 -1520373 -960324 -384238 -308070 -552041 -419189 200593 394453 -474237
40040 -474237 -1527877 -1410575 -307728 223907 -483380 -1283099 -940190 242040 1138842
40031 1138842 1346912 1278110 1271300 1368302 1676874 2314568 3093261 3635546 3664652 3009901
40021 3009901 1696969 254206 -577723 -799810 -1290107 -2518629 -3673163 -3709023 -2813299
40012 -2813299 -2041011 -1796024 -1544887 -940067 -333241 -19681 260927 743953 1106313
40003 1106313 862523 -45844 -1272248 -2352600 -2827788 -2486439 -1728278 -1335389 -1596360
39994 -1596360 -1936301 -1691519 -975173 -439432 -410067 -668714 -962327 -1251367 -1404231 -1087141
39984 -1087141 -190124 891836 1615817 1751781 1354225 584664 -137301 -128057 848729 1956880
39974 1956880 2017164 978198 15402 -90511 52777 -394719 -1042599 -827328 369057
39965 369057 1611521 2222548 2204285 1446551 -285993 -2298725 -3060007 -1989746 -311949
39956 -311949 519379 487818 433837 592165 639237 652711 987964 1411272 1220409 152027
39946 152027 -1442469 -3087475 -4238103 -4245918 -3121503 -2059184 -2263089 -3376917 -4006968
39937 -4006968 -3715408 -3456082 -3938114 -4612935 -4621281 -3867605 -2759204 -1621480 -755306
39928 -755306 -408043 -337778 -39832 320752 -43827 -1207787 -2075935 -1828191 -1071489 -848071
39918 -848071 -1124947 -1093475 -523799 69407 410898 789288 1368116 1789310 1608312 809719
39908 809719 -126557 -521299 -72563 667076 736623 -19377 -599852 -112948 1060509 1921024
39898 1921024 2232503 2497019 2817064 2680731 1948501 1283978 1306721 1794257 1998471 1482559
39888 1482559 503797 -249354 -302696 55694 37606 -595376 -1057811 -569941 440095 821387
39878 821387 233803 -546185 -830822 -711566 -385627 332364 1349804 1840761 1147557
39869 1147557 -187504 -895817 -374479 804572 1660311 1712028 1192399 674704 522131
39860 522131 570099 389365 -115990 -578530 -705471 -643650 -615826 -490011 -11158 740345
39850 740345 1425482 1832521 1906059 1549662 738104 -251385 -1044399 -1595490 -2159176 -2871859
39840 -2871859 -3601986 -4151167 -4338296 -3984074 -3189401 -2588054 -2820695 -3602009 -3808564
39831 -3808564 -2862829 -1655145 -1555587 -2665087 -3638951 -3335770 -2110391 -1186383 -1165289
39822 -1165289 -1618649 -1941276 -2053786 -2190613 -2434694 -2684663 -2807831 -2607503 -1870836
39813 -1870836 -726477 184616 200921 -679268 -1758656 -2245073 -1813487 -773536 56897
39804 56897 -183422 -1615985 -3244000 -3744095 -2828885 -1566183 -1174515 -1757229 -2438435
39795 -2438435 -2470051 -1834741 -908274 -14623 555772 458069 -445393 -1801500 -2961127
39786 -2961127 -3493632 -3417865 -2944787 -2157946 -1069395 87381 840484 898045 502062
39777 502062 167204 25662 -364515 -1372253 -2574959 -3001283 -2200929 -840287 -6878
39768 -6878 -43637 -345971 -263130 175760 582424 906306 1439639 2239213 2905503 2999650
39758 2999650 2471611 1653396 1006366 840495 1053259 1180954 976286 860662 1388383
39749 1388383 2267016 2496079 1716072 825130 774669 1242822 1188333 415750 -257663 -389597
39739 -389597 -608118 -1580983 -2918044 -3592584 -3106325 -1816812 -380774 694003 1125295
39730 1125295 962246 638285 609532 907051 1238196 1433446 1486198 1212971 309633 -1113130
39720 -1113130 -2424189 -3162702 -3546829 -3965255 -4228904 -3846262 -2951440 -2309418 -2210194
39711 -2210194 -2001235 -1181037 -398353 -597536 -1462505 -1650176 -632970 598025 966177
39702 966177 584508 83198 -524514 -1482305 -2368036 -2531370 -2208386 -2224748 -2636226 -2627510
39692 -2627510 -1906646 -1252848 -1269424 -1370449 -617081 897206 2063293 1932143 506174
39683 506174 -1412781 -2842087 -3268401 -2939301 -2406974 -1777787 -762349 510483 1324145
39674 1324145 1312268 1034193 1192420 1725744 2159931 2433448 2758473 2945992 2544753 1569158
39664 1569158 537982 -150856 -402284 -123649 643239 1316424 1162215 241946 -584976
39655 -584976 -785179 -724995 -853775 -882514 -273920 796786 1515158 1328805 339182 -1088039
39645 -1088039 -2589656 -3643671 -3698609 -2816261 -1886366 -1785672 -2416454 -2942843 -2927617
39636 -2927617 -2754374 -2770154 -2537297 -1443362 205048 1321428 1312437 690043 240190
39627 240190 26216 -484068 -1588851 -2946233 -3839999 -3681933 -2450490 -791284 504720
39618 504720 1213786 1641575 1910290 1792550 1382285 1255939 1536776 1426524 340569
39609 340569 -965621 -1230739 -375022 515490 753647 645058 454106 -197039 -1465130
39600 -1465130 -2625257 -2884336 -2357991 -1696753 -1133104 -439906 445600 1290255 1920759
39591 1920759 2293491 2315136 1940347 1358131 819984 434200 360594 914189 2059367 3026230
39581 3026230 2978108 2040393 1195542 1118487 1544500 1842057 1741071 1334088 798271 383868
39571 383868 343267 602813 789718 806636 1005276 1480829 1659124 1139021 556914 814494
39561 814494 1605979 1653378 551496 -547986 -483656 521897 1539418 2159545 2284719
39552 2284719 1494677 -292541 -2032402 -2588997 -2224894 -1874844 -1316576 362069 2553834
39543 2553834 3274406 2013758 647146 624685 987907 456185 -167077 505755 1788604
39534 1788604 1941454 1150985 1213927 2444692 3144799 2391835 1247871 616879 -133726
39525 -133726 -1499146 -2510297 -2279424 -1535255 -1367844 -1509675 -1110815 -327456 162629
39516 162629 552672 1510287 2812200 3560094 3496480 3083752 2519237 1653382 702459 96588
39506 96588 -287156 -889059 -1541659 -1589096 -913043 -119352 299336 366077 240298 40839
39496 40839 -9795 179666 281268 3950 -345933 -314053 -81652 -175247 -597314 -891331
39486 -891331 -875861 -662423 -174958 637980 1339958 1496885 1375646 1378143 1167235 394850
39476 394850 -50666 1075674 3214323 4171231 2865642 649663 -671469 -947008 -1037622
39467 -1037622 -1115633 -684244 261852 1054372 1137221 489986 -446084 -881083 -169185 1352713
39457 1352713 2434591 2242575 1206509 218188 -416667 -750299 -563932 295506 1330877
39448 1330877 1854902 1847567 1826605 2058557 2358264 2497608 2445171 2364871 2569076 3150197
39438 3150197 3536955 2962165 1575459 402124 -103112 -609662 -1541966 -2150048 -1763666
39429 -1763666 -1055962 -974652 -1174574 -790189 -185093 -457395 -1470791 -1874113 -1090046
39420 -1090046 101728 1058627 1918907 2475175 1891978 190188 -1240952 -1407880 -956331
39411 -956331 -856385 -858474 -274518 523505 603518 44113 -143964 457748 1179149 1305469
39401 1305469 854371 249299 -147221 -82397 479121 1179568 1572660 1628492 1612431 1557441
39391 1557441 1292457 951046 955761 1397520 1838059 1879280 1615131 1375254 1285177 1229404
39381 1229404 1039622 586200 -125475 -801868 -976750 -494996 178620 344500 -183751
39372 -183751 -865776 -1087520 -908186 -916692 -1356508 -1739862 -1528430 -875541 -320928 19252
39362 19252 454061 1009482 1300778 1190024 1022508 1025128 959227 584096 -7756 -722611
39352 -722611 -1584178 -2258410 -2127852 -1302672 -875133 -1467830 -2120289 -1536625 -18560
39343 -18560 948442 866575 749711 1300878 1810753 1470274 738956 481341 453663 -214208
39333 -214208 -1317405 -1547608 -374483 1015288 1217957 429426 44031 711752 1573435
39324 1573435 1544868 693364 -105251 -461033 -771106 -1294271 -1583909 -1117682 -45511
39315 -45511 1068003 1945285 2612971 2922239 2576519 1668323 764735 304699 174124 8657
39305 8657 -290532 -495099 -405990 -170232 -225252 -855242 -1776535 -2350846 -2332775 -2163747
39295 -2163747 -2308658 -2601417 -2624543 -2448725 -2422198 -2381940 -1793027 -743310 -49578 -51178
39285 -51178 44046 1068866 2590175 3317993 2626885 1103097 -360529 -1441587 -2190747
39276 -2190747 -2401279 -1617128 196607 2220179 3252764 2722602 1158496 -391946 -1238674
39267 -1238674 -1223081 -385402 993057 2102480 2047835 877321 -281166 -444113 195280
39258 195280 741310 737453 449185 283744 358604 515756 435386 -147737 -1093931 -1897586
39248 -1897586 -2282559 -2463794 -2543071 -2076327 -790381 573696 869958 6244 -846286
39239 -846286 -669554 272518 944160 780333 132704 -283099 -94194 525376 1189706 1758892
39229 1758892 2392571 3166557 3853024 4192087 4140203 3689464 2758436 1538220 612193
39220 612193 340465 414443 433501 551290 967238 1145325 377803 -998047 -1807315 -1507702
39210 -1507702 -672792 20717 393145 227110 -803301 -2224993 -2772291 -1990886 -1060297
39201 -1060297 -1268190 -2337140 -3079452 -3079706 -2737073 -2128076 -1018794 153144 509646
39192 509646 111551 78877 999412 2105229 2500370 2435371 2716755 3405165 3855069 3767887
39182 3767887 3448156 3032741 2175107 786989 -396286 -508798 292376 832440 237808
39173 237808 -1066684 -1961558 -2015030 -1833192 -2056982 -2494650 -2485168 -1817025 -1005251 -782718
39163 -782718 -1434543 -2463594 -2901428 -2285339 -1364253 -1341419 -2284140 -2952065 -2558432 -1922993
39153 -1922993 -2153622 -2856000 -2731347 -1627051 -786908 -1011897 -1695971 -1981392 -1851641
39144 -1851641 -1591110 -1061114 -199275 435720 379194 69825 219057 697263 775567 287841
39134 287841 -181698 -279408 -417434 -1137932 -2329170 -3264118 -3257949 -2282960 -1081379 -554478
39124 -554478 -824443 -1052687 -459454 654021 1263203 854384 -149855 -1132912 -1898953
39115 -1898953 -2405620 -2402044 -1711053 -612443 408891 1171399 1751701 2017423 1583436
39106 1583436 378062 -989167 -1692350 -1493478 -875988 -352271 95893 687175 1185395
39097 1185395 1012299 65034 -982271 -1419206 -1239227 -842605 -279332 709018 1924925
39088 1924925 2539968 1992102 786859 36435 234525 771542 747612 53988 -543670
39079 -543670 -306541 731049 1942724 2768310 2998324 2627834 1823975 1047596 803371
39070 803371 1048993 1115903 494123 -474975 -1005117 -880832 -701505 -1034919 -1656117 -1876146
39060 -1876146 -1460097 -903258 -764352 -989423 -1087727 -845651 -591569 -698540 -1045794 -1152377
39050 -1152377 -768555 -191226 -5559 -564611 -1646704 -2575809 -2806342 -2457277 -2100610
39041 -2100610 -1969416 -1710355 -1135051 -777988 -1167394 -1809732 -1637311 -484790 620233
39032 620233 870431 676449 801349 1101153 835461 -55614 -739948 -606082 -20764 215898
39022 215898 -202559 -919278 -1404669 -1359527 -772729 98329 700634 365562 -1144936 -3164229
39012 -3164229 -4428604 -4122100 -2600111 -993668 -252659 -662677 -1907716 -3204161 -3682775
39003 -3682775 -3213171 -2672850 -2796686 -2988188 -2130522 -489626 313062 -472836 -1620658
38994 -1620658 -1636200 -598105 493377 1320347 2152775 2776799 2706252 2205994 2048110
38985 2048110 2322367 2350330 1693797 473090 -1136829 -2869008 -3986102 -3884744 -3027293
38976 -3027293 -2371907 -1985589 -1265708 -451534 -575839 -1635495 -2173288 -1340776 -216703
38967 -216703 -186043 -934677 -1102128 -281598 749892 1445949 2005162 2451715 2171100 760614
38957 760614 -1158714 -2396707 -2365627 -1610231 -1120826 -1179335 -1124551 -437612 310906 184572
38947 184572 -627069 -875823 20513 1134869 1314080 604681 -141937 -512138 -732073
38938 -732073 -1009299 -1308676 -1600835 -1862640 -1975080 -1933478 -1936258 -2022466 -1936110 -1562518
38928 -1562518 -1077956 -461701 546946 1683732 2077614 1494053 971485 1469829 2472036
38919 2472036 2811782 2406423 2112879 2117793 1624172 249430 -1244449 -1952030 -1865337 -1546488
38909 -1546488 -1212239 -500371 984415 2978825 4416261 4285664 2858621 1633105 1651570
38900 1651570 2329140 2464329 1856713 1147053 547806 -222504 -963902 -1044415 -464050 53332
38890 53332 92886 -168273 -680540 -1546005 -2266150 -2043696 -1086983 -583654 -1018392 -1512000
38880 -1512000 -1269458 -667330 -296354 92657 836963 1328479 736115 -659866 -1768498
38871 -1768498 -2130705 -2304506 -2859738 -3579137 -3740888 -2900711 -1393117 -144516 185328
38862 185328 -120431 -335885 -365985 -698525 -1268482 -1243623 -302734 675415 751944 113333
38852 113333 -448291 -646466 -679975 -625317 -488735 -453546 -536771 -430021 -136631 -195851
38842 -195851 -764596 -1161325 -960478 -790169 -1229823 -1669631 -1280376 -448591 -78921 -32675
38832 -32675 433093 1117724 1226245 992497 1356719 2045277 1657469 -17967 -1390653
38823 -1390653 -1363770 -780179 -808985 -1232516 -1309605 -1171439 -1207722 -1005880 -176915 435492
38813 435492 -282147 -1856023 -2535179 -1385556 859837 2917547 4004884 3879125 2829337
38804 2829337 1780976 1585686 1978249 1885731 917887 -141296 -552062 -618896 -1034256
38795 -1034256 -1745755 -2041831 -1562736 -783193 -495930 -1021316 -1898077 -2263616 -1619187
38786 -1619187 -276465 1010365 1779250 2062157 2015559 1773976 1695588 2216969 3136619
38777 3136619 3450367 2428237 692863 -352557 -239531 -21264 -837302 -2332327 -3044137
38768 -3044137 -2194187 -508467 777746 1136793 734775 -207965 -1489490 -2654895 -3237151
38759 -3237151 -3220526 -2881723 -2325020 -1612759 -1133112 -1186801 -1287844 -627189 672259 1536591
38749 1536591 1417658 1004580 1050056 1247281 883485 -30804 -1011740 -1945308 -2852145 -3246960
38739 -3246960 -2722086 -1959289 -2107053 -3097107 -3576121 -2771624 -1528563 -1055370 -1399991
38730 -1399991 -1759499 -1739815 -1622010 -1675625 -1847280 -2041759 -2196162 -2054777 -1304635 -110670
38720 -110670 733753 465565 -777135 -1865178 -1669683 -222884 1300257 1892623 1742567
38711 1742567 1693733 2019357 2265625 2119345 1730533 1123411 2620 -1555457 -2762300
38702 -2762300 -2852987 -1860348 -472868 519605 564193 -307277 -1261414 -1370182 -764048 -419136
38692 -419136 -556284 -201511 1062592 1925658 1024336 -890585 -1750454 -807558 778144
38683 778144 1798802 2069754 1595931 180189 -1616098 -2427459 -1820824 -1111119 -1588990
38674 -1588990 -2733594 -3105297 -2364831 -1403341 -908279 -809320 -907402 -1115225 -1172762 -934639
38664 -934639 -838020 -1299261 -1785477 -1402085 -376104 74367 -455409 -932604 -531182 68238
38654 68238 -202880 -1073640 -1280234 -356194 779563 998157 60209 -1497102 -2965509
38645 -2965509 -3782432 -3725689 -3100407 -2519178 -2313079 -2299952 -2198235 -2042349 -2042866 -2203486
38635 -2203486 -2251976 -1881654 -965239 354645 1625373 2208818 1713183 465151 -555752
38626 -555752 -498786 529731 1527368 1598917 815246 -44896 -452644 -536414 -585188 -562510
38616 -562510 -304020 130464 615952 1267392 2226932 3230136 3723390 3425304 2540013
38607 2540013 1481152 667119 473282 921295 1372990 1045191 37961 -631990 -358675
38598 -358675 151541 -177523 -1280053 -2041374 -1787341 -998281 -473129 -455037 -837514 -1620223
38588 -1620223 -2685269 -3501609 -3551718 -2886954 -1932264 -969081 -154463 224325 4195
38579 4195 -468927 -659786 -489111 -281285 -183701 -81177 1719 -79419 -171841 75988 655909
38568 655909 1187846 1451228 1418738 831231 -519723 -1965651 -2261436 -1134012 148857
38559 148857 268678 -647215 -1537472 -1848983 -1802764 -1645053 -1384485 -1112980 -1006300 -1078505
38549 -1078505 -1266485 -1519000 -1558417 -1035950 -262127 -119014 -721786 -946926 -59943 1021730
38539 1021730 1164129 913841 1504067 2526663 2377268 905659 -232199 -154638 100536
38530 100536 -384229 -909952 -650846 -200699 -450269 -1008513 -951040 -336937 123892 240322
38520 240322 170240 -271990 -1144008 -1791288 -1681269 -1265652 -1126323 -909470 -89644 861626
38510 861626 1186843 1173836 1616653 2381104 2642777 2188928 1428353 539101 -315249 -452243
38500 -452243 403925 1148306 577213 -805336 -1650903 -1911735 -2497969 -3270865 -3312896 -2960121
38490 -2960121 -3415935 -4251070 -3546636 -1009928 1223262 1639786 1153611 984796 807046
38481 807046 181035 -127449 298830 385451 -514396 -1201343 -740914 -327661 -1142024 -1925698
38471 -1925698 -987051 644482 662251 -735341 -1229077 -216826 447874 -267689 -1080439
38462 -1080439 -780785 14626 293668 95076 -220052 -624207 -719348 139001 1402227
38453 1402227 1513661 207103 -877151 -626291 25026 -75452 -478909 -330080 -7183
38444 -7183 -168309 -275515 424840 1301043 1232357 469726 111734 211109 -69410 -688705
38434 -688705 -646182 332425 1408831 2071484 2680602 3301152 3213825 2120874 879068
38425 879068 399777 492179 373131 -182604 -733283 -871390 -621517 -370267 -623719 -1519789
38415 -1519789 -2393336 -2232329 -851323 757099 1560913 1619694 1676365 1953344 1966510 1494098
38405 1494098 1125851 1558188 2641408 3441530 3180645 1951001 576567 -80840 218836
38396 218836 893069 1034322 374149 -258730 198439 1641349 2738387 2571197 1844875
38387 1844875 1893662 2839843 3529807 3191228 2276322 1502455 919837 341168 -54212 -143693
38377 -143693 -314591 -805669 -1006203 -165827 1402558 2543017 2619534 2035458 1411593
38368 1411593 899134 467838 307683 580925 1040093 1203796 889000 472263 579840
38359 579840 1396141 2259190 2230427 1241519 328021 394540 1101297 1459903 1197316 821679
38349 821679 515687 -124946 -1082632 -1524733 -915626 107418 578344 483991 531321 918573
38339 918573 1117538 870288 639945 795250 956071 612012 -29643 -390594 -471086 -766664
38329 -766664 -1248927 -1182460 -258690 743710 951986 526521 113604 -385894 -1531081
38320 -1531081 -2956619 -3390668 -2370725 -1005621 -510504 -762216 -933512 -848493 -879410
38311 -879410 -994844 -821144 -389523 19327 594122 1695329 2897306 3206560 2390347
38302 2390347 1368102 1069390 1486815 2033143 2276431 2125027 1777440 1666491 2035526
38293 2035526 2518827 2630191 2627982 3186843 4116763 4249911 2972698 1150443 32601
38284 32601 -193806 -264020 -752322 -1636499 -2521343 -2834812 -2225247 -1204848 -908017 -1686129
38274 -1686129 -2447583 -2024283 -711062 288546 472161 159369 -630286 -2211868 -4099304
38265 -4099304 -5009324 -4431372 -3315783 -2699161 -2402019 -1713223 -746627 -318406 -771661
38256 -771661 -1659182 -2493544 -3138912 -3379039 -2708702 -935187 1247329 2639355 2585070
38247 2585070 1585271 806956 952665 1683740 2247810 2483988 2803003 3174000 2762640
38238 2762640 1042806 -1153212 -2406230 -2435344 -2329739 -2941754 -3796997 -3990838 -3478041
38229 -3478041 -2782677 -1927150 -620431 613493 581993 -932645 -2537193 -2864681 -2239126
38220 -2239126 -1953993 -2332635 -2481684 -1914679 -1414223 -1860473 -2870132 -3205265 -2277953
38211 -2277953 -775424 144626 -30579 -854677 -1532294 -1787306 -2097354 -2984759 -4209998
38202 -4209998 -5014491 -5189237 -5442855 -6400930 -7542784 -7579061 -5870931 -3169303 -862327
38193 -862327 330482 774825 1089557 1154637 308027 -1408186 -2731327 -2475259 -1100155
38184 -1100155 -239780 -628906 -1306348 -1174262 -542561 -503075 -1362239 -2476386 -3291259
38175 -3291259 -3717342 -3610562 -2707448 -1195064 290999 1406594 2326111 3093058 3279589
38166 3279589 2566291 1268604 11475 -822121 -1089490 -661243 425238 1677565 2325144
38157 2325144 1914326 725869 -413957 -832553 -616982 -447700 -771560 -1352197 -1793405
38148 -1793405 -2171428 -2739172 -3237699 -3072137 -2152566 -1027357 -107201 731824 1619908
38139 1619908 2265933 2338458 1921961 1333515 774775 399799 442550 970985 1643271 1927028
38129 1927028 1552819 773024 284026 715908 1868600 2620871 2099877 837306 124475
38120 124475 270552 372165 -20213 -75981 871232 2013077 2172150 1563535 1320277 1632308
38110 1632308 1603360 941733 554237 1075464 1811436 1786192 1171458 951397 1474215 1956088
38100 1956088 1399673 -326048 -2314629 -3391161 -3144241 -2271409 -1801652 -2040928 -2524668
38091 -2524668 -2868441 -3147121 -3371820 -3205183 -2535264 -1858278 -1638370 -1618722 -1262041 -653968
38081 -653968 -423359 -804047 -1257746 -1128895 -348936 587296 1065545 713635 -361084
38072 -361084 -1525073 -2039239 -1737959 -1167319 -892468 -821636 -462270 246111 719645 475343
38062 475343 -217778 -719767 -864063 -1029504 -1419342 -1737140 -1714890 -1498847 -1219895 -629272
38052 -629272 353423 1072519 769831 -335098 -1240441 -1415588 -1196685 -895561 -331175
38043 -331175 433055 660248 -144328 -1371782 -1944380 -1461982 -251692 1230847 2392081
38034 2392081 2379865 949880 -679461 -817920 700728 2326210 2778997 2374210 2002242
38025 2002242 1681471 874696 -324912 -1224881 -1578372 -1827063 -2261344 -2575577 -2455649
38016 -2455649 -2139582 -2102966 -2443482 -2830466 -2945232 -2796746 -2649383 -2724547 -2934975 -2895126
38006 -2895126 -2276564 -1180874 -82350 612220 849139 773676 481813 76902 -154765
37997 -154765 86343 672548 996099 595643 -224840 -648797 -255550 550405 1112765 1295102
37987 1295102 1482766 1958515 2494557 2529190 1658243 72153 -1433709 -2137004 -2212106
37978 -2212106 -2521231 -3333158 -3741528 -2905683 -1427678 -638104 -715678 -550767 436121
37969 436121 1472544 1866613 2157079 2986343 3671506 3037108 1263339 -223135 -614947
37960 -614947 -492700 -657295 -1099560 -1401877 -1449252 -1366961 -1204568 -955627 -581624 51078
37950 51078 867265 1242153 540867 -901939 -1950445 -2027439 -1723589 -1768366 -1991334 -1765566
37940 -1765566 -1027562 -298318 91642 320023 662902 1056124 1079013 344229 -953880
37931 -953880 -1962504 -1993524 -1372196 -972497 -929332 -517298 516767 1312425 1047023 46064
37921 46064 -821817 -1266272 -1480024 -1501700 -1400392 -1592470 -2171670 -2374202 -1619669 -712273
37911 -712273 -958294 -2276584 -3271801 -3159294 -2530738 -2103359 -1823804 -1524124 -1432187 -1553186
37901 -1553186 -1400702 -814719 -270421 26288 467005 999528 801004 -259880 -876639
37892 -876639 -120934 839499 220654 -1697777 -2916385 -2605400 -2044885 -2360009 -2817806
37883 -2817806 -2174988 -600809 766856 1471569 1895268 2177898 2043477 1638568 1616828
37874 1616828 2197359 2829068 3043742 3074735 3319762 3682616 3843711 3771253 3470358 2573974
37864 2573974 889574 -747063 -1001128 263536 1480393 1133591 -403433 -1413973
37856 -1413973 -945644 370281 1515252 2244263 2818645 3335696 3795900 4309945 4752537
37847 4752537 4654503 3943473 3338674 3373412 3440403 2655995 1426294 1086810 1846065 2158433
37837 2158433 724590 -1650054 -2966954 -2361431 -719184 816075 2056139 3275730
37829 3275730 4205920 4112603 2752389 837225 -588683 -1097486 -1086585 -1103324 -1166473 -901588
37819 -901588 -213935 470766 691922 418012 -115765 -796405 -1615470 -2397662 -2829476 -2778542
37809 -2778542 -2434827 -2136280 -2134113 -2435723 -2744864 -2662139 -2121660 -1537325 -1329419 -1439465
37799 -1439465 -1586483 -1848494 -2510669 -3303886 -3373557 -2354806 -1056002 -552588 -811011
37790 -811011 -786453 135723 1384714 2062546 2021643 1715654 1375567 863668 191897 -332754
37780 -332754 -510596 -403608 -56218 533383 1088398 1162570 790305 598462 944795 1333439
37770 1333439 1122751 472921 8642 -225876 -739207 -1549319 -1985418 -1778238 -1582462
37761 -1582462 -1938276 -2370175 -2180146 -1611492 -1377381 -1362850 -807193 254752 793872
37752 793872 324005 -322011 -295855 11155 -221168 -804609 -857555 -218976 412759 638713
37742 638713 728601 789426 484501 -178886 -600803 -475902 -209347 -79805 255442 914497
37732 914497 1206857 614771 -253443 -519690 -351645 -492763 -874852 -821507 -494881 -901657
37722 -901657 -2193457 -3044220 -2278548 -382316 1149524 1427814 701941 -187740 -443872
37713 -443872 138144 844373 697121 -237769 -739734 -10126 1278128 2039186 2210735
37704 2210735 2372173 2495205 2057118 1128650 385473 94108 -90501 -362202 -609535
37695 -609535 -989512 -1756838 -2418490 -2002860 -506533 744420 636822 -473498 -1487095
37686 -1487095 -1910125 -1932251 -1699939 -1207670 -653178 -299567 -72329 294156 801347 1185338
37676 1185338 1244254 935042 355639 -132861 -66448 495507 787805 229717 -688181 -898045
37666 -898045 -81822 953680 1280295 825872 186982 -234288 -599111 -1149737 -1613038
37657 -1613038 -1400472 -504342 154359 -287746 -1475691 -2261282 -2249904 -2123665 -2219434 -1788621
37647 -1788621 -386175 864853 562347 -833158 -1430602 -472794 783672 1058613 711134
37638 711134 722038 1005313 782448 110854 -82838 575371 1375633 1567351 1197935 648729
37628 648729 -24728 -833838 -1349106 -994471 247262 1782294 2985975 3522684 3200084
37619 3200084 2005532 460597 -483759 -324516 355623 504850 -159846 -891386 -957337
37610 -957337 -543981 -332784 -444835 -248764 753641 2175141 3058966 2854466 1977010
37601 1977010 1410811 1767673 2716668 3352899 3114689 2246361 1350293 680750 51325
37592 51325 -687424 -1349398 -1644215 -1543253 -1322857 -1301987 -1576536 -1962168 -2147066 -1900862
37582 -1900862 -1190337 -207466 650821 970847 694594 248726 71778 58422 -222537 -783153
37572 -783153 -1128755 -1026142 -860066 -944820 -973823 -597996 -108348 78321 299980 1237244
37562 1237244 2676211 3453791 2832191 1343885 43885 -561533 -572829 -181748 461210
37553 461210 1085688 1353276 1054271 236946 -672141 -963553 -281359 797331 1292299
37544 1292299 1034275 815566 1152213 1551148 1424301 1109361 1297051 1813208 1733044 624071
37534 624071 -949290 -2176505 -2734856 -2717777 -2312343 -1737303 -1230983 -958095 -1010132 -1394200
37524 -1394200 -1860703 -1973919 -1678880 -1587278 -2266091 -3377909 -3991520 -3638249 -2559734
37515 -2559734 -1052956 710283 2155307 2425555 1447088 271960 -141472 -37634 -221608
37506 -221608 -701298 -672297 246594 1415379 1955935 1703701 1176552 844856 629021 71021
37496 71021 -1033772 -2197010 -2617371 -2121155 -1452558 -1327754 -1463052 -1055115 -113271
37487 -113271 374715 -173126 -999820 -972967 -130040 353223 -334019 -1733809 -2845780
37478 -2845780 -3269740 -3295342 -3164295 -2731984 -1893106 -964734 -388639 -186691 -852 263784
37468 263784 97257 -1027662 -2783680 -4070526 -4157471 -3465543 -2882251 -2518771 -1714566
37459 -1714566 -328260 649322 252451 -1105339 -2098197 -2168555 -2013345 -2274221 -2516964
37450 -2516964 -2040675 -1162822 -885576 -1385087 -1633725 -804537 533011 1096756 438237
37441 438237 -727583 -1585250 -2000664 -2141373 -1926504 -1287416 -609016 -350439 -364385 -175451
37431 -175451 77033 -309805 -1319060 -1699017 -433127 1667249 2691145 1898758 463834
37422 463834 -196879 -44885 21174 -447275 -1120470 -1546435 -1513499 -985687 -234810 131128
37412 131128 -181832 -597377 -321503 525497 1026985 721594 111499 -177977 -102871 153345
37402 153345 598255 1112309 1247169 827765 373253 446479 905668 1266945 1480250 1788428
37392 1788428 2086804 2087888 1997784 2328818 3008608 3351351 3076631 2726423 2779074 2886538
37382 2886538 2383428 1182267 -173694 -1015891 -835558 481943 2258382 3225132 2667359
37373 2667359 1161734 -247155 -1254089 -2094581 -2549388 -2106551 -1051712 -370157 -337601
37364 -337601 -204354 282953 85429 -1567081 -3623512 -4322648 -3417197 -2170805 -1390660
37355 -1390660 -700792 182856 740406 648228 413175 384100 37436 -999403 -1990666 -2061025
37345 -2061025 -1532281 -1314272 -1410090 -1129919 -550790 -541682 -1240485 -1670052 -1267004 -815418
37335 -815418 -1266759 -2360091 -3064575 -2878289 -2085342 -1142002 -408781 -182720 -428918
37326 -428918 -694612 -738212 -938691 -1569782 -2020428 -1453421 -84166 928993 877913 141219
37316 141219 -593510 -1038626 -1088076 -624335 74598 304019 -218919 -865464 -890112 -380633
37306 -380633 34701 123611 145735 171510 -113952 -865563 -1758015 -2322087 -2325289 -1785790
37296 -1785790 -901769 -29698 527576 791285 977723 1109591 1018674 749348 642621 901706
37286 901706 1306627 1449771 1056123 85425 -1143398 -1891419 -1517284 -266560 842193
37277 842193 1149534 966565 814285 619792 160801 -234953 -173412 15970 -149047 -225735
37267 -225735 571204 1757060 1818930 418784 -888549 -826809 -148313 -219812 -858476 -945804
37257 -945804 -549892 -821339 -1938028 -2757372 -2730758 -2640132 -2894102 -2537070 -904418 873238
37247 873238 1228577 299010 -506234 -616776 -722234 -1251620 -1670734 -1491101 -995434 -638304
37237 -638304 -512693 -757545 -1761534 -3438297 -4793611 -4779875 -3390211 -1570578 -251841
37228 -251841 247365 75044 -515391 -1333105 -2163001 -2547193 -1841068 184950 2812325
37219 2812325 4815191 5528720 5176357 4154868 2547404 580065 -984669 -1428818 -853037
37210 -853037 -30087 327734 -70892 -1102390 -2180964 -2505019 -1874434 -1098664 -1074289
37201 -1074289 -1572268 -1516696 -462177 812542 1337710 1040797 544751 336880 494586
37192 494586 907646 1356577 1515276 1228175 774702 667361 1203127 2262306 3381991
37183 3381991 3942397 3551505 2487815 1578859 1377889 1586444 1522773 994801 395002
37174 395002 46049 -166541 -497467 -1005133 -1578484 -2038864 -2154841 -1802396 -1190124 -720660
37164 -720660 -572573 -599529 -614258 -489857 266 1024098 2230561 2842814 2470766 1548275
37154 1548275 747929 284248 37822 -49313 -128591 -622841 -1648408 -2464697 -2179906 -997778
37144 -997778 -104448 -171985 -585144 -444482 181175 438215 -180034 -1299942 -2126645 -2126906
37134 -2126906 -1339595 -264580 536330 819360 664201 231615 -287247 -622622 -707078
37125 -707078 -946120 -1717744 -2562892 -2473477 -1219089 176641 632288 190869 -360750
37116 -360750 -541605 -384820 -79936 63789 -253964 -686073 -258405 1261100 2553002
37107 2553002 2258513 907379 212737 651955 1039267 593253 55705 234367 603532
37098 603532 167960 -1074896 -2334979 -3123778 -3439992 -3329014 -2919313 -2534998 -2226329
37089 -2226329 -1578643 -495549 297739 141150 -586259 -1022195 -978520 -857947 -728281
37080 -728281 -235314 684176 1623701 2166656 2087897 1320047 147591 -890338 -1707250
37071 -1707250 -2760734 -3916228 -4006616 -2482260 -775294 -664332 -1726259 -2004075 -1067150
37062 -1067150 -600272 -1603852 -2800681 -2681240 -1638330 -938452 -746376 -437408 8841
37053 8841 232951 466265 984625 1082210 -68656 -1814268 -2628329 -2276177 -2073969 -2822880
37043 -2822880 -3701103 -3621083 -2687258 -1775972 -1428784 -1665680 -2251626 -2635160 -2149358 -796509
37033 -796509 522054 949941 535300 -99488 -500341 -497396 -104189 245025 -187727 -1533865
37023 -1533865 -2842527 -3052459 -2171866 -970872 156408 1285420 2125988 2046518 1133267
37014 1133267 406392 531041 909314 580196 -443750 -1357723 -1758546 -1946349 -2162601
37005 -2162601 -2272921 -2280308 -2424320 -2531439 -2001127 -898628 -365358 -1178284 -2381679
36996 -2381679 -2333185 -945776 172169 -42144 -791020 -832353 -268992 -88657 -524385
36987 -524385 -845182 -548078 109246 727465 1176134 1338482 1090307 613296 159194 -519954
36977 -519954 -1845368 -3436044 -4241581 -3951958 -3528011 -3821178 -4298703 -3832401 -2344862
36968 -2344862 -916381 -424259 -758154 -1341811 -1788007 -1941764 -1836844 -1804034 -2163065
36959 -2163065 -2574633 -2121223 -380251 1860863 3316161 3449616 2697512 1671481 666801
36950 666801 -29692 57870 1091790 2500394 3462831 3721369 3615192 3436575 3144883
36941 3144883 2685325 2165124 1636183 1081631 688255 693111 856094 643512 176078 341520
36931 341520 1481514 2584576 2509321 1555782 969579 1186334 1511477 1395210 1004674
36922 1004674 493723 -246690 -884423 -711107 199978 836463 718178 616253 1231023
36913 1231023 2052819 2263627 1942903 1542701 951820 67943 -411474 60078 678412
36904 678412 325216 -554483 -491597 736626 1816105 1970595 1867184 2074089 2025000 1234508
36894 1234508 383924 299407 710276 920247 1016653 1479948 2104546 2246967 1855358 1449367
36884 1449367 1299721 1340769 1661631 2316444 2764297 2264126 896049 -400047 -893020
36875 -893020 -721526 -493513 -688183 -1459270 -2566715 -3436918 -3653682 -3386460 -2992443
36866 -2992443 -2339934 -1074161 488825 1418917 1327803 863935 712710 651486 137194
36857 137194 -552987 -516072 427648 1239907 865289 -444833 -1456969 -1468177 -1010303 -955043
36847 -955043 -1392239 -1745555 -1664558 -1271902 -658447 251524 1239179 1780087 1758804 1716428
36837 1716428 2070169 2528530 2646009 2503654 2365646 2101938 1584947 1321700 1916449
36828 1916449 3022377 3570081 3039874 1827742 371438 -1242376 -2606478 -2823242 -1576248
36819 -1576248 171345 1100607 822782 -126187 -1114323 -1736909 -1733538 -1238957 -899295 -1108271
36809 -1108271 -1256581 -400966 1321642 2629783 2636235 1850977 1313334 1239008 1058624 503224
36799 503224 8617 7474 336274 554672 484882 147494 -548684 -1627555 -2657726 -2998952
36789 -2998952 -2527150 -1754577 -1122431 -603109 -240461 -565209 -1876875 -3369898 -3714952
36780 -3714952 -2611239 -1179087 -601866 -872298 -1159130 -943874 -359973 273048 721951
36771 721951 727281 77194 -1072218 -2142185 -2496190 -1884224 -666081 366598 630750
36762 630750 342999 211930 399178 192269 -927000 -2270287 -2603070 -1676698 -477683
36753 -477683 66398 -1807 -216175 -494727 -957502 -1372272 -1352772 -970195 -702095 -793999
36743 -793999 -1050377 -1283484 -1596446 -2066466 -2421303 -2279740 -1622722 -833274 -273191 47460
36733 47460 335245 631678 685977 291167 -280281 -351245 467927 1703034 2368610 1987676
36723 1987676 1035895 189722 -593293 -1798577 -3262425 -4031762 -3651079 -3031590 -3364048
36714 -3364048 -4412946 -4699823 -3472892 -1718209 -848776 -1052314 -1519805 -1794033 -2080488
36705 -2080488 -2433157 -2502117 -2203979 -1907168 -1670742 -929909 608805 2196933 2700787
36696 2700787 1845511 405883 -691685 -1083490 -919459 -549149 -324587 -420664 -731251
36687 -731251 -1037054 -1229027 -1260184 -1047101 -658901 -459540 -745618 -1319016 -1737313 -1909030
36677 -1909030 -2055268 -2131628 -1801850 -1123367 -770434 -1257575 -2238259 -2850971 -2535155 -1326306
36667 -1326306 309633 1636196 1978853 1332334 464318 61551 -32093 -371659 -980000
36658 -980000 -1382994 -1411457 -1378220 -1487485 -1633946 -1801596 -2064571 -2118221 -1472816 -333213
36648 -333213 364499 154195 -294616 -156410 403494 583432 56649 -804528 -1492668 -1631688
36638 -1631688 -1016569 -13338 327587 -733661 -2571580 -3732980 -3497593 -2365262 -1106076
36629 -1106076 -40974 663645 714929 37831 -1021354 -2031003 -2665491 -2554587 -1493687
36620 -1493687 59055 1235394 1696320 1829575 1901688 1670065 1088456 678299 745733
36611 745733 872347 747917 906877 1889258 3100813 3368803 2463816 1286401 584283
36602 584283 226377 -158783 -513169 -595517 -428653 -202624 7786 243475 547044 892916
36592 892916 1061903 686137 -263942 -1135415 -1206417 -696958 -661447 -1632803 -2793944 -2894883
36582 -2894883 -1765719 -474144 175 -181327 -218274 59967 -63236 -1041717 -2137251
36573 -2137251 -2195009 -1204568 -410707 -710738 -1613006 -2190745 -2430771 -2918802 -3585619 -3665691
36563 -3665691 -2880720 -1886930 -1379545 -1356380 -1449621 -1429993 -1151998 -517401 205375 460270
36553 460270 120466 -250079 -168194 113609 110519 -84556 -9289 352530 549014 459699
36543 459699 550513 1088092 1529111 1139439 62249 -731479 -667115 -287083 -404292 -902419
36533 -902419 -1002029 -595049 -479701 -997391 -1287696 -614557 180560 -408479 -2346761 -3808001
36523 -3808001 -3345402 -1474068 264668 1068766 1154006 831577 71934 -1096881 -2284467
36514 -2284467 -2967843 -2882381 -2214534 -1474856 -1078550 -1029751 -1133736 -1369331 -1706415 -1700075
36504 -1700075 -879490 356219 884163 217177 -868312 -1501357 -1927337 -2848794 -3952062
36495 -3952062 -4043677 -2739798 -1187332 -643500 -851748 -484113 937873 2292517 2376102
36486 2376102 1645555 1684709 3006321 4293135 4243885 3348992 2981238 3284922 3139631
36477 3139631 2087541 1051139 848810 1095504 1124871 1104380 1528176 2242313 2663797
36468 2663797 2519329 1846597 776817 -173086 -201931 723803 1457923 1025432 -97442
36459 -97442 -775545 -755009 -524598 -108156 879081 2106769 2558876 1865076 808937 338117
36449 338117 687884 1544352 2444454 2933183 2887666 2739168 2899638 3069042 2668258 1792399
36439 1792399 1051274 601521 104650 -447991 -716301 -798343 -1146440 -1637956 -1637465 -1088136
36429 -1088136 -572122 -120594 935897 2559062 3574034 3284357 2528896 2348829 2475947
36420 2475947 2099431 1444612 1450020 2170602 2552581 1838599 471305 -496406 -426461 470563
36410 470563 1390215 1700161 1645174 1998845 2811412 3055639 2019621 540453 102866
36401 102866 969566 1963014 2031099 1341329 748875 741578 1101793 1295174 1056197 669140
36391 669140 566465 656042 491868 254543 818910 2301206 3310731 2631392 1124047
36382 1124047 712246 1692654 2464686 2077637 1527049 1872935 2477835 2283702 1816795
36373 1816795 2401747 3861548 4621775 4151173 3734272 4272431 4699081 3620581 1561155
36364 1561155 237284 94320 25278 -519881 -698394 -41246 365193 -489061 -1717931
36355 -1717931 -1668333 -311688 884014 1231249 1495436 2184095 2689865 2699532 3076982 4382702
36345 4382702 5575732 5368936 4152247 3312436 3111772 2595981 1449297 541380 388562
36336 388562 316354 -293932 -905425 -693351 193441 1012391 1557753 2062424 2268079 1545815
36326 1545815 20437 -1250875 -1551016 -1317071 -1241712 -1150661 -504581 348362 424944 -322143
36316 -322143 -719270 -115867 551253 269610 -287304 251544 1655964 2275864 1542400
36307 1542400 767486 1011475 1591575 1505320 1059483 989972 1012701 574901 278733 1080709
36297 1080709 2507540 3138024 2668154 2071337 1758890 1084251 -101701 -889764 -852485
36288 -852485 -852802 -1573394 -2323160 -2166927 -1329649 -505045 475272 2121007 3868100 4423514
36278 4423514 3536335 2397202 2018803 2060723 1746487 1328008 1847083 3494239 4911671
36269 4911671 4601265 2787197 1315916 1598330 3146727 4437033 4712592 4367010 3903175
36260 3903175 3326799 2577462 1837770 1205237 570524 -11769 -291742 -288550 -315293 -425253
36250 -425253 -339636 -63411 -10144 -273376 -304330 353577 1413273 2208191 2355579 1874175
36240 1874175 1084732 626021 1104758 2404835 3694178 4365212 4611925 4882442 5202809
36231 5202809 5317684 5113885 4637593 4009390 3464531 3098127 2529760 1371777 95126
36222 95126 -281070 454296 1432462 2042497 2645012 3527750 4130849 4021621 3769083 3955554
36212 3955554 4034249 3176360 1716871 715306 455193 393844 310337 472784 842566 1128648
36202 1128648 1562731 2635670 4025318 4706546 4262441 3302471 2484141 1899860 1553390
36193 1553390 1644468 2124441 2610317 2958885 3361904 3736943 3653250 3072490 2565791 2488986
36183 2488986 2391320 1558224 -89148 -1761306 -2331672 -1281297 570992 1558209 862629
36174 862629 -546927 -1187874 -833251 -229927 466901 1756678 3411462 4393772 4464124
36165 4464124 4664523 5659023 6605614 6351986 4974646 3482288 2635551 2643832 3401284
36156 3401284 4378913 4779532 4402137 3965813 4111985 4523675 4483903 3854458 3046906 2457480
36146 2457480 2345999 2803102 3415447 3459918 2859694 2408445 2589699 2798906 2335109 1543066
36136 1543066 1188535 1179374 806948 17563 -431775 -91943 583656 892507 720850 633099
36126 633099 1286796 2674399 3916615 4118136 3434559 2777604 2463271 1956093 1107449
36117 1107449 592589 660966 594937 153469 360915 1752382 2937338 2398294 929644
36108 929644 632016 1976570 3568333 4499255 5080232 5274761 4397998 2830439 2233722
36099 2233722 3261138 4490481 4486541 3694419 3400193 3885624 4534563 4881602 4700001
36090 4700001 3847976 2815620 2648759 3583268 4541471 4679146 4496575 4593636 4392045
36081 4392045 3262258 2000660 1767303 2184762 1985415 1162645 949297 1769236 2661560
36072 2661560 2827662 2418322 1617723 304481 -976750 -992959 521152 2130127 2367943
36063 2367943 1473831 815373 1148677 2099092 2948112 3293458 3117760 2666424 2207411
36054 2207411 1759294 1232523 818744 822990 1077658 1055283 669171 382532 395234 406468
36044 406468 383197 743276 1390694 1454646 627329 -60684 348357 1261803 1513056 1246751
36034 1246751 1532710 2348304 2397169 1170805 -113160 -200777 606920 1276051 1617874
36025 1617874 2152174 2945090 3551535 3899268 4358222 4916022 4996587 4244949 2977951
36016 2977951 1741124 874995 607497 1053587 1887436 2448859 2483450 2452634 2819032 3359684
36006 3359684 3575609 3501674 3592160 3909244 3970848 3488331 2797365 2377865 2317973 2468030
35996 2468030 2787543 3257252 3710292 4038262 4318935 4440336 3916244 2563025 1135233
35987 1135233 636068 989445 1047376 98031 -1230310 -1861249 -1498487 -547824 641234
35978 641234 1823564 2520205 2402398 1916532 1819443 2062914 1837563 900768 173896 600609
35968 600609 1885519 2873524 2952236 2637323 2824742 3754795 4743466 4870458 3996378 2996404
35958 2996404 2685684 2643776 1742588 -36671 -1143925 -369040 1487286 2676305 2712618
35949 2712618 2467700 2360810 1810244 700672 61671 550327 1256500 988747 70946
35940 70946 -224565 367433 881435 765274 586128 841511 1082387 740205 66118 -350828
35930 -350828 -407995 -208712 497556 1808121 2974323 3134638 2632040 2690843 3704877
35921 3704877 4769384 5182245 5424796 6020480 6281665 5218214 3255187 1940165 2011668
35912 2011668 2755900 3345108 3751521 4014068 3695090 2788726 2306759 2998134 4051880
35903 4051880 4113964 3228785 2622938 2693368 2481495 1391432 222059 -105399 146793
35894 146793 302110 556352 1480071 2685329 3064730 2287769 1158921 402576 -112064
35885 -112064 -698348 -1081663 -733675 363440 1619838 2351245 2256589 1571415 851174
35876 851174 480731 402799 417535 521677 673143 523511 -88215 -593154 -356423 181590
35866 181590 -100125 -1267791 -1909557 -975907 721991 1600721 1346069 999973 1312014
35857 1312014 1927250 2221439 2151909 2069250 2238214 2752489 3510369 4131493 4274476 4144034
35847 4144034 4299538 4845565 5201619 4835197 3882163 2884994 2240438 2064454 2287036
35838 2287036 2683890 3024310 3250818 3256765 2583231 901200 -1120755 -2135843 -1674871
35829 -1674871 -765279 -506718 -649559 -310811 422658 620961 71249 -336771 52995
35820 52995 847719 1452093 1918254 2457952 2793685 2659530 2482399 2836215 3455606 3494071
35810 3494071 2722129 1870597 1700738 2200106 2825542 3173209 3247721 3303583 3524895 3732590
35800 3732590 3485338 2694021 1968138 1934833 2311009 2225489 1537559 1171414 1800432 2804191
35790 2804191 3129781 2782193 2687325 3182722 3453304 2710413 1321374 348095 326114 912678
35780 912678 1494393 1701314 1449790 939494 625511 783929 1012117 557718 -656676
35771 -656676 -1700000 -1649270 -683022 230238 553842 597577 737466 787749 404530 -272656
35761 -272656 -721434 -578805 152618 1210301 2115212 2341835 1800536 1026814 585518
35752 585518 427999 160876 -232071 -378252 -128556 282983 644251 854598 669713 -41950
35742 -41950 -736735 -561796 508078 1544518 1948692 2155073 2641112 3011915 2782513
35733 2782513 2431577 2749112 3538032 3954857 3895930 3962470 4105902 3506146 2075539 957809
35723 957809 958922 1400374 1247695 630242 407769 791417 1295964 1665236 1889567 1551201
35713 1551201 234261 -1335413 -1585956 52507 2317707 3582764 3586501 3239683 3236835
35704 3236835 3495800 3673678 3545142 2878774 1499876 -338315 -1947706 -2723777 -2554416
35695 -2554416 -1755741 -807245 -87027 415398 1120307 2307915 3551847 4057402 3624677
35686 3624677 2853841 2221862 1442772 144428 -1226944 -1801150 -1437266 -851065 -550714
35677 -550714 -247519 460101 1319859 1680394 1204747 85878 -1139278 -1779575 -1392824
35668 -1392824 -331153 459438 516751 342865 416478 277207 -661580 -1787950 -1817643 -642141
35658 -642141 375094 247957 -400097 -460444 100478 541962 654053 893040 1440484 1918493
35648 1918493 2036301 1906442 1701654 1557741 1834750 2826010 3991638 4075222 2430137
35639 2430137 -83877 -1919390 -2342394 -1767360 -848219 181826 1211338 1867890 1836544
35630 1836544 1308869 723241 198184 -344706 -566994 164777 1793585 3234601 3489560
35621 3489560 2749833 1883580 1174496 313008 -513064 -455100 801939 2417271 3375154
35612 3375154 3522552 3220091 2533210 1366039 31097 -923421 -1288482 -1179271 -690746
35603 -690746 20378 614113 1015565 1684537 2864940 3833472 3602286 2279298 1041485
35594 1041485 716982 1000665 1156113 909129 459872 69608 -147296 -283118 -533519
35585 -533519 -816760 -682907 15601 646209 590111 260384 518648 1205476 1243613 323669
35575 323669 -542882 -512629 -1327 222141 160656 164444 144148 -46839 -56377 391580 900681
35564 900681 1117528 1498832 2527841 3638596 3846202 3113627 2208905 1563211 1245207
35555 1245207 1689184 3189812 4766651 4862206 3399833 1970442 1653809 1816904 1528847
35546 1528847 968564 678831 458711 -47738 -445419 -274438 8785 -221596 -494871
35537 -494871 169359 1655166 2803601 2986096 2618751 2121215 1416160 639631 331947
35528 331947 555621 717598 709931 1325671 2850654 3987428 3127995 378052 -2504709
35519 -2504709 -4041921 -4196894 -3722474 -3157820 -2688484 -2406389 -2309195 -2251392 -2092812 -1774064
35509 -1774064 -1231242 -453514 362635 962958 1358185 1729242 1969552 1623015 423833
35500 423833 -1282334 -2747253 -3326684 -2836876 -1689456 -692381 -410743 -645795 -795505
35491 -795505 -694238 -670936 -755485 -462143 320557 824269 372765 -512536 -643911 357365
35481 357365 1726734 2605804 2802767 2522720 2037437 1808889 2295485 3256300 3718882
35472 3718882 3090492 2009110 1649039 2319506 3120447 2966208 1721892 327015 -109279
35463 -109279 620843 1665342 2138519 2124464 2246046 2396409 1733562 223431 -726174
35454 -726174 6912 1482605 1713537 266259 -1231830 -1293183 -238543 710191 1045398
35445 1045398 995365 640460 -91779 -843268 -1032702 -592680 68048 744380 1521143 2264209
35435 2264209 2631216 2609775 2475219 2175055 1387552 330273 -176972 212028 830101
35426 830101 957181 773884 834998 1117796 1312095 1675586 2704584 4046071 4630402
35417 4630402 4049773 3049274 2394478 1963153 1344090 685454 394478 459107 643859
35408 643859 1002680 1601158 2020394 1821191 1369460 1496733 2294642 2892892 2624410 1864367
35398 1864367 1416315 1480340 1586332 1295058 631021 -44920 -316674 65521 990763 1945881
35388 1945881 2283177 1676346 442330 -589976 -754448 -255896 -5606 -513508 -1180500
35379 -1180500 -1084103 -256091 423775 565181 727926 1245949 1325493 25651 -2194969
35370 -2194969 -3676891 -3345768 -1748461 -180191 730180 1274223 1865637 2466041 2803167
35361 2803167 2813151 2684764 2594404 2536646 2343794 1775989 734118 -412687 -852135 -55521
35351 -55521 1496845 2702079 3040965 2966607 2945102 2720365 1975877 1153229 890557 1020187
35341 1020187 969202 943957 1725881 3217326 4178994 3784842 2660235 1934422 1927333 2268514
35331 2268514 2708932 3167468 3339521 2883860 1879347 726839 -253796 -896701 -1109903
35322 -1109903 -953530 -581733 -32910 567247 625301 -425688 -2075007 -2950195 -2477523
35313 -2477523 -1592621 -1310198 -1386645 -1122913 -750960 -1020065 -1838728 -2345921 -2155648 -1650811
35303 -1650811 -1128182 -448262 454556 1357581 2065536 2484969 2524421 2345919 2420491 2836346
35293 2836346 2938444 2247737 1293121 833303 756718 606981 666539 1425848 2389326 2654329
35283 2654329 2395986 2402818 2307320 915144 -1490533 -2868861 -2148261 -830824 -927086
35274 -927086 -2367704 -3508204 -3410548 -2531368 -1604629 -862449 -278705 107677 199358 -59797
35264 -59797 -478501 -509286 238483 1319364 1821863 1544957 1253819 1639021 2591007 3569666
35254 3569666 4023182 3411652 1665544 -228395 -990757 -615313 -268543 -457865 -429451
35245 -429451 250019 776436 477007 -6774 235350 1060883 1855691 2599589 3441942 3941385
35235 3941385 3666227 2993817 2510949 2167311 1705880 1265819 862159 49118 -1085112
35226 -1085112 -1409248 -220539 1474724 2177020 1780378 1234900 925890 488356 -201815
35217 -201815 -866232 -1291543 -1148837 80625 2090996 3305429 2526926 561895 -780786
35208 -780786 -794416 -58495 786216 1336911 1151686 385452 170950 1208193 2527209
35199 2527209 2799823 2248586 2027744 2372918 2686217 2825106 2970052 2872538 2572336 3080203
35189 3080203 4911316 6819277 7536357 7751595 8623128 9533411 9462977 9397146 10805035
35180 10805035 12725896 13218087 12932201 14202148 17180115 20109774 23028538 27795168
35172 27795168 34660013 42242490 50576354 60388616 69763410 75950115 80329315 86683884
35164 86683884 94703193 101148133 107770223 121018938 143032511 171800358 212169898
35157 212169898 273441523 346544993 394588022 382533914 315009290 232434041 169928240
35150 169928240 131506997 104341916 82348513 67376941 58059781 49451901 40542906
35143 40542906 33947218 29663314 25094025 19972325 16259631 14109026 12120010 10626796
35135 10626796 10870117 11741442 10980332 8981593 8055017 8408538 8076820 6522556 5235801
35126 5235801 4803800 4193062 3076907 2373629 2262751 1882274 1172607 996593 1314283
35117 1314283 1163077 538078 446154 1025192 1392549 1386499 1676924 2144299 2001431 1601623
35107 1601623 2208929 3710624 4404542 3468634 1958733 946376 296467 -269201 -497431
35098 -497431 -504654 -861716 -1312207 -900691 175350 457761 -432437 -987237 -127596 1254506
35088 1254506 2006356 2426957 3102618 3424620 2688746 1628428 1407507 1838860 1939080
35079 1939080 1608886 1423673 1262967 534977 -494533 -902083 -573012 -303869 -384507
35070 -384507 -158884 772113 1826646 2269627 2066409 1561655 891288 127491 -416376
35061 -416376 -497706 -379709 -565986 -1121977 -1552818 -1454498 -1083099 -1050432 -1519267 -2011493
35051 -2011493 -2098050 -1899622 -1633719 -1088384 -106352 679394 364872 -936254 -2050683
35042 -2050683 -2202633 -1868767 -1874414 -2247143 -2435971 -2216541 -1824996 -1411535 -838831 14008
35032 14008 1019825 1846992 2130468 1731954 913217 119153 -400764 -582481 -322393 337605
35022 337605 894950 778491 85847 -567692 -939260 -1311668 -1745518 -1927728 -1929240 -2273544
35012 -2273544 -2863823 -2657130 -1033555 1119067 2363872 2321297 1710640 1214210 982305
35003 982305 971933 1076056 1006399 572819 36629 -143854 214558 1001074 1938584 2524902
34993 2524902 2360010 1867516 2072424 3149719 3834045 2959464 994992 -746083 -1813892
34984 -1813892 -2526396 -2715744 -1902021 -535337 296167 498803 1042713 2188888 2981633
34975 2981633 2962338 3025968 3746684 4057751 2789420 703306 -328207 258688 1377677
34966 1377677 2121063 2577978 2738463 1976552 263427 -1135281 -1095809 -214807 -69673
34957 -69673 -1186045 -2580197 -3238318 -3221869 -3151364 -3333887 -3754204 -4332213 -4711348 -4255636
34947 -4255636 -2837362 -1336652 -776931 -1149004 -1623610 -1682437 -1367247 -649450 496340
34938 496340 1373271 1007262 -305239 -906409 104799 1518051 1626845 506580 -354929
34929 -354929 -242102 141076 71878 -289429 -573933 -807315 -969364 -690704 169099 1140843
34919 1140843 1716659 1943038 2179202 2582385 3042754 3359079 3341983 2982519 2550730 2271065
34909 2271065 2005795 1652800 1676197 2581329 3853699 4175591 2976493 1180523 100581
34900 100581 80797 511546 682759 289427 -451335 -833568 -214933 1140390 2164721
34891 2164721 2229880 1851875 1821404 2097337 2004840 1164434 -197993 -1535172 -2208677 -1845519
34881 -1845519 -896776 -430055 -883489 -1443776 -1205889 -487686 -254714 -586122 -600945 190140
34871 190140 1307683 2124117 2480878 2348936 1633839 616439 -41642 -102081 -73121 -389895
34861 -389895 -736307 -592542 -79097 205435 -60176 -743621 -1607295 -2349357 -2431318 -1433595
34851 -1433595 298802 1789996 2410164 2407149 2281959 2032210 1450989 922717 1245237
34842 1245237 2508451 3715764 3898354 3196886 2358216 1514923 185358 -1605419 -3023569
34833 -3023569 -3498806 -3434052 -3429836 -3340021 -2664750 -1535646 -656459 -326954 -62118 700561
34823 700561 1824271 2518783 2055798 499293 -1156107 -1730478 -973064 127162 311064
34814 311064 -704816 -1990650 -2265882 -995469 1095350 2529037 2410976 1335473 604623
34805 604623 562478 352953 -508294 -1208520 -874849 24179 386477 77837 -126857 135855
34795 135855 575287 1147015 2104848 3088681 3210010 2345601 1480247 1398543 1777208 1953863
34785 1953863 1895202 1925670 2064016 2147677 2222035 2354356 2337587 1925031 1164299 330351
34775 330351 -232729 -189122 451751 1049863 916579 255346 -76844 166946 349294 163963
34765 163963 271178 1216291 2432425 2947905 2551637 1681894 681415 -227950 -726361
34756 -726361 -815454 -1029622 -1583524 -1777695 -1017729 6895 108923 -642318 -929837 11792
34746 11792 1461034 2245819 2012079 1239514 593302 539221 1145195 1962157 2359246 2150798
34736 2150798 1721075 1515512 1614270 1740388 1440540 389774 -1145163 -2258369 -2212323
34727 -2212323 -1265995 -380005 -151195 -324391 -260521 392280 1367212 1893595 1398905 337999
34717 337999 -104208 484095 1088744 725735 -46245 11319 894852 1463314 1277130 1067684
34707 1067684 1291247 1501843 1508959 1908293 2817496 3145286 1969850 -100506 -1744564
34698 -1744564 -2501247 -2763268 -2738195 -2250457 -1285525 -85522 1037467 1548950 866412
34689 866412 -724416 -1877781 -1668467 -806397 -565350 -965618 -1034400 -564145 -415665
34680 -415665 -1028058 -1738390 -1875382 -1615632 -1388552 -1233034 -1176998 -1543709 -2358924 -3015005
34670 -3015005 -3046801 -2772777 -2657525 -2495473 -1832520 -832511 -16853 661163 1710715
34661 1710715 3020756 3607763 2793576 1194305 130895 254478 1068281 1678849 1698070
34652 1698070 1404201 1281698 1527273 1903005 1990138 1622704 1081367 805420 940061 1270936
34642 1270936 1565847 1780291 1883993 1733928 1293152 794519 486713 374477 407579 692234
34632 692234 1184221 1405324 977864 336045 271451 690470 523310 -783032 -2276698
34623 -2276698 -2544902 -1368942 215272 1247081 1644251 1797311 1946894 2049167 1877956
34614 1877956 1196108 88583 -923871 -1392349 -1461927 -1544139 -1607135 -1291280 -723589 -639407
34604 -639407 -1442998 -2545345 -2971002 -2441827 -1595717 -1185803 -1241208 -1115165 -408095 300107
34594 300107 40614 -1094865 -1677236 -666515 1042326 1662806 893508 175451 453133
34585 453133 883597 390144 -556557 -761027 -258089 -220550 -1112233 -2097504 -2416353 -2309664
34575 -2309664 -2207478 -1890984 -1083838 -269158 -189512 -807795 -1381405 -1452971 -1254098 -1161371
34565 -1161371 -1207752 -1200445 -995311 -591259 -196853 -189142 -706662 -1270866 -1157644 -259923
34555 -259923 699861 942873 379248 -494526 -1121379 -1168172 -660966 -105223 -135229 -696514
34545 -696514 -883077 -21294 1350945 2120164 2015218 1757610 1895232 2235458 2515478
34536 2515478 2809489 2939935 2276168 722635 -669687 -785193 223760 1339063 2073444
34527 2073444 2698889 3279609 3357803 2729319 1843352 1205015 879689 750481 796345 951214
34517 951214 1104312 1353049 1830697 2229673 2026980 1288965 668369 465799 389104 465827
34507 465827 1298367 2844462 3812907 3225387 1997793 1821459 2731825 3030998 1740834
34498 1740834 -56176 -784675 -299780 429990 777046 712688 107692 -1208841 -2748133
34489 -2748133 -3538939 -3153482 -2008034 -614668 828629 1989982 2292481 1670625 899106
34480 899106 686199 858340 924766 987342 1393861 1809690 1503863 516152 -302765 -528064
34470 -528064 -601544 -790600 -603309 228337 967511 833524 184032 -87159 86152 88571
34460 88571 -131615 41692 770823 1472388 1772820 1892141 1881344 1374967 474507 18718
34450 18718 391569 756781 178563 -1007923 -1689552 -1497686 -1099284 -1157675 -1709124 -2511934
34440 -2511934 -3342588 -3846866 -3641284 -2746604 -1558922 -308189 1052193 2297701 2749134
34431 2749134 2011813 661792 -229275 -257862 -42132 -280829 -768915 -730567 -30348 493650
34421 493650 152486 -606775 -821443 -302348 314660 612993 744306 765932 481335 123831
34411 123831 313050 920061 830446 -519884 -2096925 -2550526 -1975500 -1512020 -1643347
34402 -1643347 -1908592 -2057239 -2371078 -2763785 -2567904 -1547756 -406664 31342 -388390
34393 -388390 -1338659 -2375928 -2914625 -2487273 -1398254 -631516 -750087 -1265327 -1374084
34384 -1374084 -933090 -433222 -399997 -1104572 -2461238 -3833958 -4264314 -3329011 -1657336
34375 -1657336 -335058 84880 -162398 -526053 -613018 -358304 35519 367623 687335
34366 687335 1138847 1614799 1862679 1923043 2079529 2339539 2419411 2334779 2448346 2690139
34356 2690139 2326169 981937 -545225 -1108415 -661470 -332639 -1043894 -2461648 -3430417
34347 -3430417 -3240231 -2347384 -1831692 -2145808 -2594473 -2287244 -1350184 -648021 -451695
34338 -451695 -206394 251553 237758 -496272 -946523 -219756 932225 1018371 -83779 -1032787
34328 -1032787 -973524 -523966 -629530 -1340804 -2068011 -2333964 -1913000 -821706 453161
34319 453161 1203441 1298171 1280680 1404094 1133695 51511 -1219693 -1576824 -692614 742457
34309 742457 1822002 2015859 1161866 -525344 -2304110 -3169168 -2589491 -1021876 342546
34300 342546 448263 -770836 -2302633 -2983284 -2588250 -1839202 -1386956 -1222116 -1195152
34291 -1195152 -1501613 -2171756 -2548720 -1987389 -886687 -298158 -488724 -578971 213104
34282 213104 1580849 2662634 3023308 2722538 1880027 698474 -355697 -908915 -1091542
34273 -1091542 -1206260 -1179913 -804647 -349556 -346708 -782303 -1078544 -970329 -834132 -962836
34263 -962836 -1075986 -862741 -521652 -372424 -348437 -303335 -439277 -932439 -1455230 -1620529
34253 -1620529 -1629617 -1874240 -2138794 -1938123 -1536746 -1780317 -2777165 -3551815 -3352048 -2648394
34243 -2648394 -2402636 -2850871 -3468541 -3745525 -3523716 -2827495 -1785134 -614237 505242
34234 505242 1360201 1503818 621378 -742924 -1434634 -1017574 -276154 30348 261784
34225 261784 1123127 2410844 3359109 3773672 3895172 3499833 2236787 732689 190558
34216 190558 718750 1111052 601036 -150736 -275839 9451 -27654 -491823 -995759 -1421547
34206 -1421547 -1861785 -2199039 -2377964 -2737211 -3426019 -3816114 -3218166 -1990119 -1201879
34197 -1201879 -1269510 -1631410 -1794487 -1948192 -2311758 -2541663 -2242240 -1666972 -1437182 -1727899
34187 -1727899 -2098726 -2070330 -1596197 -986141 -588594 -573057 -853784 -1174674 -1391384 -1709734
34177 -1709734 -2486341 -3663347 -4535014 -4325308 -3001279 -1277514 206950 1364628 2164856
34168 2164856 2158192 1051675 -469210 -1210235 -891124 -526230 -1122729 -2452054 -3428331
34159 -3428331 -3329054 -2298279 -981125 -70885 33453 -440300 -777886 -593035 -319480
34150 -319480 -514990 -896759 -613409 565571 1867895 2422296 2102593 1350399 608009
34141 608009 170024 227476 713854 1301420 1819473 2474474 3329066 3739465 2818996 583640
34131 583640 -1771348 -3033741 -3165081 -2991408 -2936431 -2647633 -1915456 -1247260 -1077315
34122 -1077315 -966892 -320522 416124 176913 -1112502 -2270075 -2460860 -2172937 -2109397
34113 -2109397 -1968523 -1145153 -46028 286096 -394852 -1395726 -2258756 -3156664 -4046996
34104 -4046996 -4348958 -3824712 -3119522 -2979790 -3331527 -3479339 -2951521 -1932945 -1080007
34095 -1080007 -969606 -1452676 -1600899 -719470 638938 1238772 760069 153490 260707
34086 260707 848739 1331517 1640730 1821917 1499475 545362 -215967 132915 1257935
34077 1257935 1898866 1463444 582974 96734 177042 556182 984066 1228975 1083735 617277
34067 617277 151046 -115606 -223005 -232056 -208046 -370188 -884428 -1539288 -1990605 -2237675
34057 -2237675 -2426407 -2322288 -1583296 -518630 122931 230356 496889 1315525 2240592
34048 2240592 2856668 3388922 3912752 3705175 2220992 287032 -553556 226065 1711308
34039 1711308 2717216 2743044 1874032 478100 -845960 -1555917 -1610383 -1347230 -961186
34030 -961186 -482369 -165581 -350078 -886800 -1213579 -1090204 -793376 -522644 -155024 258389
34020 258389 298671 -244264 -1016756 -1552992 -1701048 -1449999 -825626 -182779 -64303 -433506
34010 -433506 -551096 -2707 661665 785138 590064 699848 1115086 1409063 1645418 2254041
34000 2254041 3058763 3246295 2462672 1314059 576889 392507 393780 182727 -455169 -1397815
33990 -1397815 -2128575 -2209063 -1852160 -1596198 -1436325 -902078 -107371 17715 -1055147
33981 -1055147 -2568233 -3292432 -2829783 -1699978 -561501 161461 260739 -50322 -140728
33972 -140728 276803 576726 -15851 -1231889 -1967762 -1700217 -1087667 -1029128 -1659479 -2489981
33962 -2489981 -3074133 -3243723 -3062741 -2881149 -3148409 -3825135 -4199664 -3664822 -2528548
33953 -2528548 -1645873 -1322385 -1058830 -441479 264951 723980 1219805 2121513 2922116
33944 2922116 2658453 1409788 499135 689974 958749 -29242 -1714403 -2145809 -715399
33935 -715399 853944 760317 -657446 -1752958 -1861931 -1722932 -1991191 -2409830 -2482675
33926 -2482675 -2119165 -1444219 -616370 13396 140430 44825 326077 955323 1203513 731314
33916 731314 82485 -285416 -785304 -1883611 -3008225 -3110933 -2147966 -1188574 -969618
33907 -969618 -1048750 -643157 291578 1228410 1879877 2349548 2731986 3064723 3530460 4163981
33897 4163981 4384652 3428552 1443495 -367249 -1009016 -672312 -118337 379612 902581
33888 902581 1168223 844386 447219 974107 2452792 3654895 3534898 2235605 395710
33879 395710 -1678247 -3646615 -4802107 -4883809 -4596829 -4515398 -4068985 -2577892 -768790
33870 -768790 -48352 -494195 -831134 -455328 -246786 -1042985 -2380360 -3249728 -3252316 -2535105
33860 -2535105 -1385399 -428950 -489872 -1604248 -2716788 -2922269 -2502067 -2219026 -2165241
33851 -2165241 -1946708 -1514492 -1123345 -857807 -847231 -1519928 -2874361 -3852470 -3344523
33842 -3344523 -1701965 -415910 -297125 -755445 -937086 -751730 -518345 -336318 -272928
33833 -272928 -666352 -1693951 -2849870 -3291871 -2697239 -1547628 -563544 22227 603586
33824 603586 1619892 2856647 3484327 2937886 1618607 489503 49810 -34076 -313067
33815 -313067 -866363 -1320435 -1358610 -1048651 -670262 -297063 297489 1165757 1762355 1404899
33805 1404899 256673 -575671 -210317 1047171 2178642 2549181 2185515 1351709 410606
33796 410606 -103544 99265 575320 584261 72203 -217688 306206 1408545 2382886 2733559
33786 2733559 2413422 1717644 1088139 785667 623617 167705 -750677 -1818954 -2494321
33777 -2494321 -2377719 -1497061 -383255 329849 579501 906154 1596424 2163322 2041991
33768 2041991 1389799 671249 -133047 -1172466 -1920295 -1682989 -850388 -646802 -1469584
33759 -1469584 -2394330 -2611749 -2424858 -2332824 -1999019 -913111 460179 1023762 371127
33750 371127 -797081 -1481635 -1260771 -555208 -333984 -1320136 -3175063 -4694331 -5063663
33741 -5063663 -4636041 -4241519 -4156582 -4135629 -4043416 -3918486 -3668214 -3232196 -2885463 -2878566
33731 -2878566 -2876795 -2245315 -905077 463635 1102077 816143 5237 -693100 -841735
33722 -841735 -505643 -77436 268124 707508 1221852 1300601 550024 -676993 -1661399 -2124908
33712 -2124908 -2269520 -2230420 -1966853 -1578546 -1241358 -843641 -128083 752766 1207422 868195
33702 868195 58576 -500321 -369777 162673 252745 -688706 -2219898 -3183586 -3003459 -2308012
33692 -2308012 -1945583 -1827267 -1337213 -569643 -343288 -960211 -1694103 -1796335 -1488121
33683 -1488121 -1565852 -2287715 -3010398 -2919568 -1962119 -947472 -629047 -766013 -422853 734601
33673 734601 1913641 2232450 1778808 1184867 650610 41124 -471387 -693464 -1052802
33664 -1052802 -1997547 -2863012 -2398949 -588608 1061028 1393048 859771 451179 247353
33655 247353 -240807 -917959 -1134115 -611667 309737 1237705 2052084 2718702 3100905 2944791
33645 2944791 2007585 453780 -863930 -1010364 -65386 829193 740448 -193609 -1325879
33636 -1325879 -2251116 -2653679 -2161622 -985578 -122300 -220775 -724135 -850177 -904664 -1689790
33626 -1689790 -2966206 -3600626 -3213345 -2670089 -2763692 -3273148 -3606996 -3634584 -3511334 -3243060
33616 -3243060 -2766690 -2052659 -956459 531435 1735281 1637845 141755 -1539758 -2195744
33607 -2195744 -1931880 -1764850 -2266543 -3076481 -3515326 -3231589 -2379734 -1536163 -1349213
33598 -1349213 -1967953 -2875476 -3454150 -3523512 -3149257 -2302212 -1155228 -445538 -878008
33589 -878008 -2092299 -2773136 -2071664 -601047 262256 -134057 -1207421 -1983735 -2098734
33580 -2098734 -1887089 -1776242 -1888613 -2186671 -2676523 -3267152 -3598605 -3288788 -2354248
33571 -2354248 -1198272 -190427 541494 923598 852962 441448 96749 140796 476299
33562 476299 815794 1133728 1687292 2613987 3648087 4240828 3935379 2739967 1221981
33553 1221981 118116 -266419 -195868 -13752 260551 702357 1130948 1340287 1544799
33544 1544799 2164515 3109011 3646358 3173340 1895546 587793 -132893 -170641 150332
33535 150332 291390 -196621 -1195074 -1869391 -1386381 65005 1243191 1078991 -210073
33526 -210073 -1430638 -1698078 -1144999 -446195 -32836 101498 157450 387863 1020933 1986962
33516 1986962 2742425 2669830 1760382 705390 165058 42563 -378611 -1583963 -3198580
33507 -3198580 -4260504 -4142395 -3175422 -2290773 -2057299 -2205436 -2125627 -1621941 -1017595
33498 -1017595 -699207 -795768 -1195168 -1625655 -1801256 -1739822 -1845331 -2381636 -2973368 -3025967
33488 -3025967 -2590708 -2329325 -2564766 -2899050 -2958544 -2978666 -3308401 -3791428 -4061905 -4081351
33478 -4081351 -3928252 -3409588 -2446734 -1601470 -1583004 -2307338 -3020079 -3335472 -3585589 -4072665
33468 -4072665 -4528058 -4520376 -4016309 -3353734 -2907525 -2801185 -2659280 -1761175 74678 1828821
33458 1828821 2137777 893859 -663628 -1579050 -2104748 -2688899 -2978051 -2576807 -2103774
33449 -2103774 -2495217 -3574574 -4262920 -4098195 -3651377 -3416747 -3192913 -2798252 -2581100
33440 -2581100 -2768799 -2906106 -2459492 -1598205 -907002 -603049 -481442 -420133 -449355 -391152
33430 -391152 72748 820398 1137285 487720 -638072 -1023404 -115663 1105559 1138927
33421 1138927 -103729 -984659 -194681 1417437 1870110 655702 -697788 -841707 -355561
33412 -355561 -655807 -1897437 -2842595 -2505504 -1122743 428054 1466129 1688406 1109871
33403 1109871 72949 -970707 -1776452 -2197317 -1912146 -761406 610443 1017662 -26430
33394 -26430 -1639831 -2478970 -2172899 -1576157 -1634619 -2242852 -2374915 -1336888 280155
33385 280155 1149867 720799 -208448 -651502 -712298 -1135935 -1896232 -2098190 -1370520 -484637
33375 -484637 -178507 -112175 339880 807388 337504 -1063186 -2154833 -1901474 -575637
33366 -575637 779750 1470463 1458637 1025796 569468 504213 956982 1594887 1962477 1908926
33356 1908926 1558171 1067358 631164 494307 631887 587985 22011 -698520 -907225 -599475
33346 -599475 -445721 -756094 -1020830 -739455 -115957 500738 1281601 2337104 2916421
33337 2916421 2115768 281359 -1198736 -1583317 -1391178 -1179275 -733455 55605 513088
33328 513088 196056 -178294 197897 801008 551256 -352658 -640686 53464 724953 732973
33318 732973 729996 1309458 1850601 1533179 640354 -88832 -740156 -1789435 -2807677 -2780670
33308 -2780670 -1689743 -718454 -649945 -921757 -663862 26292 412653 299895 253822 724320
33298 724320 1441052 1833438 1776811 1653465 1706960 1636021 1085552 390497 373395 1246853
33288 1246853 2112197 1891264 531096 -1056414 -2074210 -2470944 -2577639 -2530905 -2188956
33279 -2188956 -1450794 -572007 -113987 -388416 -944914 -982815 -411854 -15216 -250201 -473856
33269 -473856 33108 765223 568912 -721936 -2133294 -2968231 -3428450 -3690684 -3331833
33260 -3331833 -2116801 -646178 294077 580667 615017 779474 1274421 1995144 2358444
33251 2358444 1847873 963561 892842 1850805 2539893 1848633 358958 -576487 -626401 -488989
33241 -488989 -601720 -784481 -879235 -873258 -592831 -57889 123762 -443837 -1034374 -662213
33231 -662213 330832 613814 -248565 -1308704 -1668182 -1311763 -422188 944433 2236565
33222 2236565 2666372 2488846 2810793 3637185 3471073 1664463 -195749 -449313 216887
33213 216887 -35372 -1398195 -2416845 -2318894 -1744342 -1306108 -894984 -444482 -76528
33204 -76528 546259 1727035 2599457 1938459 244226 -585437 -58513 133561 -1113809
33195 -1113809 -2472601 -2314143 -1220972 -784856 -965966 -454408 921976 1953493 2042888
33186 2042888 1817181 1678374 1223321 362101 -310531 -624376 -1111827 -1754847 -1638645
33177 -1638645 -472523 577907 321247 -1016982 -2472725 -3640107 -4461486 -4464381 -3283677
33168 -3283677 -1600887 -597442 -567496 -777820 -567010 56671 743009 1070896 641992
33159 641992 -422328 -1183595 -787095 366676 1037995 735661 135759 -188785 -596881
33150 -596881 -1526011 -2535640 -2878819 -2641660 -2600867 -3013952 -3160192 -2295337 -714835
33141 -714835 456913 489232 -190117 -583732 -322365 25147 -133804 -575059 -625708 -126432
33131 -126432 391130 453033 226055 284953 983170 2063833 2809830 2732147 2228858 2251865
33121 2251865 3049019 3626555 2955808 1385765 193130 -50203 136847 287031 534795
33112 534795 821284 527649 -557384 -1631149 -1867001 -1481037 -1200836 -1121517 -753284
33103 -753284 101047 1159531 2159179 2967819 3338746 3088053 2456914 1879467 1469741
33094 1469741 1070413 638109 235576 -130612 -293693 154246 1261918 2329821 2653257
33085 2653257 2372892 2001104 1432561 210939 -1417681 -2608646 -3062447 -3205642 -3186601
33076 -3186601 -2642290 -1700750 -1255723 -1751654 -2459063 -2502120 -1952697 -1333726 -667515 245524
33066 245524 1036991 1070715 408067 -152337 -20882 560675 810483 142324 -1197275 -2124544
33056 -2124544 -1743743 -519998 148008 -211962 -470726 395344 1740785 2252373 1824423
33047 1824423 1321370 957930 251742 -571346 -538912 492519 1482186 1785754 1903696
33038 1903696 2169356 1917858 761017 -364402 -449458 64914 101309 -322706 -360252 37539
33028 37539 13423 -706540 -1333263 -1221027 -659785 -216461 -52681 -185939 -752943 -1634831
33018 -1634831 -2286814 -2246752 -1511436 -355629 775875 1201703 482997 -847019 -1644794
33009 -1644794 -1501017 -1155758 -1318955 -1709677 -1656321 -1075848 -387096 69395 71049 -545982
32999 -545982 -1487061 -1986353 -1709664 -1233174 -1107881 -994252 -430051 81903 -273007 -1185378
32989 -1185378 -1522906 -1049774 -807970 -1568759 -2802045 -3529431 -3450405 -2827849 -1910665
32980 -1910665 -940867 -253693 53939 199934 203275 -239012 -1056713 -1512852 -1080191 -244103
32970 -244103 54521 -444556 -1132751 -1309661 -849536 -249933 -209934 -952376 -1859446 -2108911
32960 -2108911 -1749365 -1637489 -2129309 -2483362 -1974136 -978107 -357485 -269458 -290807 -347853
32950 -347853 -735858 -1392261 -1876818 -2018541 -1992676 -1863549 -1654873 -1749874 -2517793 -3527279
32940 -3527279 -3800133 -2976236 -1694398 -734332 -294186 -173765 -109450 216981 999830
32931 999830 1953398 2507497 2443853 1995299 1374666 682226 210338 236662 485163 374216
32921 374216 -205672 -1005353 -2214435 -4202918 -6325943 -7072807 -5929774 -4185794 -3229982
32912 -3229982 -2862900 -2096872 -912996 -198324 -335267 -849739 -1289791 -1576461 -1562822
32903 -1562822 -1079645 -479319 -429662 -1048126 -1795914 -2278558 -2595153 -2845070 -2872414 -2640414
32893 -2640414 -2351305 -2029418 -1423773 -483469 453461 1068644 1301642 1121578 500386
32884 500386 -268618 -682846 -654794 -607558 -736401 -630464 25375 774700 933369 632504
32874 632504 764019 1778382 2946874 3136006 2174617 1083147 808390 1039246 696270
32865 696270 -491988 -1496916 -1322291 -280461 564509 797802 798345 756984 454340 67374
32855 67374 279222 1214889 2013264 1984318 1603755 1731755 2291929 2462510 1952115 1347831
32845 1347831 1224345 1568882 2181727 3026508 3921938 4365797 4024397 3114566 2014608
32836 2014608 770083 -682510 -2052782 -2932430 -3422103 -4008661 -4690579 -4722428 -3594233
32827 -3594233 -1913193 -774053 -390836 12974 844170 1345017 621107 -999070 -2288507
32818 -2288507 -2618798 -2451247 -2339208 -2207413 -1954290 -2103833 -3159204 -4547866 -4938123
32809 -4938123 -3780972 -2085250 -1356990 -1968109 -2847268 -2718902 -1398417 198752 1133487
32800 1133487 1335724 1467808 2084218 2994134 3373705 2513102 602006 -1223501 -1863323
32791 -1863323 -1380081 -869022 -1057082 -1437249 -1172015 -441463 -185665 -654529 -1060984
32782 -1060984 -858595 -557571 -805185 -1300107 -1276396 -649882 32738 549496 1148351 1765352
32772 1765352 1837484 1117472 140966 -383837 -253018 384068 1415114 2644689 3596669
32763 3596669 3870062 3589195 3204840 2967447 2882271 3032594 3529513 4131124 4309662 3843068
32753 3843068 3048586 2271993 1440482 386369 -617825 -1038515 -766585 -296691 -162467
32744 -162467 -451672 -946503 -1443598 -1747299 -1593340 -890686 13951 537993 340821 -492286
32734 -492286 -1629067 -2676269 -3297225 -3405853 -3243837 -3067338 -2783718 -2127324 -1180456
32725 -1180456 -435603 -261321 -537729 -903453 -1133517 -1178366 -1085624 -1047587 -1306841 -1818962
32715 -1818962 -2191931 -2169188 -2007218 -2131131 -2539145 -2811627 -2643126 -2116157 -1492288 -990814
32705 -990814 -766170 -829182 -924736 -726804 -263183 51961 -67297 -417935 -623175 -629719
32695 -629719 -643432 -683930 -545726 -246074 -161026 -491433 -835764 -613829 196038 1061756
32685 1061756 1555893 1610941 1142840 -4181 -1472394 -2282284 -1848722 -834897 -441783
32676 -441783 -978050 -1661087 -1747090 -1268377 -627971 -81826 209758 179297 144229 590141
32666 590141 1378125 1663233 951758 -212553 -985393 -1176610 -1049858 -706395 -294300
32657 -294300 -376279 -1261189 -2186141 -2031173 -855506 70635 -106275 -900707 -1417537 -1491286
32647 -1491286 -1498572 -1600625 -1678235 -1678556 -1590467 -1315933 -922089 -799063 -1230581 -1983422 -2591475
32636 -2591475 -2831831 -2662895 -2008521 -1039721 -459785 -962934 -2367086 -3668903 -4038282
32627 -4038282 -3495039 -2606885 -1844937 -1315897 -862580 -320458 167699 124675 -700701 -1762959
32617 -1762959 -2108605 -1480299 -662753 -481420 -796729 -861946 -416308 82527 229042 115777
32607 115777 -126348 -729272 -1853752 -3013800 -3361781 -2566667 -1190675 -173810 -53624
32598 -53624 -631032 -1260943 -1492268 -1484031 -1696126 -2148467 -2269245 -1675432 -784318 -250885
32588 -250885 -46729 311055 683813 204472 -1458762 -3305940 -3954058 -3072009 -1467271
32579 -1467271 -36598 893937 1391295 1652608 1947106 2369912 2545188 1924279 521102
32570 521102 -926794 -1704240 -1828433 -1823167 -1914018 -1727168 -907073 144959 527797 27214
32560 27214 -318696 582758 2196242 2655098 1081726 -1091313 -1778261 -728478 472573
32551 472573 606178 23729 -404726 -520595 -589487 -543433 -182583 275074 472191 526649
32541 526649 811713 1217864 1160414 387894 -632287 -1292053 -1502565 -1557702 -1550999 -1271214
32531 -1271214 -710523 -367433 -765359 -1750091 -2561628 -2661632 -2239180 -1812684 -1616097
32522 -1616097 -1528854 -1317841 -762318 120200 746734 336333 -979070 -1903305 -1475604
32513 -1475604 -415311 -153641 -828520 -1280244 -975159 -731753 -1199969 -1734645 -1462228
32504 -1462228 -647999 -199823 -330081 -458716 -142822 479716 938793 740244 -214314
32495 -214314 -1185594 -1112109 -19816 694410 5957 -1312765 -1791353 -1236271 -629791
32486 -629791 -441389 -192095 346524 611079 132212 -870236 -2004624 -3089035 -3788511
32477 -3788511 -3573565 -2378948 -812855 499606 1330648 1559641 1109600 354494 -39471
32468 -39471 50527 64135 -323244 -715215 -690707 -405632 -179941 -31652 35511 -191992
32458 -191992 -725169 -1263354 -1820499 -2817678 -4116428 -4704366 -4053989 -3156634 -3274574
32449 -3274574 -4082980 -4104883 -2851858 -1485188 -1240708 -2142638 -3527422 -4906340 -5800769
32440 -5800769 -5538107 -4043471 -2431439 -1966920 -2504625 -2660915 -1620920 -134841 543457
32431 543457 137879 -700362 -1471687 -2109128 -2323146 -1597769 -203281 573062 -53368
32422 -53368 -1081163 -850561 731380 2048503 1904034 771215 -392602 -1489713 -2685703
32413 -2685703 -3359159 -2779909 -1428340 -529434 -417880 -432991 -423262 -1131758 -2678736 -3770013
32403 -3770013 -3228724 -1601888 -347091 129947 660238 1712152 2624685 2678415 2143309
32394 2143309 1775817 1740817 1560395 943271 235153 55955 704958 1849704 2656972
32385 2656972 2436479 1411151 630187 745968 1091087 539478 -806620 -1592978 -1142362
32376 -1142362 -573061 -1276169 -2838962 -3474383 -2367528 -589096 498311 799150 986501
32367 986501 1241643 1246360 990204 789298 645485 278535 -196105 -247226 243332 624195
32357 624195 240620 -729244 -1488518 -1536500 -1144638 -960332 -1307501 -1935013 -2378217 -2440573
32347 -2440573 -2255875 -2006170 -1794723 -1764321 -2049061 -2512510 -2788713 -2706302 -2414916 -1972883
32337 -1972883 -1170294 -18820 935700 1182771 886870 557181 301919 -119405 -672109
32328 -672109 -1035636 -1190801 -1468624 -1916951 -2111255 -1792057 -1299853 -1123896 -1263777 -1259366
32318 -1259366 -750307 70477 502813 -17982 -1104463 -1468637 -246849 1820427 3063026
32309 3063026 2743107 1678384 945294 676760 488546 430392 850254 1611318 2079576
32300 2079576 1881734 1276085 742446 458792 215974 -255928 -841985 -964723 -219043
32291 -219043 889071 1271081 553051 -369411 -443792 222919 658321 408258 13252 61790
32281 61790 308487 42317 -897231 -1794227 -1819641 -1002570 -250314 -316466 -967804 -1442974
32271 -1442974 -1502198 -1470552 -1290366 -286384 1790645 4074739 5388089 5305852 4084047
32262 4084047 2153391 271144 -445834 427963 1792087 2091230 1110037 -54576 -628988
32253 -628988 -837228 -969534 -845226 -525968 -657593 -1581886 -2733355 -3355635 -3255607
32244 -3255607 -2477927 -912451 1188049 2848830 3257853 2748205 2315919 2363423 2440910
32235 2440910 2056118 1228894 342551 -126231 152092 959584 1462105 959649 -332037
32226 -332037 -1574062 -2244389 -2398529 -2178319 -1661949 -1233459 -1459310 -2281912 -2801043
32217 -2801043 -2329461 -1437120 -1411602 -2631396 -3952941 -4033432 -2963729 -2064020 -2099837
32208 -2099837 -2374884 -1948612 -1125502 -952079 -1534599 -1847010 -1314518 -616266 -491840
32199 -491840 -614052 -342695 60833 -139928 -873347 -1308856 -1098544 -770606 -822101 -1106820
32189 -1106820 -1283880 -1291456 -1142797 -720454 -57288 504102 714045 791715 1161176 1856991
32179 1856991 2332943 1957007 764473 -394176 -726754 -465324 -507993 -1053419 -1259210
32170 -1259210 -556936 448080 974034 1232718 1752860 2159219 1749124 907907 694128
32161 694128 1149026 1325530 1050989 1241493 2091207 2359350 1214782 -363225 -953518
32152 -953518 -556896 -110237 109022 468598 823505 500347 -642996 -1967466 -2828894
32143 -2828894 -2981183 -2315349 -824725 1136329 2940116 3997250 3876838 2576447 984919
32134 984919 459667 1326007 2263837 1850091 300466 -1002490 -1280293 -877328 -419838
32125 -419838 -360569 -1051344 -2275500 -2888303 -1975643 -357376 104744 -1162059 -2764134
32116 -2764134 -3196587 -2419632 -1254025 -152573 823658 1470862 1564122 1225211 750039
32107 750039 271022 -203660 -657063 -1061823 -1253322 -883730 81907 954794 997268 443238
32097 443238 173109 395365 431180 -104892 -740956 -972765 -855980 -519241 108902 767369
32087 767369 866479 423728 225842 630809 984499 709869 193550 26039 96038 21689
32077 21689 -252821 -875006 -2255767 -4081875 -5009598 -4294256 -3013490 -2650828 -3118668
32068 -3118668 -3319454 -3058555 -3022581 -3204054 -2847300 -1994666 -1699360 -2365268 -2983794 -2454098
32058 -2454098 -840086 991188 2221125 2344142 1407862 333380 285547 1353051 2395966
32049 2395966 2400158 1377959 -167399 -1814796 -2943531 -2773369 -1339476 130163 428260
32040 428260 -384700 -1368621 -1921735 -2126689 -2221152 -2260905 -2195151 -1935601 -1441471 -900751
32030 -900751 -616126 -557061 -291379 445665 1329122 1726328 1221482 -126937 -1746159
32021 -1746159 -2804582 -2920895 -2620162 -2663463 -3016574 -3065408 -2737759 -2553527 -2480400 -1773939
32011 -1773939 -376559 511114 -34344 -1314798 -1981827 -1719781 -1131117 -519632 215745
32002 215745 830671 919282 736028 904112 1310408 1155252 190478 -884162 -1407374 -1403285
31992 -1403285 -1063487 -349461 523151 845246 168685 -1072334 -2100887 -2664031 -3000533
31983 -3000533 -3206463 -3055298 -2385310 -1371104 -380683 330428 824109 1414973 2273942
31974 2273942 3043983 3021512 1859317 30416 -1476516 -1913989 -1316857 -465545 -311348
31965 -311348 -1242445 -2793802 -4091645 -4572444 -4283179 -3666193 -3201294 -3091934 -3062827
31956 -3062827 -2564534 -1410084 -98273 768641 1275060 2039323 3294785 4492231 4884224
31947 4884224 4220537 2857140 1517016 953397 1398109 2181066 2295436 1545779 749727
31938 749727 576633 666451 318978 -383008 -771659 -656249 -436475 -189824 538094 1773435
31928 1773435 2681362 2603094 1978817 1603238 1370123 549264 -872120 -2008026 -2327404
31919 -2327404 -2260457 -2274635 -2139002 -1588668 -1010042 -798325 -614198 -77835 278912 -257157
31909 -257157 -1178249 -1228636 -321063 160160 -687008 -2028532 -2514781 -1893086 -770828
31900 -770828 447163 1550725 2019240 1493899 568331 312419 1013232 1938891 2302196
31891 2302196 1994393 1432832 1073929 993895 696218 -402959 -2029131 -3050978 -2896056
31882 -2896056 -2466743 -2961736 -4187331 -4863624 -4361088 -3264203 -2314936 -1648353 -1089545
31873 -1089545 -446028 519303 1714710 2403760 2046743 1322680 1334358 1850653 1531668
31864 1531668 89415 -1070622 -870383 -568 404156 415142 640821 829212 362597
31855 362597 -409582 -559305 -47665 283051 72600 -197494 -207400 -231646 -421081 -448369
31845 -448369 -131724 162653 -34388 -844664 -2076577 -3268148 -3727693 -3079857 -1839413
31836 -1839413 -972850 -882869 -1303192 -2058471 -3143535 -3970530 -3482166 -1541940 441849
31827 441849 933222 -42119 -1145889 -1328160 -604005 491642 1475995 1898106 1411625
31818 1411625 210761 -933535 -1373355 -1165071 -782924 -470543 -154755 124470 76707
31809 76707 -435702 -1100033 -1439527 -1278441 -786466 -198903 311219 592415 621945 659519
31799 659519 1049733 1800894 2519611 2777201 2375376 1315304 -181143 -1579946 -2310991
31790 -2310991 -2302229 -2023425 -1931586 -2138620 -2620383 -3279182 -3648943 -3098489 -1710700 -504282
31780 -504282 -301877 -742020 -934784 -745533 -753417 -1137022 -1362477 -1017389 -300771 436528
31770 436528 1035755 1224594 578402 -798356 -1936755 -1835147 -547178 856174 1404736
31761 1404736 1126884 787257 850914 934602 470861 -288808 -470777 133619 654301 438604
31751 438604 102619 551257 1458173 1701047 1055847 400059 300037 507067 913182 1736048
31741 1736048 2418997 1713062 -383758 -1963351 -1531048 -41783 595775 263814 395205
31732 395205 1402784 2011947 1338715 205540 -174530 205638 519937 361233 -22852
31723 -22852 -313231 -439683 -578120 -1077958 -2071828 -3032766 -3183527 -2497962 -1752780 -1400301
31713 -1400301 -1062993 -490031 -260717 -874753 -1695891 -1623543 -569094 472795 722374
31704 722374 355467 16142 183141 988731 2075979 2600917 1948372 555782 -473650
31695 -473650 -669527 -594855 -864134 -1380128 -1785842 -2051190 -2193192 -1934316 -1166960 -374492
31685 -374492 -38292 68664 412845 792178 600066 -117172 -631274 -646294 -714669 -1300826
31675 -1300826 -2096059 -2629643 -2947594 -3177688 -2956765 -1983113 -820233 -410771 -896810
31666 -896810 -1573522 -1924197 -1965119 -1553909 -271376 1606389 2776654 2221076 443978
31657 443978 -1179471 -1944658 -2090932 -1870644 -1212040 -331363 131147 -103763 -593191
31648 -593191 -917292 -1301237 -2087324 -2957524 -3179154 -2491068 -1377209 -527821 -278564
31639 -278564 -464268 -573806 -150877 735989 1520012 1773081 1596463 1212075 558340 -317797
31629 -317797 -861516 -630806 -81566 -6448 -317120 -249462 195868 93954 -721522 -915971
31619 -915971 515787 2480249 3037492 2040513 1244062 1761781 2683412 2691114 2007233 1886867
31609 1886867 2733483 3603798 3462454 2284179 882932 104999 260211 995353 1588272
31600 1588272 1557766 1086951 765565 920807 1318341 1526919 1449281 1400179 1660927 2024588
31590 2024588 1904749 964450 -460588 -1666668 -2195861 -2028916 -1386712 -642826 -279561
31581 -279561 -503345 -905100 -898506 -530996 -463269 -1096622 -2152215 -3180923 -3987625 -4418828
31571 -4418828 -4300278 -3850419 -3620459 -3705619 -3547027 -2870947 -2234877 -2165256 -2345915 -2263214
31561 -2263214 -2078183 -2108100 -1971187 -1189822 -296515 -311084 -1260919 -2204314 -2642446 -2877411
31551 -2877411 -2974682 -2542020 -1791161 -1660595 -2367130 -2837520 -2238604 -1222943 -900944
31542 -900944 -1283597 -1592080 -1592226 -1721229 -2141409 -2436311 -2157051 -1149891 462241 2118327
31532 2118327 2866350 2126875 317205 -1642293 -3196539 -4172420 -4361014 -3728677 -2826415
31523 -2826415 -2354434 -2381045 -2451522 -2318463 -2108709 -1969005 -2028394 -2471183 -3117797 -3221141
31513 -3221141 -2337853 -1177446 -853600 -1427552 -1943409 -1819676 -1409454 -1185329 -1179775 -1321740
31503 -1321740 -1567502 -1610276 -1226120 -949149 -1488407 -2347609 -2101231 -420150 1240996
31494 1240996 1542775 832101 115740 -467171 -1096642 -1112107 154087 1798014 2086066
31485 2086066 829524 -268099 43457 961480 933142 -250138 -1365425 -1344304 -327928
31476 -327928 721336 1027916 593753 -14758 -358458 -491478 -593122 -528757 -106018 443882
31466 443882 701481 681683 737185 873864 693318 105557 -375745 -200967 691635 1930244
31456 1930244 2880081 2833204 1635939 180303 -396125 -138558 -174602 -975580 -1614620
31447 -1614620 -1255371 -474538 -260414 -403135 30324 1009499 1507187 1112591 602564
31438 602564 706450 1212856 1609270 1796216 1742766 1130610 -105469 -1357159 -1987686
31429 -1987686 -2078168 -2108712 -2200499 -2099942 -1675561 -1029694 -306683 252952 268216 -361877
31419 -361877 -1080742 -1076865 -94776 1306513 2223227 2058574 951015 -275847 -831835
31410 -831835 -778856 -821080 -1165398 -1152356 -389860 369140 179113 -700595 -1201230 -982825
31400 -982825 -643269 -472085 -40821 748179 1207762 957776 665756 1069070 1868347 2248914
31390 2248914 1992895 1359424 295335 -1354208 -3019321 -3680844 -3106668 -2146983 -1603961
31381 -1603961 -1358047 -849573 62821 1058481 1834267 2290568 2428425 2319501 2045902
31372 2045902 1498828 422001 -1132916 -2570604 -3256998 -3184949 -2862675 -2567454 -2033796
31363 -2033796 -1007297 160248 740138 375860 -609550 -1604072 -2159700 -2075779 -1405317
31354 -1405317 -587431 -270452 -636020 -1050181 -797604 -120541 -71620 -1219948 -2912507
31345 -2912507 -4035098 -4163324 -3689781 -3128231 -2687640 -2369191 -2069087 -1588276 -858522
31336 -858522 -210206 -169593 -893107 -1939900 -2668923 -2780432 -2450830 -2029383 -1676752 -1319737
31326 -1319737 -910594 -551118 -224403 378050 1385947 2197522 1937411 619038 -669294
31317 -669294 -1037214 -758146 -542300 -351513 366927 1539781 2362600 2349844 1801005 1104830
31307 1104830 258766 -630034 -979594 -405931 534602 800950 47711 -980965 -1311860
31298 -1311860 -836237 -439257 -1005988 -2320063 -3131707 -2498407 -898483 307520 444853
31289 444853 137031 304083 1027950 1689508 1879225 1763545 1681151 1741601 1836919 1796726
31279 1796726 1471809 832361 58407 -569129 -944906 -1263906 -1806664 -2601816 -3342282
31270 -3342282 -3637458 -3294877 -2360116 -1041192 270202 1061663 1082788 660679 377594
31261 377594 459002 783199 1390484 2405805 3368164 3370816 2279551 1145583 786552 556294
31251 556294 -598538 -2260090 -2805623 -1544917 385888 1467786 1310846 464296 -480348
31242 -480348 -1137721 -1261529 -927259 -494272 -173305 20664 -141861 -938127 -1950538
31233 -1950538 -2212603 -1448871 -495209 -49995 303953 1232440 2415361 2945279 2586519
31224 2586519 1909243 1417803 1216961 1348240 1780996 2143355 2038326 1580789 1148772
31215 1148772 751980 203096 -217399 60037 1002455 1863037 2107504 1957752 1855439
31206 1855439 1847862 1739996 1500754 1265741 1158841 1267741 1576232 1796638 1523316 744094
31196 744094 4998 -169081 62532 -20003 -891394 -2230238 -3224365 -3324107 -2588288 -1387448
31186 -1387448 -37302 1217792 2203806 3053958 4136161 5370689 5946446 5294722 4093896
31177 4093896 3521213 3588708 3159518 1757837 328001 -236388 -315757 -644833 -1094925
31168 -1094925 -1292817 -1678278 -2761316 -3763226 -3257558 -1128278 1135628 2162024 1856395
31159 1856395 842650 -306531 -1075110 -1090500 -606821 -372313 -736250 -1279798 -1435173
31150 -1435173 -1041977 -262345 562932 937929 592757 -106120 -547524 -590381 -407706 137449
31140 137449 1203137 2203335 2293736 1732888 1790523 2968302 4180816 4185281 3112256
31131 3112256 2045958 1650778 1726259 1668132 922287 -605580 -2191631 -2741443 -1970039
31122 -1970039 -774552 -139344 -98824 -85534 191514 619435 993530 1037276 491938 -429321
31112 -429321 -1063935 -1149274 -1221061 -1736388 -2253416 -2063135 -1320385 -900702 -1218397 -1711318
31102 -1711318 -1564078 -647868 321933 498480 -146198 -663056 -226407 710523 920045
31093 920045 79103 -795998 -820147 -321992 11185 255203 774602 1278025 1271011 1053690
31083 1053690 1307928 1874419 1881745 1111670 373915 326909 659527 789705 816651 1291612
31073 1291612 2285129 3128582 3152534 2478799 1893424 1918687 2244989 2305168 2150651 2244358
31063 2244358 2502634 2284059 1493431 911139 1001430 1099603 387596 -893162 -1884253 -2296766
31053 -2296766 -2422715 -2347625 -1972944 -1613762 -1772058 -2344538 -2675966 -2346399 -1404801 -43995
31043 -43995 1330448 1945054 1358879 246999 -274858 -93532 -97102 -699018 -1229952 -1059773
31033 -1059773 -527467 -277494 -256810 36724 609235 852741 402431 -226206 -74970 1160471
31023 1160471 2621889 3143664 2620861 2116094 2427690 3046789 2935354 1889191 579881
31014 579881 -387597 -812116 -581360 225138 996343 1010561 218883 -819082 -1579305 -1666595
31004 -1666595 -675270 1213962 2746547 2690648 1424982 514120 633158 876742 339199
30995 339199 -608755 -1077034 -875915 -394828 170839 890825 1709970 2399863 2737812 2604836
30985 2604836 2153931 1854852 1985353 2160857 1863108 1289120 1013201 949724 515153 -209166
30975 -209166 -490783 -263347 -318084 -806876 -693907 615489 2062000 2218325 1097178
30966 1097178 -167326 -856338 -989273 -569058 483789 1747960 2487201 2531384 2447111
30957 2447111 2748908 3300352 3550260 3145423 2297787 1603009 1395998 1338497 876206 -29604
30947 -29604 -1002120 -1857599 -2509443 -2495453 -1506088 -336495 -229457 -1090703 -1508821 -898610
30937 -898610 -362150 -806321 -1509524 -1520060 -1303870 -1741676 -2393605 -2190433 -1279448 -764784
30927 -764784 -923311 -994689 -579913 -17314 560682 1344424 1950028 1528268 20737 -1581616
30917 -1581616 -2480835 -2845474 -3163951 -3487763 -3512964 -2934165 -1683079 -244183 426604
30908 426604 -152285 -1291684 -1917750 -1773026 -1241701 -443971 588041 1179551 569490
30899 569490 -855151 -1868655 -1949852 -1618275 -1321314 -1004555 -766427 -845164 -853417 -105838
30889 -105838 1125175 1748555 1442779 1013881 947653 793631 337274 129442 308502 128033
30879 128033 -633789 -994771 -407704 40136 -760419 -1996722 -1948306 -440058 1040269
30870 1040269 1468267 1289378 1232569 1209537 780374 6524 -617170 -756675 -461091 74575
30860 74575 771272 1612589 2325629 2352448 1483371 374371 -101354 503 -174571 -954174
30850 -954174 -1717026 -1996955 -2121799 -2311801 -2031372 -950179 164734 353822 -245045
30841 -245045 -814872 -1117205 -1456977 -1704997 -1288669 -131872 1081150 1571920 949598
30832 949598 -705545 -2661277 -3741248 -3444476 -2689578 -2747681 -3591488 -4035259 -3385307
30823 -3385307 -2131781 -994930 -124794 548985 891248 823196 538805 209701 -175134
30814 -175134 -565843 -820583 -966191 -1073581 -844707 175586 1838401 3291241 3840565
30805 3840565 3589931 3087674 2654514 2191379 1401161 126653 -1319244 -2199858 -2020269
30796 -2020269 -1101960 -195840 366500 749090 974714 770848 116950 -544419 -798398
30787 -798398 -611898 -128737 522758 1141797 1511982 1611427 1504237 1098431 350037 -447646
30777 -447646 -1039491 -1683583 -2628761 -3287746 -2793937 -1433558 -558883 -751943 -1003165
30768 -1003165 -274387 950863 1461404 1047339 524635 385495 365184 274641 391941 835437
30758 835437 1198964 1133808 914330 1130745 1987498 3069459 3724929 3633544 3038524 2379516
30748 2379516 1723517 802553 -319354 -1026070 -921198 -498544 -585711 -1298628 -1995400
30739 -1995400 -2112113 -1546946 -361127 1231161 2500885 2509085 1100357 -839087 -2352386
30730 -2352386 -3185666 -3376427 -2747212 -1422210 -370084 -577883 -1768867 -2680755 -2660605
30721 -2660605 -2263532 -2112453 -1962897 -1376719 -687825 -587230 -1062863 -1434903 -1307744
30712 -1307744 -870621 -337568 250334 636050 470780 53010 282765 1455671 2606662
30703 2606662 2581795 1444917 297289 -86428 104502 349618 483639 591658 640691
30694 640691 546899 495956 903429 1875252 2758309 2547114 1026104 -713799 -1404830 -1177203
30684 -1177203 -1329864 -2401433 -3310394 -2923448 -1723971 -1108610 -1538024 -2303376 -2770706
30675 -2770706 -2807077 -2125286 -393050 1771191 2942058 2495317 1342244 680146 728039
30666 728039 1104758 1685211 2457285 3113962 3441841 3683717 3948966 3728960 2634214
30657 2634214 1185506 166586 -423738 -959495 -1053583 105347 2221001 3691539 3368142
30648 3368142 1871258 723491 623903 988279 869934 -67851 -1326364 -2018111 -1631857
30639 -1631857 -524854 427892 696299 407924 -142345 -820983 -1316174 -1016003 236500
30630 236500 1529748 1638371 411617 -1062716 -1750355 -1663591 -1399578 -1180547 -781602
30621 -781602 -160063 322796 294453 -336949 -1450012 -2726084 -3585628 -3503196 -2558209 -1404118
30611 -1404118 -545314 79052 639270 921376 670568 219559 306452 1194230 2226259
30602 2226259 2363528 1134171 -845794 -2230854 -2054632 -690354 458376 392035 -585999
30593 -585999 -1548080 -2078652 -2326158 -2338854 -2021973 -1609444 -1535477 -1841240 -2222006 -2583163
30583 -2583163 -2985787 -3147722 -2683001 -1813316 -1129830 -667625 -36825 521194 261050
30574 261050 -626234 -822615 320338 1829134 2647568 3066888 3627650 3588706 1952349
30565 1952349 -467491 -1553480 -529195 1129341 1641468 759506 -610755 -1685758
30557 -1685758 -2254599 -2529210 -2977460 -3876295 -4803019 -4982662 -4229271 -3068581 -1945124
30548 -1945124 -964148 -445210 -864886 -1931908 -2508941 -1956165 -953990 -510398 -729542
30539 -729542 -1113622 -1516750 -2043229 -2342123 -1842341 -683558 245439 357641 35551
30530 35551 85452 791485 1656638 1957825 1483593 746297 436503 697834 1083078 1173227
30520 1173227 943106 494014 -156896 -832424 -1152087 -1052333 -1009209 -1354761 -1663481 -1308240
30510 -1308240 -467729 -61491 -674570 -1962627 -3167043 -3841342 -3976141 -3751066 -3347233
30501 -3347233 -2810218 -1985736 -760069 569227 1370427 1254804 456260 -420060 -857886
30492 -857886 -584554 444123 1921632 3158795 3524067 3065309 2545822 2711150 3548984
30483 3548984 4342938 4416077 3770479 3058093 2975791 3583939 4132075 3721787 2338355 1047790
30473 1047790 824412 1302541 1206102 67575 -1096493 -1118095 -102770 976962 1619236
30464 1619236 2017687 2235466 1970741 1166427 199190 -615466 -1146212 -1063507 -21775
30455 -21775 1586310 2676048 2569317 1603658 488846 -383389 -771795 -392661 635764
30446 635764 1606064 1933403 1740871 1424994 1048367 539255 105508 24974 305992 862184
30436 862184 1673933 2504201 2915026 2894377 2936587 3122057 2788763 1708039 886262 1313988
30426 1313988 2418214 2764352 2004913 1108584 810161 899465 1068141 1376800 1608375
30417 1608375 1104900 -288013 -1770891 -2480043 -2330866 -1741894 -1079049 -629060 -576165
30408 -576165 -709095 -594801 -224003 8794 77311 414821 993989 1021958 -1973 -1459582
30398 -1459582 -2290038 -2087132 -1204656 -246951 195500 -206499 -1115666 -1742004 -1763942 -1624587
30388 -1624587 -1709511 -1829437 -1807804 -1868710 -2008230 -1731091 -980781 -565258 -947565 -1387263
30378 -1387263 -1165787 -880612 -1343619 -1823605 -867607 1362192 3094461 3396829 3171825
30369 3171825 3331471 3340736 2305630 478852 -1157044 -2102708 -2406075 -2118049 -1431733
30360 -1431733 -935580 -1037411 -1393996 -1402660 -954317 -285852 510110 1340899 1858707 1864217
30350 1864217 1640429 1424448 945326 14516 -863494 -1140427 -1112359 -1399435 -1845270 -1817934
30340 -1817934 -1425333 -1412124 -1783960 -1587231 -432644 657541 494189 -838990 -2353311
30331 -2353311 -3376321 -3753535 -3350362 -2225486 -1102568 -812781 -1196728 -1264621 -613178
30322 -613178 -27188 -362000 -1406415 -2334791 -2860120 -3317927 -3812748 -3980716 -3701584
30313 -3701584 -3463275 -3708200 -4186664 -4307331 -3904605 -3323845 -2883196 -2571766 -2226797
30304 -2226797 -1750366 -1176766 -694683 -485798 -363385 191441 1317052 2360389 2660946
30295 2660946 2524388 2760446 3363270 3481693 2801886 2024784 1600097 947829 -359174
30286 -359174 -1464714 -1265341 -48579 948781 1284844 1522232 1871632 1822724 1252194
30277 1252194 795708 802370 861070 671091 400575 -197923 -1887972 -4436235 -6039229
30268 -6039229 -5339907 -3333201 -2119350 -2204932 -2245698 -1273445 89769 836249 922942
30259 922942 947739 1184565 1432173 1423957 1070158 580921 467271 1039882 1817901 1893214
30249 1893214 1025981 -87785 -807407 -1273658 -1835295 -2262094 -2068168 -1383094 -958056
30240 -958056 -1251609 -1822264 -1755063 -597633 1167658 2543617 2867664 2210771 1046531
$$ [...]
##END NTUPLES=NMR SPECTRUM
##END=
