##TITLE=31Pdec_41-2021
 CDCl3, 24 sc
 11.06.2021
##JCAMPDX= 6.0         $$ Bruker NMR JCAMP-DX V2.0
##DATA TYPE= NMR SPECTRUM
##DATA CLASS= NTUPLES
##ORIGIN= UXNMR, Bruker Analytische Messtechnik GmbH
##OWNER= root
$$ XWIN-NMR		Version 3.5
$$ Fri Jun 11 11:01:29 2021 Russian Standard Time (UT+4h)  she@DPX200
##.OBSERVE FREQUENCY= 81.013821
##.OBSERVE NUCLEUS= ^31P
##.ACQUISITION MODE= SIMULTANEOUS
##.ACQUISITION SCHEME= undefined
##.AVERAGES= 24
##.DIGITISER RES= 16
##SPECTROMETER/DATA SYSTEM= spect
##.PULSE SEQUENCE= zgpg30
##.SOLVENT NAME= CDCl3
##.SHIFT REFERENCE= (INTERNAL, CDCl3, 0, 248.564)
##AUDIT TRAIL= $$ (NUMBER, WHEN, WHO, WHERE, WHAT)
$$ ##TITLE= Audit trail, XWIN-NMR		Version 3.5
$$ ##JCAMPDX= 5.01
$$ ##ORIGIN= Bruker BioSpin GmbH
$$ ##OWNER= she
$$ F:/spectra/data/she/nmr/P31/1/pdata/1/auditp.txt
$$ ##AUDIT TRAIL=  $$ (NUMBER, WHEN, WHO, WHERE, WHAT)
(   1,<2021-06-11 11:00:19.90 +0400>,<she>,<DPX200>,
      <created by zg, POWCHK disabled, PULCHK disabled
       configuration hash MD5:
       00 E9 B6 7A A2 85 ED C7 34 08 36 98 17 FE 4E 26
       data hash MD5: 32K
       6E 9A 20 B0 99 A5 3D 36 1B CE 74 86 95 60 14 67>)
(   2,<2021-06-11 11:00:24.76 +0400>,<she>,<DPX200>,
      <Start of raw data processing
       efp BC_mod = 2 LB = 1 FT_mod = 6 PKNL = 1 PHC0 = -5642.319 PHC1 = -491.7251 SI = 64K 
       data hash MD5: 64K
       9D A1 4E 4C 97 22 DD DC 4E 04 46 D2 95 D1 CC DC>)
(   3,<2021-06-11 11:00:56.89 +0400>,<she>,<DPX200>,
      <pk PHC0 = -29.18257 PHC1 = 136.6 
       data hash MD5: 64K
       22 01 60 76 EB D6 28 24 C6 17 B7 D9 E4 B4 A3 50>)
(   4,<2021-06-11 11:01:00.51 +0400>,<she>,<DPX200>,
      <abs ABSG = 5 
       data hash MD5: 64K
       7A FE 5D 0C 04 42 69 35 FC B5 73 62 81 DD D2 AA>)
$$ ##END=
$$ 
$$ hash MD5
$$ C0 AB D1 8A FD B2 71 9B C3 8A 27 21 3C E8 58 CC
##$RELAX= 
##$RELAX= 
##$RELAX= 
##$RELAX= 
##$RELAX= 
##$RELAX= 
##$RELAX= 
##$RELAX= 
$$ Bruker specific parameters
$$ --------------------------
##$DU= <F:/spectra>
##$EXPNO= 1
##$NAME= <P31>
##$PROCNO= 1
##$TYPE= <nmr>
##$USER= <she>
##$AMP= (0..31)
100 100 100 100 100 100 100 100 100 100 100 100 100 100 100 100 100 100 
100 100 100 100 100 100 100 100 100 100 100 100 100 100 
##$AQSEQ= 0
##$AQ_mod= 1
##$AUNM= <au_zg>
##$AUTOPOS= <>
##$BF1= 81.014009
##$BF2= 200.13
##$BF3= 200.13
##$BF4= 200.13
##$BF5= 200.13
##$BF6= 200.13
##$BF7= 200.13
##$BF8= 200.13
##$BYTORDA= 1
##$CFDGTYP= 0
##$CFRGTYP= 5
##$CHEMSTR= <none>
##$CNST= (0..31)
1 1 145 1 1 1 1 1 1 1 1 1 1 1 1 1 1 1 1 1 1 1 1 1 1 1 1 1 1 1 1 1 
##$CPDPRG= <waltz16>
##$CPDPRG1= <>
##$CPDPRG2= <waltz16>
##$CPDPRG3= <>
##$CPDPRG4= <mlev>
##$CPDPRG5= <mlev>
##$CPDPRG6= <mlev>
##$CPDPRG7= <mlev>
##$CPDPRG8= <mlev>
##$CPDPRGB= <>
##$CPDPRGT= <>
##$D= (0..31)
0 1 0 0 0 0 0 0 0 0 0 0.03 2e-05 3e-06 0 0 0 0 0 0 0 0 0 0 0 0 0 0 0 0 
0 0 
##$DATE= 1623394819
##$DBL= (0..7)
120 120 120 11 120 120 24 19 
##$DBP= (0..7)
150 150 150 150 150 150 150 150 
##$DBP07= 0
##$DBPNAM0= <>
##$DBPNAM1= <>
##$DBPNAM2= <>
$$ [...]
##$SUBNAM3= <"">
##$SUBNAM4= <"">
##$SUBNAM5= <"">
##$SUBNAM6= <"">
##$SUBNAM7= <"">
##$SUBNAM8= <"">
##$SUBNAM9= <"">
##$SW= 501.771253377433
##$SWIBOX= (0..15)
0 1 3 0 0 0 0 0 0 0 0 0 0 0 0 0 
##$SW_h= 40650.406504065
##$TD= 32768
##$TD0= 1
##$TE= 0
##$TE2= 300
##$TE3= 300
##$TEG= 300
##$TL= (0..7)
0 120 53 12 22 120 120 120 
##$TP= (0..7)
150 150 150 150 150 150 150 150 
##$TP07= 0
##$TPNAME0= <>
##$TPNAME1= <>
##$TPNAME2= <>
##$TPNAME3= <>
##$TPNAME4= <>
##$TPNAME5= <>
##$TPNAME6= <>
##$TPNAME7= <>
##$TPOAL= (0..7)
0.5 0.5 0.5 0.5 0.5 0.5 0.5 0.5 
##$TPOFFS= (0..7)
0 0 0 0 0 0 0 0 
##$TUNHIN= 0
##$TUNHOUT= 0
##$TUNXOUT= 0
##$USERA1= <user>
##$USERA2= <user>
##$USERA3= <user>
##$USERA4= <user>
##$USERA5= <user>
##$V9= 5
##$VALIST= <valist>
##$VCLIST= <CCCCCCCCCCCCCCC>
##$VD= 0
##$VDLIST= <DDDDDDDDDDDDDDD>
##$VPLIST= <PPPPPPPPPPPPPPP>
##$VTLIST= <TTTTTTTTTTTTTTT>
##$WBST= 1024
##$WBSW= 4
##$XGAIN= (0..3)
0 0 0 0 
##$XL= 0
##$YL= 0
##$YMAX_a= 5108
##$YMIN_a= -5303
##$ZGOPTNS= <>
##$ZL1= 120
##$ZL2= 120
##$ZL3= 120
##$ZL4= 120
##$ABSF1= 248.5645
##$ABSF2= -253.2056
##$ABSG= 5
##$ABSL= 3
##$ALPHA= 0
##$AQORDER= 0
##$ASSFAC= 0
##$ASSFACI= 0
##$ASSFACX= 0
##$ASSWID= 0
##$AUNMP= <proc_1d>
##$AZFE= 0.1
##$AZFW= 0.5
##$BCFW= 0
##$BC_mod= 2
##$BYTORDP= 0
##$COROFFS= 0
##$CY= -3
##$DATMOD= 1
##$DC= 0
##$DFILT= <>
##$DTYPP= 0
##$F1P= 0
##$F2P= 0
##$FCOR= 1
##$FTSIZE= 65536
##$FT_mod= 6
##$GAMMA= 0
##$GB= 0
##$INTBC= 1
##$INTSCL= 5.30512e-09
##$ISEN= 30
##$LB= 1
##$LEV0= 0
##$LPBIN= 0
##$MAXI= 10000
##$MC2= 0
##$MEAN= 0
##$ME_mod= 0
##$MI= 50
##$NCOEF= 0
##$NC_proc= -4
##$NLEV= 6
##$NOISF1= 182.463
##$NOISF2= 159.3651
##$NSP= 0
##$NTH_PI= 0
##$NZP= 0
##$OFFSET= 248.5645
##$PC= 4
##$PHC0= -5671.501
##$PHC1= -355.1251
##$PH_mod= 1
##$PKNL= yes
##$PPARMOD= 0
##$PSCAL= 0
##$PSIGN= 0
##$REVERSE= no
##$SF= 81.014009
##$SI= 65536
##$SIGF1= 159.3651
##$SIGF2= -187.1042
##$SINO= 113.3802
##$SIOLD= 16384
##$SREGLST= <1H.CDCl3>
##$SSB= 0
##$STSI= 65536
##$STSR= 0
##$SW_p= 40650.406504065
##$SYMM= 0
##$S_DEV= 0
##$TDeff= 32768
##$TDoff= 0
##$TI= <>
##$TILT= no
##$TM1= 0
##$TM2= 0
##$TOPLEV= 0
##$USERP1= <user>
##$USERP2= <user>
##$USERP3= <user>
##$USERP4= <user>
##$USERP5= <user>
##$WDW= 1
##$XDIM= 65536
##$YMAX_p= 304122081
##$YMIN_p= -1225496
$$ End of Bruker specific parameters
$$ ---------------------------------
##NTUPLES= NMR SPECTRUM
##VAR_NAME=  FREQUENCY,     SPECTRUM/REAL,   SPECTRUM/IMAG
##SYMBOL=    X,             R,               I
##VAR_TYPE=  INDEPENDENT,   DEPENDENT,       DEPENDENT
##VAR_FORM=  AFFN,          ASDF,            ASDF
##VAR_DIM=   65536,         65536,           65536
##UNITS=     HZ,            ARBITRARY UNITS, ARBITRARY UNITS
##FACTOR=    0.620285442955139, 1,           1
##FIRST=     20137.2065510759, 0,            0
##LAST=      -20513.1999529892, 0,           0
##MIN=       -20513.1999529892, -1225496,    0
##MAX=       20137.2065510759, 304122081,    0
$$ Real data points
##PAGE= N=1
##DATA TABLE= (X++(R..R)), XYDATA
$$ [...]
41732 -172189 81923 359833 411915 167780 -134894 -321722 -456508 -527601 -329188 139026
41722 139026 482725 390257 53392 -147323 -159880 -182111 -243997 -194515 -28669 77194
41712 77194 64172 77793 204210 316496 277361 159504 141024 240462 283428 153395 -31353
41701 -31353 -86731 -46802 -115458 -316034 -389270 -163881 148952 232863 106807 34285 71310
41690 71310 9736 -217455 -381656 -311855 -148907 -101719 -150545 -160742 -140083 -196651 -319760
41679 -319760 -364231 -235640 1470 188491 207061 81885 -38036 -47073 -12304 -60259 -180115
41668 -180115 -266908 -322440 -438862 -584114 -597928 -445267 -298427 -307135 -437363 -579073
41658 -579073 -654819 -592087 -373063 -149826 -106822 -164820 -54057 255747 468688 415214
41648 415214 302877 342264 401747 271305 33202 -100768 -128645 -154050 -111082 103257
41638 103257 347673 391545 259462 139282 52485 -76539 -132754 37013 243817 141875
41628 141875 -189956 -276980 48285 391373 413673 297166 325352 366262 160468 -117945
41618 -117945 -42546 391924 690876 515250 92892 -144605 -87188 54284 100069 55391
41608 55391 -16439 -95187 -161454 -166806 -93255 7740 64692 43492 -53014 -191281 -284256
41597 -284256 -222313 2391 232124 285200 153180 -19037 -126087 -159473 -87637 140257
41587 140257 412130 468220 232451 -34367 -79892 -3825 -44988 -175490 -194939 -127790 -177903
41576 -177903 -315783 -299016 -154494 -216876 -524518 -602843 -150076 416327 495135 124448
41566 124448 -182083 -247773 -361516 -633121 -764090 -594799 -412110 -469623 -567334 -404752
41556 -404752 -83006 61639 -53327 -227299 -302692 -246656 -28544 289763 429764 183298
41546 183298 -207132 -276881 33710 299116 214953 -45188 -201257 -259767 -317331 -266836
41536 -266836 -15398 200721 75837 -283620 -486395 -433403 -403146 -513256 -484367 -134298
41526 -134298 213665 135529 -256099 -439940 -225455 -18346 -222538 -643493 -742532 -382606
41516 -382606 -30505 -139268 -552311 -728203 -458243 -93586 -21749 -187621 -308665 -349561
41506 -349561 -488767 -707364 -751636 -548196 -354125 -372026 -468437 -437837 -325554 -282267
41496 -282267 -276921 -194041 -89024 -91599 -131221 -13333 254778 440101 386287 155464 -108009
41485 -108009 -264592 -173218 166681 477257 454879 181147 36560 177561 368819 386057
41475 386057 280292 131457 -140353 -521142 -738579 -604880 -318870 -177316 -166873 -104444
41465 -104444 -14582 -57580 -181559 -155445 79891 343031 464969 396582 130892 -239041
41455 -239041 -448745 -318964 -45542 33513 -88309 -146382 -90974 -138015 -311398 -345088
41445 -345088 -161165 -53097 -201246 -365408 -304388 -169316 -174511 -170983 74542 386924
41435 386924 383724 56928 -245156 -363499 -460021 -598902 -597263 -392452 -205532 -178106 -139896
41424 -139896 68174 290656 312680 223182 249231 346826 255819 -54809 -278684 -193318 21696
41413 21696 33205 -202778 -412101 -375471 -174990 -34625 -32340 -61958 -31852 3518 -68294
41402 -68294 -264870 -490492 -642771 -693480 -666598 -576428 -419158 -222043 -61653 7342
41392 7342 28228 89259 186867 214043 117580 -14858 -81603 -89080 -60965 65655 304862
41381 304862 471083 371582 120317 31267 173058 261591 75285 -238418 -391182 -302316
41371 -302316 -81297 169728 371391 418132 287252 111394 10294 -53741 -139832 -182855
41361 -182855 -130050 -91062 -179064 -308922 -316013 -169094 76505 377575 577335 391570
41351 391570 -195718 -693761 -617904 -142565 136938 38942 -41339 161131 376661 292551
41341 292551 60127 15664 147410 154587 -85822 -379588 -506966 -462589 -392365 -394486 -406809
41330 -406809 -288474 -37552 136562 66289 -122436 -187566 -132819 -146576 -216819 -129882 97321
41319 97321 133128 -168054 -487949 -478568 -221899 -21966 49181 138662 299892 443748 504740
41308 504740 459040 280457 47838 -34904 97539 233185 191983 101311 135785 163568 -46006
41297 -46006 -387650 -528362 -394178 -220537 -130134 4919 227957 342111 218636 16657
41287 16657 -59568 -43507 -86036 -177707 -164138 483 155445 130309 -19583 -54018 137946
41276 137946 340382 262208 -40950 -209299 -98016 6108 -146949 -343008 -230810 109910
41266 109910 288895 203793 125986 182460 156031 -70007 -224841 -45463 281919 354412
41256 354412 110443 -105562 -26607 197202 224306 -22750 -258150 -208933 17481 73140
41246 73140 -151325 -377405 -333011 -92784 120378 273829 434235 498340 317870 15117
41236 15117 -141038 -148896 -244933 -450437 -491389 -256091 -2412 43110 2196 65561 147729
41225 147729 66147 -109716 -146874 844 147976 145500 33592 -49011 603 164608 275253
41214 275253 146265 -182436 -427899 -399154 -248352 -244267 -374741 -362956 -77487 254828
41204 254828 332011 164485 46097 149791 293274 206813 -59202 -187476 -57123 84507
41194 84507 26822 -67623 42371 238944 214923 -28422 -200760 -199742 -204723 -274584 -234421
41183 -234421 -60715 -8919 -188302 -340811 -256761 -118509 -181978 -362795 -408410 -285212
41173 -285212 -128490 25851 193893 267804 150133 -43337 -149263 -206958 -302598 -295295
41163 -295295 3883 450980 671257 538093 290589 160648 124419 67042 -19982 -88279
41153 -88279 -136947 -195334 -274641 -349328 -335152 -139333 184626 407220 357716 118588 -119066
41142 -119066 -298423 -464451 -585347 -563461 -367651 -46764 295620 455346 237452 -233040
41132 -233040 -509174 -348199 -48964 -8852 -154227 -155563 -26792 -64929 -271171 -312743
41122 -312743 -99136 54432 -47589 -193851 -156587 -10066 112265 243874 379843 369243
41112 369243 228753 247773 519564 668210 373189 -78452 -152634 172222 418957 334073
41102 334073 182140 242916 377260 299561 54350 -43641 116820 263085 105129 -263463
41092 -263463 -485562 -416845 -283405 -300721 -351267 -230869 -37843 -16218 -104004 -7779 261088
41081 261088 327706 53941 -198606 -130366 40399 7873 -57174 184343 570252 591488
41071 591488 186833 -104436 104524 542636 712307 507597 169591 -130268 -376775 -512936
41061 -512936 -446899 -251003 -133594 -160416 -158508 31575 331010 557339 699197 897336
41051 897336 1154874 1246466 1018177 641473 403303 328291 215662 14279 -88977 4210
41041 4210 136165 151504 94911 23233 -144251 -405362 -527489 -359533 -111951 -67732 -176203
41030 -176203 -217325 -206569 -286666 -345754 -168959 74106 -40034 -508604 -813029 -664166
41020 -664166 -404646 -433177 -627097 -661036 -564495 -559295 -574077 -363744 -6086 140434 -31394
41009 -31394 -237922 -229441 -59450 113158 222606 237502 141240 36859 64051 163767 136837
40998 136837 -21610 -84582 40426 157710 110946 28733 89462 244387 345241 372297
40988 372297 363107 281133 140801 105489 257495 413207 380232 255978 232783 251756 142405
40977 142405 -9402 23908 187638 203372 52235 21065 210227 379593 391514 407789
40967 407789 473387 322664 -118071 -421410 -241151 98521 49960 -334145 -521657 -331236
40957 -331236 -119820 -144371 -246095 -268868 -322788 -451557 -449600 -248601 -139544 -334451
40947 -334451 -584869 -525388 -183081 129991 252005 235301 138044 19521 8258 119503
40937 119503 136577 -70483 -257579 -139131 124493 129748 -150760 -332224 -197832 62118
40927 62118 240573 363896 436798 308954 2383 -139990 94220 405869 345666 -72794
40917 -72794 -394223 -294531 103852 468853 600189 506386 308088 142865 91898 137537
40907 137537 188801 145555 -38611 -295990 -456951 -412939 -268266 -218607 -277409 -273139 -139234
40896 -139234 -16386 -2251 -12225 -2002 -96735 -313631 -380561 -104666 241135 228222 -112167
40885 -112167 -329462 -204495 -7226 -21057 -141620 -134081 -39565 -78921 -280547 -431660
40875 -431660 -364625 -132026 99673 226013 264923 291324 316334 250346 43862 -172394
40865 -172394 -217024 -120532 -85869 -154437 -125355 87545 243533 118261 -119623 -140849 42039
40854 42039 108275 -57956 -205494 -140015 -16477 -48012 -159944 -160334 -95227 -167835 -372774
40843 -372774 -481406 -407959 -342796 -434253 -546125 -475460 -259175 -89452 -24695 23097 67951
40832 67951 27216 -77500 -103522 -28451 -22239 -183653 -368493 -401217 -310983 -214915 -107643
40821 -107643 53908 182739 200896 246410 470654 682631 520108 15857 -337036 -221870
40811 -221870 89551 162578 -9045 -105048 -1460 117558 109779 53535 53384 78587 45949
40800 45949 -70200 -225066 -296026 -134268 227282 469128 293657 -156994 -399943 -183061
40790 -183061 222869 379606 169187 -169051 -349920 -267689 -2706 265620 376027 298691
40780 298691 141209 34505 34608 108175 148824 40487 -199054 -369348 -304231 -106939 -13222
40769 -13222 -44650 -6554 150865 219309 78633 -80720 -46725 95403 132053 59339 32655
40758 32655 79017 79230 -21171 -177637 -367728 -551541 -568776 -306518 44221 142869 -47033
40747 -47033 -184294 -19485 262998 316450 104292 -79049 -13380 181521 228381 57337
40737 57337 -99386 -4838 243794 280339 -89490 -615735 -867668 -698706 -338028 -81925
40727 -81925 -39621 -159923 -344310 -485887 -500569 -377542 -172043 31846 118726 -8210
40717 -8210 -275220 -426806 -309048 -83140 12372 20091 150428 370151 402692 168398 -67000
40706 -67000 -72837 79415 236711 382819 478002 339664 -81898 -487761 -538977 -283783
40696 -283783 -76493 -144672 -397886 -588266 -518900 -177086 210669 344784 178198 -35912
40686 -35912 -98081 -79586 -75410 13723 248039 423702 342676 127045 2983 -40531 -93027
40675 -93027 -40155 196529 332860 74554 -340940 -438288 -251009 -238950 -483850 -563592
40665 -563592 -318838 -133189 -235514 -303831 -83188 126201 2039 -227478 -207931 -91482
40655 -91482 -241554 -574413 -708596 -592681 -499044 -516517 -505705 -462974 -485242 -448145 -166830
40644 -166830 167332 164351 -150868 -346999 -245436 -134663 -243734 -419644 -463939 -423140
40634 -423140 -390224 -332124 -253488 -244941 -261461 -148900 26677 20722 -119232 -24356 381127
40623 381127 647257 438416 29199 -157479 -166331 -278172 -438869 -366244 -70393 159684
40613 159684 213847 225710 225198 94156 -122060 -193006 -51340 106763 128613 79395 53302
40602 53302 27035 -19763 -9030 131169 376737 648084 837626 817716 559886 234474
40592 234474 53916 33481 41606 43018 116292 254472 344394 360013 401850 517903 634832
40581 634832 678437 623224 447475 213547 153806 434259 820948 856908 456181 54950
40571 54950 23594 176151 94081 -240770 -432148 -241848 99041 226159 101772 -3964
40561 -3964 81704 206502 125969 -133700 -283791 -146184 132374 314044 368017 389775 353218
40550 353218 164372 -100842 -255119 -281381 -306301 -287195 -29096 398620 587892 339357
40540 339357 14612 57246 355759 426306 134942 -135873 -72388 159183 220671 56292
40530 56292 -152528 -295442 -368075 -316598 -101934 112173 85365 -140758 -239376 -58735
40520 -58735 127034 7591 -294639 -400319 -224884 -56465 -86111 -170942 -154494 -132149
40510 -132149 -227240 -338565 -318812 -219321 -146024 -45785 130148 220140 93347 -36974
40500 -36974 136582 529068 754304 667807 494606 424253 410227 396522 410748 375515 150702
40489 150702 -164028 -286754 -182297 -95374 -92345 14905 164122 -44656 -655276 -1042708
40479 -1042708 -711123 -40310 245994 79653 -21853 151495 271360 122261 -67807
40470 -67807 -76944 -30723 -106976 -228283 -242687 -168737 -89360 13487 177093 351801 469544
40459 469544 495849 381983 128171 -84889 -30292 250804 468849 466401 358794 243136
40449 243136 42832 -226106 -304684 -28837 370812 541332 449260 328297 295896 267296
40439 267296 198741 173538 229595 286874 272715 172642 -44492 -381352 -666305 -640257 -280607
40428 -280607 106496 236099 179517 213123 407157 537610 412196 129070 -60805 -52955
40418 -52955 37093 48895 -59779 -207482 -275199 -197233 -22101 109043 86255 -58667 -190371
40407 -190371 -210100 -135038 -67283 -118440 -315650 -519239 -490436 -144310 298824 529673
40397 529673 489992 366467 286554 219430 186202 313860 567820 662725 432931 124121
40387 124121 89610 305819 428380 269421 -26768 -271210 -440073 -536945 -469267 -201694
40377 -201694 93486 181609 22721 -199716 -286086 -204259 -76813 -21288 -26092 -6851 31682
40366 31682 -24324 -212574 -383333 -373534 -230221 -138603 -159838 -172651 -79489 51640 86377
40355 86377 -20152 -195854 -316344 -290202 -152760 -79183 -216448 -479731 -603041 -437197
40345 -437197 -125529 75549 92238 66023 116895 185385 161537 85354 102293 241535 379360
40334 379360 452132 540548 652054 609273 340477 109670 179884 370210 305544 50276
40324 50276 48403 366766 485371 68468 -495004 -659420 -464249 -297812 -221225 -20687
40314 -20687 254785 334283 240298 275121 485523 587791 467753 326255 253574 87336
40304 87336 -179751 -264643 -55645 153402 111257 -23723 852 132290 186749 184421 246787
40293 246787 351888 437414 564059 731098 722484 425765 135062 194137 446530 423542
40283 423542 59993 -178066 18861 351838 369813 109443 -25647 112158 251050 169086
40273 169086 13453 5648 60558 -59463 -325286 -445706 -285296 -34889 83618 59937
40263 59937 -33857 -184185 -318815 -269633 -31546 131892 43336 -105264 -52569 120898
40253 120898 156491 51249 12039 62437 23464 -140312 -258142 -238806 -156572 -63114 37709
40242 37709 65403 -25023 -68370 80177 221917 77346 -199167 -195281 86216 209048 17820
40231 17820 -130346 4669 175076 131145 27999 61593 97877 -11282 -89263 40840
40221 40840 184978 83220 -160455 -299168 -374351 -568299 -799412 -825583 -644377 -468076
40211 -468076 -367261 -216422 41008 287601 370567 229205 -34794 -153059 69815 440119
40201 440119 532109 254125 -22643 -13415 139770 230670 300749 364758 243022 -30013 -51406
40190 -51406 322036 605726 391841 16667 -6011 160923 30129 -297720 -298911 50691
40180 50691 248941 123105 14362 72330 34971 -180529 -289406 -194409 -158424 -256324 -206850
40169 -206850 54049 169378 -33257 -231796 -164300 -27440 -51063 -120150 -103142 -123030
40159 -123030 -204418 -91223 245712 360130 -7779 -434305 -444812 -266484 -391155 -682137
40149 -682137 -574805 -42375 312092 187344 2379 174685 472851 423824 47160 -203959
40139 -203959 -110942 52520 -27540 -254946 -293523 -71896 108286 11514 -193366 -206665
40129 -206665 -60463 -32858 -149744 -108595 214005 496554 414226 109049 -31062 90426
40119 90426 219964 149451 -71318 -294208 -439667 -486451 -448356 -397992 -420061 -517825 -612711
40108 -612711 -621573 -503211 -278073 -39721 111820 173151 195618 142320 -60894 -291722
40098 -291722 -252823 138268 553841 638923 461927 366056 458476 504499 329247 77766
40088 77766 -13088 73619 171086 168563 93045 6339 -64697 -102590 -98855 -105647 -211550 -406050
40076 -406050 -520914 -402424 -131862 38251 1279 -66872 35741 253483 365359 279485
40066 279485 93556 -83798 -214097 -255724 -173217 -34552 38208 36964 66288 158812 214598
40055 214598 156096 40480 -20855 8282 50812 -22121 -237104 -390105 -207370 257593
40045 257593 554074 354611 -100768 -325824 -218439 -58548 20915 167034 408050 518411
40035 518411 381792 162878 15800 -79255 -112919 -17078 64371 -153144 -601266 -812036
40025 -812036 -564076 -204670 -90547 -94448 20016 110253 -48093 -279322 -284303 -177023
40015 -177023 -267344 -472736 -454900 -252593 -241656 -446507 -417234 65518 606301 723222
40005 723222 417921 12143 -276806 -358322 -137748 321841 654439 521320 62787 -218036
39995 -218036 -44682 348141 569172 533765 443938 418333 349444 153248 -38421 -77281
39985 -77281 -54799 -149968 -293073 -241429 5340 151526 48748 -92352 -79769 -41874 -122654
39974 -122654 -136814 147718 554092 680173 459410 200658 100933 57735 -8659 16414
39964 16414 182643 323587 321961 315294 456777 612040 489653 36928 -433503 -539151
39954 -539151 -202023 289065 581343 595313 514888 474158 390622 157712 -147645 -364483
39944 -364483 -440241 -408477 -293960 -165910 -150354 -238860 -231907 -48708 79393 -40062 -193464
39933 -193464 -63297 231834 279075 452 -262698 -312802 -327396 -424773 -404638 -129417
39923 -129417 163499 188755 22101 -60201 24671 153489 233295 242422 147251 -39107 -202734
39912 -202734 -271828 -309842 -353832 -309782 -148374 -35620 -84066 -132400 3702 196353 184535
39901 184535 -301 -79307 24146 73483 -86723 -286443 -302679 -180954 -129557 -216921
39891 -216921 -334182 -398772 -443117 -492330 -469675 -293978 -34548 108811 17853 -189785
39881 -189785 -281111 -172132 5125 102674 113347 80324 -26155 -228013 -419673 -471256
39871 -471256 -413592 -384034 -408411 -382939 -278426 -206210 -231588 -261903 -203493 -117271 -111720
39860 -111720 -157471 -123130 37913 229059 321801 259271 76663 -117216 -212992 -222515 -281261
39849 -281261 -441732 -519157 -285164 181982 483651 299912 -278487 -858277 -1112724 -1014890
39839 -1014890 -782178 -635547 -584395 -469516 -261068 -198128 -455918 -772632 -713252 -310292
39829 -310292 -73263 -238859 -410920 -204300 137520 168648 -23554 -18387 199031 269597
39819 269597 144511 129007 224305 70083 -310536 -365044 91195 442326 174977 -303252
39809 -303252 -292099 148246 378176 159715 -152589 -268456 -236183 -111749 117956 276362
39799 276362 137381 -151059 -221760 -79778 -86613 -323005 -451949 -310355 -156300 -173461
39789 -173461 -187658 -78501 -40628 -185074 -270681 -110504 104739 174038 232014 404780
39779 404780 451434 142943 -262780 -351711 -174093 -102842 -198200 -160292 119059 373805
39769 373805 377177 198632 -8949 -183169 -254210 -146723 45554 121957 69883 69099 157839
39758 157839 153350 -18021 -177998 -200153 -195030 -233780 -148461 155214 397141 240531 -199194
39747 -199194 -473579 -399358 -237697 -238529 -303233 -241259 -123989 -157771 -330471 -424088 -355040
39736 -355040 -294170 -402506 -600609 -677332 -531037 -238058 36619 134343 -6562 -265576
39726 -265576 -399726 -277875 -24487 138691 146722 102336 83853 65280 18831 -26184 -53400
39715 -53400 -88470 -124762 -111154 -55208 -49415 -136048 -226162 -231948 -212818 -279823 -382798 -328549
39703 -328549 -61100 184376 127538 -188477 -415499 -335117 -141858 -162633 -383208 -459619
39693 -459619 -211917 110560 169434 -22396 -168970 -102521 61731 157347 182382 241307
39683 241307 372759 488355 458010 255153 18334 -83791 -51537 -17963 -1926 127445
39673 127445 353937 392775 68495 -335870 -369021 6995 367501 345961 -3956 -366165
39663 -366165 -494798 -382370 -245422 -318416 -537953 -542358 -171830 193362 98434 -312001
39653 -312001 -481205 -239375 44282 125997 184950 320362 293145 54193 32763 479132
39643 479132 914359 736522 104363 -309986 -274987 -155829 -184242 -140111 140447 418294
39633 418294 417301 206781 22073 -53901 -66180 -46735 -40608 -104804 -171849 -83899 138906
39622 138906 247602 102305 -109702 -131653 35751 210821 300004 322717 266723 102144
39612 102144 -97357 -196613 -154744 -38967 89656 206129 268839 246673 188033 162922 142275
39601 142275 40990 -108041 -142379 4525 155656 72240 -240107 -503147 -472818 -214769
39591 -214769 -23986 -93940 -318020 -425770 -274286 24721 248868 297936 267717 307685
39581 307685 438628 538029 496130 345304 217835 207612 296172 384383 372071 242852 99360
39570 99360 67247 128661 121200 -34200 -190377 -167940 -12288 101479 163250 311909 520159
39559 520159 548049 317953 114216 223420 524497 650444 476211 229818 143862 204924
39549 204924 281555 321084 333922 301475 198683 51611 -93238 -211433 -264157 -183307 20064
39538 20064 169585 72024 -210152 -350308 -131803 239368 356852 138538 -69878 16630
39528 16630 248898 325965 251270 231616 249004 94081 -181495 -232870 39514 272014 171221
39517 171221 -35766 23338 270761 322158 108994 -29356 106523 275028 164984 -164276
39507 -164276 -375915 -269917 24631 223872 182273 21168 -33776 44935 26209 -248721
39497 -248721 -569130 -574360 -253366 -11941 -164116 -528034 -666915 -434201 -120011 -67330
39487 -67330 -273882 -436418 -334351 -86727 -889 -212024 -543050 -725820 -681421 -532301
39477 -532301 -404453 -308857 -201050 -71424 47016 114799 112556 60621 20024 44386 112233
39466 112233 123073 -6963 -226704 -353616 -255622 -33486 65043 -40261 -132178 23513
39456 23513 356522 588358 584469 447088 301616 177853 89061 39054 -43316 -181281 -191180
39445 -191180 91965 430850 362161 -150652 -581624 -531528 -230854 -117720 -214929 -250115
39435 -250115 -174105 -191332 -379043 -593638 -701643 -657414 -429951 -86995 140142 109450
39425 109450 -12074 -1945 84244 84401 63563 152812 208078 17704 -247526 -212978 103301
39414 103301 287873 136103 -139357 -323796 -409899 -351382 -54981 281569 276478 -30316
39404 -30316 -115137 277249 739682 813706 585853 359709 119964 -268115 -616154 -622729
39394 -622729 -366816 -194401 -216429 -265255 -259926 -282025 -343402 -372165 -382439 -402673 -313288
39383 -313288 -25148 263960 288805 135695 138078 384822 635167 709566 655504 516796
39373 516796 263472 4119 -49953 75326 109439 -21540 -51510 169437 374815 274260
39363 274260 8203 -71479 84290 216798 176826 66142 -3210 -30528 96 128814
39353 128814 260993 219514 30220 -45253 132651 368625 411934 291608 199352 157369
39343 157369 15588 -264195 -519076 -589454 -470811 -266951 -114436 -108319 -155093 14428
39333 14428 458909 746483 416487 -283393 -570597 -180860 229133 35273 -453238 -525751
39323 -525751 -151828 84447 -54489 -237418 -281204 -410660 -664270 -670771 -284917 90249
39313 90249 132027 63705 134617 111018 -246894 -600644 -489379 -101630 -2262 -241606 -330885
39302 -330885 -65840 203107 201267 115461 181482 305028 304032 205817 98802 -50471 -245861
39291 -245861 -354032 -320497 -285389 -319739 -260928 -11825 190117 62321 -276645 -425718
39281 -425718 -254477 -94666 -298044 -766475 -1059772 -914050 -516477 -236140 -197885 -234116
39271 -234116 -194766 -127414 -122015 -155253 -182284 -229182 -275074 -192883 40919 220776 179747
39260 179747 53347 67250 180821 183092 46307 -80202 -150723 -213235 -183939 46849 310868
39249 310868 307944 70611 -68415 -13396 -28924 -234515 -382587 -317251 -264001 -407910 -532783
39238 -532783 -402309 -217284 -325037 -666156 -874019 -798746 -592368 -366176 -103985 121773
39228 121773 165767 57754 -18775 -8137 -22975 -109156 -187607 -223589 -238335 -166206 61522
39217 61522 285170 229463 -94115 -338958 -270341 -47819 52156 -380 -52768 -41023 -16922
39206 -16922 8170 73058 150311 167257 154381 250685 501531 725591 682514 377010 100472
39195 100472 99084 271389 320175 162493 -491 -45481 -121562 -348121 -532261 -419851
39185 -419851 -100157 93834 23842 -159847 -320842 -467706 -576316 -551368 -432647 -403976
39175 -403976 -503941 -538157 -385139 -187376 -105251 -67295 66543 242900 306762 252897 193471
39164 193471 138301 3986 -168153 -185720 48452 378148 546214 446950 186910 -57084
39154 -57084 -190472 -229947 -236912 -257713 -309561 -368242 -358330 -223512 -41907 14709 -87998
39143 -87998 -146781 25936 322513 476911 436820 401285 485449 568232 542236 509372 598273
39132 598273 738500 762867 633498 434944 225502 24399 -116589 -158775 -163891 -229485
39122 -229485 -348728 -411396 -336738 -156916 16258 81404 34308 -23599 -3731 55098 60093
39111 60093 24213 35337 79743 53221 -30190 -15983 142667 286388 289129 233933 238967 260954
39099 260954 206283 111282 71251 83497 74461 -3321 -171880 -398115 -508078 -324087 19715
39088 19715 134511 -103460 -351743 -330339 -262217 -460317 -727919 -618694 -168543 116410
39078 116410 4243 -189187 -163796 -49602 -73952 -162355 -117945 37522 140913 151807
39068 151807 143852 147475 157922 200925 261497 239900 88637 -92540 -185075 -181132 -112270 33521
39056 33521 226395 334107 268181 127249 86567 170768 212994 45335 -289177 -526733
39046 -526733 -442368 -149034 -22780 -227397 -454420 -330341 41023 227704 105131 1480
39036 1480 161250 398769 422454 226396 -9179 -176449 -225790 -100849 125904 225236
39026 225236 95881 -75552 -95381 -33912 -44221 -84403 -29970 76595 108984 89588 133401
39015 133401 235306 296912 301194 300775 297164 267734 233625 185795 60645 -92283 -86105 92003
39003 92003 134992 -174267 -565964 -597779 -269062 6322 8030 -49878 61494 239188 264569
38992 264569 145201 68488 133704 271641 374949 409398 406389 390644 336225 223515 124060
38981 124060 124921 141553 -32619 -383192 -554724 -273503 228677 457669 271403 1063
38971 1063 -42050 70815 88864 -59747 -239223 -313873 -260668 -124044 47819 209006 293040
38960 293040 237618 82365 -10130 39718 31037 -290788 -768105 -879002 -420276 132134
38950 132134 218363 -71560 -202738 24853 308132 392876 368829 360301 304726 172987 103165
38939 103165 149478 131509 -101749 -425472 -589961 -497179 -252524 -59376 -85439 -287272
38929 -287272 -372217 -120245 271215 392334 160419 -119803 -240303 -294384 -330584 -190522
38919 -190522 128224 309008 178170 22742 134703 304761 154578 -208079 -302910 2992
38909 2992 303807 253245 11236 -59491 97438 216867 87528 -215088 -437992 -404917
38899 -404917 -167411 66252 153759 148827 179358 245307 225673 79110 -59702 -33481 134302
38888 134302 250880 179091 11781 -28279 139877 355959 426077 340346 197433 6490
38878 6490 -276781 -559247 -646549 -495697 -272166 -124992 -62208 -71849 -166933 -246495 -131293
38867 -131293 139877 258306 61001 -189575 -161064 71074 180240 128629 217638 574376
38857 574376 906905 912646 689322 535513 504699 408821 199241 66193 97952 82905 -176684
38846 -176684 -507927 -556787 -278314 12663 107419 159085 347990 527618 435898 124061
38836 124061 -82576 -10015 195518 308924 243881 40315 -176320 -227866 -64782 90982
38826 90982 -11099 -266475 -315123 -60488 174755 112718 -104276 -159172 9297 198303
38816 198303 234203 120377 -13770 -1578 215586 437712 336507 -143132 -637361 -750511
38806 -750511 -479866 -132391 59700 88678 42195 5857 50589 167327 235129 166772 55467
38795 55467 68851 217586 325619 228359 -59907 -363963 -493157 -393071 -182762 -26365
38785 -26365 21070 4609 -39685 -91156 -92752 -28054 -13999 -157310 -348096 -384915 -284480
38774 -284480 -244809 -305886 -309292 -222823 -210428 -306508 -332296 -248288 -253795 -368133 -274741 151244
38762 151244 493215 328249 -139240 -372852 -251253 -101858 -101566 -91444 12545 40695
38752 40695 -99683 -239940 -230489 -165867 -199111 -306222 -348794 -252982 -56298 128156 161928
38741 161928 -10175 -283071 -492424 -568249 -519279 -344217 -81421 125122 156931 70594
38731 70594 -7138 -54484 -85061 -13552 210781 423544 429271 311549 310983 418914 371018
38720 371018 92892 -111337 54957 478114 752735 615163 173524 -232943 -345938 -189000
38710 -189000 20731 141559 206591 241445 151940 -86227 -282756 -261562 -118916 -60262
38700 -60262 -92571 -98023 -102240 -204856 -323269 -294204 -178782 -158772 -162018 55730 431197
38689 431197 578343 365733 145493 217633 393836 356485 181828 166476 290585 225639
38679 225639 -132911 -463626 -459209 -251247 -219001 -467711 -693897 -610426 -342562 -236492
38669 -236492 -347511 -374347 -169498 -36992 -297172 -760746 -958384 -788693 -573315 -485102
38659 -485102 -326170 13170 257224 150540 -113176 -162303 20831 139478 69011 3218
38649 3218 98134 228146 205794 78990 59841 220091 396672 416468 303053 179805 46275
38638 46275 -194983 -487794 -588375 -387295 -109863 -33295 -125645 -169434 -147731 -234436 -409675
38627 -409675 -379548 10440 499767 702678 537131 226929 -19928 -180686 -299649 -337476
38617 -337476 -202108 87862 331136 322728 117385 -14562 29977 13211 -259498 -533719
38607 -533719 -374378 201405 670620 640205 264608 -67446 -198700 -191394 -70738 178334
38597 178334 446992 539029 376438 76630 -158337 -188220 -29033 151997 188107 80277
38587 80277 -50380 -161141 -313534 -488772 -537137 -392295 -217901 -238230 -478932 -737457
38577 -737457 -771131 -499880 -87134 173137 120203 -122794 -317361 -374229 -352733 -281023
38567 -281023 -150184 -40814 -52464 -109502 -29751 204257 423310 511634 472549 287381
38557 287381 -33540 -267050 -154279 185375 335035 165373 2951 76954 163409 15703
38547 15703 -188474 -157279 13632 16108 -159819 -253064 -173135 -77661 -60767 -71508 -112593
38536 -112593 -229314 -313299 -200124 30656 128442 66670 80887 251530 335156 139493
38526 139493 -175055 -338113 -332702 -333864 -409277 -464566 -421718 -294533 -114271 91100 245159
38515 245159 249349 86761 -138451 -267661 -195564 27379 173327 9460 -425040 -785442
38505 -785442 -776163 -488380 -248536 -170448 -57239 217889 466295 465813 296076 168881 64510
38494 64510 -168228 -418186 -382139 -85080 39018 -236520 -560357 -512999 -212093 -63393
38484 -63393 -113848 -79573 69258 16385 -341987 -655704 -610455 -350253 -203778 -223089 -222993
38473 -222993 -121605 -10582 39159 49805 35488 -29135 -123477 -146448 -3745 272539 501434
38462 501434 507460 340066 254411 380362 514988 408654 168508 137285 384770 578095
38452 578095 425794 36863 -261547 -298426 -155722 -26774 -62827 -252216 -393460 -285832
38442 -285832 24055 284056 321598 172093 -46563 -235482 -317098 -298971 -300545 -351773 -251846
38431 -251846 138532 558679 617091 351274 163471 210033 258937 200240 249217 495614
38421 495614 678054 620953 511049 499667 407138 115436 -94173 52665 354716 428467
38411 428467 252475 86474 45559 79607 191016 347178 347949 105886 -105154 -10338 219487
38400 219487 227803 23263 -109060 -116057 -174823 -256050 -140205 106858 104308 -271075 -621607
38389 -621607 -515218 -15063 432563 502979 272968 71187 114360 289013 330970 197944
38379 197944 94163 94768 19754 -179563 -230391 -3158 139567 -151157 -585284 -580397 -110145
38368 -110145 276531 249799 38850 -66119 -105280 -216747 -372654 -486942 -512373 -356966
38358 -356966 11976 339838 295659 -16709 -111625 202950 561933 609369 464729 398572
38348 398572 377504 241548 92965 162876 408572 543154 427335 211309 108294 191459
38338 191459 387955 535583 469429 172329 -164082 -299164 -150703 178203 506095 661934
38328 661934 557217 260742 -30053 -152082 -106639 -24823 -33421 -142033 -228397 -172111 -34643
38317 -34643 -9545 -114275 -76913 287172 700167 687094 190592 -345853 -535012 -419140
38307 -419140 -215799 24162 324708 555082 529015 265866 -19581 -171635 -228425 -307919
38297 -307919 -433185 -493118 -373461 -121285 74609 103229 47451 9525 -52018 -160631
38287 -160631 -129028 217351 677704 829851 579326 275353 198617 215688 97207 -75379
38277 -75379 -60820 142472 305257 312049 268555 266881 240519 113582 -43015 -100968 -54076
38266 -54076 -10812 -21717 -14304 57103 90723 -21368 -185668 -203151 -72779 -10930 -117963
38255 -117963 -233532 -227984 -216043 -309319 -367725 -234622 -46883 -33429 -136408 -132289 -27570
38244 -27570 -5104 -38547 87402 379100 603208 684018 790795 965492 999474 784690
38234 784690 480543 223509 -22847 -216865 -181192 33263 73078 -184158 -344319 -66724
38224 -66724 345760 327966 -128223 -464777 -342526 -23644 130268 178898 373640 624467
38214 624467 534005 -25047 -631349 -764228 -389078 92766 388335 544065 634932 563285
38204 563285 336388 241583 455216 700523 640531 434144 479357 705889 623352 112812
38194 112812 -325363 -285609 2277 92175 -54261 -148311 -43801 149578 281107 283429
38184 283429 190546 150484 280589 443462 372601 85865 -94903 -33574 27631 -81803
38174 -81803 -162849 -33838 113177 48254 -85431 -43426 68719 -7567 -209781 -262431 -140140
38163 -140140 -50400 -42491 -2998 20883 -126725 -352807 -383233 -213441 -132670 -237683 -275779
38152 -275779 -89624 106796 73183 -96366 -160132 -85135 -14677 -10868 -16459 3644 31471
38141 31471 53778 39866 -80857 -312725 -511356 -510141 -305314 -35237 191941 354433
38131 354433 415570 289442 -28571 -369007 -524444 -473719 -387877 -393284 -417735 -330397 -148619
38120 -148619 1951 80631 154006 242533 281985 249366 195788 130320 7443 -128986 -132250
38109 -132250 42612 238892 282215 164441 -23007 -226519 -414641 -525802 -528667 -462506
38099 -462506 -349511 -159162 68862 182111 109104 4470 65787 256550 344090 202529
38089 202529 -33932 -143387 -66856 60724 105425 98678 156102 264991 270661 112171 -63353
38078 -63353 -111874 -76451 -34700 65021 217421 195313 -128331 -430632 -288150 184226 453078
38067 453078 324702 142300 161537 210947 149184 190156 482806 755090 712846 485459
38057 485459 345001 263376 96582 -43270 22687 174603 187057 128627 211165 378364
38047 378364 403153 288428 222907 219258 128351 -45676 -150158 -152624 -138835 -120413 -94669
38036 -94669 -171702 -364996 -409554 -114603 260075 354928 284146 414860 686004 662469 256069
38025 256069 -127682 -232150 -241162 -304808 -265256 -61868 38376 -104635 -190211 60706
38015 60706 412250 421062 53869 -312143 -401360 -292871 -211346 -263474 -377660 -398260 -250571
38004 -250571 -39645 71062 63405 41421 42623 28131 22321 68348 78340 -50423 -210496
37993 -210496 -238484 -248081 -474011 -790775 -782613 -361037 93073 310319 412219 444582 140975
37982 140975 -519261 -975968 -774836 -262441 -99999 -322736 -412325 -160522 96442 90774
37972 90774 -45090 -142139 -245022 -357073 -312511 -90323 39215 -119419 -389402 -460229
37962 -460229 -251885 93627 412401 572684 490293 249215 93350 155255 279724 242256
37952 242256 68387 5476 202386 511849 627151 402705 42780 -85981 104459 269499
37942 269499 78606 -280685 -320963 38808 335047 237281 3861 21462 205890 214837
37932 214837 36626 -50285 10377 19708 -22238 118081 408322 449129 55584 -421364 -580336
37921 -580336 -466741 -337348 -219943 -15275 192626 264509 282698 384037 464267 372847
37911 372847 257094 345240 500910 404006 115783 25197 222970 367785 243646 24753
37901 24753 -122733 -280172 -464979 -492591 -347454 -301049 -440555 -477082 -281827 -193999
37891 -193999 -446796 -679578 -462629 4136 198837 48742 -101934 -121692 -179132 -302476
37881 -302476 -348518 -365049 -515064 -664479 -515364 -158390 -19600 -202378 -342599 -212945
37871 -212945 -28187 -16430 -99861 -157690 -225607 -276399 -167824 40708 92280 -3013 77398
37860 77398 371753 455409 127819 -185302 -85163 164289 106881 -148357 -162793 87313
37850 87313 256095 272608 380106 567610 493740 51190 -425100 -606760 -471633 -107798
37840 -107798 391540 754474 659630 205620 -96165 20024 245934 223898 59426 29225
37830 29225 72596 -56701 -307648 -381318 -199343 5014 52521 -7976 -99373 -223436 -327565
37819 -327565 -306634 -201587 -180577 -257357 -249322 -97469 13987 -13079 2755 176849 255130
37808 255130 -31000 -454626 -515658 -151475 148587 23094 -306972 -432750 -316799 -211001
37798 -211001 -220943 -241411 -224819 -241959 -302243 -333976 -336463 -364362 -373791 -272920 -120775 -77552
37786 -77552 -140263 -129729 16695 142193 133127 86525 104051 100418 -26235 -171199 -156215
37775 -156215 -13543 36266 -128721 -395463 -552916 -464884 -139766 251445 442177 289935
37765 289935 -40375 -217161 -107915 83569 94799 -70915 -191404 -147601 -72517 -143914
37755 -143914 -317734 -359135 -131910 212372 370938 198267 -140444 -319182 -154574 224943
37745 224943 509244 509976 318241 152077 99866 74533 -21498 -189404 -385448 -562201 -630144
37734 -630144 -496008 -202191 66256 177144 164726 97663 -36044 -214943 -291326 -171552
37724 -171552 1699 22438 -84172 -128203 -79851 -111688 -291418 -444016 -412317 -289658
37714 -289658 -263399 -335863 -347388 -233072 -119488 -142811 -259847 -299935 -176717 13474
37704 13474 121438 117660 77996 41964 -9340 -42567 20902 139085 131855 -69142 -268671
37693 -268671 -243347 -56111 11258 -183482 -471146 -562125 -343604 3962 166888 32176
37683 32176 -141614 -17658 343270 515008 301064 35430 90897 333108 362802 121100
37673 121100 -103599 -168914 -196346 -224296 -128672 59511 109515 -36819 -155376 -114725 -70854
37662 -70854 -152285 -225346 -147267 -25274 -36392 -161496 -261608 -276840 -224373 -140332 -117145
37651 -117145 -235669 -384521 -348027 -154083 -87181 -239205 -332738 -176444 -4518 -92954
37641 -92954 -289942 -267732 -62776 11903 -101711 -144667 866 147864 154059 121141 147383
37630 147383 162431 149055 278356 614806 860326 650184 55551 -435416 -478742 -248268
37620 -248268 -154553 -311436 -446758 -322586 -56146 74099 -2797 -151273 -313885 -550440
37610 -550440 -774095 -713335 -288245 162022 239397 -13178 -174502 20001 395633 619509
37600 619509 598676 499189 459802 424509 286871 108825 80310 243292 371556 230907
37590 230907 -104935 -333855 -295456 -115050 21171 69212 66223 29446 -5655 21395 83189
37579 83189 60336 -77426 -204608 -223761 -183445 -133092 -10057 212967 402739 423218 313820
37568 313820 195046 116983 121817 303696 627555 820545 668593 344696 217473 375056
37558 375056 558123 546027 387490 237037 177344 241054 403409 493603 313268 -67191
37548 -67191 -314560 -249415 -88646 -131116 -357111 -525949 -548983 -530418 -495544 -345146 -113238
37537 -113238 -14852 -121433 -203134 -68517 110807 43576 -229381 -398210 -347411 -253647
37527 -253647 -205245 -64225 172582 216424 -68231 -340085 -223852 122826 253038 110911
37517 110911 48670 191023 225334 -62222 -421651 -515192 -388145 -343792 -523602 -793106
37507 -793106 -919611 -741834 -296435 134001 254673 114050 37127 136427 148631 -106532
37497 -106532 -390194 -401408 -233843 -181957 -258146 -228015 -44691 70327 -16657 -172195
37487 -172195 -212208 -106076 69443 223377 267474 166538 23 -107922 -113824 -54501
37477 -54501 18612 33187 -82837 -274106 -359229 -282109 -235451 -366259 -487024 -314818 77703
37466 77703 316795 230181 43545 22456 139287 198482 129864 32390 12023 70227 114938
37455 114938 41278 -163328 -384981 -490831 -452881 -320845 -123853 114027 301313 336231
37445 336231 237839 134508 117255 164738 198794 156832 33755 -96213 -135074 -79101 -20949
37434 -20949 2184 59070 159217 170901 20997 -148584 -176500 -127851 -172816 -312958 -422559
37423 -422559 -486959 -581231 -655180 -568091 -328953 -84855 128189 391048 640262 664019
37413 664019 449216 293367 419972 661648 697205 479365 249084 191692 246473 253487
37403 253487 162397 48229 -28737 -119713 -304438 -518200 -556581 -336370 -71736 -44166
37393 -44166 -233259 -353062 -264061 -153196 -233611 -444691 -572865 -537685 -420420 -304979
37383 -304979 -231491 -240078 -319353 -353015 -253998 -127241 -157849 -334433 -428178 -292504 -56169
37372 -56169 65968 56838 71363 173378 238469 146178 -41750 -163789 -149016 -47141 77017
37361 77017 175430 167797 -11130 -279618 -429576 -348239 -151161 -26402 -4988 32925 165454
37350 165454 339032 465486 521232 521806 459890 322744 157735 72244 134796 282934 368254
37339 368254 308689 155559 -10991 -178822 -330407 -361766 -215673 -51587 -100143 -328613
37329 -328613 -435176 -244097 66039 231889 241617 258018 338805 411983 447410 472125 456587
37318 456587 350788 214694 166776 215159 272861 321793 421149 567793 698740 823009
37308 823009 978409 1046850 821495 339501 -44587 -63545 120493 147716 -56892 -225660
37298 -225660 -142737 101911 297019 381601 428606 464437 439069 348387 278381 309706 433943
37287 433943 569717 621318 535464 355565 210824 190438 234675 218371 132743 89689 132631
37276 132631 155513 67540 -53384 -56242 82015 220037 197359 -9535 -244656 -291528 -96177
37265 -96177 151618 252073 258936 347194 469441 410715 211092 202957 485673 690932 512297
37254 512297 179379 92261 221136 233898 46001 -146814 -268046 -401229 -505207 -469171
37244 -469171 -395803 -451467 -494875 -269054 79108 133637 -123204 -260929 -92055 67990
37234 67990 -39687 -262308 -404013 -502081 -549910 -394262 -125302 -112259 -390926 -480375
37224 -480375 -132280 197254 33515 -369325 -449980 -186348 3607 -14761 539 147125
37214 147125 245457 202147 117079 38515 -66330 -121210 -14964 155241 170670 -367 -185736
37203 -185736 -248392 -167901 19675 191008 169885 -37701 -191580 -152766 -63845 -29875 97050
37192 97050 372212 506238 290895 -1480 -27503 69641 -55132 -320237 -359172 -151604
37182 -151604 -15005 -33197 23444 213368 308533 206787 74667 30607 19085 27010 116670
37171 116670 235995 281718 320345 458358 565550 451776 233441 163210 180922 34333
37161 34333 -225689 -310045 -207532 -171448 -208233 -81584 143385 98808 -231554 -390830
37151 -390830 -171294 50695 -37503 -178911 -42395 171095 56255 -304651 -423919 -112533
37141 -112533 254931 230790 -163206 -483338 -397595 -88335 -25321 -335207 -614104 -522867
37131 -522867 -311687 -422398 -769939 -883888 -681848 -571349 -730534 -823390 -609838 -351820
37121 -351820 -337469 -408525 -291879 -81214 -30575 -96642 -43906 128462 184327 17049 -231373
37110 -231373 -397841 -463980 -495179 -521951 -481766 -261720 135805 487504 545209 338379
37100 338379 119331 6961 -111170 -296871 -420571 -389996 -308129 -285606 -263539 -138910
37090 -138910 61770 222898 251423 108947 -149023 -347030 -331338 -142197 74485 272747
37080 272747 453445 488512 254867 -85544 -215935 -88628 43837 39055 28691 127635
37070 127635 252052 296975 250939 79488 -251204 -571540 -588063 -259309 120163 276532
37060 276532 201861 26588 -121088 -113246 75956 256980 256347 221792 389650 599699 451385
37049 451385 -28011 -319785 -144822 161355 189224 -13282 -179273 -251760 -300305 -270253
37039 -270253 -93008 116705 181446 62774 -157387 -341652 -309732 -21555 221547 61728
37029 61728 -366132 -517675 -185871 204505 227524 19679 -34916 127713 290879 336733
37019 336733 301175 201558 47586 -77350 -107848 -73527 -1559 112580 181715 66017 -197383
37008 -197383 -390293 -378296 -191438 127358 484200 592225 237496 -300504 -493600 -276828
36998 -276828 -93772 -174611 -263510 -196634 -212400 -432466 -531882 -263951 100193 206262
36988 206262 131460 120954 142559 60180 -33946 -1149 76752 104856 186409 349429 354622
36977 354622 82408 -170643 -105413 125935 192361 61738 -94206 -212765 -248261 -34409
36967 -34409 419628 729277 572524 131666 -201448 -344253 -449575 -540718 -536542 -448420
36957 -448420 -282276 39037 416834 523992 281406 68194 149391 250625 80217 -97379
36947 -97379 104287 495568 599765 425738 377343 509551 444463 28397 -414909 -550802
36937 -550802 -386119 -118827 63595 37506 -141142 -213132 -42860 127826 1976 -327185
36927 -327185 -534685 -534301 -487276 -460497 -388644 -287088 -219965 -148430 -55596 -82883 -285735
36916 -285735 -423527 -278166 -11336 88713 30848 -20143 -107750 -352528 -626954 -715049
36906 -715049 -641940 -518771 -262721 162175 445530 300103 -51739 -197464 -157231 -217467
36896 -217467 -325928 -203211 49576 35584 -260261 -432034 -331758 -261952 -400772 -525331
36886 -525331 -445761 -288717 -201826 -147059 -118158 -219595 -408709 -475183 -372118 -259386
36876 -259386 -156598 97160 453950 601532 435640 236111 202254 152886 -87726 -312808
36866 -312808 -240830 3293 35878 -233969 -478218 -395863 -79475 154219 177714 148950
36856 148950 208143 257876 176028 109893 303045 656747 762372 450521 36118 -106638
36846 -106638 37057 257603 406376 387307 137341 -192418 -291215 -107269 59368 50946
36836 50946 96018 335486 493014 339778 123405 151237 274828 202523 14417 -80496
36826 -80496 -195317 -465524 -568845 -126228 583727 889621 625494 241661 87484 102379
36816 102379 188124 372715 560851 552109 351228 117564 -147268 -495225 -709760 -523413
36806 -523413 -104923 113188 71070 113002 388427 649125 673435 510039 274529 47616
36796 47616 -32787 86394 177238 9522 -252975 -292031 -157719 -135803 -197958 -58944 267080
36785 267080 453389 405441 354486 382002 303297 85857 -31141 81953 285325 427694
36775 427694 458932 320467 54176 -51773 208584 569978 619349 396865 252483 236850
36765 236850 127834 -42565 -30325 107171 87774 -34255 60838 335262 410043 222287
36755 222287 96415 129929 93929 -10741 80555 290303 205511 -163718 -280490 55263
36745 55263 373248 330381 223404 354406 450927 163546 -291832 -446446 -239065 21271
36735 21271 128780 100255 -3756 -129145 -221506 -292252 -349091 -259186 68544 395306 396013
36724 396013 181743 164774 382391 435779 189143 9636 126063 249305 102900 -104511
36714 -104511 -62712 126147 149339 -43099 -253557 -350757 -345288 -282169 -209527 -157989 -101784
36703 -101784 -45102 -83055 -198818 -139831 214023 507964 325800 -166050 -428273 -319114
36693 -319114 -169319 -141688 -61120 93708 81379 -124307 -248882 -208427 -206957 -262868 -142031
36682 -142031 134260 224666 40580 -108575 -73552 -76689 -223520 -288579 -144062 52940
36672 52940 225766 467904 671759 569800 253466 135524 292167 382523 311653 363332
36662 363332 542637 451282 32453 -219562 -65899 100139 -11024 -110601 45382 177025
36652 177025 50577 -39912 167347 359392 164930 -199385 -288859 -109511 7112 -54273
36642 -54273 -151423 -169903 -76746 94445 152907 -66032 -338808 -269389 61612 166403 -40374
36631 -40374 -121456 24007 -94662 -621424 -889744 -410106 292463 424193 25892 -271530
36621 -271530 -213333 -48032 31619 22851 -121748 -396200 -550618 -368260 -3500 219773
36611 219773 178785 -56019 -347260 -461831 -243254 43774 -63993 -508858 -688252 -352762
36601 -352762 5746 -41918 -214879 -81409 213565 249355 -1820 -246263 -332283 -281862
36591 -281862 -112187 87853 157561 141612 260681 468908 448995 194398 110185 341641
36581 341641 522007 417404 285013 335192 391451 358326 448992 649070 558608 107112
36571 107112 -184354 -22576 190328 92423 -72900 -50491 -77785 -312562 -392770 -92188
36561 -92188 191033 137247 94724 409710 765208 770748 622254 578214 389027 -105576 -427546
36550 -427546 -225678 -2458 -303994 -737208 -633524 -197250 -86748 -249663 -121874 281256
36540 281256 403409 137574 -70778 -49796 -72783 -215612 -205870 55957 345544 474405
36530 474405 401033 109885 -243046 -276217 134222 570588 651858 570748 652800 777555
36520 777555 717044 641927 748691 770515 437890 67139 94396 352858 407989 299898
36510 299898 359545 574624 706890 759752 803190 653619 249496 -9916 168492 449231
36500 449231 444641 372819 555419 732072 544687 261336 301172 447102 275925 -5983
36490 -5983 72251 379195 450108 327708 380862 557634 551298 443055 471515 452261 135808
36479 135808 -172196 -79134 137799 1898 -279931 -212649 42205 -16821 -259649 -173441
36469 -173441 148343 183965 -22362 34677 333089 352027 52924 -36676 247971 482329
36459 482329 415421 269532 232559 254925 349517 551219 643303 420231 78385 -110909
36449 -110909 -242683 -408636 -300050 206655 522964 148139 -431449 -458124 -106986 -74616
36439 -74616 -334440 -297055 45383 149941 -49889 -109042 39116 67081 30446 270833
36429 270833 623952 590062 227146 53408 154487 190158 148647 260916 318458 -47731
36419 -47731 -532326 -477327 70222 463417 488922 451133 390959 116545 -136596 5528
36409 5528 243604 8986 -467992 -465551 -18223 166358 -29482 -2494 417652 700317
36399 700317 598286 471397 513503 497070 367804 318203 259832 -25243 -280277 -96977
36389 -96977 290434 348298 197135 342711 656981 587730 217965 120157 288685 224875
36379 224875 -37219 -14221 233411 227089 69017 252652 596045 473185 13184 -73772
36369 -73772 206683 191369 -130566 -99264 302600 387001 130455 337123 1184607 1792999
36359 1792999 1579047 991074 571873 258827 -55553 -134066 111495 421838 645297 790839
36349 790839 689027 271593 4202 294306 738854 761639 604083 757773 897412 485428
36339 485428 -40020 71295 473846 336063 -53736 226612 963180 1094486 574982 365758
36329 365758 668017 740547 442420 405333 654706 564261 204084 270252 684681 711815
36319 711815 396454 413907 625954 330861 -212595 -130180 377289 370987 -5458 171683
36309 171683 695078 537129 -81640 40786 822761 992254 451614 396148 975051 1032393
36299 1032393 382806 148094 550733 555421 23198 35696 719730 930179 472791 460882
36289 460882 1085207 1234161 712163 603914 1060613 1005489 407122 485843 1263600 1334247
36279 1334247 510370 230889 866424 1124610 621122 496514 989547 992034 483115 730479
36269 730479 1624337 1596854 633994 455336 1253835 1322976 410296 223227 1047373 1200147
36259 1200147 445823 487042 1431309 1393930 288561 226835 1442101 1782632 972799 1158009
36249 1158009 2451729 2455248 1069086 986617 2449030 2631578 1301406 1558345 3704701
36240 3704701 4299032 2752132 2535542 4230318 4261381 2382977 2869208 6070229 7066081
36231 7066081 5314330 6477731 11564388 14517988 14349837 17924739 25997293 30303193
36223 30303193 30928972 40053472 59157603 73137934 83336634 122850428 208630938
36216 208630938 293318285 304122081 230502849 138092933 88045352 75982822 64810667
36209 64810667 44421742 31299539 30235071 28474166 21062035 16299619 16962975 15853041
36201 15853041 10790665 8059321 9467810 9290404 5700599 3754939 5273898 5853969
36193 5853969 3715843 2540213 3739047 3984589 2160244 1458819 2900280 3421453 1955380
36184 1955380 1251115 2229035 2324230 804850 254306 1427549 1823028 665645 337226
36175 337226 1549160 1883679 517526 -168044 866668 1486585 582229 28101 900803
36166 900803 1541311 949713 588327 1282411 1615259 870967 486084 1178010 1538126 795740
36156 795740 223829 572906 750632 192282 -17576 541595 686364 17189 -183546 584892
36146 584892 1050922 583883 278932 712898 888377 330782 30779 399778 437316 -190295
36136 -190295 -353905 386789 883491 500368 134164 337229 381459 -31594 -74240 430704
36126 430704 463995 -210606 -445435 159698 458477 -110690 -505843 -57601 371765 104184
36116 104184 -209320 -33030 112630 -33059 165742 796541 930613 335088 33491 445928
36106 445928 630461 118476 -187620 233031 534518 149377 -183575 56535 170909 -301021
36096 -301021 -614773 -274911 -31556 -436750 -745341 -262318 430279 554763 335340 247434
36086 247434 128630 -176104 -292257 -106319 -72451 -211352 81186 763825 931059 359900
36076 359900 -27328 243093 516641 470313 768682 1574946 1899212 1265501 623595 715569
36066 715569 890124 479177 37256 186035 431930 188672 -107223 79557 351838 239942
36056 239942 127717 388931 535947 142383 -280433 -202754 -3 -128607 -256719 -36169
36046 -36169 128247 -104018 -267906 39812 377959 302959 165062 332845 468785 306423
36036 306423 291771 707032 998285 715914 300119 220845 180517 -122449 -305130 -99092
36026 -99092 26384 -235637 -376425 -45870 210200 -50579 -313194 -46133 354196 362215
36016 362215 243141 378180 474164 231578 14951 108388 112163 -194562 -261021 214149
36006 214149 586501 389998 205407 534206 782147 355858 -160013 -9697 394887 281559
35996 281559 -90502 -19274 310880 262971 -33531 -28128 157110 52949 -169576 -65157
35986 -65157 134246 -78137 -500098 -569905 -337712 -219945 -178521 12388 113796 -118444
35976 -118444 -284004 -5404 256795 -31117 -411920 -148661 452642 512190 31481 -210285
35966 -210285 -471 111470 -140265 -439285 -589774 -700686 -719808 -502885 -259320 -285171
35956 -285171 -400461 -253771 30749 108432 49057 114258 200577 108607 31055 161674 199863
35945 199863 -118620 -422437 -316569 -133002 -321028 -559230 -319899 103584 46916 -380405
35935 -380405 -516648 -251865 -23788 58891 223330 373249 266117 140399 335163 517053
35925 517053 160099 -419780 -433786 125222 518469 450993 310730 276604 108900 -146754
35915 -146754 -117163 163980 270015 179747 287163 567782 528742 94770 -214400 -137504
35905 -137504 -3544 -57047 -111971 -53826 -81670 -260092 -356139 -283021 -239216 -295822 -286367
35894 -286367 -176682 -119161 -104391 26057 213695 229065 53414 -160280 -399768 -657768
35884 -657768 -652453 -182711 376311 467885 144367 -63604 30421 126694 55375 -12652 39935
35873 39935 147518 295436 463714 440488 121849 -155619 -45153 230701 234808 49860
35863 49860 95178 381265 541118 478490 404630 345044 179063 49595 165616 325169
35853 325169 198194 -71962 -127549 -59987 -181205 -338071 -162183 165059 149841 -136392
35843 -136392 -195221 -27630 -106059 -450162 -566433 -355321 -256687 -391401 -363377 -68765
35833 -68765 76832 -79369 -147721 75468 274849 230837 129029 63042 -128800 -347323
35823 -347323 -223291 165778 251030 -109130 -352047 -145165 93570 -15352 -156731 77322
35813 77322 468712 558843 352053 184592 201492 329520 497462 593982 472842 218295
35803 218295 115247 193550 150780 -117558 -314755 -256336 -163662 -217991 -241449 -90721 26831
35792 26831 -66849 -174592 -75847 72753 8251 -201187 -286625 -175354 -13279 79281 89695
35781 89695 51734 16741 7873 -12534 -35749 39940 181941 120997 -246545 -545757 -392862
35770 -392862 -5473 110371 -69603 -156004 -61944 -52088 -136776 -61032 100057 2862 -263018
35759 -263018 -236179 61119 81274 -262323 -359865 54407 416237 299679 128051 389038
35749 389038 793847 830958 621783 578063 629303 440970 91741 -73833 -34027 8683
35739 8683 91478 328377 475712 192780 -376131 -747894 -736501 -528590 -238441 171962
35729 171962 582633 739664 608060 394627 234428 121062 99208 248189 493309 668406
35719 668406 746136 815416 876754 839543 678518 453700 241571 143663 234172 392238 357880
35708 357880 89999 -119503 -45745 156283 224653 173303 178389 259302 319702 372457 481810
35697 481810 573647 511082 287238 -8245 -306360 -503587 -440839 -116805 207650 299487
35687 299487 236042 237621 346724 452115 515931 581276 621166 545951 334816 73278 -93514
35676 -93514 -31467 230093 409073 229303 -194753 -458423 -399135 -254594 -215629 -160207
35666 -160207 5183 88956 -43356 -171141 -71628 76982 -13431 -236838 -241350 34268
35656 34268 313798 412826 414187 444835 529317 635613 659964 441188 14309 -247611 -23045
35645 -23045 483826 752858 614401 400551 399511 483053 413152 249484 224874 361998 451809
35634 451809 379048 268127 259413 291399 213984 31980 -112160 -178165 -278282 -438893 -494233
35623 -494233 -345267 -164186 -156865 -253441 -261514 -216651 -299612 -468106 -489398 -337286 -231359
35612 -231359 -240741 -184724 -14688 50972 -75010 -141061 43530 278011 275689 72076 -110832
35601 -110832 -209620 -285550 -314464 -253220 -180409 -153427 -64090 148594 295720 201011 37663
35590 37663 119436 426107 616666 501316 253640 129212 172448 240619 169065 -111030
35580 -111030 -496346 -746897 -711247 -515530 -424494 -521342 -625789 -528145 -216018 136591
35570 136591 337319 323333 178615 11406 -160588 -343492 -423979 -241679 156166 481469
35560 481469 514707 333317 149660 48455 -790 14723 139245 323273 442153 440461
35550 440461 385399 380731 462103 561571 574696 495824 446727 494321 509450 355120 155482
35539 155482 158947 346359 438499 336376 253122 284865 174890 -239532 -605754 -449592
35529 -449592 113631 436067 150021 -372823 -508682 -132269 301158 345548 51181 -186551
35519 -186551 -143362 16055 35415 -85266 -159177 -117769 -64547 -64413 -67255 -47321 -43207 -33015
35507 -33015 62393 210856 258910 133789 -82908 -297611 -456624 -455362 -219107 76967
35497 76967 109544 -166660 -416184 -379256 -218098 -229586 -392667 -430707 -233969 -4719
35487 -4719 16988 -159874 -288583 -146008 204189 434639 317645 16404 -131892 -75642
35477 -75642 -67872 -223484 -333984 -223059 -38040 -27507 -210314 -417416 -515462 -461821 -281785
35466 -281785 -108278 -105408 -253772 -355462 -321742 -268256 -249286 -136275 109550 288587
35456 288587 268027 215526 317069 451810 381541 121468 -100623 -149229 -61563 70901
35446 70901 149851 123108 111976 306838 604322 596447 132120 -364566 -421613 -139913 49182
35435 49182 46527 86600 188938 82304 -277668 -526037 -376505 -10509 181785 69771
35425 69771 -130950 -130142 136916 408191 328353 -115326 -495683 -460553 -214199 -207674 -443994
35414 -443994 -468702 -80200 339286 358189 50393 -195018 -188609 -41926 78393 76888 -77189
35403 -77189 -283522 -321904 -110763 117997 87135 -135285 -214758 -16624 209146 181385
35393 181385 -26204 -79242 194465 590635 755531 567634 243551 70526 99319 167992
35383 167992 186441 247999 397862 447661 206713 -163049 -256449 55143 415202 421895 125303
35372 125303 -84215 16270 277859 434704 374393 163280 -29877 -36947 130171 228710
35362 228710 86982 -100044 -26972 212128 215772 -82297 -267444 -94659 136702 130272
35352 130272 105027 353095 624141 475990 31928 -180907 -58687 -4083 -172019 -231205
35342 -231205 -26931 78979 -187791 -524633 -515807 -240945 -48822 13646 143523 312966
35332 312966 277675 40903 -47877 231957 626234 694633 353121 -24189 -69783 126992
35322 126992 172622 -60164 -242477 -78484 248625 356933 216508 108584 144319 180222
35312 180222 171325 230765 313235 215974 -25141 -102978 76812 224131 136357 22003 152315
35301 152315 455116 663628 660244 494653 246546 20624 -87851 -123906 -198185 -246949
35291 -246949 -107534 142728 235598 152231 154380 289065 271954 15011 -162653 -70949 35094
35280 35094 -45110 -68302 186990 452511 384455 123775 6271 -5892 -137540 -280766
35270 -280766 -165459 100888 161165 1392 -48870 113441 222995 101353 -119518 -283294
35260 -283294 -402764 -501760 -519487 -435485 -308478 -182039 -100504 -159776 -370258 -548048
35250 -548048 -523224 -365774 -232603 -121476 21352 96930 -1175 -160265 -202284 -143401
35240 -143401 -80989 21299 187796 239721 35376 -247193 -356084 -342492 -392348 -444832
35230 -444832 -317522 -75085 72086 115091 158867 135615 -31859 -142007 -1048 154211
35220 154211 -19138 -352905 -394812 -170921 -144189 -406849 -520140 -277903 -48324 -131829
35210 -131829 -289799 -206883 -7960 6774 -166560 -317764 -337911 -224625 7473 237582
35200 237582 282959 184090 201824 393929 482031 309906 128215 195936 379379 415819 336673
35189 336673 330906 368599 267377 27062 -171150 -236637 -224581 -177975 -102746 -51876 -75702
35178 -75702 -130990 -155780 -164710 -167387 -93433 81742 242453 292362 300269 349524 361552 242786
35166 242786 104775 126001 246942 228583 23744 -124729 -29118 176686 241315 146234
35156 146234 84109 128081 112167 -90343 -317774 -302108 -40939 179600 138786 -92921
35146 -92921 -307794 -382533 -298479 -114092 -107 -123608 -383849 -447581 -190993 89907
35136 89907 96666 -52315 -78054 -28671 -167920 -481517 -669336 -616346 -516427 -486916 -400291
35125 -400291 -195954 -47454 -66012 -89718 53141 257907 297367 133517 -75380 -192415
35115 -192415 -210996 -208299 -265064 -380349 -437707 -327947 -111816 34993 42639 6010 20241
35104 20241 74674 123314 147795 129756 53521 -52666 -147118 -222997 -260644 -196044 -26951
35093 -26951 128689 181912 183875 184341 119302 -22718 -95030 -38069 -37939 -207223 -325441 -207463
35081 -207463 -105449 -328432 -644429 -579023 -220818 -145106 -497087 -746705 -519367 -111584
35071 -111584 78752 127632 252417 341656 219921 47647 46383 84765 -61268 -250505
35061 -250505 -188857 54711 149681 30187 -60393 -9239 31874 -45026 -167070 -276056 -395151
35050 -395151 -469733 -385673 -193817 -100764 -176672 -256520 -195303 -64304 -28257 -152936 -384667
35039 -384667 -606161 -669510 -486860 -146156 146317 280401 322438 356386 350966 254627 134271
35028 134271 105397 150755 121922 -52151 -248188 -295907 -169370 46863 304438 562748
35018 562748 660889 434423 15851 -195118 343 331705 426630 291395 209927 289138
35008 289138 368458 322970 192734 26563 -151538 -220914 -73040 126256 56088 -292360
34998 -292360 -521388 -335077 65095 257587 125429 -69958 -64265 108481 193774 37298
34988 37298 -200881 -210882 57886 282277 187682 -56527 -85483 122649 247488 129301
34978 129301 -43513 -78729 -7675 99056 247662 352844 239320 -53672 -230909 -156416
34968 -156416 -64228 -182335 -379857 -401600 -270109 -225342 -376157 -602459 -731586 -680432
34958 -680432 -497930 -352999 -381013 -486424 -439486 -221347 -85334 -190820 -381053 -446282
34948 -446282 -406968 -380516 -344941 -215823 -29395 113548 188627 214072 185424 141824 171459
34937 171459 260308 273934 173730 95808 130091 190156 188145 155201 103685 -22773 -170620
34926 -170620 -182888 -90989 -132974 -342084 -417197 -204846 -7926 -144434 -468306 -642660
34916 -642660 -653347 -697284 -755624 -673158 -535213 -559437 -671643 -582643 -281499 -76799 -104433
34905 -104433 -150577 -61625 -3525 -144262 -324352 -251964 101180 463245 565937 393246
34895 393246 168715 137737 318653 461744 316435 -60990 -337083 -250726 115647 420281
34885 420281 395897 115568 -76571 51338 331399 402451 183691 -41371 -46959 56703
34875 56703 77224 41464 56047 59164 -50848 -174378 -151334 -59459 -120978 -346384 -499601
34864 -499601 -419820 -192478 6952 86757 57722 5629 32785 132758 179325 130331 130798
34853 130798 279977 430634 407784 300680 303824 371005 301859 111058 11116 37791 2618
34842 2618 -136171 -164672 9672 144341 -115 -307797 -480260 -418481 -246226 -53680
34832 -53680 179649 427605 557116 484715 312734 244260 366954 548892 571145 361269
34822 361269 63568 -123009 -119519 26728 206282 263154 69064 -299462 -552880 -501717
34812 -501717 -300820 -219430 -252847 -193758 -51947 -105747 -452885 -780247 -753196 -435195
34802 -435195 -120016 88107 274083 400294 307378 40616 -113379 -19912 107546 48227
34792 48227 -94697 -98448 13436 57765 29370 66256 135007 68025 -81136 -65429 97063
34781 97063 63824 -256292 -435543 -132706 334459 405021 63041 -202081 -109646 153345
34771 153345 343949 424683 383082 160244 -156872 -361697 -399634 -358677 -212310 104695
34761 104695 392912 366075 159128 209722 543824 669895 369596 93768 265295 630496
34751 630496 697952 470135 302618 298558 293379 265618 322676 368991 182367 -211269 -554664
34740 -554664 -708317 -703398 -514860 -88929 422663 732858 738486 566149 333811 79138
34730 79138 -113297 -140939 -43482 36574 37310 -14218 -108025 -206486 -173869 64078 342542
34719 342542 407118 202155 -105965 -306610 -240830 126725 573571 718632 448623 90012
34709 90012 -42402 -70265 -256119 -483254 -409800 -47283 216444 180912 53138 31947
34699 31947 8431 -163912 -354113 -316232 -38936 245439 357213 340112 321079 305312 214647
34688 214647 96943 108946 198713 40963 -452302 -773301 -407549 328562 601914 241734
34678 241734 -48207 153669 339742 6495 -444489 -382543 5138 105815 -59049 -149
34668 -149 252583 220098 -41128 72057 629195 924585 572391 93398 56429 285607
34658 285607 347308 274850 319264 399493 309344 186989 304544 568680 639846 437105 187373
34647 187373 57360 24754 49623 117936 147378 58440 -69664 -65592 114082 326984 396206
34636 396206 269662 50878 -118186 -224430 -369041 -527531 -472186 -105298 279769 338479
34626 338479 169055 139999 290380 295294 50093 -126923 -2963 219236 237630 47053
34616 47053 -171684 -305106 -293920 -104505 140521 223522 141872 128565 269433 366292 288373
34605 288373 168811 121556 68815 1558 83571 302919 355954 124045 -57428 101159
34595 101159 375510 398891 238170 210543 327760 343466 231478 194811 244101 168594 -48061
34584 -48061 -143188 11885 213594 255262 213327 265583 395147 421842 242791 -56089 -281015
34573 -281015 -276957 -46010 244125 404478 394748 325686 297651 274370 138498 -124098 -321212
34562 -321212 -220145 127415 331117 85433 -405801 -626068 -371934 26467 157838 -15437
34552 -15437 -255641 -394628 -412765 -317113 -133317 31930 54994 -92421 -343279 -583819
34542 -583819 -673855 -530756 -250381 -36741 41298 104339 225193 286979 165699 -77754
34532 -77754 -287367 -385789 -377686 -291564 -191917 -134279 -53862 150010 355719 248634 -251963
34521 -251963 -775383 -900347 -648431 -379788 -296411 -284712 -228880 -237874 -458078 -792686
34511 -792686 -950487 -777085 -453395 -295596 -379276 -467690 -351380 -126288 -18481 -55729
34501 -55729 -95447 -87923 -82006 -21277 193795 431063 396119 52280 -276893 -323342 -167939
34490 -167939 -15416 94633 211630 306746 337542 329695 274390 102095 -130911 -207211 -35491
34479 -35491 184469 218647 75750 -91351 -201114 -230044 -147748 -17470 -18018 -209815 -403044
34468 -403044 -404686 -279108 -220756 -277565 -340260 -312863 -173649 45042 243032 317335 312980
34457 312980 384351 544323 613915 500645 340994 258221 173318 -994 -160090 -168150 -69919
34446 -69919 16912 85769 170308 222473 204400 179177 188357 169834 95319 27143 -48159 -224687
34434 -224687 -403745 -291834 133706 434539 264446 -119177 -226304 -35918 55677 -104025
34424 -104025 -223502 -71115 165147 167169 -74059 -263161 -156214 185716 477480 508326
34414 508326 337606 161366 40641 -102274 -243027 -226954 -36045 136643 173072 165522
34404 165522 152338 -19838 -383270 -643630 -534834 -195033 53925 130710 143422 81416
34394 81416 -138379 -414273 -536655 -473064 -341174 -164438 102397 355982 400540 218596
34384 218596 -2722 -99757 -37802 148079 347845 374306 143408 -181451 -361907 -339144
34374 -339144 -202989 -19834 165402 272681 285354 293560 311892 210300 -32682 -208074
34364 -208074 -190746 -157793 -269225 -362919 -249138 -86617 -127630 -275115 -263663 -128332
34354 -128332 -99678 -158018 -116016 -53475 -208089 -465500 -445919 -150370 -39732 -327346
34344 -327346 -623709 -498193 -46160 336237 459122 381344 176978 -79240 -227450 -149773
34334 -149773 66981 225191 229127 143665 110607 233846 457693 560218 392169 117088
34324 117088 56281 277932 503873 462895 184703 -103673 -231646 -176656 -24112 88454
34314 88454 50104 -152154 -442562 -696132 -760867 -562983 -254298 -103414 -143225 -120827
34304 -120827 57565 88975 -247455 -604214 -451292 162469 642886 622191 310258 54698
34294 54698 -57258 -61293 61393 252538 323946 196861 13248 -91150 -146266 -206529 -233468
34283 -233468 -192831 -111697 694 135099 189819 82373 -66769 -79165 -17522 -81996 -229509
34272 -229509 -204125 27338 191987 135313 20236 2478 2333 -76150 -167723 -212848 -251930
34261 -251930 -250140 -100939 89473 33444 -267390 -403263 -127529 242692 263698 -36222
34251 -36222 -286496 -313552 -238134 -152756 -12309 181447 327570 367264 320341 200642 26769
34240 26769 -115910 -142839 -74530 4252 36560 -14032 -168774 -350719 -395951 -247955 -58710
34229 -58710 -2111 -63745 -104431 -55542 41148 123866 151613 97307 -30217 -180088 -302468
34218 -302468 -366158 -341571 -228263 -88528 11457 66340 76599 6465 -104782 -99367 78346
34207 78346 236273 210981 160630 309485 513759 438522 120121 -50963 60889 163194
34197 163194 71408 -9171 73951 98371 -134737 -403828 -383544 -117155 128072 273263
34187 273263 392755 437028 310684 125948 84807 159156 136549 -46505 -234848 -310452
34177 -310452 -335315 -412335 -515509 -492728 -226737 173970 391427 235299 -80261 -198251
34167 -198251 -118659 -145595 -328877 -342541 -45176 234361 201423 30057 3786 44657 -51746
34156 -51746 -183450 -134308 3898 -9600 -143774 -209525 -237634 -343373 -356717 -42306 388129
34145 388129 458927 128219 -152900 -127815 -31676 -96306 -198472 -188090 -180931 -285721 -358318
34134 -358318 -285380 -241699 -385617 -523595 -387507 -84564 57282 6465 56855 333565
34124 333565 576103 518646 258209 86992 102147 162469 167922 187852 274194 303101 125472
34113 125472 -187015 -380283 -315487 -125445 -24841 -37826 6068 222394 490857 571895
34103 571895 403156 220548 298489 579162 699729 454700 73049 -110805 -106399 -150193
34093 -150193 -255590 -213832 -34232 -9986 -223850 -323269 -5694 520393 803443 701065
34083 701065 431224 213010 93235 41391 6138 -73907 -171034 -158698 -19449 65217 -24146
34072 -24146 -141784 -111135 -15205 -40533 -156017 -183378 -101290 -46281 -66809 -89480 -87081
34061 -87081 -90873 -82323 -42871 -48079 -151526 -264248 -311982 -381882 -513943 -506824 -206003 145441
34049 145441 169920 -105323 -307665 -279229 -223456 -277108 -293792 -145694 59658 181204
34039 181204 225544 234326 204305 185489 246036 295194 171564 -59377 -159906 -114268 -163506
34028 -163506 -363430 -442737 -258918 -72308 -135658 -284346 -215687 25600 137806 10498
34018 10498 -195545 -340279 -418669 -410600 -246274 42257 279401 297809 82294 -205512
34008 -205512 -313246 -106404 241527 379382 183074 -93337 -167500 -78237 -39467 -88608
33998 -88608 -82148 41424 192759 283129 277594 144487 -80469 -228474 -179184 -71638 -134562
33987 -134562 -324402 -359319 -143867 75811 74455 -47136 -70014 -2032 -13399 -119185 -143136
33976 -143136 6794 209519 320057 341676 338414 295009 166834 -6590 -147998 -256099
33966 -256099 -363496 -417243 -335466 -178898 -113629 -158850 -119226 143023 492223 686195
33956 686195 655135 491916 271337 44367 -69252 7283 119261 9154 -330034 -606092
33946 -606092 -590226 -372996 -182932 -90959 -6962 115667 188307 94446 -147931 -336792
33936 -336792 -252191 66810 289111 159955 -165963 -325018 -214225 -43998 31555 57032
33926 57032 41870 -91371 -242124 -149489 172540 340715 145683 -132673 -208709 -249683
33916 -249683 -488698 -686806 -467099 9164 243076 195109 313725 727365 979007 752921
33906 752921 365764 245226 317605 254969 37793 -87155 -27109 93308 172715 191117
33896 191117 135359 65836 130958 333506 434985 280076 45030 -38121 -10548 -9214 20612
33885 20612 139447 145417 -144515 -495738 -530738 -298794 -164780 -207984 -180865 -41571 -36977
33874 -36977 -188442 -179059 98707 330654 310112 256514 365529 446397 313781 183693 316356
33863 316356 544618 536313 315109 151769 102803 18044 -114906 -176500 -178486 -214662 -229112
33852 -229112 -117037 29873 50307 -17567 -64737 -170259 -413530 -571254 -387057 -44850
33842 -44850 49446 -92631 -78064 178890 288138 22158 -324078 -407725 -294320 -210176
33832 -210176 -161139 -55936 42945 48492 40460 102687 127881 -10852 -221142 -296910 -159035
33821 -159035 125750 433556 590810 457978 127493 -113502 -123749 -47433 -21676 42742
33811 42742 240429 427932 394536 154475 -82203 -135537 27846 265984 297946 -35996
33801 -35996 -494904 -659809 -495308 -373714 -442034 -379366 -13913 258874 67063 -292555
33791 -292555 -295462 -11597 76941 -75490 -32320 325433 567867 438850 272370 417112
33781 417112 669633 620145 272927 -21978 -77515 -1115 74339 113665 76598 -78750 -284122
33770 -284122 -410283 -427804 -399352 -335381 -189723 7370 150495 227733 367279 639456
33760 639456 892439 892580 613165 289142 160321 233474 339017 350983 280788 208997 210152
33749 210152 302838 387410 293068 6965 -209950 -110389 175299 278813 98433 -84596
33739 -84596 -47825 80862 91462 -6415 -124629 -305355 -564128 -712349 -586888 -322513
33729 -322513 -160946 -111873 -38755 45032 31008 -37069 -51103 -88743 -272564 -441886 -309181
33718 -309181 54238 241447 90100 -94262 -29614 126758 55412 -251486 -518800 -561997
33708 -561997 -437027 -290849 -215523 -209829 -185996 -57264 127926 220976 188711 166540 213330
33697 213330 167508 -92030 -365722 -352200 -117343 -76314 -411249 -738736 -573595 3559
33687 3559 420886 352262 83464 20729 116282 55697 -166664 -237103 -61474 71429 -21591
33676 -21591 -105404 77155 349850 334270 5602 -269084 -223367 5945 106818 -25348
33666 -25348 -195144 -147985 118625 306635 145271 -257353 -523297 -466156 -265749 -150043
33656 -150043 -122991 -102380 -104883 -141949 -114994 25004 166973 222485 249984 275057 198600
33645 198600 36437 15497 233743 453690 458974 385891 442362 525419 423046 202268 72417
33634 72417 25325 -62853 -121960 -16431 146126 167745 102172 121329 172350 101795 -21611
33623 -21611 -62513 -138248 -389895 -597967 -476767 -211688 -200575 -359731 -237478 217210
33613 217210 569449 605807 555917 537023 364020 55142 -51799 96687 91955 -244358
33603 -244358 -496883 -308403 52367 138069 -30527 -132377 -64615 56538 182330 311600
33593 311600 361925 287441 152268 -44782 -363254 -630448 -514136 -61258 221010 58928
33583 58928 -200014 -178495 -56700 -199819 -534891 -719913 -688503 -620742 -564321 -463387
33573 -463387 -401622 -463745 -498935 -342408 -121900 -38672 -13205 131197 301210 291489 165559
33562 165559 136892 191064 156712 41023 -26400 -71675 -178300 -226764 -66046 158899 191847
33551 191847 83884 78633 166080 128127 -20452 -28929 144591 255910 188452 103343 102277
33540 102277 54007 -133090 -325377 -373229 -310604 -247177 -215785 -196494 -168579 -106315 -25951
33529 -25951 -15634 -103485 -158824 -74648 30915 -14141 -132108 -85827 158709 379449 407331
33518 407331 295584 176117 119255 141849 207329 221754 148460 87766 128787 196250 174307
33507 174307 90452 32611 -12845 -87204 -138918 -130449 -124412 -106549 78495 404142 513388
33496 513388 200849 -172257 -131914 201894 307075 68386 -91751 94479 392999 523157
33486 523157 537617 567550 532065 319991 25606 -180503 -251085 -224947 -153182 -125569 -194546
33475 -194546 -239526 -105610 108121 135195 -57511 -214086 -181936 -92776 -81621 -90780 -48217
33464 -48217 2361 38739 92030 74154 -158178 -486209 -576695 -371744 -223172 -363817 -545583
33453 -545583 -437647 -121939 89665 130727 170796 265949 321677 340608 430697 572871 614383
33442 614383 526825 482232 603939 767974 735279 428303 17750 -255420 -309074 -249278
33432 -249278 -190462 -118285 31005 229969 373284 377185 212007 -66678 -252270 -116616
33422 -116616 251176 419190 150743 -208754 -188303 118680 221392 3850 -154584 -67816
33412 -67816 -35579 -264001 -465849 -338703 -62481 34557 8586 109965 278316 244067
33402 244067 21649 -93343 8508 127592 112354 34294 -39562 -166100 -319461 -304699
33392 -304699 -31159 289755 391746 308525 301957 450343 496572 212358 -210426 -334975
33382 -334975 -48152 263814 218451 -79762 -256434 -212675 -174006 -262766 -333757 -265806 -136739
33371 -136739 -28228 103126 263724 345741 317002 303617 386566 479633 483074 400165 263650
33360 263650 127562 134396 348119 518661 328710 -81592 -212197 62533 276022 102935
33350 102935 -109990 105845 594641 804869 560539 194884 26025 57593 144393 168312
33340 168312 92080 37331 202622 537246 696516 527011 327112 343422 326992 -1368
33330 -1368 -351233 -277461 21123 -31136 -403935 -455207 8844 373939 172447 -233680
33320 -233680 -312125 -177041 -250910 -486903 -487220 -209572 -32812 -157806 -370950 -433317 -350497
33309 -350497 -182713 106600 470872 665255 494997 90677 -208894 -235873 -159088 -235797
33299 -235797 -455317 -528132 -264079 141384 320491 179650 -27180 -63315 38602 137818
33289 137818 209462 292224 356604 365455 366323 387285 324682 89044 -184639 -238177 -16533
33278 -16533 236555 256277 41307 -198562 -317145 -363315 -435413 -494997 -411190 -169707 65647
33267 65647 140725 83767 37215 80918 171883 189122 3488 -381536 -707401 -654874 -277872
33256 -277872 -32950 -169978 -316428 -1266 578429 772885 425254 90610 190765 450357
33246 450357 446073 285389 331174 536478 514509 154742 -235548 -381211 -303707 -133088
33236 -133088 57630 193022 201399 128871 82052 52179 -47468 -194604 -282551 -305854 -342453
33225 -342453 -379224 -342624 -273058 -267338 -274855 -172191 -23600 -19618 -143302 -159903 7364
33214 7364 147833 94642 -55798 -155982 -197762 -165658 50924 415473 627413 468552
33204 468552 112169 -123827 -187923 -227861 -240647 -77084 241932 488206 541918 522521
33194 522521 540939 516959 353379 149779 96921 209831 288279 159294 -108309 -277404
33184 -277404 -219040 -66220 -54975 -245806 -471616 -548924 -449218 -248232 -12105 211120
33174 211120 367671 430447 411166 320483 183248 89869 114134 162222 52434 -203687 -360246
33163 -360246 -259049 -37182 80010 25730 -173726 -504941 -837121 -884053 -532369 -70785
33153 -70785 135687 69800 -64700 -219250 -436974 -554779 -363354 -24407 64561 -152691
33143 -152691 -319320 -217322 -9423 150668 333850 503186 389794 -30871 -305185 -88976
33133 -88976 313133 375508 107081 -34313 140362 350391 353621 263767 269544 340694 347243
33122 347243 262319 127118 -28643 -134182 -86333 85355 174205 32748 -209872 -275032
33112 -275032 -65352 213007 283803 111217 -77592 -77352 69075 187809 228878 263499 271059
33101 271059 129320 -141667 -320966 -274616 -142108 -108360 -126939 -28042 187211 323405
33091 323405 240193 21743 -104087 5459 225110 249621 -27356 -300926 -230912 46483
33081 46483 114653 -37268 15188 359241 477593 60166 -428581 -462767 -291363 -453056
33071 -453056 -802851 -770189 -407058 -352884 -736532 -936432 -628740 -296347 -346890 -434087
33061 -434087 -154299 176773 62585 -291667 -310740 921 121880 -85118 -187392 65378
33051 65378 374808 421566 293946 197805 116831 -12032 -76580 15528 121436 61104 -112178
33040 -112178 -223680 -238481 -232114 -193780 -44805 185838 365787 436536 458252 464614 388197
33029 388197 179515 -77124 -238414 -270110 -280842 -371914 -488564 -466106 -236006 50365
33019 50365 152966 3407 -212805 -269812 -160688 -72159 -105896 -136787 -28753 98349
33009 98349 -19833 -411429 -764397 -778153 -491922 -167202 37882 144522 199737 215624
32999 215624 222999 235554 184346 27469 -103866 -28253 221503 414467 414651 310168 235786
32988 235786 219012 226731 213201 93782 -170989 -429742 -446371 -204023 62786 194911
32978 194911 281387 422942 522034 448462 255477 77846 -57722 -172921 -209600 -121164
32968 -121164 4495 64212 88268 122991 78348 -117411 -304633 -264523 -65396 749 -161666
32957 -161666 -328460 -314216 -234743 -284742 -421328 -441259 -286871 -107837 -41721 -69486 -96601
32946 -96601 -64307 47326 227675 395742 431882 317782 186358 158121 181435 128077 -106
32935 -106 -85042 -91169 -103287 -155201 -181070 -181058 -264870 -447261 -565664 -514907 -408818 -379291
32923 -379291 -376844 -328027 -317491 -402740 -404166 -143621 211349 317224 109500 -167106 -326454
32912 -326454 -382174 -381472 -367531 -444209 -593040 -516422 -15373 555138 637610 254150 -43520
32901 -43520 -33053 -71616 -346897 -485778 -230039 43147 -72652 -322617 -231894 84653
32891 84653 127257 -161091 -338410 -172304 104297 257572 320427 329173 191042 -59907
32881 -59907 -181790 -38637 213971 345607 285705 107421 -47901 -10016 274890 602013
32871 602013 660388 360341 -84585 -370694 -310248 68737 478257 542121 209013 -104280
32861 -104280 8830 427738 701454 650706 480413 366077 268552 168093 155732 215726
32851 215726 182712 1286 -191031 -302361 -391302 -470782 -426402 -223040 -13863 46025
32841 46025 -41584 -190200 -317690 -341795 -245298 -164284 -246408 -407668 -407781 -187134 53379
32830 53379 133485 71320 -48612 -197858 -343745 -422958 -414491 -319122 -97461 209076 362674
32819 362674 178615 -136171 -172643 130094 404663 378670 193562 107345 151249 219475
32809 219475 274905 318688 325092 311118 315279 262394 55823 -160660 -101540 217902 420686
32798 420686 276192 -544 -101651 -10174 131952 268335 347359 255909 44359 -31460
32788 -31460 93389 129008 -85105 -234247 -15193 294405 192135 -281051 -588419 -453966
32778 -453966 -132412 84476 207185 306247 305498 172044 31164 -57321 -205856 -448109
32768 -448109 -594289 -485990 -226807 -23183 63348 88004 81641 56884 48014 48013 3401 -64452
32756 -64452 -61702 -13758 -92063 -335615 -505274 -379989 -79247 93812 49261 -44472 -66047
32745 -66047 -80745 -157205 -234955 -248774 -250759 -319364 -429224 -483871 -421951 -246167 -11001
32734 -11001 176584 218889 145416 98302 139645 152898 17046 -205883 -373591 -478096 -596166
32723 -596166 -667793 -533757 -230271 -35447 -106320 -237700 -145635 126717 276731 151530
32713 151530 -109260 -324470 -462182 -535098 -486974 -288275 -32061 164659 276224 310006
32703 310006 232783 65859 -34550 50739 190053 137819 -96548 -206790 -9452 265467
32693 265467 271288 15412 -184781 -166791 -96283 -152713 -293821 -419504 -523953 -550698 -353274
32682 -353274 -4570 107033 -224481 -650516 -742529 -634183 -738688 -975184 -853012 -324399
32672 -324399 69165 49683 -11296 169689 263121 -42656 -409197 -379741 -133058 -117852
32662 -117852 -252757 -128289 211040 352743 272404 339695 584350 598382 244798 -119170
32652 -119170 -234660 -217114 -140082 90058 300367 85431 -495088 -820375 -595954 -284759
32642 -284759 -306438 -368320 -71450 309125 254237 -118833 -236951 40759 304196 293918
32632 293918 183239 138442 70369 -76846 -164387 -114788 -53330 -80987 -118646 -73082 2175
32621 2175 -9856 -142970 -312496 -370062 -236098 -31569 28100 -57576 -39625 180090 325758
32610 325758 144090 -163667 -199803 56715 250097 170953 -26115 -134517 -146841 -137732
32600 -137732 -115742 -66800 -1128 77092 138875 98383 -61245 -190531 -157877 -55589 -31866
32589 -31866 576 237147 597423 749718 562085 275934 140501 92203 -66393 -320500
32579 -320500 -436287 -257369 84620 264677 72457 -356377 -658579 -625397 -388825 -184420
32569 -184420 -71547 -3185 -10770 -112534 -147528 50630 355192 458423 281759 63931
32559 63931 29373 165063 343087 470921 484381 362835 192709 82503 16931 -61730
32549 -61730 -73960 84992 278905 240576 -11546 -139438 25050 211669 106372 -189125
32539 -189125 -317597 -164408 46847 128966 177870 370569 661255 815592 717434 513963
32529 513963 406475 399981 370528 300149 265604 229117 82617 -65357 64473 459080 687409
32518 687409 458673 48118 -107815 3196 123865 233142 462250 663976 567692 309667
32508 309667 294985 509474 495504 114473 -198727 -137085 31672 1335 -57065 112269
32498 112269 328101 275856 57207 4437 140883 234705 242739 306249 408488 410636 356238
32487 356238 390254 438842 315849 92490 10 -350 -159718 -439851 -480476 -167936 147751
32476 147751 174362 78914 140353 278612 217502 -52572 -264383 -262493 -166663 -148280 -215633
32465 -215633 -256153 -191380 -51057 71981 126967 153939 200716 226605 162051 28945 -105197
32454 -105197 -256932 -460991 -597321 -488415 -204987 -55696 -179244 -350518 -315177 -113748
32444 -113748 86790 277036 496398 611107 474555 203851 26685 -59494 -186917 -263736
32434 -263736 -87666 198076 176748 -208623 -487145 -316314 50653 209289 184547 224182
32424 224182 278699 110085 -229369 -450576 -488420 -502508 -458956 -156575 289435 449350
32414 449350 209904 -15129 82327 250060 144081 -88533 -74047 177640 342855 334285
32404 334285 365984 503873 547918 420843 325153 376457 359737 50615 -396830 -602469
32394 -602469 -440095 -187205 -174164 -400420 -577346 -508398 -306531 -178107 -116135 16333
32384 16333 160457 84447 -215373 -414753 -313716 -135818 -159494 -281050 -233883 -62584
32374 -62584 -30175 -151885 -183141 -44940 83308 109283 134103 167528 62249 -181175 -345499
32363 -345499 -338964 -317792 -345757 -232290 105602 382740 281691 -125379 -494209 -607840
32353 -607840 -492691 -286777 -167764 -278712 -548714 -692258 -533895 -224029 -6755 82110
32343 82110 134606 143638 56175 -51633 -47331 73179 221458 355176 444414 403910 213106
32332 213106 6185 -106903 -199058 -350594 -449537 -364968 -200957 -153040 -204962 -203498 -157207
32321 -157207 -203586 -320197 -327242 -176513 -10108 67851 66873 -18825 -180232 -259132 -115785
32310 -115785 67619 -42681 -405846 -573234 -301871 105381 250116 147817 51353 4252
32300 4252 -124532 -297487 -316524 -148064 10023 6380 -99988 -170204 -134342 -1168 156040
32289 156040 222667 161893 95849 154444 268278 247108 56108 -132097 -181043 -145510 -133201
32278 -133201 -129704 -37875 174892 427388 589309 580636 446429 320076 260745 177353 12060
32267 12060 -71717 126191 481609 608028 360270 47635 -1573 126117 146555 44274
32257 44274 19290 65315 -46834 -340078 -513761 -369400 -84232 88798 154248 219407
32247 219407 219394 45209 -188530 -257790 -140968 2180 98633 188925 245049 203781 145225
32236 145225 175058 142133 -218787 -804637 -1123342 -904407 -458490 -232659 -244731 -209530
32226 -209530 -43210 65666 16417 -54664 -394 162607 328905 409000 356277 208147
32216 208147 79710 18166 -64504 -195355 -205416 7078 200188 64242 -284331 -420022
32206 -420022 -228433 -40717 -55434 -19097 295832 640473 645521 385251 214216 189790
32196 189790 54590 -247642 -424706 -275901 19766 165775 82562 -112416 -275668 -304089
32186 -304089 -182941 -32263 21586 30699 122538 234872 187309 24260 -2398 142988 195478
32175 195478 63171 43642 329250 599958 436715 -69870 -464800 -532029 -416706 -267048
32165 -267048 -110711 -18588 -43498 -29365 195031 475436 525332 410762 449757 643771
32155 643771 655537 406530 219585 227036 117305 -292350 -671135 -669361 -419724 -214788
32145 -214788 -41117 184399 240560 -78545 -499344 -583933 -348103 -128915 13046 284319
32135 284319 642507 780682 627340 428510 316087 202236 113797 203365 381582 363083
32125 363083 149551 47653 128949 122643 -38862 -53298 182354 321540 155653 -8912
32115 -8912 103417 249582 137438 -11284 129586 329878 134288 -324107 -446433 -65914
32105 -65914 343267 417178 342167 392259 484357 432259 295232 215000 163840 94469 121070
32094 121070 303551 427679 262480 -74813 -256384 -176806 -20603 56940 76333 52043
32084 52043 -96080 -351708 -494730 -328502 62943 398302 500845 434080 372049 420823
32074 420823 557131 671832 670702 572911 487404 456413 393971 263827 218872 385227 569346
32063 569346 443250 51818 -166523 -1103 194239 33077 -307004 -380031 -174415 -76712
32053 -76712 -205887 -263657 -102893 20368 -77364 -196281 -143502 -58769 -71893 16508 355397
32042 355397 634101 483722 99906 3196 261237 415304 206989 -60118 -20872 242025
32032 242025 391145 295233 90004 -71952 -152048 -183578 -218266 -268253 -252073 -72855 220538
32021 220538 447262 498799 425739 298483 114576 -100120 -230679 -212516 -146820 -175881
32011 -175881 -284411 -307874 -135875 137606 292192 229787 128521 254712 579557 722103
32001 722103 414107 -95427 -318628 -153853 32751 -35511 -205230 -229166 -165624 -210127
31991 -210127 -309385 -225513 72617 332508 350957 193916 41922 -28413 -43145 -27664 16432
31980 16432 94717 227675 416347 569879 548861 341915 128758 76909 113177 4800
31970 4800 -321647 -641726 -671202 -382117 -6716 242847 364440 459301 532341 491547 324057
31959 324057 168879 155267 219839 177799 -11432 -146688 -36177 212602 288772 73012
31949 73012 -208544 -293369 -201465 -113356 -56077 74529 227938 192001 -66649 -270464 -161979
31938 -161979 181039 478007 562620 451809 238012 66923 104213 340503 513586 418115
31928 418115 223904 259731 511287 600282 319556 -63270 -178199 -41826 12899 -208248
31918 -208248 -561835 -786785 -768238 -580744 -391057 -337894 -416396 -464160 -342048 -137660
31908 -137660 -87458 -258997 -422766 -335071 -69659 68614 -59087 -259474 -277065 -104930
31898 -104930 57199 64987 -53295 -182320 -211454 -75291 181094 382698 375159 204201
31888 204201 56579 21503 9028 -86489 -250181 -401522 -484025 -462006 -321514 -123951
31878 -123951 12869 23933 -71576 -245995 -471389 -647870 -655281 -516622 -387457 -339946
31868 -339946 -291440 -198276 -158006 -223637 -275761 -219574 -177784 -315338 -554241 -637523 -448114
31857 -448114 -128929 99064 141597 81060 91335 250362 390629 248182 -165045 -497229
31847 -497229 -504440 -390331 -476974 -682747 -643875 -308942 -57614 -144029 -335489 -285764 -34411
31836 -34411 104644 17808 -100366 -82956 -7237 -20052 -110147 -160535 -138788 -113345 -101623
31825 -101623 -19220 175420 366764 394367 247161 64843 -44251 -101386 -162021 -209590
31815 -209590 -191643 -110101 -28809 -6619 -32730 -20198 97456 227861 158355 -168620 -500358
31804 -500358 -553035 -388874 -308077 -390331 -408029 -245070 -114376 -209238 -380234 -366536 -174779
31793 -174779 -13249 20967 -21321 -114237 -252193 -335463 -259378 -93491 -14996 -78868 -168738
31782 -168738 -148284 19014 244194 349429 228509 19542 -30675 70030 45847 -194153
31772 -194153 -357052 -212514 30012 67303 -11126 67795 243422 222102 14284 -43749
31762 -43749 176490 401367 364519 119808 -122997 -223933 -121288 143165 347432 258882
31752 258882 -56332 -281297 -243603 -82253 -871 -38907 -107462 -87996 96323 352833
31742 352833 425035 214482 -4244 57436 237936 154080 -174466 -328292 -132426 114709
31732 114709 156184 129915 233381 368624 343672 182854 29694 -71250 -126015 -90293
31722 -90293 39379 173122 261956 337626 364659 244043 30086 -60537 59303 227592
31712 227592 268885 174352 19503 -98046 -36157 237590 473774 399505 137911 41686
31702 41686 118492 37473 -240662 -324384 -47680 216113 166323 63361 253091 563935
31692 563935 583845 288391 10575 -36488 119800 398183 664703 699290 441261 133031
31682 133031 -1834 -36153 -83776 -32791 177302 286017 92897 -115731 57280 474363
31672 474363 635219 409768 164944 175175 308964 343787 242079 39865 -246475 -514366
31662 -514366 -601201 -480504 -257459 34639 434079 842038 1025870 884475 570896 325435
31652 325435 280376 396088 492234 401224 173484 26134 16481 -44829 -234264 -322758 -165250
31641 -165250 -31209 -225919 -574648 -657075 -432237 -236345 -216432 -168007 39300 241030
31631 241030 274801 214051 203511 269813 364890 431470 398087 253965 108148 31296 -83593
31620 -83593 -320899 -508704 -422103 -132711 100754 209316 303827 367863 281803 121489
31610 121489 107230 243825 311564 236792 180842 225147 245236 151216 13641 -90052 -145479
31599 -145479 -118827 -10177 57954 31282 103140 410042 664807 481928 4942 -231417
31589 -231417 -66850 118382 61679 -40225 9074 69039 12543 15464 227827 470098 512276
31578 512276 394892 256187 95683 -85520 -157759 -72510 36192 120305 312044 575694
31568 575694 579070 156085 -375026 -611924 -543788 -384891 -193543 55915 243232 245734
31558 245734 145483 44912 -129776 -390217 -481257 -230989 84296 67327 -243976 -474140
31548 -474140 -447506 -304142 -176409 -79014 -60963 -158724 -240043 -173398 -94737 -218437 -444983
31537 -444983 -472315 -266402 -98130 -109368 -159221 -133166 -98882 -96932 -64459 -37065 -144080
31526 -144080 -315685 -281746 9282 239719 157463 -75563 -164626 -106159 -98851 -181850 -216932
31515 -216932 -157288 -97303 -74771 -31242 16871 -45997 -237727 -409437 -443203 -395953 -368098
31504 -368098 -343459 -267361 -189150 -186545 -209126 -161824 -116552 -243254 -501898 -618287 -464538
31493 -464538 -258002 -223969 -251375 -109450 143366 248435 158982 61607 22382 -67331 -176525
31482 -176525 -107972 125544 226118 59968 -116578 -67896 62887 46609 -19079 118830
31472 118830 439183 676380 695225 593525 492439 432539 421844 408440 277086 38382
31462 38382 -83471 55390 248989 198824 -48262 -183087 -107989 -47289 -168708 -355859
31452 -355859 -428615 -376860 -279007 -154671 -12564 64087 -368 -135890 -151300 61722 347245
31441 347245 380118 44901 -338583 -366353 -114747 -62876 -371046 -602342 -399095 -74833
31431 -74833 -130875 -450964 -492903 -158103 87936 -13566 -162169 -66907 104697 84965
31421 84965 -67053 -168781 -237033 -325912 -299095 -61123 186846 220987 162033 262717 449646
31410 449646 406403 73937 -240930 -293067 -185388 -152464 -247647 -343288 -318047 -150871 99323
31399 99323 330328 444077 416886 335529 340493 488991 650420 597098 273185 -85991 -224387
31388 -224387 -198384 -254926 -407930 -403069 -166085 11860 -87352 -246004 -144661 134085
31378 134085 237301 55278 -203018 -366510 -414083 -280911 84804 445146 422833 38152
31368 38152 -243747 -157230 8296 -79210 -257657 -186661 54605 121381 27276 127219 446907
31357 446907 510889 48839 -505353 -550536 -131520 150923 -34527 -372108 -412613 -172993
31347 -172993 -30989 -169434 -356807 -293706 -5490 230011 279843 313126 498116 687240
31337 687240 592390 239072 13604 167826 476016 559326 405493 320124 418197 448977
31327 448977 202249 -140536 -221503 48675 414805 588481 506052 299623 127759 61890
31317 61890 78008 120106 165768 218836 252232 212810 101653 -1128 -23938 21447 80892
31306 80892 139811 235183 405302 635906 834287 875325 727987 522799 418435 404189
31296 404189 325918 117690 -102816 -209051 -222798 -224426 -202140 -90028 101293 285812
31286 285812 400344 425205 337896 128173 -138773 -323345 -290277 789 436230 777973
31276 777973 826605 590490 246110 -65354 -310569 -437283 -337445 -27635 260195 302729
31266 302729 138385 -10349 -12183 78306 151067 152996 89106 3326 -41607 -15813 56023
31255 56023 133813 169005 80770 -152652 -352188 -254466 135929 466389 435963 131566 -173480
31244 -173480 -383673 -536905 -554482 -326965 15704 210724 233560 296984 469306 572703
31234 572703 515551 443480 447739 383408 143487 -100350 -129321 9762 129491 216869 391193
31223 391193 599521 586724 217953 -311981 -657224 -645598 -400032 -184822 -150213 -212217
31213 -212217 -190734 -58333 12385 -118608 -348963 -428963 -235208 113601 399350 510217
31203 510217 503263 495400 511911 468270 324345 204535 266665 457170 523551 325015 19503
31192 19503 -149804 -164454 -203683 -361415 -537878 -615256 -596341 -509973 -300887 63680 425499
31181 425499 513872 238426 -177324 -425098 -440442 -434935 -610038 -909949 -1087492 -972353
31171 -972353 -631928 -272105 -8913 223244 503006 703628 580159 142402 -211279 -122776
31161 -122776 244047 399230 193189 -13201 65667 208539 72623 -247878 -382236 -264387
31151 -264387 -194826 -345844 -532033 -526785 -339564 -99895 109477 221536 190426 115141
31141 115141 175534 365963 473947 396310 271335 204417 98521 -89005 -155744 47061
31131 47061 305061 311070 132126 93721 233806 216982 -114075 -410646 -263819 211006
31121 211006 515592 436252 281541 381566 605573 585725 276716 17124 47128 236383
31111 236383 372482 465727 596239 663224 523285 250088 16353 -180956 -416921 -549210
31101 -549210 -357179 39520 240331 109623 -52257 7067 149277 156277 92556 116575
31091 116575 157936 60879 -100502 -126540 -23504 20327 -57844 -134560 -124801 -72570 -19468
31080 -19468 54909 152491 234903 274452 245631 122546 -26711 -39387 122909 259898 198808
31069 198808 73862 136523 359723 471326 367727 252341 314268 475226 543548 469493
31059 469493 354822 304407 331818 345972 215901 -70144 -319039 -319187 -111907 54594 54956
31048 54956 17613 76929 155291 109555 -14689 -32680 97239 181535 40952 -225547 -331579
31037 -331579 -164411 54771 58462 -105680 -161857 -21385 108596 83412 48666 162071
31027 162071 295386 231756 12423 -155644 -230875 -316792 -387114 -317829 -171506 -157299 -271429
31016 -271429 -246830 61550 468727 719178 754216 649305 484143 350770 300826 222955
31006 222955 -21301 -289724 -250972 114653 392602 285021 14515 -52885 56000 59264
30996 59264 -84656 -157370 -72443 33380 82076 142776 217999 192350 46973 -77795 -87715
30985 -87715 -34229 27385 115198 220382 289284 341458 445664 538101 434196 90066 -297116
30974 -297116 -524236 -585044 -574385 -536171 -491013 -474477 -449015 -312529 -103359 -50278 -264442
30963 -264442 -505680 -450903 -125800 128748 90333 -134848 -325563 -370895 -256250 -24655
30953 -24655 173889 169564 6703 -66643 48885 133492 -12054 -225785 -219900 -36683 34258
30942 34258 -43727 10758 279743 416540 154944 -230785 -292402 -63596 18999 -197980
30932 -197980 -355511 -126771 321911 590255 549905 392079 304238 299800 317178 328921 349066
30921 349066 407130 498560 543169 474823 391140 465627 640428 592878 168884 -311381 -416841
30910 -416841 -183448 -59027 -282135 -590016 -622187 -382102 -155257 -124678 -224262 -287439
30900 -287439 -210321 -16853 143541 113264 -78508 -200514 -92143 108711 130264 -72305
30890 -72305 -258249 -221632 -40113 69372 49532 38033 128421 225578 198884 92871 75233
30879 75233 194712 305960 266566 107168 -55884 -181679 -279408 -298222 -180748 79
30869 79 97795 93126 105199 175376 176723 4610 -256188 -440762 -495368 -472420 -405793 -290690
30857 -290690 -149905 -35088 21910 9982 -71619 -179118 -233313 -215365 -188029 -159060 -14918
30846 -14918 295705 584715 587894 289801 -63388 -284089 -418207 -550957 -603242 -455059
30836 -455059 -179846 5936 22482 23417 163861 366334 413928 245324 41562 -25509 -32721
30825 -32721 -178436 -459949 -636857 -551436 -330933 -178751 -105197 -8229 100247 147241
30815 147241 194852 335400 413896 147349 -404025 -769294 -635128 -243786 -9535 43774
30805 43774 159993 321318 245196 -81660 -265305 -67645 196662 82941 -349561 -615997
30795 -615997 -452263 -110752 26887 -82861 -176977 -60920 182539 332686 279350 98150
30785 98150 -78697 -202059 -287164 -302200 -165184 124241 420896 551276 456312 198924
30775 198924 -95209 -265713 -191401 64618 256557 216736 60318 10579 81850 102264
30765 102264 27363 34488 257535 588527 811658 806837 568669 169494 -222563 -430490
30755 -430490 -457618 -452619 -418431 -160560 332228 678873 537661 110135 -85128 111897
30745 111897 353806 322587 117338 12016 70490 149641 130810 19962 -86895 -70651
30735 -70651 78524 174633 29535 -242696 -305826 -46118 266900 358441 279926 233960 268386
30724 268386 306228 300643 187780 -132707 -570763 -783000 -583480 -260933 -206556 -359401
30714 -359401 -351133 -116561 22613 -100815 -249372 -191312 -57397 -111359 -367317 -598370
30704 -598370 -597514 -332231 35279 226212 94442 -158693 -192081 20747 164776 61603
30694 61603 -100716 -132144 -132454 -205711 -165940 149693 465291 351031 -132005 -439245 -244524
30683 -244524 173131 355577 226478 57853 47319 132131 165832 109136 21783 -34612 -32215
30672 -32215 44168 191192 338392 349094 144805 -153112 -273495 -47179 409132 792734
$$ [...]
##END NTUPLES=NMR SPECTRUM
##END=
