##TITLE=31Pdec_40-2021
 CDCl3, 24 sc
 10.06.2021
##JCAMPDX= 6.0         $$ Bruker NMR JCAMP-DX V2.0
##DATA TYPE= NMR SPECTRUM
##DATA CLASS= NTUPLES
##ORIGIN= UXNMR, Bruker Analytische Messtechnik GmbH
##OWNER= root
$$ XWIN-NMR		Version 3.5
$$ Thu Jun 10 10:28:24 2021 Russian Standard Time (UT+4h)  she@DPX200
##.OBSERVE FREQUENCY= 81.013821
##.OBSERVE NUCLEUS= ^31P
##.ACQUISITION MODE= SIMULTANEOUS
##.ACQUISITION SCHEME= undefined
##.AVERAGES= 24
##.DIGITISER RES= 16
##SPECTROMETER/DATA SYSTEM= spect
##.PULSE SEQUENCE= zgpg30
##.SOLVENT NAME= CDCl3
##.SHIFT REFERENCE= (INTERNAL, CDCl3, 0, 248.564)
##AUDIT TRAIL= $$ (NUMBER, WHEN, WHO, WHERE, WHAT)
$$ ##TITLE= Audit trail, XWIN-NMR		Version 3.5
$$ ##JCAMPDX= 5.01
$$ ##ORIGIN= Bruker BioSpin GmbH
$$ ##OWNER= she
$$ F:/spectra/data/she/nmr/P31/1/pdata/1/auditp.txt
$$ ##AUDIT TRAIL=  $$ (NUMBER, WHEN, WHO, WHERE, WHAT)
(   1,<2021-06-10 10:27:18.00 +0400>,<she>,<DPX200>,
      <created by zg, POWCHK disabled, PULCHK disabled
       configuration hash MD5:
       00 E9 B6 7A A2 85 ED C7 34 08 36 98 17 FE 4E 26
       data hash MD5: 32K
       CC BD 4B 3A B9 61 C4 D0 4F 3F 1D 95 46 AF E2 2A>)
(   2,<2021-06-10 10:27:20.54 +0400>,<she>,<DPX200>,
      <Start of raw data processing
       efp BC_mod = 2 LB = 1 FT_mod = 6 PKNL = 1 PHC0 = -6006.031 PHC1 = 357.8748 SI = 64K 
       data hash MD5: 64K
       56 40 80 B6 74 7C A5 03 18 77 70 6C B4 13 9E 2A>)
(   3,<2021-06-10 10:27:51.68 +0400>,<she>,<DPX200>,
      <pk PHC0 = 173.8612 PHC1 = -354.4 
       data hash MD5: 64K
       31 77 54 A8 62 22 37 B7 82 23 9A 9C A2 CE DC CD>)
(   4,<2021-06-10 10:27:55.62 +0400>,<she>,<DPX200>,
      <abs ABSG = 5 
       data hash MD5: 64K
       77 CD DE D2 4E A0 6E 74 51 DC 8D 7C 0C CB 03 73>)
$$ ##END=
$$ 
$$ hash MD5
$$ C3 A8 AE 48 5C 48 28 60 B2 4B 2B 79 16 37 00 D9
##$RELAX= 
##$RELAX= 
##$RELAX= 
##$RELAX= 
##$RELAX= 
##$RELAX= 
##$RELAX= 
##$RELAX= 
$$ Bruker specific parameters
$$ --------------------------
##$DU= <F:/spectra>
##$EXPNO= 1
##$NAME= <P31>
##$PROCNO= 1
##$TYPE= <nmr>
##$USER= <she>
##$AMP= (0..31)
100 100 100 100 100 100 100 100 100 100 100 100 100 100 100 100 100 100 
100 100 100 100 100 100 100 100 100 100 100 100 100 100 
##$AQSEQ= 0
##$AQ_mod= 1
##$AUNM= <au_zg>
##$AUTOPOS= <>
##$BF1= 81.014009
##$BF2= 200.13
##$BF3= 200.13
##$BF4= 200.13
##$BF5= 200.13
##$BF6= 200.13
##$BF7= 200.13
##$BF8= 200.13
##$BYTORDA= 1
##$CFDGTYP= 0
##$CFRGTYP= 5
##$CHEMSTR= <none>
##$CNST= (0..31)
1 1 145 1 1 1 1 1 1 1 1 1 1 1 1 1 1 1 1 1 1 1 1 1 1 1 1 1 1 1 1 1 
##$CPDPRG= <waltz16>
##$CPDPRG1= <>
##$CPDPRG2= <waltz16>
##$CPDPRG3= <>
##$CPDPRG4= <mlev>
##$CPDPRG5= <mlev>
##$CPDPRG6= <mlev>
##$CPDPRG7= <mlev>
##$CPDPRG8= <mlev>
##$CPDPRGB= <>
##$CPDPRGT= <>
##$D= (0..31)
0 1 0 0 0 0 0 0 0 0 0 0.03 2e-05 3e-06 0 0 0 0 0 0 0 0 0 0 0 0 0 0 0 0 
0 0 
##$DATE= 1623306437
##$DBL= (0..7)
120 120 120 11 120 120 24 19 
##$DBP= (0..7)
150 150 150 150 150 150 150 150 
##$DBP07= 0
##$DBPNAM0= <>
##$DBPNAM1= <>
##$DBPNAM2= <>
$$ [...]
##$SUBNAM3= <"">
##$SUBNAM4= <"">
##$SUBNAM5= <"">
##$SUBNAM6= <"">
##$SUBNAM7= <"">
##$SUBNAM8= <"">
##$SUBNAM9= <"">
##$SW= 501.771253377433
##$SWIBOX= (0..15)
0 1 3 0 0 0 0 0 0 0 0 0 0 0 0 0 
##$SW_h= 40650.406504065
##$TD= 32768
##$TD0= 1
##$TE= 0
##$TE2= 300
##$TE3= 300
##$TEG= 300
##$TL= (0..7)
0 120 53 12 22 120 120 120 
##$TP= (0..7)
150 150 150 150 150 150 150 150 
##$TP07= 0
##$TPNAME0= <>
##$TPNAME1= <>
##$TPNAME2= <>
##$TPNAME3= <>
##$TPNAME4= <>
##$TPNAME5= <>
##$TPNAME6= <>
##$TPNAME7= <>
##$TPOAL= (0..7)
0.5 0.5 0.5 0.5 0.5 0.5 0.5 0.5 
##$TPOFFS= (0..7)
0 0 0 0 0 0 0 0 
##$TUNHIN= 0
##$TUNHOUT= 0
##$TUNXOUT= 0
##$USERA1= <user>
##$USERA2= <user>
##$USERA3= <user>
##$USERA4= <user>
##$USERA5= <user>
##$V9= 5
##$VALIST= <valist>
##$VCLIST= <CCCCCCCCCCCCCCC>
##$VD= 0
##$VDLIST= <DDDDDDDDDDDDDDD>
##$VPLIST= <PPPPPPPPPPPPPPP>
##$VTLIST= <TTTTTTTTTTTTTTT>
##$WBST= 1024
##$WBSW= 4
##$XGAIN= (0..3)
0 0 0 0 
##$XL= 0
##$YL= 0
##$YMAX_a= 6779
##$YMIN_a= -6725
##$ZGOPTNS= <>
##$ZL1= 120
##$ZL2= 120
##$ZL3= 120
##$ZL4= 120
##$ABSF1= 248.5645
##$ABSF2= -253.2056
##$ABSG= 5
##$ABSL= 3
##$ALPHA= 0
##$AQORDER= 0
##$ASSFAC= 0
##$ASSFACI= 0
##$ASSFACX= 0
##$ASSWID= 0
##$AUNMP= <proc_1d>
##$AZFE= 0.1
##$AZFW= 0.5
##$BCFW= 0
##$BC_mod= 2
##$BYTORDP= 0
##$COROFFS= 0
##$CY= -3
##$DATMOD= 1
##$DC= 0
##$DFILT= <>
##$DTYPP= 0
##$F1P= 0
##$F2P= 0
##$FCOR= 1
##$FTSIZE= 65536
##$FT_mod= 6
##$GAMMA= 0
##$GB= 0
##$INTBC= 1
##$INTSCL= 5.30512e-09
##$ISEN= 30
##$LB= 1
##$LEV0= 0
##$LPBIN= 0
##$MAXI= 10000
##$MC2= 0
##$MEAN= 0
##$ME_mod= 0
##$MI= 50
##$NCOEF= 0
##$NC_proc= -4
##$NLEV= 6
##$NOISF1= 182.463
##$NOISF2= 159.3651
##$NSP= 0
##$NTH_PI= 0
##$NZP= 0
##$OFFSET= 248.5645
##$PC= 4
##$PHC0= -5832.169
##$PHC1= 3.474792
##$PH_mod= 1
##$PKNL= yes
##$PPARMOD= 0
##$PSCAL= 0
##$PSIGN= 0
##$REVERSE= no
##$SF= 81.014009
##$SI= 65536
##$SIGF1= 159.3651
##$SIGF2= -187.1042
##$SINO= 113.3802
##$SIOLD= 16384
##$SREGLST= <1H.CDCl3>
##$SSB= 0
##$STSI= 65536
##$STSR= 0
##$SW_p= 40650.406504065
##$SYMM= 0
##$S_DEV= 0
##$TDeff= 32768
##$TDoff= 0
##$TI= <>
##$TILT= no
##$TM1= 0
##$TM2= 0
##$TOPLEV= 0
##$USERP1= <user>
##$USERP2= <user>
##$USERP3= <user>
##$USERP4= <user>
##$USERP5= <user>
##$WDW= 1
##$XDIM= 65536
##$YMAX_p= 430627561
##$YMIN_p= -1747896
$$ End of Bruker specific parameters
$$ ---------------------------------
##NTUPLES= NMR SPECTRUM
##VAR_NAME=  FREQUENCY,     SPECTRUM/REAL,   SPECTRUM/IMAG
##SYMBOL=    X,             R,               I
##VAR_TYPE=  INDEPENDENT,   DEPENDENT,       DEPENDENT
##VAR_FORM=  AFFN,          ASDF,            ASDF
##VAR_DIM=   65536,         65536,           65536
##UNITS=     HZ,            ARBITRARY UNITS, ARBITRARY UNITS
##FACTOR=    0.620285442955139, 1,           1
##FIRST=     20137.2065510759, 0,            0
##LAST=      -20513.1999529892, 0,           0
##MIN=       -20513.1999529892, -1747896,    0
##MAX=       20137.2065510759, 430627561,    0
$$ Real data points
##PAGE= N=1
##DATA TABLE= (X++(R..R)), XYDATA
$$ [...]
$$ plain form
39286 -213055 -240433 -114668 -102201 -129433 66202 378292 396033 30837 -344070 -432892
39276 -432892 -317979 -156211 54383 292665 421370 402576 346656 271964 91298 -103876
39266 -103876 -63144 215924 404369 293410 55034 -67974 -56376 25126 176619 319206
39256 319206 270004 31110 -133321 -67653 57097 46209 -34350 -39226 16017 58078 87421
39245 87421 69533 -71414 -225891 -149742 108555 165294 -98056 -253053 40263 450624
39235 450624 444935 85785 -122186 -33291 7571 -182921 -333872 -196386 74451 194096
39225 194096 137691 76903 103851 167293 181970 109445 -9847 -84519 -87247 -91512 -108915 -6377
39213 -6377 245854 370986 99036 -379171 -586982 -403819 -201487 -253856 -352696 -209457
$$ packed form
39286b13055k7378J25765J2467k7232J95635L12090J7741l65196l74907q8822
39276d32892J14913J61768K10594K38282J28705j8794n5920p4692j80666j95174
39266a03876M0732K79068J88445j10959k38376j23008J1598Q1502J51493J42587
39256C19206m9202k38894j64431O5668J24750j0888q0559m876N5243M2061K9343
39245H7421j7888j40947j54477P6149K58297N6739k63350j54997K93316M10361
39235D50624n689l59150k07971Q8895M0862j90492j50951J37486K70837J19645
39225A94096n6405o0788K6948O3442J4677p2525j19292p4672k728m265j7403J02538
39213f377K52231J25132k71950m78207k07811J83163K02332n2369r8840J43239
$$ plain form
39203 -209457 48131 76285 -149853 -305430 -169838 140392 391050 469305 373811 155075
39193 155075 -58059 -104413 46025 240173 304845 209285 47612 -62511 -39391 107258
39183 107258 227952 138166 -142504 -335990 -205780 134360 336592 227091 -33047 -205844
39173 -205844 -250248 -268457 -297334 -276389 -182148 -85112 -59314 -94857 -123287 -107926 -89183
39162 -89183 -126050 -196682 -207951 -136116 -80615 -90699 -25353 248995 568833 605209 309270
39151 309270 -6799 -104245 -82815 -90085 -45183 123235 210575 22699 -236790 -216559 38638
39140 38638 161616 48591 -15769 129570 264902 188433 45867 55720 156707 158201 60368
39129 60368 -2339 -10740 -45233 -104418 -115943 -63928 37289 218512 458157 586449 450971
$$ packed form
39203b09457K57588K8154k26138j55577J35592L10230K50658P8255r5494k18736
39193A55075k13134m6354J50438J94148O4672r5560j61673j10123K3120J46649
39183A07258J20694q9786k80670j93486J30210L40140K02232j09501k60138j72797
39173b05844m4404j8209k8877K0945R4241R7036K5798l5543k8430J5361J8743
39162h9183l6867p0632j1269P1835N5501j0084O5346K74348L19838L6376k95939
39151C09270l16069r7446K1430p270M4902J68418Q7340j87876k59489K0231K55197
39140C8638J22978j13025o4360J45339J35332p6469j42566R853J00987J494r7833
39129F0368o2707q401l4493n9185j1525N2015J01217J81223K39645J28292j35478
$$ plain form
39118 450971 132696 -149266 -301369 -370284 -344654 -152576 111312 160395 -148998 -561133
39108 -561133 -647592 -278935 232534 476721 347155 56249 -165186 -269772 -314478 -323043
39098 -323043 -300055 -286514 -297498 -257724 -103458 85331 163399 118668 88839 173883 321122
39087 321122 411977 394578 320551 296777 382402 488809 437002 190543 -37418 -26727 152738
39076 152738 226826 70070 -177856 -339007 -380330 -348786 -276434 -205085 -188362 -208481 -168529
39065 -168529 -5492 242728 479609 600337 540738 365262 254335 291334 322478 167206
39055 167206 -99421 -250199 -234594 -195238 -191613 -147276 -75494 -103349 -221524 -248402 -114919
39044 -114919 36439 106069 155403 187916 75684 -157575 -240459 -44292 145727 -3103
$$ packed form
39118D50971l18275k81962j52103o8915K5630J92078K63888M9083l09393m12135
39108e61133q6459L68657N11469K44187j29566k90906k21435j04586m4706q565
39098c23043K2988J3541j0984L9774J54266J88789P8068m4731k9829Q5044J47239
39087C21122R0855j7399p4027k3774Q5625J06407n1807k46459k27961J0691J79465
39076A52738P4088j56756k47926j61151m1323L1544P2352P1349J6723k0119L9952
39065a68529J63037K48220K36881J20728n9599j75476j10927L6999L1144j55272
39055A67206k66627j50778J5605L9356L625M4337P1782k7855j18175k6878J33483
39044a14919J51358O9630M9334L2513j12232k33259q2884J96167J90019j48830
$$ plain form
39034 -3103 -379413 -555948 -330641 86278 384837 452173 363091 248879 212058 263602 311808
39023 311808 265091 140330 30965 -3526 21350 50847 40460 4034 13376 94587 143297
39012 143297 36901 -175887 -309480 -272086 -150034 -59967 -41478 -98377 -203808 -247930
39002 -247930 -123730 109333 271509 271928 145493 -73439 -337082 -497112 -458318 -378770
38992 -378770 -456604 -560184 -393010 -8372 230890 241761 318630 522164 472847 19235
38982 19235 -354132 -177280 301361 486987 246804 -77841 -249031 -282324 -175956 68438
38972 68438 234672 96743 -207245 -334539 -203024 9683 218217 431170 509611 312085
38962 312085 11746 -113025 -131998 -299566 -513348 -416612 -35532 195702 118187 46345
$$ packed form
39034c103l76310j76535K25307M16919K98559O7336q9082j14212l6821N1544M8206
39023C11808m6717j24761j09365l4491K4876K9497j0387l6426R342Q1211M8710
39012A43297j06396k12788j33593L7394J22052R0067J8489n6899j05431m4122
39002b47930J24200K33063J62176M19j26435k18932k63643j60030L8794P9548
38992c78770p7834j03580J67174L84638K39262J0871P6869K03534m9317m53612
38982A9235l73367J76852M78641J85626k40183l24645j71190l3293J06368K44394
38972F8438J66234j37929l03988j27294J31515K12707K08534K12953P8441j97526
38962C12085l00339j24771j8973j67568k13782R6736L81080K31234p7515p1842
$$ plain form
38952 46345 145649 130281 -178946 -468599 -427214 -231031 -174279 -150548 85323 391032 420023
38941 420023 193065 63461 162425 260327 191514 75769 44630 30975 -51745 -133021 -124113
38930 -124113 -91676 -158940 -312156 -420946 -423531 -402277 -458975 -566289 -590169 -456972 -242760
38919 -242760 -60634 77271 199935 234938 74794 -205910 -357780 -248250 -24263 89023
38909 89023 38747 -83858 -199535 -259732 -217019 -111411 -106348 -291921 -503992 -491470 -241426
38898 -241426 11318 100131 100309 144269 198461 121937 -114151 -353906 -404068 -229088 -5282
38887 -5282 33585 -153589 -336025 -253626 64192 320883 317852 170569 81670 40255 -75797
38876 -75797 -185151 -53246 301275 509312 318094 -40039 -164257 -31205 49607 -45627
$$ packed form
38952D6345R9304j5368l09227k89653M1385J96183N6752K3731K35871L05709K8991
38941D20023k26958j29604R8964R7902o8813j15745l1139j3655q2720q1276Q908
38930a24113L2437o7264j53216j08790k585K1254n6698j07314k3880J33197K14212
38919b42760J82126J37905J22664L5003j60144k80704j51870J09530K23987J13286
38909H9023n0276j22605j15677o0197M2713J05608N063j85573k12071J2522K50044
38898b41426K52744Q8813J78M3960N4192p6524k36088k39755n0162J74980K23806
38887e282L8867j87174j82436Q2399L17818K56691l031j47283q8899m1415j16052
38876g5797j09354J31905L54521K08037j91218l58133j24218J33052Q0812r5234
$$ plain form
38866 -45627 -114580 -55527 -98825 -424072 -792960 -824753 -506885 -176917 -57551 -52671 -4709
38855 -4709 70126 72630 -10042 -113578 -186378 -208840 -184371 -152151 -164595 -232732 -328478 -429435
38843 -429435 -509282 -507366 -388277 -228376 -162997 -238178 -381810 -515836 -603235 -570615 -308105
38832 -308105 161250 579502 646605 336379 -58119 -234004 -168753 -39867 66749 208946
38822 208946 345346 257936 -126764 -491856 -447599 -46668 262870 208495 -29493 -164294
38812 -164294 -166671 -158314 -169352 -175364 -206078 -252805 -221135 -127474 -166303 -402038 -581590 -481255
38800 -481255 -265266 -225576 -315924 -270566 -85004 -9862 -90049 -87199 83273 194653 110806
38789 110806 24912 113062 216106 104910 -120573 -161439 27023 146730 -58258 -477805
$$ packed form
38866d5627o8953N9053m3298l25247l68888l1793L17868L29968J19366M880M7962
38855d709P4835K504q2672j03536p2800k2462K4469L2220j2444o8137r5746j00957
38843d29435p9847J916J19089J59901O5379p5181j43632j34026q7399L2620K62510
38832c08105M69355M18252O7103l10226l94498j75885O5251J28886J06616J42197
38822B08946J36400q7410l84700l65092M4257M00931L09538n4375k37988j34801
38812a64294k377Q357j1038o012l0714m6727L1670R3661l8829k35735j79552J00335
38800d81255K15989L9690r0348M5358J85562P5142q0187K850J70472J11380q3847
38789A10806q5894Q8150J03044j11196k25483m0866J88462J19707k04988m19547
$$ plain form
38779 -477805 -755475 -669520 -340285 -61809 16484 -33287 -123750 -264658 -407701 -386035
38769 -386035 -177768 -43831 -163054 -298723 -147870 113522 48977 -325759 -528550 -372973
38759 -372973 -233203 -348890 -368959 49148 585905 673124 314718 21710 63524 233334
38749 233334 296598 243414 91748 -159823 -330679 -180004 178227 322759 106828 -133315
38739 -133315 -106526 17851 -51655 -252175 -321858 -242550 -213029 -282596 -311851 -262269 -250761
38728 -250761 -302714 -289511 -155265 -4478 82595 134803 146412 51040 -92121 -101290 31483
38717 31483 72827 -60357 -76027 267187 697566 743904 419167 188744 239983 222789 -113087
38706 -113087 -435919 -319575 76308 234486 43574 -114601 -30874 27098 -177369 -414446
$$ packed form
38779d77805k77670Q5955L29235K78476P8293m9771r0463j40908j43043K1666
38769c86035K08267J33937j19223j35669J50853K61392o4545l74736k02791J55577
38759c72973J39770j15687k0069M18107N36757Q7219l58406k93008M1814J69810
38749B33334O3264n3184j51666k51571j70856J50675L58231J44532k15931k40143
38739a33315K6789J24377o9506k00520o9683P9308K9521o9567k9255M9582J1508
38728b50761n1953J3203J34246J50787Q7073N2208J1609r5372j43161r169J32773
38717C1483M1344j33184j5670L43214M30379M6338l24737k30423N1239j7194l35876
38706a13087l22832J16344L95883J58178j90912j58175Q3727N7972k04467k37077
$$ plain form
38696 -414446 -333890 -11497 164490 49239 -119636 -141090 -135087 -294093 -535592 -584048
38686 -584048 -338863 3812 211576 260921 254542 212107 83917 -78292 -138466 -89876 -89765
38675 -89765 -209406 -300011 -216410 -35245 94117 189176 338376 467000 428586 282855
38665 282855 244685 362771 481052 525948 578632 628734 540021 345553 275124 342123 218359
38654 218359 -241111 -640654 -549084 -143454 54180 -55984 -110998 23710 44069 -176881
38644 -176881 -261905 66668 433859 289938 -275266 -653442 -575033 -388504 -428978 -540039
38634 -540039 -427786 -161028 -21317 -45104 -22662 132228 298539 417398 574148 756852
38624 756852 772688 528553 221520 102043 166777 237886 253120 290360 335012 226246 -94042
$$ packed form
38696d14446Q0556L22393J75987j15251j68875k1454O003j59006k41499m8456
38686e84048K45185L42675K07764M9345o379m2435j28190j62209o0174M8590J11
38675h9765j19641r0605Q3601J81165J29362R5059J49200J28624l8414j45731
38665B82855l8170J18086J18281M4896N2684N0102q8713j94468p0429O6999j23764
38654B18359m59470l99543R1570M05630J97634j10164n5014J34708K0359k20950
38644a76881q5024L28573L67191j43921n65204l78176P8409J86529m0474j11061
38634e40039J12253K66758J39711k3787K2442J54890J66311J18859J56750J82704
38624G56852J5836k44135l07033j19477O4734P1109J5234L7240M4652j08766l20288
$$ plain form
38613 -94042 -416034 -465278 -224667 45531 107678 -12245 -115477 -101251 -69723 -159571 -366761
38602 -366761 -571607 -680613 -662624 -494198 -192102 99382 190828 80653 2321 151753
38592 151753 440683 612978 546626 337163 129520 -2138 -16361 106850 278792 310419
38582 310419 110069 -170010 -283159 -181493 -64907 -101576 -196920 -146889 34318 107782
38572 107782 -37623 -208543 -206385 -143839 -251347 -464566 -480051 -221411 36940 92809
38562 92809 84742 180391 253163 115612 -111524 -164383 -74320 -128915 -403470 -622502 -550818
38551 -550818 -279671 -30879 107533 124203 -38735 -359201 -606805 -559688 -321001 -225027
38541 -225027 -397194 -582033 -506341 -272001 -202958 -349817 -386592 -94644 267430 305429
$$ packed form
38613i4042l21992m9244K40611K70198O2147j19923j03232J4226L1528q9848k07190
38602c66761k04846j09006J7989J68426L02096K91484R1446j10175p8332J49432
38592A51753K88930J72295o6352k09463k07643j31658j4223J23211J71942L1627
38582C10419k00350k80079j13149J01666J16586l6669r5344N0031J81207P3464
38572A07782j45405j70920K158O2546j07508k13219j5485K58640K58351N5869
38562I2809q067R5649P2772j37551k27136n2859R0063n4595k74555k19032P1684
38551e50818K71147K48792J38412J6670j62938l20466k47604M7117K38687R5974
38541b25027j72167j84839P5692K34340O9043j46859l6775K91948L62074L7999
$$ plain form
38531 305429 74861 6113 241117 405087 204844 -70288 36115 433973 590829 307567
38521 307567 -10418 41438 329700 455622 317190 127236 9550 -114308 -239477 -169314
38511 -169314 170694 494755 438854 24769 -352437 -417526 -306975 -283048 -343984 -307412
38501 -307412 -157930 -54283 -22585 82776 270647 344295 251868 234553 441368 636800
38491 636800 538400 253102 88309 72077 -9132 -173666 -203454 -48497 67775 24870
38481 24870 -19792 44919 70387 -53677 -126772 77843 393864 412060 40237 -325462 -282423
38470 -282423 68233 242669 -15720 -396935 -402354 15381 383592 315281 -34896 -267506
38460 -267506 -284447 -267438 -240098 -23731 342030 502077 276913 -31708 -57699 114084
$$ packed form
38531C05429k30568o8748K35004J63970k00243k75132J06403L97858J56856k83262
38521C07567l17985N1856K88262J25922j38432j89954j17686j23858j25169P0163
38511a69314L40008L24061n5901m14085l77206o5089J10551K3927o0936L6572
38501c07412J49482J03647L1698J05361J87871P3648r2427j7315K06815J95432
38491F36800r8400k85298j64793j6232q1209j64534k9788J54957J16272m2905
38481B4870m4662O4711K5468j24064p3095K04615L16021J8196l71823l65699M3039
38470b82423L50656J74436k58389l81215n419M17735L68211o8311l50177k32610
38460b67506j6941J7009K7340K16367L65761J60047k25164l08621k5991J71783
$$ plain form
38450 114084 125844 -86118 -216103 -73784 145197 173200 40757 -26156 52838 161211
38440 161211 223576 298857 403163 417197 278589 131865 124806 145403 -21287 -295247 -321357
38429 -321357 22052 371994 325103 -29110 -249776 -136930 59366 24833 -233709 -460646
38419 -460646 -474782 -328095 -191961 -147826 -110731 23166 188201 210429 64642 -77905
38409 -77905 -117918 -172201 -333354 -461901 -398001 -234942 -167179 -181708 -139900 -77320 -152652
38398 -152652 -338330 -435359 -398775 -383652 -430510 -362612 -83739 233187 362099 276946 110729
38387 110729 -6003 -6198 93186 184214 175620 107451 57428 -11806 -153326 -249974 -149775
38376 -149775 46308 86281 -43563 -107371 -29856 -13175 -152035 -240722 -129462 -2326
$$ packed form
38450A14084J1760k11962j29985J42319K18981K8003j32443o6913P8994J08373
38440A61211O2365P5281J04306J4034j38608j46724p059K0597j66690k73960k6110
38429c21357L43409L49942m6891l54213k20666J12846J96296l4533k58542k26937
38419d60646j4136J46687J36134M4135L7095J33897J65035K2228j45787j42547
38409g7905m0013n4283j61153j28547O3900J63059O7763j4529M1808O2580p5332
38398a52652j85678r7029L6584J5123m6858O7898K78873L16926J28912q5153j66217
38387A10729j16732j95R9384R1028q594o8169n0023o9234j41520r6648J00199
38376a49775J96083L9973j29844o3808P7515J6681j38860q8687J11260J27136
$$ plain form
38366 -2326 -83532 -280023 -353557 -290410 -260088 -316441 -372507 -406256 -475258 -553450 -539795 -428372
38354 -428372 -318815 -254737 -186652 -106249 -86484 -145683 -177027 -85595 65283 129344 81009
38343 81009 44944 79421 33156 -244401 -595516 -666132 -385953 -122478 -202928 -467344 -523382
38332 -523382 -308440 -109757 -83275 -70848 58120 169310 95973 -90715 -187577 -115718
38322 -115718 39784 163833 203431 178596 146048 124453 71892 -21761 -81937 -56127 18319
38311 18319 140699 401878 767478 966672 817019 524632 402685 416495 316929 121833
38301 121833 89836 247310 332798 244099 158872 140799 14445 -236864 -316039 -47912 325363
38290 325363 473300 349648 80311 -251961 -532705 -582874 -403780 -242298 -236479 -215232
$$ packed form
38366b326q1206j96491p3534O3147L0322n6353n6066l3749o9002p8192J3655J11423
38354d28372J09557O4078O8085Q0403J9765n9199l1344R1432J50878O4061m8335
38343H1009l6065L4477m6265k77557l51115p0616K80179K63475q0450k64416n6038
38332e23382K14942J98683K6482J2427J28968J11190p3337j86688r6862P1859
38322a15718J55502J24049L9598k4835l2548k1595n2561r3653o0176K5810P4446
38311A8319J22380K61179L65600J99194j49653k92387j21947J3810r9566j95096
38301A21833l1997J57474Q5488q8699q5227j8073j26354k51309p9175K68127L73275
38290C25363J47937j23652k69337l32272k80744n0169J79094J61482N819K1247
$$ plain form
38280 -215232 -24132 189046 229021 176111 208133 268015 167023 -81733 -257974 -212021
38270 -212021 5592 236881 334730 266794 175310 229653 371064 353805 97672 -181158
38260 -181158 -272532 -214944 -132637 -25612 133766 252636 225892 100595 18749 57878 178866
38249 178866 263569 202444 24076 -114796 -163228 -264658 -449239 -443312 -72788 347731
38239 347731 419114 269577 283299 381042 182798 -183094 -146438 352864 704828 605233
38229 605233 464157 565301 563501 229654 -11776 179687 406250 210161 -136758 -161822
38219 -161822 -30989 -168390 -430127 -381884 -107900 -26284 -111727 -1493 265258 278853
38209 278853 -42952 -367588 -484384 -418602 -151277 241997 347531 -99143 -635516 -607783
$$ packed form
38280b15232J91100K13178L9975n2910L2022N9882j00992k48756j76241M5953
38270b12021K17613K31289R7849o7936r1484N4343J41411j7259k56133k78830
38260a81158r1374N7588Q2307J07025J59378J18870k6744j25297q1846L9129J20988
38249A78866Q4703o1125j78368j38872m8432j01430j84581N927L70524M20519
38239C47731P1383j49537J3722R7743j98244l65892L6656M99302L51964r9595
38229F05233j41076J01144j800l33847k41430J91463K26563j96089l46919k5064
38219a61822J30833j37401k61737M8243K73984Q1616q5443J10234K66751J3595
38209B78853l21805l24636j16796O5782K67325L93274J05534m46674n36373K7733
$$ plain form
38199 -607783 -153353 18732 -267637 -491176 -354189 -128991 -15370 125342 255426 78300
38189 78300 -323590 -423704 -78709 188063 16337 -258276 -237151 -87904 -141819 -304207
38179 -304207 -283428 -76884 131826 277028 317576 139548 -165944 -241089 26199 241211
38169 241211 76661 -197232 -131024 214461 417599 362496 323335 447414 546115 432131
38159 432131 165425 -101570 -305046 -424483 -411300 -241994 28149 298438 474965 499131
38149 499131 369751 148768 -58743 -147513 -101736 -71459 -254615 -618725 -860088 -773131
38139 -773131 -532649 -423753 -419335 -281006 3730 182971 123327 -52163 -222532 -388745
38129 -388745 -498900 -429802 -221006 -90795 -138046 -233180 -260960 -256979 -246272 -168917 -40457
$$ packed form
38199f07783M54430J72085k86369k23539J36987K25198J13621J40712J30084j77126
38189G8300m01890j00114L44995K66772j71726k74613K1125J49247n3915j62388
38179c04207K0779K06544K08710J45202M0548j78028l05492p5145K67288K15012
38169B41211j64550k73893O6208L45485K03138n5103l9161J24079R8701j13984
38159D32131k66706k66995k03476j19437J3183J69306K70143K70289J76527K4166
38149D99131j29380k20983k07511q8770M5777L0277j83156l64110k41363Q6957
38139g73131K40482J08896M418J38329K84736J79241n9644j75490j70369j66213
38129c88745j10155O9098K08796J30211m7251r5134k7780L981J0707P7355J28460
$$ plain form
38118 -40457 21465 5512 42132 156669 186059 33732 -165657 -228613 -131829 23833 130952
38107 130952 121627 21348 -33443 45576 156948 178933 206825 394633 609324 526839 102350
38096 102350 -317201 -422053 -267425 -108347 -106712 -278710 -562340 -842428 -998440 -965400
38086 -965400 -717132 -281589 140089 232893 -72963 -446703 -559231 -475057 -418765 -367331
38076 -367331 -192016 -9047 -5541 -64297 42704 227057 265959 253980 394847 494786 232181
38065 232181 -164657 -152533 222678 342138 24374 -186772 47938 334872 279298 123344
38055 123344 221667 388025 247855 -123281 -363134 -359052 -253068 -148522 -118947 -269212
38045 -269212 -514041 -542165 -248081 63423 130751 92367 144769 169692 6644 -184608
$$ packed form
38118d0457O1922j5953L6620J14537K9390j52327j99389o2956R6784J55662J07119
38107A30952r325j00279n4791P9019J11372K1985K7892J87808K14691q2485m24489
38096A02350m19551j04852J54628J59078J635j71998k83630k80088j56012L3040
38086i65400K48268M35543M21678R2804l05856l73740j12528Q4174N6292N1434
38076c67331J75315J82969L506n8756J07001J84353L8902j1979J40867R9939k62605
38065B32181l96838J2124L75211J19460l17764k11146K34710K86934n5574j55954
38055A23344R8323J66358j40170l71136k39853M082J05984J04546K9575j50265
38045b69212k44829k8124K94084L11504O7328l8384N2402K4923j63048j91252
$$ plain form
38035 -184608 -151075 85745 349737 565553 666283 520697 203564 60907 241609 434384
38025 434384 330034 61839 -83075 -93330 -79942 11787 214036 324332 200886 26847
38015 26847 -8516 -20055 -125757 -144266 67759 279183 255685 175803 284322 422833 341168
38004 341168 200813 278817 396927 175919 -284307 -498332 -298538 16033 176185 160264
37994 160264 -17817 -301222 -408725 -90096 431925 654372 431256 75197 -145870 -248156
37984 -248156 -284602 -231512 -152853 -158762 -181111 -70476 113239 203492 261743 465648 700736
37973 700736 643512 278322 -22326 6368 252324 498243 655021 659761 437457 73720
37963 73720 -194904 -248256 -174411 -74903 41759 164411 248203 281369 261888 175534 111433
$$ packed form
38035a84608L3533K36820K63992K15816J00730j45586l17133j42657J80702J92775
38025D34384j04350k68195j44914j0255J3388R1729K02249J10296j23446j74039
38015B6847l5363j1539j05702j8509K12025K11424k3498p9882J08519J38511q1665
38004C41168j40355P8004J18110k21008m60226k14025J99794L14571J60152j5921
37994A60264j78081k83405j07503L18629N22021K22447k23116l56059k21067j02286
37984b48156l6446N3090P8659n909k2349J10635J83715R0253N8251K03905K35088
37973G00736n7224l65190l00648K8694K45956K45919J56778M740k22304l63737
37963G3720k68624n3352P3845R9508J16662J22652Q3792L3166j9481q6354o4101
$$ plain form
37952 111433 240569 509038 566547 246112 -121407 -188757 -133028 -299961 -548046 -482402
37942 -482402 -187396 -111238 -260948 -166393 261577 483812 173168 -267800 -349056 -176909
37932 -176909 -121273 -178181 -83643 173460 338837 278110 92915 -75100 -169805 -218998 -302490
37921 -302490 -419946 -383838 -49541 351538 415655 152526 5093 174340 330192 193394
37911 193394 -11393 13431 126107 45041 -132930 -128826 21471 79872 45599 74631 108974
37900 108974 11853 -51165 171834 501116 522041 283335 264430 575983 753439 532716
37890 532716 275347 304271 331014 3536 -390195 -344200 -519 37589 -339592 -610692
37880 -610692 -480428 -262991 -235660 -181169 109383 352316 209719 -125396 -226729 -85190
$$ packed form
37952A11433J29136K68469N7509l20435l67519o7350N5729j66933k48085O5644
37942d82402K95006P6158j49710R4555M27970K22235l10644m40968q1256J72147
37932a76909N5636n6908R4538K57103J65377o0727j85195j68015r4705m9193q3492
37921c02490j17456L6108L34297M01079O4117k63129j47433J69247J55852j36798
37911A93394k04787K4824J12676q1066j77971M104J50297N8401l4273K9032L4343
37900A08974r7121o3018K22999L29282K0925k38706j8905L11553J77456k20723
37890E32716k57369K8924K6743l27478l93731M5995L43681L8108l77181k71100
37880f10692J30264K17437K7331N4491K90552K42933j42597l35115j01333J41539
$$ plain form
37870 -85190 -21409 -111605 -149623 -95156 -121097 -228558 -213799 -39092 125227 246204 450577
37859 450577 675748 684457 486840 353206 322392 122991 -274593 -474389 -257813 34905
37849 34905 22376 -167096 -188381 -23990 108654 141467 101600 -97576 -449594 -638474
37839 -638474 -411859 -17926 111569 -9088 -2388 238632 410913 304675 82571 -14385
37829 -14385 36656 109517 93063 -47602 -218017 -226448 -17738 202185 242838 207154 275887
37818 275887 352775 211431 -95860 -280487 -220028 -36178 176027 398926 510796 367778
37808 367778 68736 -145305 -246354 -387316 -542108 -515493 -330018 -247228 -326003 -304786
37798 -304786 -59684 130828 -23500 -388368 -555054 -301693 217107 633100 647817 270503
$$ packed form
37870h5190O3781r0196l8018N4467k5941j07461J4759J74707J64319J20977K04373
37859D50577K25171Q709j97617j33634l0814j99401l97584j99796K16576K92718
37849C4905j2529j89472k1285J64391J32644L2813l9867j99176l52018j88880
37839f38474K26615L93933J29495j20657O700K41020J72281j06238k22104r6956
37829a4385N1041P2861j6454j40665j70415q431K08710K19923M0653l5684O8733
37818B75887P6888j41344l07291j84627O0459J83850K12205K22899J11870j43018
37808C67778k99042k14041j01049j40962j54792K6615J85475Q2790p8775K1217
37798c04786K45102J90512j54328l64868j66686K53361N18800M15993J4717l77314
$$ plain form
37788 270503 -179077 -398748 -408000 -397230 -376093 -223206 -23356 -22304 -213513 -301704 -168516
37777 -168516 -50856 -113736 -160852 12132 233997 196984 -81689 -294284 -251894 -45815
37767 -45815 150428 259614 290640 276189 236695 168652 98090 132633 343556 577818 552921
37756 552921 225328 -85432 -67020 209498 430050 460652 443500 493285 497962 315044 43680
37745 43680 -59554 69192 195819 127949 20451 134945 362912 301913 -110355 -374613
37735 -374613 -93018 407950 484144 61434 -304880 -246648 -26946 -37112 -229241 -310673
37725 -310673 -252396 -283861 -476146 -617066 -524351 -279814 -75318 44130 175521 356685
37715 356685 498219 538047 546105 581494 537015 288060 -42448 -178251 -83852 -46958 -272446
$$ packed form
37788B70503m49580k19671r252J0770K1137J52887J99850J052j91209q8191J33188
37777a68516J17660o2880m7116J72984K21865l7013k78673k12595M2390K06079
37767d5815J96243J09186L1026j4451l9494o8043p0562L4543K10923K34262k4897
37756E52921l27593l10760J8412K76518K20552L0602j7152M9785M677j82918k71364
37745D3680j03234J28746J26627o7870j07498J14494K27967o0999m12268k64258
37735c74613K81595N00968P6194m22710l66314N8232K19702j0166j92129q1432
37725c10673N8277l1465j92285j40920R2715K44537K04496J19448J31391J81164
37715C56685J41534L9828Q058L5389m4479k48955l30508j35803R4399L6894k25488
$$ plain form
37704 -272446 -600445 -765345 -739939 -647227 -510828 -312046 -159914 -176538 -302443 -404492
37694 -404492 -468962 -503552 -396119 -111166 104855 -2563 -297022 -402262 -200052 80075
37684 80075 216554 183775 34722 -137947 -159152 46168 251979 163969 -175703 -460728
37674 -460728 -548013 -549892 -554328 -539161 -523124 -518301 -393494 -90209 118942 -33853 -298849
37663 -298849 -195285 205818 312726 -83940 -481427 -439199 -168639 -49309 -18759 156160
37653 156160 358169 325188 155380 177062 438643 696427 819361 864407 810227 553495
37643 553495 176004 -73999 -114771 -119511 -220658 -319557 -266901 -91955 35267 2023 -135594
37632 -135594 -205973 -85490 156251 298138 199781 -41571 -224676 -297578 -385513 -560357
$$ packed form
37704b72446l27999j64900K5406R2712J36399J98782J52132j6624j25905j02049
37694d04492o4470l4590J07433K84953K16021j07418k94459j05240K02210K80127
37684H0075J36479l2779j49053j72669k1205K05320K05811q8010l39672k85025
37674d60728q7285j879m436J5167J6037M823J24807L03285K09151j52795k64996
37663b98849J03564M01103J06908l96666l97487M2228K70560J19330L0550J74919
37653A56160K02009l2981j69808K1682K61581K57784J22934M5046n4180k56732
37643E53495l77491k50003m0772m740j01147r8899N2656J74946J27222l3244j37617
37632a35594p0379J20483K41741J41887r8357k41352j83105p2902q7935j74844
$$ plain form
37622 -560357 -682228 -554467 -201884 120688 239172 262445 359091 445259 318110 58683
37612 58683 1988 235464 441398 400250 332886 480163 637010 475639 117234 -49948
37602 -49948 9056 4988 -74567 105760 617354 1042189 1041582 789150 628002 593852 514635
37591 514635 365182 279768 323603 421489 450690 329158 94600 -81805 -75064 7177 -38507
37580 -38507 -216027 -350520 -369495 -348110 -296988 -142351 84036 262423 373808 438489
37570 438489 330473 -40272 -409152 -393907 -63296 119469 -25495 -181100 -98580 47024
37560 47024 43481 -9349 32232 75358 23017 -7105 66024 91283 -24717 -102444 -11242 54543
37548 54543 -106853 -340708 -370122 -197647 -1126 183501 385476 463562 258283 -104957
$$ packed form
37622e60357j21871J27761L52583L22572J18484K3273R6646Q6168j27149k59427
37612E8683n6695K33476K05934m1148o7364J47277J56847j61371l58405j67182
37602d9948N9004m068p9555J80327N11594M24835o07k52432j61148l4150p9217
37591E14635j49453q5414M3835R7886K9201j21532k34558j76405O741Q2241m5684
37580c8507j77520j34493j8975K1385N1122J54637K26387J78387J11385O4681
37570D38489j08016l70745l68880J5245L30611J82765j44964j55605Q2520J45604
37560D7024l543n2830M1581M3126n2341l0122P3129K5259j16000p7727R1202O5785
37548E4543j61396k33855k9414J72475J96521J84627K01975P8086k05279l63240
$$ plain form
37538 -104957 -333770 -338896 -269446 -235361 -201876 -132197 -64945 -52305 -117015 -236860 -321343
37527 -321343 -285395 -182967 -152251 -207291 -242518 -259274 -372370 -549756 -600891 -506910 -489649
37516 -489649 -632281 -715344 -591030 -433982 -412103 -382794 -176082 56041 69504 -66836
37506 -66836 -92672 38013 151426 174991 208757 309153 402652 404984 300785 141417 35836
37495 35836 58861 128201 118457 121943 357990 747473 876788 552765 103188 -96882 -111632
37484 -111632 -174275 -206651 3367 314773 344133 21545 -321352 -425082 -350947 -223177
37474 -223177 -23818 243226 407122 311209 43880 -135075 -88872 34512 -27001 -312636
37464 -312636 -546431 -465340 -160144 66988 110261 85704 -7510 -308301 -700463 -760266
$$ packed form
37538a04957k28813n126O9450L4085L3485O9679O7252J2640o4710j19845q4483
37527c21343L5948J02428L0716n5040l5227j6756j13096j77386n1135R3981J7261
37516d89649j42632q3063J24314J57048K1879K9309K06712K32123J3463j36340
37506f6836k5836J30685J13413K3565L3766J00396R3499K332j04199j59368j05581
37495C5836K3025O9340r744L486K36047L89483J29315l24023m49577k00070j4750
37484a11632o2643l2376K10018L11406K9360l22588l42897j03730P4135J27770
37474b23177J99359K67044J63896r5913k67329j78955M6203J23384o1513k85635
37464c12636k33795Q1091L05196K27132M3273k4557r3214l00791l92162n9803
$$ plain form
37454 -760266 -303821 289002 526882 359327 64524 -173079 -307331 -261740 -31024 169394
37444 169394 135727 -25904 -65334 49950 170451 246392 311521 282237 69187 -153169
37434 -153169 -93391 212559 379477 183985 -125650 -163583 105529 372597 398368 246243
37424 246243 89700 -38910 -175577 -216897 -29685 223763 161231 -278744 -647515 -564377
37414 -564377 -220166 -4048 92118 269133 368781 103859 -285338 -261174 112781 186253
37404 186253 -232837 -543826 -328019 13470 -6876 -188704 -100672 173365 284114 232374
37394 232374 200102 83220 -264338 -567712 -452598 -64985 121319 -6417 -144330 -97947
37384 -97947 39890 145937 153799 -3723 -236563 -252324 24485 215346 19056 -279479
$$ packed form
37454g60266M56445N92823K37880j67555k94803k37603j34252M5591K30716K00418
37444A69394l3667j61631l9430J15284J20501P5941O5129k9284k13050k22356
37434a53169N9778L05950J66918j95492l09635l7933K69112K67068K5771j52125
37424B46243j56543j28610j36667m1320J87212K53448o2532m39975l68771Q3138
37414e64377L44211K16118R6166J77015R9648k64922l89197K4164L73955P3472
37404A86253m19090l10989K15807L41489k0346j81828Q8032K74037J10749n1740
37394B32374l2272j16882l47558l03374J15114L87613J86304j27736j37913M6383
37384i7947J37837J06047P862j57522k32840j5761K76809J90861j96290k98535
$$ plain form
37374 -279479 -247401 7945 77969 -42382 -42406 62802 -31430 -298268 -371154 -176619 -37564
37363 -37564 -75880 -17755 280080 557485 567443 404260 269512 216532 244245 365912 484841
37352 484841 447538 285068 171515 123672 -3053 -208505 -310049 -237938 -112321 -6322
37342 -6322 116831 219486 198001 98756 95026 232304 391843 477207 446512 251372 -21246
37331 -21246 -71349 248107 598686 539856 166292 -16733 187324 469623 540215 443539
37321 443539 292795 77731 -145481 -199152 -55057 88906 98227 51005 50047 103770 212419
37310 212419 349881 370452 173943 -69285 -122273 -57013 -119152 -269703 -223949 56198
37300 56198 282912 294042 224359 171166 49737 -132437 -200513 -119611 -73346 -143896 -205725
$$ packed form
37374b79479L2078K55346P0024j20351k4J05208r4232k66838p2886J94535J39055
37363c7564l8316N8125K97835K77405R958j63183j34748n2980K7713J21667J18929
37352D84841l7303j62470j13553m7843j26725k05452j01544P2111J25617J05999
37342f322J23153J02655k1485r9245l730J37278J59539Q5364l0695j95140k72618
37331b1246n0103L19456L50579n8830l73564j83025K04057K82299P0592r6676
37321D43539j50744k15064k23212n3671J44095J43963R321m7222r58N3723J08649
37310B12419J37462K0571j96509k43228n2988O5260o2139j50551M5754K80147
37300E6198K26714J1130o9683n3193j21429j82174o8076Q0902M6265p0550o1829
$$ plain form
37289 -205725 -208216 -257607 -348720 -333758 -228079 -209689 -236241 -33117 410684 701484 568235
37278 568235 209466 -50311 -135187 -90950 73588 215777 62895 -365032 -629229 -432581
37268 -432581 -43271 113974 40807 29703 148773 205232 111596 -25125 -132927 -234797
37258 -234797 -295588 -218132 -2782 224376 331911 249979 -13355 -326756 -488039 -427185
37248 -427185 -285785 -210470 -164256 -41503 134856 259434 311909 348056 368238 313522 180154
37237 180154 50717 5946 51107 130595 196290 257626 345025 419342 383851 229034 79350
37226 79350 21939 -6338 -52368 3884 256719 535336 578227 387083 182757 61702 -48763
37215 -48763 -124181 -28788 198865 331761 296449 257609 274260 164240 -136766 -355425 -240872
$$ packed form
37289b05725k491m9391r1113J4962J05679J8390k6552K03124M43801K90800j33249
37278E68235l58769k59777q4876M4237J64538J42189j52882m27927k64197J96648
37268d32581L89310J57245p3167j1104J19070N6459r3636j36721j07802j01870
37258b34797o0791P7456K15350K27158J07535q1932k63334l13401j61283O0854
37248d27185J41400P5315M6214J22753J76359J24578N2475L6147K0182n4716j33368
37237A80154j29437m4771M5161P9488O5695O1336Q7399P4317l5491j54817j49684
37226G9350n7411k8277m6030N6252K52835K78617M2891j91144k04326j21055j10465
37215d8763p5418R5393K27653J32896l5312l8840J6651j10020l01006k18659J14553
$$ plain form
37204 -240872 59702 220226 171295 69175 -44517 -259913 -512240 -572193 -392317 -228629
37194 -228629 -285886 -417882 -365119 -179428 -165005 -392633 -536494 -335889 -5835 62855
37184 62855 -114896 -169905 -7016 -7571 -439900 -974154 -1066821 -657272 -188658 -10617 -37139
37173 -37139 -7343 144303 265770 215031 25334 -135831 -151338 -73464 -13148 43088 177679
37162 177679 323698 291846 59521 -159254 -212240 -194472 -240554 -310977 -301286 -213221 -115467
37151 -115467 -63186 -105544 -216674 -216628 12741 236839 93773 -362272 -689857 -680343 -548126
37140 -548126 -433770 -213630 37647 -46925 -470766 -669447 -343840 25533 -44065 -261113
37130 -261113 -137024 114429 -49506 -537229 -759195 -566946 -383474 -469397 -655069 -760316
$$ packed form
37204b40872L00574J60524m8931j02120j13692k15396k52327n9953J79876J63688
37194b28629n7257j31996N2763J85691J4423k27628j43861K00605L30054O8690
37184F2855j77751n5009J62889n55m32329n34254r2667M09549M68614J78041k6522
37173c7139K9796J51646J21467n0739j89697j61165j5507P7874O0316N6236J34591
37162A77679J46019l1852k32325k18775n2986J7768m6082p0423R691Q8065R7754
37151a15467N2281m2358j11130M6K29369K24098j43066m56045l27585R514J32217
37140e48126J14356K20140K51277q4572m23841j98681L25607L69373o9598k17048
37130b61113J24089K51453j63935m87723k21966J92249J83472q5923j85672j05247
$$ plain form
37120 -760316 -748864 -519896 -52343 309873 216433 -114710 -170643 94468 278385 229018
37110 229018 186991 266730 308482 235509 102238 -150490 -530564 -705959 -396309 73524
37100 73524 168976 -40412 -79433 59298 -35980 -333919 -337131 17730 218842 80105 13858
37089 13858 189046 182534 -206510 -502966 -331675 -40185 -86945 -310739 -288824 -31513
37079 -31513 145250 162150 187212 290631 393135 426297 368793 267152 276448 461963 575525
37068 575525 349374 -16464 -74516 165343 239736 -5381 -190933 -77926 72882 24417
37058 24417 -51790 30765 134869 114427 74838 80234 -20082 -240225 -298788 -48656 261072
37047 261072 361696 298616 220662 144343 74728 66908 67143 -16352 -67228 64040 180262
$$ packed form
37120g60316J1452K28968M67553L62216r3440l31143n5933K65111J83917m9367
37110B29018m2027P9739M1752p2973j33271k52728l80074j75395L09650M69833
37100G3524R5452k09388l9021J38731r5278k97939l212L54861K01112j38737o6247
37089A3858J75188o512l89044k96456J71291K91490m6760k23794K1915K57311
37079c1513J76763J6900K5062J03419J02504L3162n7504j01641R296J85515J13562
37068E75525k26151l65838n8052K39859P4393k45117j85552J13007J50808m8465
37058B4417p6207Q2555J04104k0442l9589N396j00316k20143n8563K50132L09728
37047B61072J00624o3080p7954p6319o9615p820K35q3495n0876J31268J16222
$$ plain form
37036 180262 -18271 -358116 -407429 -237820 -318814 -613708 -532105 44640 464972 331187
37026 331187 78194 139163 242952 36728 -220602 -152849 57654 54346 -57390 1737
37016 1737 127493 76561 -51694 -54881 -52004 -219288 -386315 -330440 -208543 -277669 -434530
37005 -434530 -433581 -327595 -302967 -292002 -121964 132710 278277 316463 355972 379143 322140
36994 322140 209730 55742 -142924 -223181 -948 306648 236360 -196140 -419009 -167221
36984 -167221 109046 41 -236127 -198101 -6402 14821 -85873 -94866 -74251 -153515 -191008
36973 -191008 -57445 44343 -57573 -124882 100552 412373 456468 280510 174703 188788
36963 188788 175711 120816 104354 109849 112157 152479 156651 -36278 -316767 -342561 -94536
$$ packed form
37036A80262j98533l39845m9313J69609q0994k94894Q1603N76745M20332j33785
37026C31187k52993O0969J03789k06224k57330O7753K10503l308j11736N9127
37016A737J25756n0932j28255l187K877j67284j67027N5875J21897o9126j56861
37005d34530R49J05986K4628J0965J70038K54674J45567L8186L9509K3171n7003
36994C22140j12410j53988j98666q0257K22233L07596p0288m32500k22869K51788
36984a67221K76267j09005k36168L8026J91699K1223j00694q993K0615p9264l7493
36973a91008J33563J01788j01916o7309K25434L11821M4095j75958j05807J4085
36963A88788j3077n4895j6462N495K308M0322M172j92929k80489k5794K48025
$$ plain form
36952 -94536 36098 -98454 -157198 45267 191842 67359 -46287 53498 80838 -140422
36942 -140422 -228697 90016 376727 117051 -448683 -702312 -510418 -185503 88369 288072
36932 288072 313678 185783 190220 423848 535394 294943 9389 -31090 -48039 -250896
36922 -250896 -317266 44197 461017 430451 108952 -12275 130183 286260 411640 529453
36912 529453 437650 88048 -123174 41252 204678 57247 -29240 301528 621750 400743
36902 400743 -38455 -76067 123676 -10278 -348546 -287351 144576 344906 170529 19485
36892 19485 -29307 -279383 -643077 -648242 -269914 -1505 -38317 -86193 -29721 -109616 -352396
36881 -352396 -442399 -258011 -15262 151449 271655 255984 32955 -122133 82615 406798
$$ packed form
36952i4536J30634j34552n8744K02465J46575j24483j13646R9785K7340k21260
36942a40422q8275L18713K86711k59676n65734k53629J91894L24915K73872J99703
36932B88072K5606j27895M437K33628J11546k40451k85554m0479j6949k02857
36922b50896o6370L61463M16820l0566l21499j21227J42458J56077J25380J17813
36912E29453r1803l49602k11222J64426J63426j47431q6487L30768L20222k21007
36902D00743m39198l7612J99743j33954l38268O1195M31927K00330j74377j51044
36892A9485m8792k50076l63694n165L78328K68409l6812m7876N6472p9895k42780
36881c52396r0003J84388K42749J66711J20206j5671k23029j55088K04748L24183
$$ plain form
36871 406798 392607 93929 -65562 -11039 -4381 -63757 -8195 57269 -76683 -196045 46901
36860 46901 452556 525885 268567 71500 -10536 -177554 -259375 52642 479751 470375 154815
36849 154815 153742 479349 500030 37725 -367648 -398471 -327471 -291761 -19848 483439 727921
36838 727921 490563 140351 -16685 -119319 -290292 -382773 -365029 -408781 -473805 -358433
36828 -358433 -216202 -394994 -715147 -613851 -104600 158575 -62822 -241713 -32518 193647
36818 193647 93724 -71867 -8046 86452 -18474 -121705 -5948 131416 43742 -146241
36808 -146241 -209009 -145644 -25343 152685 246057 22287 -387479 -515056 -237512 -861
36798 -861 -140151 -400866 -394465 -152214 44432 82856 38333 11294 92744 284968 415872
$$ packed form
36871D06798j4191k98678j59491N4523O658n9376N5562O5464j33952j19362K42946
36860D6901M05655P3329k57318j97067q2036j67018q1821L12017M27109r376l15560
36849A54815j073L25607K0681m62305m05373l0823P1000L5710K71913N03287K44482
36838G27921k37358l50212j57036j02634j70973r2481J7744m3752o5024J15372
36828c58433J42231j78792l20153J01296N09251K63175k21397j78891K09195K26165
36818A93647r9923j65591O3821R4498j04926j03231J15757J37364q7674j89983
36808a46241o2768O3365J20301J78028R3372k23770m09766j27577K77544K36651
36798h61j39290k60715O401K42251J96646L8424m4523k7039Q1450J92224J30904
$$ plain form
36787 415872 357476 259762 267679 166166 -253412 -642769 -493615 11111 200342 -46505
36777 -46505 -169954 84911 284707 103094 -181197 -251487 -216581 -219088 -122547 117608 248493
36766 248493 143443 -4691 -96065 -253275 -385426 -174811 291471 444467 59615 -371973
36756 -371973 -382709 -115536 128148 383783 684869 725354 322678 -146255 -211074 54701
36746 54701 226212 125069 -93017 -249194 -270382 -168486 -81108 -174533 -398020 -528732
36736 -528732 -504602 -449714 -350381 -54789 340093 479119 252002 -30186 -87189 10085
36726 10085 81174 105337 146141 249969 457343 687919 676819 316550 -49321 -37057 202283
36715 202283 241658 61469 -35622 -55254 -250769 -503269 -424662 -94427 -21241 -291813
$$ packed form
36787D15872n8396r7714P917j01513m19578l89357J49154N04726J89231k46847
36777d6505j23449K54865J99796j81613k84291p0290L4906k507R6541K40155J30885
36766B48493j05050j48134r1374j57210j32151K10615M66282J52996l84852m31588
36756c71973j0736K67173K43684K55635L01086M0485m02676m68933o4819K65775
36746E4701J71511j01143k18086j56177k1188J01896Q7378r3425k23487j30712
36736e28732K4130N4888R9333K95592L94882J39026k27117k82188n7003R7274
36726A0085P1089K4163M0804J03828K07374K30576j1100l60269l65871J2264K39340
36715B02283L9375j80189r7091j9632j95515k52500P8607L30235P3186k70572
$$ plain form
36705 -291813 -434354 -265047 -180828 -380615 -453405 -75680 424694 561343 328565 43129
36695 43129 -102568 -85170 41863 102569 -62775 -317416 -370975 -215373 -88010 -42492
36685 -42492 49427 128117 22975 -163336 -210931 -223193 -399148 -508306 -209656 224082
36675 224082 207367 -184306 -286393 100292 488606 588262 622508 657758 425537 2491
36665 2491 -108966 174770 309706 10358 -332960 -361246 -212436 -60246 152101 308586
36655 308586 124728 -233423 -215725 216624 456416 219671 -71309 -94194 -62636 -103145
36645 -103145 27673 297764 242242 -196846 -413488 -90341 306477 354617 282220 359552
36635 359552 392604 241926 175955 295535 256195 -48251 -186913 46214 256223 213029
$$ packed form
36705b91813j42541J69307Q4219j99787p2790L77725N00374J36649k32778k85436
36695D3129j45697J7398J27033O0706j65344k54641n3559J55602J27363M5518
36685d2492R1919P8690j05142j86311m7595j2262j75955j09158K98650M33738
36675B24082j6715l91673j02087L86685L88314R9656L4246L5250k32221m23046
36665B491j11457K83736J34936k99348l43318k8286J48810J52190K12347J56485
36655C08586j83858l58151J7698M32349K39792k36745k90980k2885L1558m0509
36645a03145J30818K70091n5522m39088k16642L23147L96818M8140p2397P7332
36635C59552L3052j50678o5971J19580l9340l04446j38662K33127K10009m3194
$$ plain form
36625 213029 268758 589803 719839 400490 106319 222845 375041 146747 -171903 -154912
36615 -154912 18662 -14065 -154926 -175597 -206194 -378585 -458426 -309792 -238907 -421385
36605 -421385 -498589 -200782 147606 203060 158073 262217 318811 130502 -69808 -90030
36595 -90030 -153631 -358614 -330689 94322 413655 224584 -84526 23819 387552 509749
36585 509749 344224 166327 35426 -108646 -152473 -47980 -11272 -134771 -185849 -88564
36575 -88564 -138163 -428750 -588261 -419105 -258951 -351417 -425686 -279162 -193280 -357767
36565 -357767 -458148 -265810 -76015 -133358 -190311 -66332 -61164 -354644 -569596 -408527
36555 -408527 -178072 -211361 -305612 -197814 -71546 -129216 -166199 -7709 123040 65463
$$ packed form
36625B13029N5729L21045J30036l19349k94171J16526J52196k28294l18650J6991
36615a54912J73574l2727j40861k0671l0597j72391p9841J48634P0885j82478
36605d21385p7204K97807L48388N5454m4987J04144N6594j88309k00310k0222
36595i0030o3601k04983K7925M25011L19333j89071l09110J08345L63733J22197
36585E09749j65525j77897j30901j44072m3827J04493L6708j23499n1078R7285
36575h8564m9599k90587j59511J69156J60154r2466p4269J46524Q5882j64487
36565c57767j00381J92338J89795n7343n6953J23979N168k93480k14952J61069
36555d08527K30455l3289r4251J07798J26268n7670l6983J58490J30749n7577
$$ plain form
36545 65463 42350 167350 176949 -7683 -31153 247847 458504 388312 319740 391898 308884
36534 308884 2447 -131919 13690 18940 -239339 -328855 -156159 -233303 -660701 -773581
36524 -773581 -274488 203788 175521 19222 90769 75153 -192643 -220812 187941 420680
36514 420680 143392 -48800 249270 472930 180597 -60212 284366 721886 660149 441762
36504 441762 564402 721011 520133 341584 568340 762415 499092 221379 369119 481188
36494 481188 101798 -236551 77693 608324 639745 348785 255337 230076 -3868 -111886
36484 -111886 171308 347118 59056 -105002 338173 767197 519935 91572 183814 423654
36474 423654 205004 -26502 397261 989100 863801 248883 -23727 49360 -45541 -169000
$$ packed form
36545F5463k3113J25000R599j84632k3470K79000K10657p0192o8572P2158q3014
36534C08884l06437j34366J45609N250k58279q9516J72696p7144m27398j12880
36524g73581M99093M78276k8267j56299P1547j5616k67796k8169M08753K32739
36514D20680k77288j92192K98070K23660k92333k40809L44578M37520o1737k18387
36504D41762J22640J56609k00878j78549K26756J94075k63323k77713J47740J12069
36494D81188l79390l38349L14244N30631L1421k90960r3448k5261k33944j08018
36484a11886K83194J75810k88062j64058M43175M29024k47262m28363R2242K39840
36474D23654k18650k31506M23763N91839j25299o14918k72610P3087r4901j23459
$$ plain form
36464 -169000 81313 336028 42447 -398062 -273401 146061 138865 -137305 -50633 235973
36454 235973 123815 -198714 -99352 266976 218960 -241189 -526683 -493795 -426975 -327522
36444 -327522 -86707 20611 -189638 -327256 -146814 -104127 -446308 -552292 -39331 362963
36434 362963 21435 -436314 -235241 202070 173770 18513 277089 464145 -2287 -532523
36424 -532523 -381535 -57021 -329003 -735110 -531969 -223186 -568705 -950384 -410525 465826
36414 465826 456987 -188665 -321712 28388 -63202 -530907 -489488 51278 291568 159931
36404 159931 214526 379072 211509 10521 267034 530466 197155 -204326 66808 498935
36394 498935 287291 -62345 280233 736252 352793 -251857 114457 1019320 1180682 758557
$$ packed form
36464a69000K50313K54715k93581m40509J24661M19462p196k76170Q6672K86606
36454B35973j12158l22529R9362L66328m8016m60149k85494L2888O6820R9453
36444c27522K40815J07318k10249j37618J80442M2687l42181j05984N12961M02294
36434C62963l41528m57749K01073M37311k8300j55257K58576J87056m66432n30236
36424e32523J50988L24514k71982m06107K03141L08783l45519l81679N39859Q76351
36414D65826q839o45652j33047L50100r1590m67705M1419N40766K40290j31637
36404A59931N4595J64546j67563k00988K56513K63432l33311m01481K71134M32127
36394D98935k11644l49636L42578M56019l83459o04650L66314R04863J61362m22125
$$ plain form
36384 758557 837618 1240664 959921 254653 210225 635063 465600 -140823 -165530 241331
36374 241331 146300 -189142 189722 888644 766813 156833 295544 959168 929859 423448
36364 423448 683868 1473990 1426278 712548 882032 2064871 2749884 2407471 2014328 1906640
36354 1906640 1405142 667440 664902 1205494 1137087 538596 540362 1030212 815225 22110
36344 22110 -19363 689468 774252 65838 -137357 478382 831924 625409 676895 986108
36334 986108 714094 130141 316244 959788 762594 -40097 -7928 748199 691947 -271838
36324 -271838 -657433 -177857 -58603 -486815 -358528 310030 313017 -292985 -230411 465171
36314 465171 535421 70226 312912 1006185 732441 -214174 -206397 591154 502312 -378850
$$ packed form
36384G58557P9061M03046k80743p05268m4428M24838j69463o06423k4707M06861
36374B41331r5031l35442L78864O98922j21831o09980J38711O63624k9309n06411
36364D23448K60420P90122m7712p13730J69484J182839O85013l42413l93143j07688
36354A906640n01498p37702k538N40592o8407n98491J766M89850k14987p93115
36344B2110m1473P08831Q4784p08414k03195O15739L53542k06515N1486L09213
36334I86108k72014n83953J86103O43544j97194q02691L2169P56127n6252r63785
36324b71838l85595M79576J19254m28212J28287O68558K987o06002O2574O95582
36314D65171P0250m65195K42686O93273k73744r46615P777P97551q8842q81162
$$ plain form
36304 -378850 -356621 492107 415483 -528439 -476710 639685 933217 165715 64305 846416
36294 846416 920192 233553 367565 1140907 788441 -347694 -127327 1252364 1408322
36285 1408322 227791 28437 1039365 1055636 -53550 17119 1380364 1545863 228925
36276 228925 -80001 1003327 1073512 -160303 -188765 1283148 1640081 514823 501853
36267 501853 1848012 1778264 81280 -173688 1445804 1826961 437326 389060 2147205
36258 2147205 2402322 635017 367284 2300318 2844999 1169206 823320 2575746 2822721
36249 2822721 996358 984567 3198182 3259480 733577 593050 3603239 4422600 1988291
36240 1988291 1946975 5560175 6692587 3601573 2623192 5838304 6880121 3870851 3855162
$$ packed form
36304c78850K2229Q48728p6624r43922N1729J116395K93532p67502j01410P82111
36294H46416P3776o86639J34012P73342l52466j136135K20367J379691J55958
36285A408322j180531j99354J010928J6271j109186P0669J363245J65499j316938
36276B28925l08926J083328P0185j233815k8462J471913L56933j125258j2970
36267E01853J346159o9748j696984k54968J619492L81157j389635m8266J758145
36258B147205K55117j767305k67733J933034N44681j675793l45886J752426K46975
36249B822721j826363j1791K213615O1298k525903j40527L010189Q19361k434309
36240A988291m1316L613200J132412l091014r78381L215112J041817l009270j5689
$$ plain form
36231 3855162 8813477 10928590 8089288 9197565 16805448 21024912 19221333 23027469
36223 23027469 35403673 42458755 41601839 52327747 80326460 101679108 112721741
36216 112721741 162109867 282452346 409155949 430627561 324520443 187854081
36210 187854081 115687109 102339180 89257336 59929197 41156023 41476642 40224827
36203 40224827 28686407 20563255 21586424 20621681 13426099 9512348 12039796 12218038
36195 12218038 7089655 4506079 7153006 7885363 4147611 2411485 5074241 6173399
36187 6173399 3305733 1775361 3784679 4520591 2008831 719978 2471775 3125966
36179 3125966 1082105 287174 2180695 2902623 1022079 230511 1932840 2603662 873807
$$ packed form
36231C855162M958315K115113k839302J108277P607883M219464j803579L806136
36223B3027469J2376204P055082q56916J0725908K7998713K1352648J1042633
36216A12721741M9388126J20342479J26703603K1471612j06107118j36666362
36210A87854081p2166972j3347929j3081844k9328139j8773174L20619j251815
36203D0224827j1538420q123152J023169r64743p195582l913751K527448J78242
36195A2218038n128383k583576K646927P32357l737752j736126K662756J099158
36187F173399k867666j530372K009318P35912k511760j288853J751797O54191
36179C125966k043861p94931J893521P21928j880544p91568J702329O70822j729855
$$ plain form
36170 873807 134648 1751622 2473642 913863 120998 1401657 1807674 91543 -779497
36161 -779497 623239 1565833 553442 -27766 1097600 1619366 378629 -326444 666696
36152 666696 1167367 72168 -506674 448485 838715 -290516 -774854 402447 1057274
36143 1057274 20798 -642751 332289 1060220 247394 -419581 309741 958343 460144
36134 460144 235194 1157281 1647783 725341 -67034 394767 850133 332835 -28186 485356
36124 485356 660007 -94584 -387171 457333 1004815 439639 41294 569615 824473 168972
36114 168972 -147630 463459 678065 -105150 -475275 291538 812490 242850 -196790 279813
36104 279813 503428 -247598 -756786 -226418 217765 -203570 -442216 182677 562682 -4599
$$ packed form
36170H73807p39159J616974P22020j559779p92865J280659M06017j716131q71040
36161g79497J402736R42594j012391n81208J125366N21766j240737p05073R93140
36152F66696N00671j095199n78842R55159L90230j129231m84338J177301O54827
36143A057274j036476o63549R75040P27931q12826o66975P29322O48602m98199
36134D60144k24950R22087M90502r22442p92375M61801M55366n17298l61021N13542
36124D85356J74651p54591k92587Q44504N47482n65176l98345N28321K54858o55501
36114A68972l16602O11089K14606p83215l70125P66813N20952n69640m39640M76603
36104B79813K23615p51026n09188N30368M44183m21335k38646O24893L80005n67281
$$ plain form
36094 -4599 -380906 229485 759098 337159 -142622 137947 450421 157372 -63965 202393
36084 202393 198434 -287098 -233578 573716 847819 130919 -281216 259849 627597 246346
36074 246346 255917 1168464 1673991 1118963 907116 1955065 2914187 2487698 1496299 1080512
36064 1080512 798887 89471 -259436 297428 757780 388178 118721 655054 976436
36055 976436 255512 -469239 -141221 451011 261024 -157537 17907 229189 -169447 -436818
36045 -436818 134086 715927 430857 -21710 251510 671935 432524 86382 360063 658140
36035 658140 278597 -127003 167596 452988 -94384 -749758 -472768 269191 448002 243854
36025 243854 377522 619555 406880 71707 121791 170343 -187223 -381628 42183 367401
$$ packed form
36094d599l76307O10391N29613m21939m79781K80569L12474k93049k21337K66358
36084B02393l959m85532N3520Q07294K74103p16900m12135N41065L67748l81251
36074B46346R571R12547N05527n55028k11847J047949R59122m26489r91399m15787
36064A080512k81625p09416l48907N56864M60352l69602k69457N36333L21382
36055I76436p20924p24751L28018N92232j89987m18561J75444K11282l98636k67371
36045d36818N70904N81841k85070m52567K73220M20425k39411l46142K73681K98077
36035F58140l79543m05600K94599K85392n47372o55374K76990P41959J78811k04148
36025B43854J33668K42033k12675l35173N0084M8552l57566j94405M23811L25218
$$ plain form
36015 367401 -37926 -464828 -131713 359909 159307 -286523 -180016 129994 -22593 -241680
36005 -241680 98107 528327 356893 14687 213602 596270 516142 316211 539192 718425
35995 718425 268625 -258250 -133809 156056 -169500 -673396 -495854 55021 90794 -306244
35985 -306244 -432530 -271389 -212767 -71076 412708 702689 280738 -289471 -240639 124929
35975 124929 157149 100300 416993 636193 169865 -417141 -276095 228883 222091 -98411
35965 -98411 53641 521834 551684 232493 247465 539708 508378 220107 204921 337816
35955 337816 93822 -350372 -376724 -31219 151133 131745 211615 241840 -46323 -300383
35945 -300383 -87488 228055 89447 -215473 -82810 304881 388792 283423 420643 606964
$$ packed form
36015C67401m05327m26902L33115M91622k00602m45830J06507L10010j52587k19087
36005b41680L39787M30220j71434l42206J98915L82668q0128j99931K22981J79233
35995G18425m49800n26875J24441K89865l25556n03896J77542N50875L5773l97038
35985c06244j26286J61141N8622J41691M83784K89981m21951n70209M8832L65568
35975A24929L2220n6849L16693K19200m66328n87006J41046N04978o792l20502
35965i8411J52052M68193K9850l19191J4972K92243l1330k88271j5186J32895
35955C37816k43994m44194k6352L45505J82352j9388P9870L0225k88163k54060
35945c00383K12895L15543j38608l04920J32663L87691Q3911j05369J37220J86321
$$ plain form
35935 606964 439641 204536 356370 573310 338769 -22229 82218 401926 363747 180032
35925 180032 340785 530260 224528 -134327 185828 794466 747215 178462 30104 394889
35915 394889 474629 75553 -151215 34863 154057 13344 -36732 86632 82874 -15893
35905 -15893 105135 313757 199959 -109347 -137833 66736 82376 -30446 111932 367605
35895 367605 266062 -87526 -174563 9539 43892 -54542 78225 334159 264524 -74037
35885 -74037 -216753 -122250 -138231 -279632 -285136 -217002 -285318 -308050 -60797 143768 -28281
35874 -28281 -220044 -3592 227792 -79545 -525854 -365026 149940 185055 -187332 -139508
35864 -139508 418334 723402 524883 384038 528545 520652 230142 117316 336385 456331
$$ packed form
35935F06964j67323k35105J51834K16940k34541l60998J04447L19708l8179j83715
35925A80032J60753J89475l05732l58855L20155O08638m7251n68753j48358L64785
35915C94889P9740l99076k26768J86078J19194j40713n0076J23364l758r8767
35905a5893J21028K08622j13798l09306k8486K04569J5640j12822J42378K55673
35895C67605j01543l53588q7037J84102L4353r8434J32767K55934o9635l38561
35885g4037j42716R4503j5981j41401n504O8134o8316k2732K47253K04565j72049
35874b8281j91763K16452K31384l07337m46309J60828N14966L5115l72387M7824
35864a39508N57842L05068j98519j40845J44507p893k90510j12826K19069J19946
$$ plain form
35854 456331 261872 25799 -130146 -361788 -536123 -337920 23892 25145 -243574 -190555
35844 -190555 217099 377156 93539 -175934 -205984 -278527 -444838 -358603 -21023 102937
35834 102937 -90873 -144612 144150 396403 330923 132282 -15611 -167095 -277793 -205745
35824 -205745 -103527 -238195 -436224 -325733 -72266 -170414 -540001 -598324 -258841 -65095
35814 -65095 -229615 -322013 -91191 132031 83325 -29319 -6613 13466 -80215 -160107 -159995
35803 -159995 -152722 -68759 218965 529800 562172 401673 349658 336553 67776 -325714 -390862
35792 -390862 -77427 217215 290098 262045 146195 -124532 -326550 -206987 -16803 -162370
35782 -162370 -452470 -369049 31566 219966 111470 115174 301018 307742 118068 153407 494815
$$ packed form
35854D56331j94459k36073j55945k31642j74335J98203L61812J253k68719N3019
35844a90555M07654J60057k83617k69473l0050p2543j66311Q6235L37580J23960
35834A02937j93810n3739K88762K52253o5480j98641j47893j51484j10698P2048
35824b05745J02218j34668j98029J10491K53467r8148l69587n8323L39483J93746
35814f5095j64520r2398K30822K23222m8706j12644K2706K0079r3681p9892J12
35803a59995P273Q3963K87724L10835L2372j60499n2015j3105k68777l93490o5148
35792c90862L13435K94642P2883k8053j15850k70727k02018J19563J90184j45567
35782a62370k90100Q3421M00615J88400j08496L704J85844O724j89674L5339L41408
$$ plain form
35771 494815 717803 616280 442956 347156 202560 52203 102047 231967 128423 -87242
35761 -87242 5916 374166 557738 435906 307006 248467 92159 -15070 223468 557232
35751 557232 441264 -10246 -130325 208078 439504 321729 247725 397616 421983 184173
35741 184173 32146 97446 60469 -162261 -212948 7839 132267 17130 -46121 9509
35731 9509 -118623 -394372 -339716 111338 381700 152269 -189218 -267118 -212526 -177086 -29273
35720 -29273 183075 126016 -178822 -242091 95249 389394 372109 334114 455732 442125 156125
35709 156125 -41354 61731 150968 -7430 -176490 -185828 -254513 -446681 -409545 -8407
35699 -8407 349793 364785 251179 193917 4193 -345915 -469246 -224304 -32058 -146045
$$ packed form
35771D94815K22988j01523j73324r5800j44596j50357M9844J29920j03544k15665
35761h7242R3158L68250J83572j21832j28900n8539j56308j07229K38538L33764
35751E57232j15968m51510j20079L38403K31426j17775p4004J49891K4367k37810
35741A84173j52027O5300l6977k22730n0687K20787J24428j15137o3251N5630
35731I509j28132k75749N4656M51054K70362k29431l41487p7900N4592L5440J47813
35720b9273K12348n7059l04838o3269L37340K94145j7285l7995J21618j3607k86000
35709A56125j97479J03085Q9237j58398j69060r338o8685j92168L7136M01138
35699h407L58200J4992j13606n7262j89724l50108j23331K44942J92246j13987
$$ plain form
35689 -146045 -207735 56806 301626 189809 -6073 67562 220434 123385 -106558 -193140
35679 -193140 -158253 -79626 165669 513314 550302 179931 -44321 264951 661644 554982
35669 554982 116093 -103951 -78798 -177139 -398887 -398199 -138917 49161 22796 -31608 16120
35658 16120 85264 93769 36193 -96514 -256945 -306182 -225464 -205586 -342159 -439734 -320720
35647 -320720 -114253 -13429 40759 181641 308162 220907 -52079 -290833 -366930 -328894
35637 -328894 -269869 -217225 -110442 120097 380893 416428 150096 -109006 -58012 140942
35627 140942 125952 -83330 -185635 -158594 -218660 -283907 -41677 416067 591581 319576
35617 319576 -17909 -127448 -133613 -149284 -54677 127689 152200 21437 40987 242423 272909
$$ packed form
35689a46045o1690K64541K44820j11817j95882P3635J52872r7049k29943q6582
35679a93140L4887P8627K45295L47645L6988l70371k24252L09272L96693j06662
35669E54982m38889k20044K5153r8341k21748O88K59282J88078k6365n4404M7728
35658A6120O9144Q505n7576j32707j60431m9237Q0718J9878j36573r7575J19014
35647c20720K06467J00824N4188J40882J26521q7255k72986k38754p6097L8036
35637c28894N9025N2644J06783K30539K60796L5535k66332k59102N0994J98954
35627A40942j4990k09282j02305K7041o0066o5247K42230M57744J75514k72005
35617C19576l37485j09539o165j5671R4607J82366K4511j30763J9550K01436L0486
$$ plain form
35606 272909 32846 -125492 -39669 -10326 -188415 -266117 -80497 39612 -112043 -193201
35596 -193201 82613 388270 281214 -123293 -408202 -455747 -383891 -170706 246784 691801
35586 691801 902618 841466 650661 469668 417554 531399 634778 521803 296193 207702
35576 207702 182707 -45510 -358436 -347713 -34530 102431 -77284 -185050 -63606 -59308
35566 -59308 -293452 -353458 -46686 196044 62831 -119588 -43283 11403 -233336 -447555
35556 -447555 -245942 108769 130042 -117982 -206744 -29327 164358 189492 18706 -300005
35546 -300005 -528516 -344786 174536 519151 421594 169878 41477 -72837 -226273 -167181
35536 -167181 124986 222251 -46418 -243143 -90307 19253 -221575 -389251 -54850 401639
$$ packed form
35606B72909k40063j58338Q5823K9343j78089p7702J85620J20109j51655q1158
35596a93201K75814L05657j07056m04507k84909m7545P1856K13185M17490M45017
35586F91801K10817o1152j90805j80993n2114J13845J03379j12975k25610q8491
35576B07702k4995k28217l12926J0723L13183J36961j79715j07766J21444M298
35566e9308k34144o0006L06772K42730j33213j82419P6305N4686k44739k14219
35556d47555K01613L54711K1273k48024q8762J77417J93685K5134j70786l18711
35546c00005k28511J83730N19322L44615r7557k51716j28401j14314j53436N9092
35536a67181K92167R7265k68669j96725J52836J09560k40828j67676L34401M56489
$$ plain form
35526 401639 395177 100689 99758 417296 606181 520337 365024 211637 38710 20363 247904
35515 247904 427942 344789 285127 490514 601823 266960 -112168 26314 403323 302967
35505 302967 -244439 -515628 -235876 125924 206925 169263 195633 203675 177863 255768 385906
35494 385906 345562 142025 -8957 -79817 -189304 -228894 8845 369595 465182 243830
35484 243830 5338 -111159 -215333 -284609 -158527 82421 166102 78650 69477 193805
35474 193805 235798 119709 47796 180895 454108 710408 795161 600712 245534 63517
35464 63517 166329 221909 -41452 -370775 -393853 -213658 -152478 -159984 6262 220873 177952
35453 177952 -10335 15228 192505 138968 -126893 -176578 87916 270423 147998 -31425
$$ packed form
35526D01639o462k94488r31L17538J88885q5844j55313j53387j72927j8347K27541
35515B47904J80038q3153n9662K05387J11309l34863l79128J38482L77009j00356
35505C02967n47406k71189K79752L61800Q1001l7662K6370Q042k5812P7905J30138
35494C85906m0344k03537j50982p0860j09487l9590K37739L60750R5587k21352
35484B43830k38492j16497j04174o9276J26082K40948Q3681q7452r173J24328
35474A93805M1993j16089p1913J33099K73213K56300Q4753j94449l55178j82017
35464F3517J02812N5580k63361l29323k3078J80195O1180p506J66246K14611m2921
35453A77952j88287K5563J77277n3537k65861m9685K64494J82507j22425j79423
$$ plain form
35443 -31425 -38475 37653 113730 287975 534157 608400 411948 126621 -97786 -269444 -322246
35432 -322246 -118661 237923 426453 319185 81838 -145474 -346908 -428703 -290646 -105937
35422 -105937 -148530 -331536 -317703 -99313 -22191 -185547 -296572 -227348 -223416 -378708 -383418
35411 -383418 -58064 285441 335914 283071 467239 794948 880568 615424 263509 78326
35401 78326 99619 264740 461401 487566 197761 -254304 -482698 -270456 171958 428983
35391 428983 332949 114229 81037 248553 393361 406404 400402 454509 471119 380183 289603
35380 289603 298684 331662 300418 268933 300284 301563 190395 60112 4270 -63625 -227204
35369 -227204 -365496 -341942 -247763 -242042 -282080 -225642 -82463 28314 46477 -64780 -345143
$$ packed form
35443c1425p050P6128P6077J74245K46182P4243j96452k85327k24407j71658n2802
35432c22246K03585L56584J88530j07268k37347k27312k01434q1795J38057J84709
35422a05937m2593j83006J3833K18390P7122j63356j11025O9224L932j55292m710
35411c83418L25354L43505N0473n2843J84168L27709Q5620k65144l51915j85183
35401G8326K1293J65121J96661K6165k89805m52065k28394K12242M42414K57025
35391D28983r6034k18720l3192J67516J44808J3043o002N4107J6610r0936r0580
35380B89603R081L2978l1244l1485L1351J279j11168j30283n5842o7895j63579
35369b27204j38292K3554R4179N721m0038N6438J43179J10777J8163j11257k80363
$$ plain form
35358 -345143 -648246 -647704 -269948 93355 77314 -158956 -229564 -110171 -62969 -123917 -71094
35347 -71094 139391 263023 112960 -238554 -598666 -794863 -734826 -515050 -386969 -445893
35337 -445893 -481839 -304829 -29695 162918 319218 512178 592906 453308 307629 361352
35327 361352 415005 191903 -129401 -154156 83411 171835 -32930 -245677 -240028 -122261
35317 -122261 -81574 -167125 -333861 -475427 -448635 -272734 -196132 -343480 -467687 -325577
35307 -325577 -97618 -94647 -239923 -234039 -75459 -166 -27887 8913 83467 43372 -24575
35296 -24575 79136 246516 195367 -25797 -88182 85142 235296 202278 78934 -40283
35286 -40283 -122702 -74351 102634 130355 -196506 -598645 -642558 -354133 -87073 59230
$$ packed form
35358c45143l03103N42L77756L63303j6041k36270p0608J19393M7202o0948N2823
35347g1094K10485J23632j50063l51514l60112j96197O0037K19776J28081n8924
35337d45893l5946J77010K75134J92613J56300J92960Q0728j39598j45679N3723
35327C61352N3653k23102l21304k4755K37567Q8424k04765k12747N649J17767
35317a22261M0687q5551j66736j41566K6792J75901P6602j47348j24207J42110
35307c25577K27959K971j45276N884J58580P5293k7721L6800P4554m0095o7947
35296b4575J03711J67380n1149k21164o2385J73324J50154l3018j23344j19217
35286d0283q2419M8351J76985K7721l26861m02139m3913K88425K67060J46303
$$ plain form
35276 59230 205565 229698 -96648 -574641 -737628 -517292 -235096 -678 307621 527791
35266 527791 336860 -90691 -210554 28255 110767 -138779 -272295 -36747 209481 189997
35256 189997 178176 404326 566800 361990 36288 -18710 154664 289971 344132 375793
35246 375793 294263 79386 -33698 80079 149732 -98778 -509209 -751521 -774850 -710904
35236 -710904 -551522 -239454 79670 183932 56884 -152726 -334495 -427199 -373532 -214382
35226 -214382 -99415 -96920 -126712 -132958 -140285 -99131 103533 429703 703923 857327 918529
35215 918529 796697 403726 -21498 -107930 89822 150025 -29117 -65989 239245 549883
35205 549883 530432 319777 210296 222753 251564 289992 276042 60032 -248521 -272937 48335
$$ packed form
35276E9230J46335K4133l26346m77993j62987K20336K82196K34418L08299K20170
35266E27791j90931m27551j19863K38809Q2512k49546j33516K35548K46228j9484
35256A89997j1821K26150J62474k04810l25702n4998J73374J35307N4161L1661
35246C75793q1530k14877j13084J13777O9653k48510m10431k42312k3329O3946
35236g10904J59382L12068L19124J04262j27048k09610j81769r2704N3667J59150
35226b14382J14967K495k9792o246p327M1154K02664L26170K74220J53404O1202
35215I18529j21832l92971m25224q6432J97752O0203j79142l6872L05234L10638
35205E49883j9451k10655j09481J2457K8811L8428j3950k16010l08553k4416L21272
$$ plain form
35194 48335 269082 113421 -67714 112710 414984 358669 -11109 -226008 -92557 155480
35184 155480 302479 351494 320720 173540 -37865 -184718 -211413 -144213 -35401 760
35174 760 -143590 -345975 -298203 76943 464300 569238 464580 355768 253558 95125
35164 95125 -42181 -75928 -63330 -21626 154007 398782 395392 34803 -327624 -366007 -248876
35153 -248876 -279629 -357654 -210240 57010 98746 -103623 -252125 -250540 -301786 -488906 -625285
35142 -625285 -567658 -386676 -189152 -19131 43733 -84424 -338318 -559761 -685961 -715003
35132 -715003 -565816 -205540 139096 163800 -108342 -328917 -260241 -20941 131679 95236
35122 95236 -44015 -146898 -155578 -157163 -289447 -532033 -680575 -615637 -480894 -465095 -520955
$$ packed form
35194D8335K20747j55661j81135J80424L02274n6315l69778k14899J33451K48037
35184A55480J46999M9015l0774j47180k11405j46853k6695O7200J08812L6161
35174G60j44350k02385M7772L75146L87357J04938j04658j08812j02210j58433
35164I5125j37306l3747J2598M1704J75633K44775l390l60589l62427l8383J17131
35153b48876l0753p8025J47414K67250M1736k02369j48502J585n1246j87120j36379
35142f25285N7627J80982J97524J70021O2864j28157k53894k21443j26200k9042
35132g15003J49187L60276L44636K4704k72142k20575O8676K39300J52620l6443
35122I5236j39251j02883q680j585j32284k42586j48542O4938J34743J5799n5860
$$ plain form
35111 -520955 -464482 -267182 -77030 -2713 -27946 -95958 -150343 -133973 -45075 60768 179069
35100 179069 350657 495708 445746 248996 212649 454664 640754 429181 -6969 -209631
35090 -209631 -59239 157988 226974 206546 172650 92645 3784 27764 130344 114202 -66830
35079 -66830 -215894 -207246 -170516 -236966 -299654 -195930 879 48682 -153803 -449311 -595855
35068 -595855 -486940 -221828 -1420 71657 103266 264711 531218 656656 463847 80853
35058 80853 -194399 -213840 -71655 88659 232648 365508 419473 320791 131305 10715
35048 10715 26237 92082 117925 110971 82675 -22400 -197745 -275557 -114376 152230 215320
35037 215320 -45656 -425396 -645937 -637800 -532198 -470154 -477079 -472510 -360869 -134946 105995
$$ packed form
35111e20955N6473J97300J90152P4317k5233o8012n4385J6370Q8898J05843J18301
35100A79069J71588J45051m9962j96750l6347K42015J86090k11573m36150k02662
35090b09631J50392K17227O8986k0428l3896q0005q8861K3980J02580j6142j81032
35079f6830j49064Q648L6730o6450o2688J03724J96809M7803k02485k95508j46544
35068e95855J08915K65112K20408P3077L1609J61445K66507J25438j92809l82994
35058H0853k75252j9441J42185J60314J43989J32860N3965r8682j89486j20590
35048A0715J5522O5845K5843o954k8296j05075j75345p7812J61181K66606O3090
35037B15320k60976l79740k20541Q137J05602O2044o925M569J11641K25923K40941
$$ plain form
35026 105995 265084 352462 440434 541382 582159 487930 266502 37824 -23172 145384
35016 145384 367126 381685 158411 -72670 -142758 -129523 -152537 -184423 -184927 -219513 -287805
35005 -287805 -232051 3868 221276 264191 255543 322234 330233 162357 3517 21921 23942
34994 23942 -181091 -326081 -78540 316491 338832 7607 -197928 -160341 -222584 -443631
34984 -443631 -432614 -76784 200234 139905 27882 100826 133109 -53879 -194721 -81453
34974 -81453 15857 -131122 -202774 144799 597892 589519 162219 -130874 -73244 -339 -166380
34963 -166380 -364696 -298636 -5880 237392 256673 116944 -347 -15285 -41396 -196690
34953 -196690 -354607 -272049 9829 151454 9016 -127438 31067 346928 494533 418083
$$ packed form
35026A05995J59089Q7378Q7972J00948M0777r4229k21428k28678o0996J68556
35016A45384K21742J4559k23274k31081p0088J3235k3014l1886n04l4586o8292
35005b87805N5754K35919K17408M2915q648O6691P999j67876j58840J8404K021
34994B3942k05033j44990K47541L95031K2341l31225k05535L7587o2243k21047
34984d43631J1017L55830K77018o0329j12023P2944L2283j86988j40842J13268
34974h1453R7310j46979p1652L47573M53093q373m27300k93093N7630P2905j66041
34963a66380j98316O6060K92756K43272J9281j39729j17291j4938k6111j55294
34953a96690j57917Q2558K81878J41625j42438j36454J58505L15861J47605p6450
$$ plain form
34943 418083 292728 182340 5570 -237761 -433575 -508942 -468392 -333437 -164431 -64135
34933 -64135 -58883 -62923 -29764 -21527 -73057 -135117 -201704 -315045 -395896 -288388 -48964 44726
34921 44726 -124167 -348307 -417176 -367496 -311932 -269681 -277862 -404140 -528953 -404598 -71240
34910 -71240 94296 -85546 -322817 -335024 -255245 -319129 -448887 -447150 -349187 -277497 -164272
34899 -164272 82779 327838 400982 369167 355793 278925 39979 -203971 -234808 -95170
34889 -95170 29034 92246 121761 41595 -180394 -363327 -339592 -209312 -142929 -87420 92036
34878 92036 320507 399131 270870 20229 -252936 -407685 -299221 -8538 169364 129156
34868 129156 110675 282586 455810 433181 351973 403872 475055 357484 96416 -137766
$$ packed form
34943D18083j25355j10388j76770k43331j95814p5367M0550J34955J69006J00296
34933f4135N252m040L3159Q237n1530o2060o6587j13341q0851J07508K39424R3690
34921D4726j68893k24140o8869M9680N5564M2251q181j26278j24813J24355L33358
34910g1240J65536j79842k37271j2207P9779o3884j29758J737R7963P1690J13225
34899a64272K47051K45059P3144l1815j3374p6868k38946k43950l0837J39638
34889i5170J24204O3212K9515q0166k21989j82933K3735J30280O6383N5509J79456
34878I2036K28471P8624j28261k50641k73165j54749J08464K90683J77902m0208
34868A29156j8481J71911J73224k2629q1208N1899P1183j17571k61068k34182
$$ plain form
34858 -137766 -299861 -357008 -197410 93947 170213 -77662 -269098 -98097 183262 209394
34848 209394 90132 126883 250878 225045 146884 245432 386303 290070 77054 86602 283468
34837 283468 339267 201449 101514 86152 11903 -66534 35236 230200 262009 145665 88907
34826 88907 66543 -83968 -241867 -160687 26477 -37243 -308272 -381194 -145532 101014
34816 101014 213418 359021 553724 545193 283050 56757 28716 33791 -32093 -18317 141180
34805 141180 250394 164499 -12565 -148678 -225732 -201034 -17312 200067 241559 130250
34795 130250 52483 3721 -144691 -259838 -60383 344674 473984 146766 -258329 -353437
34785 -353437 -184427 23831 212620 386146 444553 320983 110664 -46352 -67992 83681
$$ packed form
34858a37766j62095n7147J59598K91357P6266k47875j91436J71001K81359K6132
34848B09394j19262L6751J23995k5833p8161R8548J40871r6233k13016R548J96866
34837B83468N5799j37818r9935j5362p4249p8437J01770J94964L1809j16344n6758
34826H8907k2364j50511j57899Q1180J87164o3720k71029p2922K35662K46546
34816A01014J12404J45603J94703q531k62143k26293k8041N075o5884J3776J59497
34805A41180J09214q5895j77064j36113p7054K4698J83722K17379M1492j11309
34795A30250p7767m8762j48412j15147J99455M05057J29310l27218m05095r5108
34785c53437J69010K08258J88789J73526N8407j23570k10319j57016k1640J51673
$$ plain form
34775 83681 323888 404208 202162 -20396 53322 300442 355335 207839 166632 280097
34765 280097 291657 179841 209128 363433 278815 -95481 -299520 -64363 266860 301689
34755 301689 157157 141194 233740 212976 28645 -222321 -454881 -531076 -312800 39089
34745 39089 138748 -54923 -105260 218510 517555 372510 24375 2487 314520 485170
34735 485170 285625 -25952 -175541 -190993 -187601 -153006 -66000 -15251 -66214 -129606 -74542
34724 -74542 81774 186967 155549 86171 114300 188856 129319 -69848 -172323 -46497 110314
34713 110314 77210 -42628 -31512 43793 -39079 -235453 -295353 -203776 -196897 -331271 -388042
34702 -388042 -254636 -81219 3322 39417 54294 14695 -8855 81145 160020 24269 -213326
$$ packed form
34775H3681K40207Q0320k02046k22558P3718K47120N4893j47496m1207J13465
34765B80097J1560j11816K9287J54305q4618l74296k04039K35157L31223L4829
34755C01689j44532j5963R2546k0764j84331k50966k32560p6195K18276L51889
34745C9089R9659j93671n0337L23770K99045j45045l48135k1888L12033J70650
34735D85170j99545l11577j49589j5452L392L4595Q7006N0749n0963o3392N5064
34724g4542J56316J05193l1418o9378K8129P4556n9537j99167j02475J25826J56811
34713A10314l3104j19838J1116P5305q2872j96374n9900R1577O879j34374n6771
34702c88042J33406J73417Q4541L6095J4877l9599k3550R0000P8875j35751k37595
$$ plain form
34691 -213326 -224321 20059 210775 214557 219969 303645 284230 132298 98829 264928 360399
34680 360399 216127 17217 -83575 -215947 -436163 -504029 -280348 -11641 50089 8046
34670 8046 46181 95074 38210 -31303 -32513 -111653 -360596 -559913 -474456 -198450 32144
34659 32144 163149 241249 231096 129468 50981 17032 -101982 -271864 -225011 92434 335555
34648 335555 275763 164086 277459 438075 359472 179882 217361 400746 387499 126739
34638 126739 -102797 -148607 -120444 -114198 -113429 -136917 -216945 -264221 -182303 -60299 -42765 -87155
34626 -87155 -56877 37409 96727 131714 189240 184017 20929 -205881 -340432 -394128 -449395
34615 -449395 -446724 -290908 -84130 -34028 -178055 -365641 -449102 -359700 -102549 181329
$$ packed form
34691b13326j0995K44380J90716L782N412Q3676j9415j51932l3469J66099R5471
34680C60399j44272j98910j00792j32372k20216o7866K23681K68707O1730m2043
34670H046L8135M8893n6864o9513j210p9140k48943j99317Q5457K76006K30594
34659C2144J31005P8100j0153j01628p8487l3949j19014j69882M6853L17445K43121
34648C35555n9792j11677J13373J60616p8603j79590L7479J83385j3247k60760
34638A26739k29536m5810K8163O246P69k3488q0028m7276Q1918J22004J7534m4390
34626h7155L0278R4286N9318L4987N7526n223j63088k26810j34551n3696n5267
34615d49395K671J55816K06778N0102j44027j87586q3461Q9402K57151K83878
$$ plain form
34605 181329 269924 124315 -26655 2590 110986 115570 23122 -61484 -119806 -143901 -50841
34594 -50841 161581 345252 420985 459127 436024 213591 -83413 -51399 365322 619975
34584 619975 303005 -220187 -360981 -182549 -179774 -404599 -421161 -67827 305253 393797
34574 393797 251852 3721 -298029 -459211 -236988 230149 474470 310783 43505 -53445
34564 -53445 -90898 -229937 -345419 -265694 -91366 -31804 -98014 -157734 -158746 -134396 -104296
34553 -104296 -100789 -185852 -337584 -430250 -414478 -397684 -457194 -496011 -390960 -190573 -61915
34542 -61915 -96862 -240022 -361402 -361754 -255345 -160594 -151638 -142008 -13309 169107 218617
34531 218617 115858 61464 170524 276475 172542 -60483 -139416 35130 239967 223983
$$ packed form
34605A81329Q8595j45609j50970K9245J08396M584r2448q4606n8322k4095R3060
34594e0841K12422J83671P5733L8142k3103k22433k97004L2014M16721K54653
34584F19975l16970n23192j40794J78432K775k24825j6562L53334L73080Q8544
34574C93797j41945k48131l01750j61182K22223M67137K44321j63687k67278r6950
34564e3445l7453j39039j15482P9725J74328N9562o6210n9720j012K4350L0100
34553a04296L507q5063j51732r2666J5772J6794n9510l8817J05051K00387J28658
34542f1915l4947j43160j21380l52J06409R4751Q956R630J28699J82416M9510
34531B18617j02759n4394J09060J05951j03933k33025p8933J74546K04837j5984
$$ plain form
34521 223983 20486 -131215 -104086 9945 97864 171168 247456 230477 44904 -195647
34511 -195647 -302986 -242994 -115002 29330 187699 300720 337743 424203 658543 863488
34501 863488 788983 515236 332405 246504 7251 -328738 -339214 74376 399398 221765
34491 221765 -167762 -255940 -65292 23982 -30139 66344 336778 434815 206286 -57141
34481 -57141 -54348 129102 205621 72977 -109081 -126694 68173 293731 309332 99629 -92696
34470 -92696 -92132 -18785 -66979 -197672 -229304 -118949 44533 233832 463391 648041 686437
34459 686437 633022 593456 504002 229098 -143693 -327382 -197451 35792 89757 -50844
34449 -50844 -131013 56350 397186 566658 435817 241763 227140 268970 127112 -70558
$$ packed form
34521B23983k03497j51701K7129J14031Q7919P3304P6288j6979j85573k40551
34511a95647j07339N9992J27992J44332J58369J13021L7023Q6460K34340K04945
34501H63488p4505k73747j82831q5901k39253l35989j0476M13590L25022j77633
34491B21765l89527q8178J90648Q9274n4121R6483K70434R8037k28529k63427
34481e7141K793J83450P6519j32644j82058j7613J94867K25558J5601k09703j92325
34470i2696N64P3347m8194j30693l1632J10355J63482J89299K29559J84650L8396
34459F86437n3415l9566q9454k74904l72791j83689J29931K33243N3965j40601
34449e0844q0169J87363L40836J69472j30841j94054j4623M1830j41858j97670
$$ plain form
34439 -70558 6452 268971 239055 -184423 -491221 -325369 -14864 -9425 -213498 -278402 -197570
34428 -197570 -170989 -173872 -102267 -81930 -194483 -174136 145658 369315 81747 -389602 -392069
34417 -392069 30271 212495 -92032 -446443 -550722 -634674 -859092 -949679 -696617 -316578
34407 -316578 -50444 162924 361746 335224 11786 -288688 -287368 -134258 -98827 -156480
34397 -156480 -155635 -142372 -225505 -303557 -199254 48911 232064 214208 6278 -273759 -421719
34386 -421719 -293874 -26756 65826 -103297 -293267 -312859 -256471 -249632 -217893 -81828 41077
34375 41077 29342 -21547 34429 142767 143526 18178 -103406 -107084 23366 196693 237509
34364 237509 45482 -235223 -362503 -330689 -351292 -472755 -490270 -324968 -200743 -274855
$$ packed form
34439g0558P7010K62519k9916m23478l06798J65852L10505N439k04073o4904Q0832
34428a97570K6581k883P1605K0337j12553K0347L19794K23657k87568m71349k467
34417c92069M22340J82224l04527l54411j04279q3952k24418r0587K53062L80039
34407c16578K66134K13368J98822k6522l23438l00474J320J53110L5431n7653
34397a56480Q45J3263q3133p8052J04303K48165J83153j7856k07930k80037j47960
34386d21719J27845K67118R2582j69123j89970j9592N6388O839L1739J36065J22905
34375D1077j1735n0889N5976J08338P59j25348j21584l678J30450J73327M0816
34364B37509j92027k80705j27280L1814k0603j21463j7515J65302J24225p4112
$$ plain form
34354 -274855 -354790 -202323 93236 281703 316651 307720 255040 103858 -22317 78658
34344 78658 358025 512009 352499 29148 -168806 -135315 -26452 -55793 -232029 -321789
34334 -321789 -124039 249092 485262 467690 394515 447687 525014 432956 204514 50900
34324 50900 67984 150378 166929 87198 -55216 -204786 -273233 -179508 59104 317180 465903
34313 465903 470408 383414 273106 179074 124072 119592 126639 58136 -100425 -201177 -84951
34302 -84951 171473 303917 199384 30740 -13228 45952 120924 223972 324637 246405
34292 246405 -61187 -312298 -221378 64552 154972 -45422 -280105 -364535 -356358 -317925 -217616
34281 -217616 -96501 -55668 -40021 103740 317810 351387 149200 -34330 4449 162715
$$ packed form
34354b74855p9935J52467K95559J88467L4948q931n2680j51182j26175J00975
34344G8658K79367J53984j59510l23351j97954L3491J08863k9341j76236q9760
34334c21789J97750L73131K36170j7572p3175N3172P7327r2058k28442j53614
34324E0900J7084Q2394J6551p9731j42414j49570o8447R3725K38612K58076J48723
34313D65903M505q6994j10308r4032n5002m480P047o8503j58561j00752J16226
34302h4951K56424J32444j04533j68644m3968N9180P4972J03048J00665p8232
34292B46405l07592k51111R0920K85930R0420k00394k34683q4430Q177L8433J00309
34281b17616J21115M0833J5647J43761K14070L3577k02187j83530L8779J58266
$$ plain form
34271 162715 219002 92114 -143579 -329979 -287420 17705 360473 483316 400190 294710
34261 294710 218591 150239 224696 537613 799177 614575 95709 -259231 -311162 -395367
34251 -395367 -618714 -625150 -280836 -29934 -219790 -544033 -557739 -347343 -258162 -295943
34241 -295943 -255461 -169103 -166279 -110653 158998 407103 290004 -60955 -202783 -41924
34231 -41924 108846 73143 -33298 -164444 -408822 -652793 -608778 -284322 -56758 -157841
34221 -157841 -396724 -502945 -442708 -284883 -57433 127875 102025 -51408 -1268 321663
34211 321663 505837 220347 -239609 -314250 44531 337356 252856 65254 150734 399828
34201 399828 394411 50198 -235190 -138921 137108 169185 -79389 -230472 -72871 121664
$$ packed form
34271A62715N6287j26888k35693j86400M2559L05125L42768J22843q3126j05480
34261B94710p6119o8352P4457L12917K61564j84602n18866l54940n1931q4205
34251c95367k23347o436L44314K50902j89856l24243j3706K10396Q9181l7781
34241b95943M0482Q6358K824N5626K69651K48105j17099l50959j41828J60859
34231d1924J50770l5703j06441j31146k44378k43971M4015L24456K27564j01083
34221a57841k38883j06221O0237J57825K27450J85308k5850j53433N0140L22931
34211C21663J84174k85490m59956p4641L58781K92825q4500j87602Q5480K49094
34201C99828n417l44213k85388R6269K76029L2077k48574j51083J57601J94535
$$ plain form
34191 121664 21849 -246905 -282091 -10113 193602 41609 -272402 -373477 -219410 -97912
34181 -97912 -182194 -319246 -303257 -178086 -144990 -264646 -393680 -399827 -318464 -265490 -279114
34170 -279114 -293434 -221159 -34130 201014 363139 401078 397731 426037 378448 101918 -286266
34159 -286266 -432186 -195485 134738 229068 135006 98247 141111 104183 2996 16591 133899
34148 133899 124190 -86452 -285171 -311109 -287667 -397529 -611272 -757408 -722387 -497053
34138 -497053 -158870 126515 221600 186879 196581 257323 188131 -66404 -289475 -245590 65788
34127 65788 466444 749110 727983 340964 -206584 -568899 -614731 -505265 -383196 -201305
34117 -201305 65381 274746 311654 225222 60550 -225872 -556130 -680964 -516424 -307088
$$ packed form
34191A21664r9815k68754l5186K71978K03715j51993l14011j01075J54067J21498
34181i7912q4282j37052J5989J25171L3096j19656j29034o147Q1363N2974j3624
34170b79114j4320P2275J87029K35144J62125L7939l347K8306m7589k76530l88184
34159b86266j45920K36701L30223R4330r4062l6759M2864l6928j01187J3595J17308
34148A33899r709k10642j98719k5938K3442j09862k13743j46136L5021K25334
34138d97053L38183K85385R5085l4721R702O0742o9192k54535k23071M3885L11378
34127F5788M00656K82666k1127l87019n47548l62315m5832J09466J22069J81891
34117b01305K66686K09365L6908q6432j64672k86422l30258j24834J64540K09336
$$ plain form
34107 -307088 -259090 -231119 -18648 262392 348758 228314 88721 -5815 -108847 -166823
34097 -166823 -86175 44019 69115 46280 124810 209119 69252 -212742 -259235 45644 330072
34086 330072 232829 -121363 -350937 -336573 -269811 -281529 -274266 -140085 45914 132041 86681
34075 86681 2594 -45805 -66072 -73456 -25647 127986 359175 556363 601161 447502 167182
34064 167182 -64175 -92107 46140 128693 1968 -222119 -314472 -228426 -129028 -143017 -215632
34053 -215632 -233377 -169350 -72519 -8831 -42131 -190249 -378746 -505921 -545571 -509833 -355133
34042 -355133 -57175 240079 310514 116291 -128398 -198737 -72698 103640 169327 72292
34032 72292 -70431 -65258 113622 237695 99229 -216130 -476495 -602416 -621803 -469850
$$ packed form
34107c07088M7998K7971K12471K81040Q6366j20444j39593r4536j03032n7976
34097a66823Q0648J30194K5096k2835P8530Q4309j39867k81994m6493L04879K84428
34086C30072r7243l54192k29574J4364O6762j1718P263J34181J85999Q6127m5360
34075H6681q4087m8399k0267p384M7809J53633K31189J97188M4798j53659k80320
34064A67182k31357k7932J38247Q2553j26725k24087r2353Q6046R9398j3989p2615
34053b15632j7745O4027R6831O3688l3300j48118j88497j27175l9650L5738J54700
34042c55133K97958K97254P0435j94223k44689p0339J26039J76338O5687r7035
34032G2292j42723N173J78880J24073j38466l15359k60365j25921j9387J51953
$$ plain form
34022 -469850 -118731 198737 233686 131542 234393 510000 597071 434280 364558 499444
34012 499444 480289 108853 -242152 -182338 104810 201707 92770 52281 106335 28582 -224100
34001 -224100 -433959 -446049 -293781 -43863 242151 429525 405198 228395 41714 -100878
33991 -100878 -196235 -203730 -139014 -119582 -158995 -65977 267809 623035 698725 488550 226982
33980 226982 76412 47160 108455 193115 192591 104482 74930 167617 242231 190580 105321 73095
33968 73095 25890 -35434 61384 314912 387995 84985 -278724 -335153 -241045 -373473 -646308
33957 -646308 -630335 -280072 -39385 -172365 -416598 -423421 -212232 -45550 -84908 -282661
33947 -282661 -457999 -433936 -223516 -52079 -65137 -116529 -30485 66131 -60326 -333696
$$ packed form
34022d69850L51119L17468L4949j02144J02851K75607Q7071j62791o9722J34886
34012D99444j9155l71436l51005N9814K87148R6897j08937m0489N4054p7753k52682
34001b24100k09859j2090J52268K49918K86014J87374k4327j76803j86681j42592
33991a00878r5357p495O4716J9432l9413R3018L33786L55226P5690k10175k61568
33980B26982j50570k9252O1295Q4660n24q8109k9552R2687P4614n1651q5259l2226
33968G3095m7205o1324R6818K53528P3083l03010l63709n6429R4108j32428k72835
33957f46308J5973L50263K40687j32980k44233o823K11189J66682l9358j97753
33947b82661j75338K4063K10420J71437j3058n1392Q6044R6616j26457k73370
$$ plain form
33937 -333696 -460529 -382035 -316705 -367647 -390525 -270088 -63687 143698 289821 257529
33927 257529 -3761 -298978 -379435 -283756 -235278 -258780 -195130 -46461 28312 41673 148716
33916 148716 287430 224995 9704 -12571 262702 512327 479484 307560 208588 130103
33906 130103 -24982 -130340 -46519 106701 129716 40468 -14980 -12897 -19485 -21118 35182
33895 35182 116871 165519 199847 238784 210078 56424 -136954 -220613 -131633 86858 325450
33884 325450 419353 249859 -70834 -225611 -20176 377161 614854 529943 272705 111022
33874 111022 180194 396968 564217 561057 441337 340095 313387 312047 282970 231716 190242
33863 190242 169097 144933 88895 26387 34618 109082 93558 -101745 -262944 -103032 257290
$$ packed form
33937c33696j26833P8494O5330n0942k2878J20437K06401K07385J46123l2292
33927B57529k61290k95217q0457R5679M8478k3502O3650J48669P4773J3361J07043
33916A48716J38714o2435k15291k2275K75273K49625l2843j71924r8972p8485
33906A30103j55085j05358Q3821J53220K3015q9248n5448K083o588j633N6300
33895C5182Q1689M8648L4328L8937k8706j53654j93378q3659Q8980K18491K38592
33884C25450R3903j69494l20693j54777K05435L97337K37693q4911k57238j61683
33874A11022O9172K16774J67249l160j19720j01242k6708j340k9077n1254m1474
33863A90242k1145k4164n6038o2508Q231P4464j5524j95303j61199J59912L60322
$$ plain form
33852 257290 352391 16738 -366929 -438532 -324707 -270633 -173928 126578 398887 328916
33842 328916 82411 66415 270353 346799 244493 215018 228254 -25443 -470062 -561370
33832 -561370 -78850 478632 548478 182913 -171711 -259703 -150277 -43727 -132802 -442087
33822 -442087 -694524 -581385 -224274 -53427 -166074 -202001 18977 179995 19058 -213039
33812 -213039 -157498 122640 342195 438950 486706 411640 149998 -90915 -63716 152723
33802 152723 294918 290563 234145 131890 -50862 -201083 -184404 -72426 -8117 55001 232764
33791 232764 415233 351071 -946 -409647 -635593 -599412 -348629 -29466 151201 87552
33781 87552 -125135 -330887 -460913 -465533 -263269 95781 369330 405729 359122 438256 568565
$$ packed form
33852B57290R5101l35653l83667p1603J13825N4074R6705L00506K72309o9971
33842C28916k46505j5996K03938P6446j02306k9475J3236k53697m44619r1308
33832e61370M82520N57482O9846l65565l54624q7992J09426J06550q9075l09285
33822d42087k52437J13139L57111J70847j12647l5927K20978J61018j60937k32097
33812b13039N5541K80138K19555R6755M7756p5066k61642k40913K7199K16439
33802A52723J42195m355n6418j02255j82752j50221J6679J11978O4309O3118J77763
33791B32764J82469o4162l52017m08701k25946L6181K50783L19163J80667o3649
33781H7552k12687k05752j30026m620K02264L59050K73549L6399m6607P9134J30309
$$ plain form
33770 568565 518552 266506 15257 -107557 -158456 -211385 -258520 -271518 -229447 -105952 63618
33759 63618 145666 44877 -169880 -364458 -492343 -555606 -504778 -303304 -33930 166189
33749 166189 234859 188447 74329 -20377 -7953 88606 156437 159055 157416 148884 64881 -38877
33737 -38877 -15712 86915 44019 -136498 -126884 205104 495302 373156 2690 -188313
33727 -188313 -123646 -70012 -149052 -229061 -244194 -269862 -280559 -148894 70190 122503 -104665
33716 -104665 -423081 -583344 -524228 -358011 -238127 -243021 -283269 -164437 148251 411994
33706 411994 390124 146791 -109080 -341688 -617766 -830122 -786051 -539334 -354642 -332581
33696 -332581 -323228 -230429 -149230 -152777 -174447 -170022 -197424 -268019 -292608 -227366 -111472 66133
$$ packed form
33770E68565n0013k52046k51249j22814n0899n2929m7135j2998M2071J23495J69570
33759F3618Q2048j00789k14757j94578j27885o3263N0828K01474K69374K00119
33749A66189O8670m6412j14118r4706J2424R6559O7831K618j639q532q4003j03758
33737c8877K3165J02627m2896j80517R614L31988K90198j22146l70466j91003
33727a88313O4667N3634p9040q0009j5133k5668j0697J31665K19084N2313k27168
33716a04665l18416j60263N9116J66217J19884m894m0248J18832L12688K63743
33706D11994k1870k43333k55871k32608k76078k12356M4071K46717J84692K2061
33696c32581R353R2799Q1199l547k1670M425k7402p0595k4589O5242J15894J77605
$$ plain form
33684 66133 352560 652461 764533 652893 496053 413319 339031 230038 182837 245188
33674 245188 312142 324564 374160 477413 450556 194726 -74776 -112737 -16947 -49767 -176096
33663 -176096 -94714 254817 526828 431948 115223 -110074 -207794 -347894 -512596 -488267
33653 -488267 -261054 -117336 -229241 -393172 -369842 -267811 -317576 -414871 -239986 196476
33643 196476 489725 408283 201945 181533 273655 227828 51464 -46707 -27025 -51110 -184849
33632 -184849 -312038 -349226 -351186 -381571 -431183 -474724 -477116 -355584 -80409 194628 259823
33621 259823 122308 909 20683 63239 -24783 -214410 -370720 -438272 -447419 -404374 -283474
33610 -283474 -107859 50087 156593 243113 329030 375295 357420 338241 386856 435801 330171
$$ packed form
33684F6133K86427K99901J12072j11640j56840q2734p4288j08993m7201O2351
33674B45188O6954J2422M9596J03253k6857k55830k69502l7961R5790l2820j26329
33663a76096Q1382L49531K72011r4880l16725k25297r7720j40100j64702K4329
33653d88267K27213J43718j11905j63931K3330J02031m9765r7295J74885M36462
33643A96476K93249q1442k06338k0412R2122m5827j76364r8171J9682k4085j33739
33632a84849j27189l7188j960l0385m9612m3541k392J21532K75175K75037O5195
33621B59823j37515j21399J9774M2556q8022j89627j56310o7552r147M3045J20900
33610b83474J75615J57946J06506Q6520Q5917M6265j7875j9179M8615M8945j05630
$$ plain form
33599 330171 65443 -136736 -92585 93308 177717 110096 43558 53785 51179 -9680 -33804
33588 -33804 39958 139949 207660 288259 406208 499761 546718 605158 664540 614915 432641
33577 432641 236334 100357 -6968 -51064 73462 294270 362427 219556 98857 117530
33567 117530 66421 -191598 -420204 -380462 -221907 -180124 -146169 74126 292415 189006
33557 189006 -99191 -126181 164850 363634 253539 99625 153896 267299 185774 -61829
33547 -61829 -266229 -319872 -244455 -99904 25361 65892 68101 95137 71630 -80644 -212555
33536 -212555 -138296 -18494 -181988 -528218 -540635 -66720 330329 101233 -517298 -815299
33526 -815299 -496977 93503 507234 598102 432197 123386 -161698 -254623 -147419 -902
$$ packed form
33599C30171k64728k02179M4151J85893Q4409o7621o6538J0227k606o0859k4124
33588c3804P3762R9991O7711Q0599J17949R3553M6957N8440N9382m9625j82274
33577D32641j96307j35977j07325m4096J24526K20808O8157j42871j20699J8673
33567A17530n1109k58019k28606L9742J58555M1783L3955K20295K18289j03409
33557A89006k88197k6990K91031J98784j10095j53914N4271J13403q1525k47603
33547f1829k04400n3643P5417J44551J25265M0531K209K7036k3507j52274j31911
33536b12555P4259J19802j63494l46230j2417M73915L97049k29096o18531k98001
33526h15299L18322N90480M13731R0868j65905l08811k85084r2925J07204J46517
$$ plain form
33516 -902 49914 15217 -30319 -47816 -25560 52015 176187 277508 254757 70596 -168923
33505 -168923 -273959 -165282 23355 104277 54120 -16368 -52212 -78947 -83234 -37587 -18954
33494 -18954 -110658 -200207 -105693 81368 53659 -236494 -450230 -353869 -152476 -122143 -173446
33483 -173446 -65934 149831 240353 205414 230008 284929 144099 -181995 -381712 -301946
33473 -301946 -164778 -188749 -265739 -199154 -38316 54496 114221 297334 569758 710160
33463 710160 623426 453794 349647 279459 151342 -11062 -113955 -145114 -172328 -202807
33453 -202807 -141114 63667 278839 284198 34506 -242175 -280883 -77067 144497 230402
33443 230402 229917 214175 151018 59238 100698 327266 479763 304475 -6015 -10342 325132
$$ packed form
33516i02N0816l4697m5536j7497K2256P7575J24172J01321k2751j84161k39519
33505a68923j05036J08677J88637Q0922n0157p0488l5844k6735m287M5647J8633
33494a8954r1704q9549R4514J87061k7709k90153k13736R6361K01393L0333n1303
33483a73446J07512K15765R0522l4939K4594N4921j40830l26094j99717P9766
33473c01946J37168k3971p6990O6585J60838R2812N9725J83113K72424J40402
33463G10160q6734j69632j04147p0188j28117j62404j02893l1159k7214l0479
33453b02807O1693K04781K15172N359k49692k76681l8708K03816K21564Q5905
33443B30402m85j5742o3157r1780M1460K26568J52497j75288l10490m327L35474
$$ plain form
33432 325132 513773 221586 -270935 -498962 -421687 -302130 -212594 -52182 67668 -101472
33422 -101472 -464776 -583294 -269717 146734 299538 235101 203700 265569 331154 384143
33412 384143 419658 321103 49329 -167696 -93742 145235 209367 30152 -110914 -13750
33402 -13750 165488 160490 -52414 -261631 -287428 -142611 34067 130940 142065 122403 104019
33391 104019 93760 123289 209050 257119 131673 -127647 -281593 -180143 28275 91981
33381 91981 -24855 -148717 -156189 -78632 24999 152329 292373 384401 388846 346996 335471
33370 335471 374811 396562 318330 166583 80631 137853 231812 225767 166332 187379 243851
33359 243851 150898 -106325 -326735 -391835 -375309 -311156 -133372 64247 26064 -245421
$$ packed form
33432C25132J88641k92187m92521k28027P7275J19557Q9536J60412J19850j69140
33422a01472l63304j18518L13577M16451J52804o4437l1401O1869O5585N2989
33412C84143L5515r8555k71774k17025P3954K38977O4132j79215j41066R7164
33402a3750J79238m998k12904k09217k5797J44817J76678R6873J1125j9662j8384
33391A04019j0259K9529Q5761M8069j25446k59320j53946J01450K08418O3706
33381I1981j16836j23862p472P7557J03631J27330J40044R2028M445m1850j1525
33370C35471L9340K1751p8232j51747q5952N7222R3959o045n9435K1047N6472
33359B43851r2953k57223k20410o5100J6526O4153J77784J97619l8183k71485
$$ plain form
33349 -245421 -385760 -209184 -36485 -179750 -390907 -223661 253698 549404 462301 281489
33339 281489 278353 375379 375206 221826 -22998 -233576 -244578 -44696 89194 -95200 -421215
33328 -421215 -479889 -208758 36934 7607 -152737 -189952 -31340 256650 538461 599114
33318 599114 335232 -6479 -61616 150353 265216 149733 70215 185103 265838 130841
33308 130841 5902 162807 454860 518804 273086 -59164 -297838 -418953 -409302 -259799
33298 -259799 -86315 -67745 -245625 -484785 -612123 -528200 -245841 95372 301140 282030
33288 282030 118774 -43499 -109840 -60859 38061 67717 7339 19035 230239 481280 499418
33277 499418 301773 177828 261398 394495 457858 527249 603241 512611 250467 109281
$$ packed form
33349b45421j40339J76576J72699j43265k11157J67246M77359K95706q7103j80812
33339B81489l136R7026j73j53380k44824k10578j1002J99882J33890j84394l26015
33328d21215n8674K71131K45692k9327j60344l7215J58612K87990K81811O0653
33318E99114k63882l41711n5137K11969J14863j15483p9518J14888Q0735j34997
33308A30841j24939J56905K92053O3944k45718l32250k38674j21115R651J49503
33298b59799J73484J8570j77880k39160j27338Q3923K82359L41213K05768j9110
33288B82030j63256j62273o6341M8981R8920K9656o0378J1696K11204K51041J8138
33277D99418j97645j23945Q3570J33097O3363O9391P5992r0630k62144j41186
$$ plain form
33267 109281 228337 292063 -15956 -469308 -566809 -238154 73025 26482 -222042 -317862
33257 -317862 -162368 55656 155376 161726 222413 382892 485187 336434 -32373 -362055
33247 -362055 -443793 -313470 -135466 3050 120619 253532 414057 585840 719225 773294
33237 773294 762370 700020 534969 252601 -507 -47840 76235 178114 182077 174696 188476
33226 188476 157806 99656 106754 133443 31883 -158560 -220547 -114934 -43689 -71685 6597
33215 6597 283901 522753 505270 339303 227523 179611 144948 181103 284092 295882 188743
33204 188743 178550 325011 312104 -69968 -488645 -472088 -46614 384492 616013 714973
33194 714973 676667 433238 140714 62567 179015 246299 215028 254885 387239 439118 372036
$$ packed form
33267A09281J19056O3726l08019m53352r7501L28655L11179m6543k48524r5820
33257c17862J55494K18024R9720O350O0687J60479J02295j48753l68807l29682
33247c62055q1738J30323J78004J38516J17569J32913J60525J71783J33385N4069
33237G73294j0924o2350j65051k82368k53108m7333J24075J01879L963p381J3780
33226A88476l0670n8150P098K6689j01560j90443o1987J05613P1245k7996P8282
33215F597K77304K38852j7483j65967j11780m7912l4663L6155J02989J1790j07139
33204A88743j0193J46461j2907l82072m18677J6557M25474M31106K31521R8960
33194G14973l8306k43429k92524p8147J16448O7284l1271L9857J32354N1879o7082
$$ plain form
33183 372036 331987 355207 334986 288176 325054 337000 79635 -359798 -542985 -264328 166432
33172 166432 381003 389830 375036 331572 171591 -11970 -56299 429 -18705 -153718 -268168
33161 -268168 -249659 -120363 19873 65840 -29525 -174588 -173779 58513 347684 417773 207785
33150 207785 -40523 -52621 144608 226344 -40839 -469368 -641182 -427712 -142819 -111423
33140 -111423 -290541 -460309 -572088 -660974 -589848 -216630 260212 470944 381472 292564
33130 292564 309776 190321 -169189 -461556 -396849 -103124 150284 377923 728593 1092985
33120 1092985 1192781 981879 664307 351840 -10975 -377394 -546967 -476075 -402591 -508514
$$ packed form
33183C72036m0049K3220k0221m6810L6878J1946k57365m39433j83187K78657M30760
33172A66432K14571Q827j4794m3464j59981j83561m4329N6728j9134j35013j14450
33161b68168J8509J29296J40236M5967r5365j45063Q09K32292K89171P0089k09988
33150B07785k48308j2098J97229Q1736k67183m28529j71814K13470K84893L1396
33140a11423j79118j69768j11779q8886P1126L73218M76842K10732q9472q8908
33130B92564J7212j19455l59510k92367O4707K93725K53408K27639L50670L64392
33120A092985R9796k10902l17572l12467l62815l66419j69573P0892P3484j05923
$$ [...]
##END NTUPLES=NMR SPECTRUM
##END=
