##TITLE=31Pdec_39-2023
 CDCl3, 3000 sc
 14.7.2023
##JCAMPDX= 6.0         $$ Bruker NMR JCAMP-DX V2.0
##DATA TYPE= NMR SPECTRUM
##DATA CLASS= NTUPLES
##ORIGIN= UXNMR, Bruker Analytische Messtechnik GmbH
##OWNER= root
$$ XWIN-NMR		Version 3.5
$$ Fri Jul 14 13:40:44 2023 Russian Standard Time (UT+4h)  she@DPX200
##.OBSERVE FREQUENCY= 81.013821
##.OBSERVE NUCLEUS= ^31P
##.ACQUISITION MODE= SIMULTANEOUS
##.ACQUISITION SCHEME= undefined
##.AVERAGES= 24
##.DIGITISER RES= 16
##SPECTROMETER/DATA SYSTEM= spect
##.PULSE SEQUENCE= zgpg30
##.SOLVENT NAME= CDCl3
##.SHIFT REFERENCE= (INTERNAL, CDCl3, 0, 248.564)
##AUDIT TRAIL= $$ (NUMBER, WHEN, WHO, WHERE, WHAT)
$$ ##TITLE= Audit trail, XWIN-NMR		Version 3.5
$$ ##JCAMPDX= 5.01
$$ ##ORIGIN= Bruker BioSpin GmbH
$$ ##OWNER= she
$$ F:/spectra/data/she/nmr/P31/1/pdata/1/auditp.txt
$$ ##AUDIT TRAIL=  $$ (NUMBER, WHEN, WHO, WHERE, WHAT)
(   1,<2023-07-14 13:39:18.57 +0400>,<she>,<DPX200>,
      <created by zg, POWCHK disabled, PULCHK disabled
       configuration hash MD5:
       00 E9 B6 7A A2 85 ED C7 34 08 36 98 17 FE 4E 26
       data hash MD5: 32K
       2A 6A F0 59 FC 13 11 5E A0 CD F9 25 08 D6 9B 13>)
(   2,<2023-07-14 13:39:25.62 +0400>,<she>,<DPX200>,
      <Start of raw data processing
       efp BC_mod = 2 LB = 5 FT_mod = 6 PKNL = 1 PHC0 = -10709.7 PHC1 = 40.28482 SI = 64K 
       data hash MD5: 64K
       D4 FB 18 F3 35 C1 13 78 E1 75 92 EC CF 91 AC D6>)
(   3,<2023-07-14 13:39:52.59 +0400>,<she>,<DPX200>,
      <pk PHC0 = 35.04282 PHC1 = 0 
       data hash MD5: 64K
       50 BB 67 1A CA DB 99 42 4B 2D 3D 50 A5 B2 56 25>)
$$ ##END=
$$ 
$$ hash MD5
$$ DE C0 25 CD 0F C7 DA 55 2C 62 0F 46 1E D4 60 2B
##$RELAX= 
##$RELAX= 
##$RELAX= 
##$RELAX= 
##$RELAX= 
##$RELAX= 
##$RELAX= 
##$RELAX= 
##$RELAX= 
$$ Bruker specific parameters
$$ --------------------------
##$DU= <F:/spectra>
##$EXPNO= 1
##$NAME= <P31>
##$PROCNO= 1
##$TYPE= <nmr>
##$USER= <she>
##$AMP= (0..31)
100 100 100 100 100 100 100 100 100 100 100 100 100 100 100 100 100 100 
100 100 100 100 100 100 100 100 100 100 100 100 100 100 
##$AQSEQ= 0
##$AQ_mod= 1
##$AUNM= <au_zg>
##$AUTOPOS= <>
##$BF1= 81.014009
##$BF2= 200.13
##$BF3= 200.13
##$BF4= 200.13
##$BF5= 200.13
##$BF6= 200.13
##$BF7= 200.13
##$BF8= 200.13
##$BYTORDA= 1
##$CFDGTYP= 0
##$CFRGTYP= 5
##$CHEMSTR= <none>
##$CNST= (0..31)
1 1 145 1 1 1 1 1 1 1 1 1 1 1 1 1 1 1 1 1 1 1 1 1 1 1 1 1 1 1 1 1 
##$CPDPRG= <waltz16>
##$CPDPRG1= <>
##$CPDPRG2= <waltz16>
##$CPDPRG3= <>
##$CPDPRG4= <mlev>
##$CPDPRG5= <mlev>
##$CPDPRG6= <mlev>
##$CPDPRG7= <mlev>
##$CPDPRG8= <mlev>
##$CPDPRGB= <>
##$CPDPRGT= <>
##$D= (0..31)
0 1 0 0 0 0 0 0 0 0 0 0.03 2e-05 3e-06 0 0 0 0 0 0 0 0 0 0 0 0 0 0 0 0 
0 0 
##$DATE= 1689327558
##$DBL= (0..7)
120 120 120 11 120 120 24 19 
##$DBP= (0..7)
150 150 150 150 150 150 150 150 
##$DBP07= 0
##$DBPNAM0= <>
##$DBPNAM1= <>
##$DBPNAM2= <>
##$DBPNAM3= <>
##$DBPNAM4= <>
##$DBPNAM5= <>
##$DBPNAM6= <>
##$DBPNAM7= <>
##$DBPOAL= (0..7)
0.5 0.5 0.5 0.5 0.5 0.5 0.5 0.5 
##$DBPOFFS= (0..7)
$$ [...]
##$SUBNAM2= <"">
##$SUBNAM3= <"">
##$SUBNAM4= <"">
##$SUBNAM5= <"">
##$SUBNAM6= <"">
##$SUBNAM7= <"">
##$SUBNAM8= <"">
##$SUBNAM9= <"">
##$SW= 501.771253377433
##$SWIBOX= (0..15)
0 1 3 0 0 0 0 0 0 0 0 0 0 0 0 0 
##$SW_h= 40650.406504065
##$TD= 32768
##$TD0= 1
##$TE= 0
##$TE2= 300
##$TE3= 300
##$TEG= 300
##$TL= (0..7)
0 120 53 12 22 120 120 120 
##$TP= (0..7)
150 150 150 150 150 150 150 150 
##$TP07= 0
##$TPNAME0= <>
##$TPNAME1= <>
##$TPNAME2= <>
##$TPNAME3= <>
##$TPNAME4= <>
##$TPNAME5= <>
##$TPNAME6= <>
##$TPNAME7= <>
##$TPOAL= (0..7)
0.5 0.5 0.5 0.5 0.5 0.5 0.5 0.5 
##$TPOFFS= (0..7)
0 0 0 0 0 0 0 0 
##$TUNHIN= 0
##$TUNHOUT= 0
##$TUNXOUT= 0
##$USERA1= <user>
##$USERA2= <user>
##$USERA3= <user>
##$USERA4= <user>
##$USERA5= <user>
##$V9= 5
##$VALIST= <valist>
##$VCLIST= <CCCCCCCCCCCCCCC>
##$VD= 0
##$VDLIST= <DDDDDDDDDDDDDDD>
##$VPLIST= <PPPPPPPPPPPPPPP>
##$VTLIST= <TTTTTTTTTTTTTTT>
##$WBST= 1024
##$WBSW= 4
##$XGAIN= (0..3)
0 0 0 0 
##$XL= 0
##$YL= 0
##$YMAX_a= 5278
##$YMIN_a= -3982
##$ZGOPTNS= <>
##$ZL1= 120
##$ZL2= 120
##$ZL3= 120
##$ZL4= 120
##$ABSF1= 0
##$ABSF2= 0
##$ABSG= 0
##$ABSL= 0
##$ALPHA= 0
##$AQORDER= 0
##$ASSFAC= 0
##$ASSFACI= 0
##$ASSFACX= 0
##$ASSWID= 0
##$AUNMP= <proc_1d>
##$AZFE= 0.1
##$AZFW= 0.5
##$BCFW= 0
##$BC_mod= 2
##$BYTORDP= 0
##$COROFFS= 0
##$CY= -3
##$DATMOD= 1
##$DC= 0
##$DFILT= <>
##$DTYPP= 0
##$F1P= 0
##$F2P= 0
##$FCOR= 1
##$FTSIZE= 65536
##$FT_mod= 6
##$GAMMA= 0
##$GB= 0
##$INTBC= 1
##$INTSCL= 6.047779e-11
##$ISEN= 30
##$LB= 5
##$LEV0= 0
##$LPBIN= 0
##$MAXI= 10000
##$MC2= 0
##$MEAN= 0
##$ME_mod= 0
##$MI= 50
##$NCOEF= 0
##$NC_proc= -8
##$NLEV= 6
##$NOISF1= 182.463
##$NOISF2= 159.3651
##$NSP= 0
##$NTH_PI= 0
##$NZP= 0
##$OFFSET= 248.5645
##$PC= 4
##$PHC0= -10674.66
##$PHC1= 40.28482
##$PH_mod= 1
##$PKNL= yes
##$PPARMOD= 0
##$PSCAL= 0
##$PSIGN= 0
##$REVERSE= no
##$SF= 81.0140089999694
##$SI= 65536
##$SIGF1= 159.3651
##$SIGF2= -187.1042
##$SINO= 113.3802
##$SIOLD= 16384
##$SREGLST= <1H.CDCl3>
##$SSB= 0
##$STSI= 65536
##$STSR= 0
##$SW_p= 40650.406504065
##$SYMM= 0
##$S_DEV= 0
##$TDeff= 32768
##$TDoff= 0
##$TI= <>
##$TILT= no
##$TM1= 0
##$TM2= 0
##$TOPLEV= 0
##$USERP1= <user>
##$USERP2= <user>
##$USERP3= <user>
##$USERP4= <user>
##$USERP5= <user>
##$WDW= 1
##$XDIM= 65536
##$YMAX_p= 522087585
##$YMIN_p= -30154774
$$ End of Bruker specific parameters
$$ ---------------------------------
##NTUPLES= NMR SPECTRUM
##VAR_NAME=  FREQUENCY,     SPECTRUM/REAL,   SPECTRUM/IMAG
##SYMBOL=    X,             R,               I
##VAR_TYPE=  INDEPENDENT,   DEPENDENT,       DEPENDENT
##VAR_FORM=  AFFN,          ASDF,            ASDF
##VAR_DIM=   65536,         65536,           65536
##UNITS=     HZ,            ARBITRARY UNITS, ARBITRARY UNITS
##FACTOR=    0.620285442955139, 1,           1
##FIRST=     20137.2065510682, 0,            0
##LAST=      -20513.1999529968, 0,           0
##MIN=       -20513.1999529968, -30154774,   0
##MAX=       20137.2065510682, 522087585,    0
$$ Real data points
##PAGE= N=1
##DATA TABLE= (X++(R..R)), XYDATA
$$ [...]
43832B724427J50902J59347l4652k23682j89828N7850K96115L66919L60644M41109
43822D109151N62392N00857J65818k56149n10145n22121l89490k31365j38723
43813C290225j91891m01495o48379p80372p71181p08245o31360m79609k22631
43804a544938M6804K11182K62580K74994K81082K50777J80560J24017J05648O3338
43794B56044o9152k46816l38082k69291r7940P2950K02118K91114L04971J95585
43784C01501Q962j11774p8276L4638Q3375K4599o7765j28450j63732j78739j22560
43773c98221L7253K22654K91834J85481m799j22563q6571N1007J63160J59229
43763D98464N6573m5568o7542k2456K7140Q1322K28627N21310Q48317J000752
$$ y = [2724427, 2875329, 3034676, 3000024, 2776342, 2586514, 2644364, 2940479, 3307398, 3668042, 4109151, 4671543, 5172400, 5338218, 5082069, 4571924, 4049803, 3660313, 3428948, 3290225, 3098334, 2696839, 2048460, 1268088, 496907, -211338, -842698, -1322307, -1544938, -1498134, -1286952, -1024372, -749378, -468296, -217519, -36959, 87058, 192706, 256044, 186892, -59924, -398006, -667297, -765237, -692287, -490169, -199055, 105916, 301501, 310463, 198689, 120413, 155051, 238426, 263025, 195260, 66810, -96922, -275661, -398221, -360968, -138314, 153520, 339001, 334202, 211639, 125068, 176075, 339235, 498464, 555037, 509469, 441927, 419471, 446611, 527933, 756560, 1277870, 2126187, 3126939]
43753C126939Q91321O61142N21115N15394N00182L44997Q2190j64284l32026m49755
43743E697215n52910o34147o74238o72984o35772n56542m28269k63293j04508
43734A174552j6385l9190j32495j92358j61408j01559j10876j82225k07085j27563
43724i6592j5222M2812Q4079K26547M89546P18052P15942M38094L3033k95294
43714B340997m51405m78864m58198m11763l21060k05981j39727j70625k53264
43705e49890k82621k00479o1797J1537m6515j65998j99807p8669J05310J92382
43695a276547J24044o973o8089j4455R5523J71601J59339O7442m0667r1456n9617
43684i39855J5333P2343P7989L1545n6121j70056k85512l70838m01232l70387
$$ y = [3126939, 4018260, 4679402, 5200517, 5715911, 6216093, 6561090, 6643280, 6478996, 6146970, 5697215, 5144305, 4510158, 3835920, 3162936, 2527164, 1970622, 1542353, 1279060, 1174552, 1158167, 1118977, 986482, 794124, 632716, 531157, 420281, 238056, 30971, -96592, -111814, -69002, 15077, 241624, 731170, 1449222, 2165164, 2603258, 2636291, 2340997, 1889592, 1410728, 952530, 540767, 219707, 13726, -126001, -296626, -549890, -832511, -1032990, -1094787, -1083250, -1129765, -1295763, -1495570, -1574239, -1468929, -1276547, -1152503, -1159476, -1227565, -1242020, -1146497, -974896, -815557, -748115, -788782, -880238, -939855, -924522, -852179, -774190, -742645, -798766, -968822, -1254334, -1625172, -2026404, -2396791]
43674b396791k88403j60421L2693L06797O07821Q02350P83305N83750L48150J93401
43664H12652J36162J44466J94913K62678L13096L28263K94185J52001j55766n44413
43654A938237p74446o68363l04063P8167L19686M13727L83047K24615l867j61976
43644A444764j60968o1048J6645K7898J1166J511p839m5185j44809l24699n35006
43633B22430o54447n95786m11025k42004j61480j09729m559J30519J85226Q6102
43623a554753j40317m17113o74135q36301q15798n90631k82408p8346m2664n6240
43613e488706K2950J94512L59783M71636N53317N98812N61625M55895L73579L59055
43603a537542L35131K01991l5016k69285l80074k97284n1334J97436K54686R5573
$$ y = [-2396791, -2685194, -2845615, -2812922, -2506125, -1898304, -1095954, -312649, 271101, 619251, 812652, 948814, 1093280, 1288193, 1550871, 1863967, 2192230, 2486415, 2638416, 2482650, 1938237, 1163791, 495428, 191365, 269532, 589218, 1002945, 1385992, 1610607, 1606740, 1444764, 1283796, 1222748, 1239393, 1267291, 1278457, 1279968, 1272129, 1226944, 1082135, 757436, 222430, -432017, -1027803, -1438828, -1680832, -1842312, -1952041, -1956600, -1826081, -1640855, -1554753, -1695070, -2112183, -2786318, -3622619, -4438417, -5029048, -5311456, -5389802, -5432466, -5488706, -5465756, -5271244, -4911461, -4439825, -3886508, -3287696, -2726071, -2270176, -1896597, -1537542, -1202411, -1000420, -1035436, -1304721, -1684795, -1982079, -2033413, -1835977, -1581291, -1485718]
43593a485718p3950l8962J73051L40740L18056J57605k5203j94776l57378m68280
43583a654815m58186l29078j67350n5961O698R8160K80186N05863O33263N61387
43573e79833L41975J18423l3682j49572k64671l43792l56799l49599l64545l27657
43563b309752j03392L24464P81042J034802R84190P13007L99021J82891R2453
43554B098726N6948p798j09601j62200n8173K28719N96740Q62327Q64802N55410
43544D925900J7237n78472j039969j222954j090836p38263l41963n7518O1148
43535f5690O2712L5923M2328R1824J68984K66865L69250L98186K34512j48106
43525A456788n85515q30860p80428n45501k92071p9196J10015K54702K94008K05332
$$ y = [-1485718, -1559668, -1598630, -1425579, -1084839, -766783, -609178, -634381, -829157, -1186535, -1654815, -2113001, -2442079, -2609429, -2665390, -2658692, -2560532, -2280346, -1774483, -1141220, -579833, -237858, -119435, -153117, -302689, -567360, -911152, -1267951, -1617550, -1982095, -2309752, -2413144, -2088680, -1307638, -272836, 711354, 1424361, 1823382, 2006273, 2098726, 2155674, 2147876, 2038275, 1876075, 1817902, 2046621, 2643361, 3505688, 4370490, 4925900, 4943137, 4364665, 3324696, 2101742, 1010906, 272643, -69320, -126838, -65690, -2978, 32945, 75273, 167097, 336081, 602946, 972196, 1370382, 1604894, 1456788, 871273, 40413, -740015, -1285516, -1577587, -1656783, -1546768, -1292066, -998058, -792726]
43515g92726J4632k46381n20740o86910o36280m07141j60919N178J51115L62566
43505b917606N98424P33688P09236N72612L98727K36063J13744L0682o4938k20966
43495A89666l91015m57866l77451k51275k10123k55181k67658j69767k3118N4834
43485b158954L7697J4856P6554K12348L39088L97821L84299K95736J04044j87827
43475d84338m96022p06063p68758p19709o15064m85920l56886k66687k43871k75738
43465e419056l12179k88475j49151J12213M13375O09206N95474L96729J48035
43456c893829m085R689J52499L12624L83278L43155K57488J92528J54199J30789
43446a961665J55497K68520M28044N21546M79555L29765J25650j15622l62332
$$ y = [-792726, -778094, -1024475, -1545215, -2232125, -2868405, -3275546, -3436465, -3431287, -3280172, -2917606, -2319182, -1585494, -876258, -303646, 95081, 331144, 444888, 475570, 410632, 189666, -201349, -659215, -1036666, -1287941, -1498064, -1753245, -2020903, -2190670, -2213788, -2158954, -2121257, -2106401, -2029847, -1817499, -1478411, -1080590, -696291, -400555, -296511, -484338, -980360, -1686423, -2455181, -3174890, -3789954, -4275874, -4632760, -4899447, -5143318, -5419056, -5731235, -6019710, -6168861, -6056648, -5643273, -5034067, -4438593, -4041864, -3893829, -3897914, -3888225, -3735726, -3423102, -3039824, -2696669, -2439181, -2246653, -2092454, -1961665, -1806168, -1537648, -1109604, -588058, -108503, 221262, 346912, 231290, -131042]
43437a31042n12606m74853l06072k00271k95266n09523o02773m04620K3007M47092
43427b966927O74732O93986O13161N00729L34077J02754j06405j81010j12709
43418d47612M17P3384J01427J01573M8094r1348k80491m15890m08141k57630o7705
43407a643922J0342j16026l82044n77088n01160j46660K72503M86450L81166O7010
43397b149429k41976m05066m19699l47355k28722r2366K925N659m5590m0077P1506
43386c890190K00212K12382P7652j03604j95197j21025R5264L32196M30396L16137
43376b645777Q3581q1057p1565O0438J93430K65828L09323L78451M59684M51466
43366e96198K63436l8357k29637j44229J21202L02889K76466J68298J24302Q6152
$$ y = [-131042, -643648, -1118501, -1424573, -1624844, -1920110, -2429633, -3032406, -3437026, -3414019, -2966927, -2292195, -1598209, -985048, -484319, -150242, -47488, -153893, -334903, -447612, -447195, -373811, -272384, -170811, -122717, -214065, -494556, -910446, -1318587, -1576217, -1643922, -1633580, -1749606, -2131650, -2708738, -3209898, -3356558, -3084055, -2597605, -2216439, -2149429, -2391405, -2796471, -3216170, -3563525, -3792247, -3884613, -3881688, -3876029, -3921619, -3961696, -3890190, -3689978, -3477596, -3399944, -3503548, -3698745, -3819770, -3724506, -3392310, -2961914, -2645777, -2562196, -2643253, -2714818, -2654380, -2460950, -2195122, -1885799, -1507348, -1047664, -596198, -332762, -371119, -600756, -744985, -623783, -320894, -44428, 123870, 248172, 334324]
43356C34324q9796l57303m75592l02601J6681K11577J69601J908j25648j50060
43346g66909j07342m6005Q187K1275o2001k64649n16193o78274o55017m74466
43336c541394k55461j07914p0670j15852j80210k02796j66442j09245q1820r9504
43326d931308j48417k15204k78300k88475k07005o5949N1097R6576R3072P8965
43316e814948O7360P1961J22074K21101L32452M43875O05456Q49192J093553J192075
43306h15849J084438Q53712O21262M24731K22716j0566k33168l76311m12513l70191
43296I88261k88590j77088l3727J03043J49335M2847j90543m46176o08002o05913
43286a066553m41245j94058P908P8508N1668M2784J15914K19698K77193K96703
$$ y = [334324, 244528, -112775, -588367, -890968, -874287, -662710, -493109, -491201, -616849, -766909, -874251, -920256, -912069, -890794, -952795, -1217444, -1733637, -2411911, -3066928, -3541394, -3796855, -3904769, -3975439, -4091291, -4271501, -4474297, -4640739, -4749984, -4831804, -4931308, -5079725, -5294929, -5573229, -5861704, -6068709, -6134658, -6083561, -5986985, -5893913, -5814948, -5747588, -5675627, -5553553, -5332452, -5000000, -4556125, -3950669, -3101477, -2007924, -815849, 268589, 1122301, 1743563, 2168294, 2391010, 2380444, 2147276, 1770965, 1358452, 988261, 699671, 522583, 488856, 591899, 741234, 784081, 593538, 147362, -460640, -1066553, -1507798, -1701856, -1693948, -1615440, -1563772, -1520988, -1405074, -1185376, -908183, -611480]
43276f11480L32717L52278K28279q6481m33915n74946m30520j41408J01692K10493
43266a053291J73213j5521l14374n84543o90035o50605o13183o57706p00829o09687
43256e716561l41607N5883N08513R22747J183056J212142J024134O90934K93507
43247a67252o0536k35346j71699J7831J30245N5522j63755m32193o81986q49391
43237b558560q58843o82577l76772k3072L33902O63196R00067R68721Q46228N82844
43227b04866K72593J6929j14505j27154r8330r7508j06446m2266J33687L49104
43217a8762M76406M49014L11115J52885J3408j33209l01638m41597m85698m31401
43207d09477l41157k66410k06594j48881j13399j34120k05838k67414k43360j12203
$$ y = [-611480, -278763, 73515, 301794, 215313, -218602, -793548, -1224068, -1365476, -1263784, -1053291, -880078, -895599, -1209973, -1794516, -2484551, -3135156, -3748339, -4406045, -5106874, -5716561, -6058168, -6002285, -5493772, -4571025, -3387969, -2175827, -1151693, -460759, -167252, -227788, -463134, -634833, -617002, -486757, -431235, -594990, -1027183, -1709169, -2558560, -3417403, -4099980, -4476752, -4499824, -4165922, -3502726, -2602659, -1633938, -787710, -204866, 67727, 84656, -29849, -157003, -255333, -352841, -459287, -501553, -367866, -18762, 457644, 906658, 1217773, 1370658, 1384066, 1250857, 949219, 507622, 21924, -409477, -750634, -1017044, -1223638, -1372519, -1485918, -1620038, -1825876, -2093290, -2336650, -2448853]
43197b448853N5399J42089R7641P216J5616J72430L70900M44911L08179K321l54235
43186a186386o44581q05326q31185p38955n39583k60957K0311K14241K95744L17412
43176d159265L33982L42167L04597K02827N3702r9007k00074k22576k01302j87090
43166c832039j57464k8361K14160M51554N59965N61682N80546O63927P25814O80076
43156D19860N63254M79855M56000L97786K05268r7484l73249n14686n47160n62053
43146D27391n74432n07735l25682j12098J8149L7650o632p3317j30194j17273
43136a364173R318J98840L38491L70328L22040K25181P3243j20377k83262l32910
43126e63281k26968L9423M18423P66608R00405P70638N41005M14386L97363L12333
$$ y = [-2448853, -2393454, -2251365, -2153724, -2146508, -2130892, -1958462, -1587562, -1142651, -834472, -832151, -1186386, -1830967, -2636293, -3467478, -4206433, -4746016, -5006973, -4986662, -4772421, -4476677, -4159265, -3825283, -3483116, -3178519, -2975692, -2921990, -3020997, -3221071, -3443647, -3644949, -3832039, -3989503, -4017864, -3803704, -3352150, -2792185, -2230503, -1649957, -986030, -260216, 419860, 983114, 1462969, 1918969, 2316755, 2522023, 2424539, 2051290, 1536604, 989444, 427391, -147041, -654776, -980458, -1092556, -1074407, -1036757, -1043389, -1116706, -1246900, -1364173, -1354855, -1156015, -817524, -447196, -125156, 100025, 173268, 52891, -230371, -563281, -790249, -750826, -332403, 434205, 1334610, 2105248, 2646253, 3060639, 3458002, 3770335]
43116C770335M1137l26686o16825p63288q12266p82974o24805l26672J2737K74002
43106a55305M26374M91304M40233K19455j22322m20853n49525n24063m19223k56820
43096h70745m8690J09593J01395n2813j93003k07157j57323j79873l05743m27802
43086b232161m32654l30607k45384k74890l64444l42406j04360K59642N51619
43077c515645O52247N78319L93421J50354p3607j77365j22851K3941J70981K78815
43067a641390L42152L51777L15188K68429K23097J40302J283j33158j85835j63412
43057d81567j49709k17248l79242n98686p98081q83633q13316o33957m15138j68875
43047e539452J16597L86016N31925N13255M07665L24573K99116K87970K42212
$$ y = [3770335, 3811472, 3484786, 2867961, 2104673, 1292407, 509433, -115372, -442044, -429307, -155305, 271069, 762373, 1202606, 1422061, 1299739, 878886, 329361, -194702, -613925, -870745, -919435, -809842, -708447, -761260, -954263, -1161420, -1318743, -1498616, -1804359, -2232161, -2664815, -2995422, -3240806, -3515696, -3880140, -4222546, -4326906, -4067264, -3515645, -2863398, -2285079, -1891658, -1741304, -1814911, -1992276, -2115127, -2091186, -1920205, -1641390, -1299238, -947461, -632273, -363844, -140747, -445, 838, -132320, -318155, -481567, -631276, -848524, -1227766, -1826452, -2624533, -3508166, -4321482, -4955439, -5370577, -5539452, -5422855, -5036839, -4504914, -3991659, -3583994, -3259421, -2960305, -2672335, -2430123]
43038b430123J66474J19392J59223K72679L59483L12186J21611j05398k31261
43029a255734j84299J0257K64090M85977O27720O85378O67851N81285M38132K47731
43019B568388o050l29853o41651p82427o62258l69582r2163M4179K4982j04710
43009c51145k59759l16448j99416J9320J83346K24387K01373J66235R0141l8822
42999b80788j37668j20338j1136J02315J88784K79117L81989M64744N08732N20812
42989A896563M84884L56478J31521j04029k20179j51782K8457J56455J28570Q255
42979B715193o0537m9585q6113k58856m61121n14428m08944l16862l66166m98423
42969c05842n78855n58284m68806l27944j33318P1272K08036K59214K92360L62288
$$ y = [-2430123, -2263649, -2144257, -1985034, -1712355, -1352872, -1040686, -919075, -1024473, -1255734, -1440033, -1429776, -1165686, -679709, -51989, 633389, 1301240, 1882525, 2320657, 2568388, 2562338, 2232485, 1590834, 808407, 146149, -223433, -315596, -271417, -246435, -351145, -610904, -927352, -1126768, -1107448, -924102, -699715, -498342, -332107, -241966, -280788, -418456, -538794, -549930, -447615, -258831, 20286, 402275, 867019, 1375751, 1896563, 2381447, 2737925, 2869446, 2765417, 2545238, 2393456, 2421913, 2578368, 2706938, 2715193, 2654656, 2605071, 2518958, 2260102, 1798981, 1284553, 875609, 558747, 192581, -305842, -884697, -1442981, -1911787, -2239731, -2373049, -2301777, -2093741, -1834527, -1542167, -1179879]
42959a179879M23029L74342J83579o9704k70779l67671l88033l82603l69555l23193
42949b370467k00325J7059K92223N53313P55096R08798J032857J094573J038988
42940C122115Q66660O35351L83626J11252j46386k92927k74636j64198p5030j7514
42930D148313Q7454K56784L78516L16818L8138l74865p79749j027535j026063
42921B017811q07555n10873k57006n6577J33787K95132L40049K21083k060k22182
42911A151609l81011m79263n09197m24995k10975L9858J71272J22458J4057K6828
42901d79359J97373L82412M35396L66141K94669K93405L30669L50910L47111L34539
42891B853266K90196J54988r5105l84315n61326n23783l37062k00104k55731m41939
$$ y = [-1179879, -756850, -382508, -198929, -268633, -539412, -907083, -1295116, -1677719, -2047274, -2370467, -2570792, -2553733, -2261510, -1708197, -953101, -44303, 988554, 2083127, 3122115, 3988775, 4624126, 5007752, 5119004, 4972618, 4679691, 4405055, 4240857, 4165827, 4148313, 4235767, 4492551, 4871067, 5187885, 5226023, 4851158, 4071409, 3043874, 2017811, 1210256, 699383, 442377, 385800, 519587, 814719, 1154768, 1375851, 1373791, 1151609, 770598, 291335, -217862, -642857, -853832, -813974, -642702, -520244, -506187, -479359, -281986, 100426, 535822, 901963, 1196632, 1490037, 1820706, 2171616, 2518727, 2853266, 3143462, 3298450, 3203345, 2819030, 2257704, 1733921, 1396859, 1196755, 941024, 499085]
42881D99085n59282m77011k43274n111J30498J43968N9412r9629l05853m96614
42871a353811n70874m56875k10281j5099k5829j98308l24806k57151n3695J19174
42861c347555J83443J97105K33709K81436K77305K00604J02347N0697O4468J06006
42851a650435J38849J83425K96243M84347O56245O79158M90376J52152j96556
42842A233804m43049n70735o35501o73118o47533n14038l10620j28937Q936J75237
42832b505554M04451O02181O49035N53620M31921L61638L33173L30574L71365
42823A532404M44848M79647M06455K12898p5490m14429p20081q86135q62032o83175
42813e65090m03478m4782L52439O72130P72607N93889K05870k23827n02617n10292
$$ y = [499085, -60197, -537208, -780482, -785593, -655095, -511127, -451715, -551344, -857197, -1353811, -1924685, -2381560, -2591841, -2606940, -2632769, -2831077, -3155883, -3413034, -3466729, -3347555, -3164112, -2967007, -2733298, -2451862, -2174557, -1973953, -1871606, -1820909, -1756441, -1650435, -1511586, -1328161, -1031918, -547571, 108674, 787832, 1278208, 1430360, 1233804, 790755, 220020, -415481, -1088599, -1736132, -2250170, -2560790, -2689727, -2680791, -2505554, -2101103, -1498922, -849887, -296267, 135654, 497292, 830465, 1161039, 1532404, 1977252, 2456899, 2863354, 3076252, 3000762, 2586333, 1866252, 980117, 118085, -565090, -968568, -1013350, -660911, 11219, 783826, 1377715, 1583585, 1359758, 857141, 346849]
42803C46849k79001K9370K45428K86122J49400j12126l85525n36116n13990l91828
42793a161417k62343j48314n6348m6833j60076l11542l59110k68244j31573l3574
42783b939374J9789L8329R371n2532r7510j17997j68425k66835l32833k71565
42773d179582q5034J34195K85771L09594J96148N80j69977k26183j59437k4833
42763c918758J27432K90541M76916O61905P60437O94183N04434L52337L46420
42754B95847M00504L43660J55939o021k8348K6849N0964M4047O4279J10202J52185
42743A610107K20243L48815M63288M33267K44230K7799r3780j20686j18605j24963
42733B889715j53327k40778m32808p17992r97706j138955j083918r18189p96723
$$ y = [346849, 67848, 97218, 342646, 628768, 778168, 666042, 280517, -255599, -769589, -1161417, -1423760, -1572074, -1628422, -1675255, -1835331, -2146873, -2505983, -2774227, -2905800, -2939374, -2919585, -2881256, -2871885, -2924417, -3021927, -3139924, -3308349, -3575184, -3908017, -4179582, -4264616, -4130421, -3844650, -3535056, -3338908, -3338328, -3508305, -3734488, -3893925, -3918758, -3791326, -3500785, -3023869, -2361964, -1601527, -907344, -402910, -50573, 295847, 696351, 1040011, 1195950, 1189929, 1161581, 1188430, 1239394, 1283441, 1347720, 1457922, 1610107, 1830350, 2179165, 2642453, 3075720, 3319950, 3347749, 3253969, 3133283, 3014678, 2889715, 2736388, 2495610, 2062802, 1344810, 347104, -791851, -1875769, -2793958, -3590681]
42724c590681p72838p32362n34594j83564J89681M74239O34591O51838N20868
42715c342822L25789K18933K65935L68405L92889L32955K89097L16069L45284
42706d87466K56114l947l59045o41235p04757n38506k68990m5920N9721M4318
42696b689713q7137l10401n24884n75226l76352j1027L21396M65851M28533L47596
42686c011364L59962M91082O47882O92313N29390J67982k69457o08671p30793
42677a731674o38323m24243j93611j7862P3382R8197J12348J58480K23245K65226
42667b074835K75390K82837L11907L65423M37488N01785M96862L75041J69597
42658A141495l7215k19564m21928o46004p87151p34675n00132j98869O9529K75051
$$ y = [-3590681, -4363519, -5095881, -5630475, -5814039, -5624358, -5150119, -4515528, -3863690, -3342822, -3017033, -2798100, -2532165, -2163760, -1770871, -1437916, -1148819, -832750, -487466, -231352, -235299, -594344, -1235579, -1940336, -2478842, -2747832, -2793752, -2734031, -2689713, -2776850, -3087251, -3612135, -4187361, -4563713, -4574740, -4253344, -3787493, -3358960, -3011364, -2651402, -2160320, -1512438, -820125, -290735, -122753, -392210, -1000881, -1731674, -2369997, -2794240, -2987851, -3005713, -2932331, -2834134, -2721786, -2563306, -2340061, -2074835, -1799445, -1516608, -1204701, -839278, -401790, 99995, 596857, 971898, 1141495, 1104280, 884716, 462788, -183216, -970367, -1705042, -2205174, -2404043, -2334514, -2059463]
42648b059463M14579M77819M65957M02885L08843J83070K4227j45896k87918l67473
42638e83370l72747l23000k66111k56458l15667m02301m26379l17110r1369J54800
42628c199712L31455M14317M10172L04161R0244j64621l47147l94543l20074j49874
42618c025622R3739L30425M29050L39118J66055N3584K6406J1637j7703o004P7335
42607a521980J72834K07840J92857K03279K82001L83380M09755K98520P9908j52052
42597E56342l27086m39425m94791m60380l16740j38598n8860j39683l25485n32762
42587b677468p27627q82186r13880p47030m35129j61955q6000j95113l23289k91856
42577g441533k4397M41942J001762J518562J857156J935502J764320J423752J000586
$$ y = [-2059463, -1644884, -1167065, -701108, -298223, 10620, 193690, 217917, 72021, -215897, -583370, -956117, -1279117, -1545228, -1801686, -2117353, -2519654, -2946033, -3263143, -3354512, -3199712, -2868257, -2453940, -2043768, -1739607, -1649363, -1813984, -2161131, -2555674, -2875748, -3025622, -2931883, -2601458, -2172408, -1833290, -1667235, -1613651, -1587245, -1575608, -1593311, -1599315, -1521980, -1349146, -1141306, -948449, -745170, -463169, -79789, 329966, 628486, 708394, 556342, 229256, -210169, -704960, -1165340, -1482080, -1620678, -1679538, -1819221, -2144706, -2677468, -3405095, -4287281, -5201161, -5948191, -6383320, -6545275, -6631275, -6826388, -7149677, -7441533, -7465930, -7023988, -6022226, -4503664, -2646508, -711006, 1053314, 2477066, 3477652]
42568C477652N62853J80734p9221k08245k73917l51328m50226n34467n89618o30248
42558A103969o51781o24169n42480m44860l63568k90330k13530j63119j80479
42549b370347k44098k55658j22544J44950M28734O03554O42657O18788O06191
42540E2227N98896N29502L48648P3543k23665m58185n81273o13273o19905o32052
42530a525537n96882m36169j52152J50076L49823M02311L44298K33297R4704p4078
42520a210309k48041l35335k36500K6666K79342L53483K71533K04055K32912K30740
42510d31454K3552l78155p74243r75168r42439p39754m26817m5158L38257O43340
42500c708039Q43024R76210J069157J067323Q84418N22534J10261j98050l39518
$$ y = [3477652, 4040505, 4221239, 4142018, 3933773, 3659856, 3308528, 2858302, 2323835, 1734217, 1103969, 452188, -171981, -714461, -1159321, -1522889, -1813219, -2026749, -2189868, -2370347, -2614445, -2870103, -2992647, -2847697, -2418963, -1815409, -1172752, -553964, 52227, 651123, 1180625, 1529273, 1602816, 1379151, 920966, 339693, -273580, -893485, -1525537, -2122419, -2558588, -2710740, -2560664, -2210841, -1808530, -1464232, -1230935, -1136231, -1210309, -1458350, -1793685, -2030185, -2003519, -1724177, -1370694, -1099161, -895106, -662194, -431454, -407902, -786057, -1560300, -2535468, -3477907, -4217661, -4644478, -4689636, -4351379, -3708039, -2865015, -1888805, -819648, 247675, 1132093, 1654627, 1764888, 1566838, 1227320]
42491A227320l40766k31093j0161K94530N86107P48064P28099N65781L53876J76833
42481D098590N9841m2777j95789m04162n95732o91474o75399n81101m33130k35848
42471C03019j6961J51371J95246J00437p0579k17489k61750j86072l4592J17125
42461G9755J98643J70294L1548j88184m45902o90980q63269r08134q05602n71843
42451c993674k28754J93930O06730Q62829Q81256P51267O38542N84900M86696
42442G83722K98869J60300K31202M63322O34931O01837M24629K42555J11742O778
42432C959887q6791j48261j70937j87769k39131l25218l90874l68644k59047j57218
42422A625997j59819k43963k84964k07647p2442J0518m8q1124k11951l65434m59991
$$ y = [1227320, 886554, 655461, 645300, 939830, 1525937, 2274001, 3002100, 3567881, 3921757, 4098590, 4158431, 4115654, 3919865, 3515703, 2919971, 2228497, 1553098, 971997, 538867, 303019, 286058, 437429, 632675, 733112, 662533, 445044, 183294, -2778, -37370, 79755, 278398, 448692, 480240, 292056, -153846, -844826, -1708095, -2616229, -3421831, -3993674, -4222428, -4028498, -3421768, -2558939, -1677683, -926416, -287874, 297026, 783722, 1082591, 1242891, 1474093, 1937415, 2572346, 3174183, 3598812, 3841367, 3953109, 3959887, 3873096, 3724835, 3553898, 3366129, 3126998, 2801780, 2410906, 2042262, 1783215, 1625997, 1466178, 1222215, 937251, 729604, 657162, 667680, 667632, 586508, 374557, 9123, -450868]
42411d50868m01767j89680P2210K79189M01448M52963M43089L85883L11047K26749
42401A530263J01009q1584k63863l54908l20209k09696j05847o6731j06563j98343
42391g6472k90677l40772l36084k81060j77859l2351J38341L17104M78564N51991
42381d9275M41431J41255j94782l73589l53706k53724j72723r0374K3575R5227
42371g86685K8569j39872k54655k07706l3737J59045L02506M05576N15246O48803
42361F37090P46182P06850N12148K98935K61577M69059Q02535J062026J098996
42352F595398Q68361M30447o7029m60457o73681p48888p73496q01812q47756r07919
42342B613168r62369r72139q93669o90660l50836O6273M07586N19857L92376J62429
$$ y = [-450868, -852635, -1042315, -970105, -690916, -289468, 163495, 606584, 992467, 1303514, 1530263, 1631272, 1549688, 1285825, 930917, 610708, 401012, 295165, 228434, 121871, -76472, -367149, -707921, -1044005, -1325065, -1502924, -1535275, -1396934, -1079830, -601266, -49275, 392156, 533411, 338629, -34960, -388666, -642390, -815113, -905487, -881912, -786685, -758116, -897988, -1152643, -1360349, -1394086, -1235041, -932535, -526959, -11713, 637090, 1383272, 2090122, 2602270, 2901205, 3162782, 3631841, 4434376, 5496402, 6595398, 7463759, 7894206, 7827177, 7366720, 6693039, 5944151, 5170655, 4368843, 3521087, 2613168, 1650799, 678660, -215009, -905669, -1256505, -1190232, -782646, -262789, 129587, 292016]
42332B92016l8508j88013k98948l20781j88021P0491L43431N46508O68059P24532
42322A610766P33166P25975P31543P25776O34577L98497K6866l87903o84230p05163
42312C809870m32729m6094K14550K50534J36731j4602j34616j51731Q857L09837
42302C950607N64432O02929M45449K44699R0666n2241k31832m18678n49626o00074
42292D046331n83742n19409m23308l05129j49053P3984L44947N60750N91895L90670
42282D027936M5183k70585m11163l53757j99901q1486n7094r5829j44038j79054
42272B280212j96158j77365r9189L8605K04005L37273L56732J96299j19487m47740
42262B373187o22672o01240n00285m85740o38290r10960j169072j259841j098596
$$ y = [292016, 253508, 65495, -233453, -554234, -742255, -671764, -328333, 218175, 886234, 1610766, 2343932, 3069907, 3801450, 4527226, 5161803, 5560300, 5587166, 5199263, 4515033, 3809870, 3377141, 3331047, 3545597, 3796131, 3932862, 3918260, 3783644, 3631913, 3640770, 3950607, 4515039, 5117968, 5563417, 5808116, 5898782, 5846541, 5614709, 5196031, 4646405, 4046331, 3462589, 2943180, 2519872, 2214743, 2065690, 2139674, 2484621, 3045371, 3637266, 4027936, 4073119, 3802534, 3391371, 3037614, 2837713, 2756227, 2699133, 2603304, 2459266, 2280212, 2084054, 1906689, 1807500, 1846105, 2050110, 2387383, 2744115, 2940414, 2820927, 2373187, 1750515, 1149275, 648990, 163250, -475040, -1386000, -2555072, -3814913, -4913509]
42253d913509p38964l42096l5457J92801M30244O86981Q52851Q13073N67461K21224
42243b265391j08391l55550n06100n72501n73438n27226m59562m03298l68406
42234f139863l16531j97056j7042J55071K71339L61042M80352O24852P21330P03362
42224c353144N82649M54199M32521N50871O99134O85837L99629q7227n82390r20196
42214a138117j038117r60044p66892n75070m81147m96657n53496n78610n45167
42205g133317m55942l11936j13126J25561L65796N43870N89068M77411K76699
42196e635916J15438R0129K01737L71601N04386N49643N31069N15119N32370N40610
42186a683814M89279M00669L45253L48029L70136L79265L74974L29962J75891
$$ y = [-4913509, -5652473, -5994569, -6030026, -5837225, -5406981, -4720000, -3867149, -3054076, -2486615, -2265391, -2373782, -2729332, -3235432, -3807933, -4381371, -4908597, -5368159, -5771457, -6139863, -6456394, -6653450, -6670492, -6515421, -6244082, -5883040, -5402688, -4777836, -4056506, -3353144, -2770495, -2316296, -1883775, -1332904, -633770, 52067, 451696, 364469, -217921, -1138117, -2176234, -3136278, -3903170, -4478240, -4959387, -5456044, -6009540, -6588150, -7133317, -7589259, -7901195, -8014321, -7888760, -7522964, -6979094, -6390026, -5912615, -5635916, -5520478, -5430349, -5228612, -4857011, -4352625, -3802982, -3271913, -2756794, -2224424, -1683814, -1194535, -793866, -448613, -100584, 269552, 648817, 1023791, 1353753, 1529644]
42177A529644j04775m14150o15329o53447n68443m17384k31228l6696J23420K01274
42167a187114J64670K3622j45096k24515j41985Q1994L82686P09429R93542J102386
42157A759619R19156M91291L6842k37149k93644k28949j36299o3307o7013k11676
42147A968871m69252o79435o84891n09129l41723l19284l66476l03542q4022J42922
42137a645961K11670J16344j7289p5811k8558R4484K24840K77286K21521J35491
42127d85983J27801J96950K24152J26953l1254j16604o9874N7412J75726K20935
42117D26214J65877J9826j74502l64971n11555n76686n20234l38185r3807J27888
42107a840135K96201M33810N44938N88689N36214M15702K80529J65928R8863J10302
$$ y = [1529644, 1424869, 1010719, 395390, -258057, -826500, -1243884, -1475112, -1511808, -1388388, -1187114, -1022444, -998822, -1143918, -1368433, -1510418, -1428424, -1045738, -336309, 657233, 1759619, 2678775, 3170066, 3206908, 2969759, 2676115, 2447166, 2310867, 2247560, 2180547, 1968871, 1499619, 820184, 135293, -373836, -715559, -1034843, -1401319, -1704861, -1788883, -1645961, -1434291, -1317947, -1335236, -1411047, -1439605, -1345121, -1120281, -842995, -621474, -485983, -358182, -161232, 62920, 189873, 158619, 42015, -27859, 29553, 205279, 426214, 592091, 611917, 437415, 72444, -439111, -1015797, -1536031, -1874216, -1968023, -1840135, -1543934, -1110124, -565186, 23503, 559717, 975419, 1255948, 1421876, 1520739, 1631041]
42097A631041J92716K66499K38530R5767q8269k28433k74620k08191o2104M9247
42087A612183r94k07702m09970m62984l96312l51020l97993m82869n21019m66414
42077b085094k96869k1717K75169M77404N57694N99496O66872P16150O77087N52686
42067B118878L74021J17551k35589n80663p34784o31796m09788k70740k88813
42058e41723l78493m13831l41647j89964l033K02679M07389N36385M93713K75001
42048D6476Q855j57777j95863j81514j79147j90621j92870j52204r684K62791
42038i41558N73109P55875P51374O74872O54153O48862N03337J63219k23797m35552
42028C123894l74122j35439R2046J86918J63250R5660N260j48175l73100n98485
$$ y = [1631041, 1823757, 2090256, 2328786, 2424553, 2336284, 2107851, 1833231, 1625040, 1562936, 1612183, 1611189, 1403487, 993517, 530533, 134221, -216799, -614792, -1097661, -1618680, -2085094, -2381963, -2403680, -2128511, -1651107, -1093413, -493917, 172955, 889105, 1566192, 2118878, 2492899, 2610450, 2374861, 1794198, 1059414, 427618, 17830, -252910, -541723, -920216, -1334047, -1675694, -1865658, -1868691, -1666012, -1258623, -722238, -228525, 46476, 55331, -102446, -298309, -479823, -658970, -849591, -1042461, -1194665, -1204349, -941558, -368449, 387426, 1138800, 1813672, 2467825, 3116687, 3620024, 3783243, 3559446, 3123894, 2749772, 2614333, 2706379, 2893297, 3056547, 3152207, 3157467, 3009292, 2636192, 2037707]
42018B037707p37632p61265o90264n60555m21398l19338k38431r4213J58224M33842
42008a193323N91215N86071N01848M34249L95508L33748J98865k0291k80567m85610
41998A061713n32379l86707j20615J16672J68996l5621m09761p35363q23505o60627
41988b357197l76652r2140J49539L17050L51272K34243M4337j07078j69116j52490
41978b158232p4415M8711J68127K11109J40219m009j21137j19516P368J67350
41968a734425K60676K93111L60075M98578O00898N22067K49071q3013l27889m33110
41958B06039m18538l11675j30080J04190L58357N85791P23953P19991N76307L58476
41948B772811J43929l1062j68889k71700l23751l11567k48837j74033j22908j01576
$$ y = [2037707, 1300075, 538810, -151454, -712009, -1133407, -1452745, -1691176, -1785389, -1627165, -1193323, -602108, -16037, 485811, 920060, 1315568, 1649316, 1848181, 1827890, 1547323, 1061713, 529334, 142627, 22012, 138684, 307680, 272059, -137702, -873065, -1696570, -2357197, -2733849, -2825989, -2676450, -2359400, -2008128, -1773885, -1729548, -1836626, -2005742, -2158232, -2232647, -2183936, -2015809, -1804700, -1664481, -1668490, -1789627, -1909143, -1901775, -1734425, -1473749, -1180638, -820563, -321985, 278913, 800980, 1050051, 967038, 639149, 206039, -212499, -524174, -654254, -550064, -191707, 394084, 1118037, 1838028, 2414335, 2772811, 2916740, 2885678, 2716789, 2445089, 2121338, 1809771, 1560934, 1386901, 1263993, 1162417]
41938A162417q1861k0951J07010K83161M40506N02614M45010L15596J79754N1676
41928C384932j00019k86803m72138o08975o69018o28499m72871k46029n7724L277
41918a53867m6811j14779j25509o9342J2546N2898j170j22446j99124j51754m1077
41907i60435L557m1106o0550M0024K15953L52871L96673L69671L05196K23607
41897H45461J50813J09760R5726Q5020N5070k1756j73570l83220n70726o62028
41887d69450o60451o12242n19598l41797q5765J54153K71982K47158J57241J09566
41877a749203J56857K51290K73461J33780j31933l71470m34157k93519o9503O9099
41867b165298N0179l3815k4055J14575K27042J34451j45622l95416m19210k27060
$$ y = [1162417, 1080556, 1059605, 1166615, 1449776, 1890282, 2392896, 2837906, 3153502, 3333256, 3384932, 3284913, 2998110, 2525972, 1916997, 1247979, 619480, 146609, -99420, -157144, -153867, -200678, -315457, -440966, -510308, -497762, -444864, -446034, -568480, -767604, -919358, -960435, -956878, -997984, -1058534, -1018510, -802557, -449686, -53013, 316658, 621854, 845461, 996274, 1106034, 1201760, 1286780, 1341850, 1320094, 1146524, 763304, 192578, -469450, -1129901, -1742143, -2261741, -2603538, -2689303, -2535150, -2263168, -2016010, -1858769, -1749203, -1592346, -1341056, -1067595, -933815, -1065748, -1437218, -1871375, -2164894, -2234397, -2165298, -2115119, -2148934, -2172989, -2058414, -1831372, -1696921, -1842543, -2237959, -2657169, -2884229]
41857b884229R354J33331J10817Q381q4730j18190r4770l1431Q6852K85704N22106
41846b056805O63822N90741L15540j6058k38549k70542j37244O3771K18999K67017
41836e99308K43613K51696L62583N34497O33677N55319L40837J64674J73526L31421
41826B992535M50820L83472J43980j63679m71837p40117q76461p80635m82324
41817D55754j45817J03544K86146M54136N48351M58878J91156j21211l58296m83645
41807A388996m83628l52272j73225j08445k21148l74931l96358k90708j98942
41798a210661j71893j10085N4002K26907K69636J70645L4391n9814j20260j84133
41788a101265k53543k88033k27800l8742K28090M33960M54075K92573P8226n2381
$$ y = [-2884229, -2874875, -2741544, -2630727, -2622346, -2707076, -2825266, -2920036, -2951467, -2864615, -2578911, -2056805, -1392983, -802242, -486702, -502760, -741309, -1011851, -1149095, -1085324, -866325, -599308, -355695, -103999, 258584, 793081, 1426758, 1982077, 2322914, 2487588, 2661114, 2992535, 3443355, 3826827, 3970807, 3807128, 3335291, 2595174, 1718713, 938078, 455754, 309937, 413481, 699627, 1153763, 1702114, 2160992, 2352148, 2230937, 1872641, 1388996, 905368, 553096, 379871, 271426, 50278, -324653, -721011, -1011719, -1210661, -1382554, -1492639, -1438637, -1211730, -942094, -771449, -737058, -796872, -917132, -1101265, -1354808, -1642841, -1870641, -1909383, -1681293, -1247333, -793258, -500685, -422459, -474840]
41778d74840n6288J1610O7528P6500P5615J10095J47154R4595p3517k55971l28426
41767f05945k66778j21994P3322K92866M47120M33384K69947J00498M2578R0569
41757G55567J74552K43065K76586K98991L93716O16099Q50280Q48066M82849r4325
41747D845446o07171q97948r67955q70227o70331m62218l10094j91270q0710n7153
41737b69631k17577n01992p18665p53572o51539m77931k21343J13110M15388N60597
41727b723155N39317M38583L34121K52220J96881J51852O8177j07255l86868p24932
41717a961059j014886j111457r25505n30295j20334J68089L40845M26058L67260
41708d361284J27166j63708k84998j54535J10518L66485N87811Q08627R96437
$$ y = [-474840, -531128, -519518, -451990, -375490, -299875, -189780, -42626, 51969, -21548, -277519, -605945, -872723, -994717, -921395, -628529, -181409, 251975, 521922, 622420, 664998, 755567, 930119, 1173184, 1449770, 1748761, 2142477, 2758576, 3608856, 4456922, 4939771, 4845446, 4238275, 3340327, 2372372, 1502145, 831814, 369596, 59502, -131768, -212478, -269631, -487208, -989200, -1707865, -2461437, -3112976, -3590907, -3812250, -3699140, -3283752, -2723155, -2183838, -1745255, -1411134, -1158914, -962033, -810181, -742004, -849259, -1236127, -1961059, -2975945, -4087402, -5012907, -5543202, -5663536, -5495447, -5154602, -4728544, -4361284, -4234118, -4397826, -4682824, -4837359, -4726841, -4360356, -3772545, -2963918, -1967481]
41699a967481J047834Q92626N73465K31424J2617m2159k5169n6252j52232k36265
41689B78408k68646l01853l76878m25097l37153j09686J36305K90807L63228M29336
41679c21229M93476M46005J82267k43490o13310p18280n30816j94665J30075L68214
41669a001753M87694M36163J83984j86323m94218n92933m75910k48675j9590J59840
41659a751721K61204K34577M1050k72545n75449p60255q28559q40998q04609o58858
41649e956163l71335K280L62966O24225P11368N76109K71920k2568j27159j1413
41639c939770K13315M37302O36784Q19485R45593R29034O96167K49984k80593
41630G07301o61894p02086m22317m4213K28382L79704N03913O15252O15733M38524
$$ y = [-1967481, -919647, -27021, 546444, 777868, 790485, 748326, 723157, 666905, 514673, 278408, 9762, -292091, -668969, -1094066, -1431219, -1540905, -1404600, -1113793, -750565, -321229, 172247, 618252, 800519, 557029, -56281, -774561, -1305377, -1500042, -1369967, -1001753, -514059, -77896, 106088, -80235, -574453, -1167386, -1643296, -1891971, -1911561, -1751721, -1490517, -1255940, -1214890, -1487435, -2062884, -2823139, -3651698, -4492696, -5297305, -5956163, -6327498, -6325218, -5962252, -5338027, -4626659, -4050550, -3778630, -3801198, -3928357, -3939770, -3726455, -3289153, -2652369, -1832884, -887291, 41743, 737910, 987894, 707301, 45407, -656679, -1078996, -1123209, -894827, -515123, -11210, 604042, 1219775, 1658299]
41620A658299J46838j26597k84965k99036j96081n7318J8415M528j2929P2451
41610I23605K60198M42812N24602M95949L86067J99046o1857l35675n22242n65536
41600A746969m91218l61714k25252j13114m6889k3116j7323l0116j04067k59582
41590G4578m35043n36680n38516m86477m15103l27205k62332l00139m45641n72556
41580d245114n45469l59918j05202J61931M23233O16759O65003N98981N53844
41571b235952N99562O50267N84507L89070J36606j12179l15496m08797l42353
41562a054765j58515K0680Q7705J5469j39107k66745k81908k15500j98297k99975
41552b490958m18322l89701j79116J08294L71685N75955O82068O32288M44602
$$ y = [1658299, 1805137, 1678540, 1393575, 1094539, 898458, 841140, 859555, 864083, 851154, 923605, 1183803, 1626615, 2151217, 2647166, 3033233, 3232279, 3170422, 2834747, 2312505, 1746969, 1255751, 894037, 668785, 555671, 508782, 485666, 468343, 438227, 334160, 74578, -360465, -897145, -1435661, -1922138, -2337241, -2664446, -2926778, -3226917, -3672558, -4245114, -4790583, -5150501, -5255703, -5093772, -4670539, -4053780, -3388777, -2789796, -2235952, -1636390, -986123, -401616, -12546, 124060, 11881, -303615, -712412, -1054765, -1213280, -1192600, -1104895, -1089426, -1228533, -1495278, -1777186, -1992686, -2190983, -2490958, -2909280, -3298981, -3478097, -3369803, -2998118, -2422163, -1740095, -1107807, -663205]
41543f63205K39140J20416Q7803R5918J39611K31958L53269M77246O06449P29071
41533B417676P77731O88836M77911K04954j06748m54878p77420r58216r28651
41524A341195p25726m48160j93834l4651N928k5026m9028m6122q0926k10927l85499
41513h52776m70118l76751j50822Q4102K57509M04556N80005P47083P90341O38734
41503A651863L40735J0551k60952m29596m88896m86089n11277o08436p05851o85987
41493b173935n20424k88570p0452J17975K76340L76092L99700L72264L11885J88367
41483a010758j9895k56054m26309n00830n26350n44496n46932n15118m54016l67974
41473e168732k46599j03572M768L8278L3927P4232K01931L86032N50634O05636
$$ y = [-663205, -424065, -303649, -215846, -119928, 19683, 251641, 604910, 1082156, 1688605, 2417676, 3195407, 3884243, 4362154, 4567108, 4460360, 4005482, 3228062, 2269846, 1341195, 615469, 167309, -26525, -61176, -55248, -80274, -129302, -175424, -256350, -467277, -852776, -1322894, -1699645, -1850467, -1766365, -1508856, -1104300, -524295, 222788, 1013129, 1651863, 1992598, 2003149, 1742197, 1312601, 823705, 337616, -173661, -782097, -1487948, -2173935, -2694359, -2982929, -3053381, -2935406, -2659066, -2282974, -1883274, -1511010, -1199125, -1010758, -1030653, -1286707, -1713016, -2213846, -2740196, -3284692, -3831624, -4346742, -4800758, -5168732, -5415331, -5518903, -5514135, -5475857, -5441930, -5367698, -5165767, -4779735, -4229101, -3623465]
41463c623465M80411J96333r0000j89788p3120Q2757P9071r5235k70956k79734
41453c783726q5289K25692N10710O39971N74731M02613K55521J85816J62323J75109
41443g36529K68669M52572O50192P73332P93117P07349N06610K23709m8264k57610
41433C333147m64099p29652r79426j064367r45031p22818m93384k63115k4134
41424b352879J84049L30847M39451N22160N20679L63501N6678l11793o25173p76934
41414a649414p15130m99840k78983j49465o0128J00217L35269N14840N18071L65355
41404a519208K01223J67188K85902M47029N10125M36097L06084K05679J33658
41395A173777N9044J3870M4073Q3327j9923l08925o28571p90880p78877p14873
$$ y = [-3623465, -3143054, -2946721, -3036721, -3226509, -3299629, -3216872, -3137801, -3233036, -3503992, -3783726, -3869015, -3643323, -3132613, -2492642, -1917911, -1515298, -1259777, -1073961, -911638, -736529, -467860, -15288, 634904, 1408236, 2201353, 2908702, 3415312, 3639021, 3590757, 3333147, 2869048, 2139396, 1159970, 95603, -849428, -1572246, -2065630, -2328745, -2352879, -2168830, -1837983, -1398532, -876372, -355693, 7808, 64486, -247307, -872480, -1649414, -2364544, -2864384, -3143367, -3292832, -3352960, -3252743, -2917474, -2402634, -1884563, -1519208, -1317985, -1150797, -864895, -417866, 92259, 528356, 834440, 1040119, 1173777, 1232821, 1246691, 1290764, 1374091, 1354168, 1045243, 416672, -374208, -1153085, -1867958]
41385a867958o65096n73121l90481j75044r295J12815K50024M03571N15718N59998
41375a838869N54059M78984K71850o0834l89044n78712o22534n91775n02689l24660
41365c604224j13570k9493j67173m25360n98676n69048l69331r9388J57651L49859
41355e468753M54862M89532M95840N05016N30223N87421O87236P92327Q11125
41346a15171O64295L62203J4518k33273k85279j53356M5379J64124J31962k432
41336E92970j35781k14385k64178l29845m16463n00430n63173n81793n10092l21724
41326c244894p7165J03190J61605J65624K17099L25851M08394L85439K36845j1975
41316a329987k87164m52260l83835j12903J54866K18395P0800j21947k13353k07830
$$ y = [-1867958, -2533054, -3106175, -3496656, -3671700, -3680995, -3568180, -3318156, -2914585, -2398867, -1838869, -1284810, -805826, -533976, -594810, -983854, -1562566, -2185100, -2776875, -3279564, -3604224, -3717794, -3747287, -3914460, -4339820, -4938496, -5507544, -5876875, -5976263, -5818612, -5468753, -5013891, -4524359, -4028519, -3523503, -2993280, -2405859, -1718623, -926296, -115171, 549124, 911327, 925845, 692572, 407293, 253937, 299316, 463440, 595402, 592970, 457189, 242804, -21374, -351219, -767682, -1268112, -1831285, -2413078, -2923170, -3244894, -3322059, -3218869, -3057264, -2891640, -2674541, -2348690, -1940296, -1554857, -1318012, -1329987, -1617151, -2069411, -2453246, -2566149, -2411283, -2192888, -2122088, -2244035, -2457388, -2665218]
41306b665218k08362k77827l71423l89342k79530q6844R5780K15593K88628L51086
41296c327459M13096M67333N10261N34300N25792M95270M83392N05473N16836
41287A124294M80055M52101N45032P83998J044103J147890J000005O22344J09232
41278G309054m10234p98103r62475r10602p27098m87986k09443J12764M31788
41269C347665O39607O35509M05208L6826l35133o00578o99261o05139l30343K8935
41259B523296K81836K52676n1983m10544n68377m54846j95508O2451K61968L66393
41249B067362K84316l4947m58855p28017o90426m34171j72863m8895o5228j43624
41239d25348j91695j44877q645J30466J66728N9321j47184l65375n09993n27332
$$ y = [-2665218, -2873580, -3151407, -3522830, -3912172, -4191702, -4278546, -4182766, -3967173, -3678545, -3327459, -2914363, -2447030, -1936769, -1402469, -876677, -381407, 101985, 607458, 1124294, 1604349, 2056450, 2601482, 3385480, 4429583, 5577473, 6577478, 7199822, 7309054, 6898820, 6100717, 5138242, 4227640, 3500542, 3012556, 2803113, 2915877, 3347665, 3987272, 4622781, 5027989, 5064815, 4729682, 4129104, 3429843, 2824704, 2494361, 2523296, 2805132, 3057808, 3005825, 2595281, 2026904, 1572058, 1376550, 1439001, 1700969, 2067362, 2351678, 2316731, 1857876, 1129859, 439433, 5262, -167601, -216496, -281724, -425348, -617043, -761920, -770565, -640099, -473371, -414050, -561234, -926609, -1436602, -1963934]
41229a963934m22269k58412j07499J832P2131R3993N3521j6657l4120N9972K35888
41218b285554L98745M72729M56582M03696L58966L20328K61376J82458J23795
41209F93121J22049J64479J95137J61181N0152j05728k49731l29480l17473k14771
41199A68936n3898Q8916J11552l1385k52668l85756l47815k25530j70738k32598
41189a330984l21023l12743j58965Q9763L18055M11560L38056J78385N0621l022
41179g40297l2581r0168j63487k12651k37213k72514l27777l56928l05690j81595
41169b920901n8404O990N5786J94288M62454P56315R06199Q24595N63676K47078
41159A038076k6285k20129l37857l80502l32727j99916m9968K0565j8747r9313
$$ y = [-1963934, -2386203, -2644615, -2752114, -2750282, -2678151, -2584158, -2530637, -2547294, -2581414, -2521442, -2285554, -1886809, -1414080, -957498, -553802, -194836, 125492, 386868, 569326, 693121, 815170, 979649, 1174786, 1335967, 1386119, 1280391, 1030660, 701180, 383707, 168936, 115038, 203954, 315506, 284121, 31453, -354303, -702118, -927648, -1098386, -1330984, -1652007, -1964750, -2123715, -2033952, -1715897, -1304337, -966281, -787896, -737275, -740297, -772878, -863046, -1026533, -1239184, -1476397, -1748911, -2076688, -2433616, -2739306, -2920901, -2979305, -2972315, -2916529, -2722241, -2259787, -1503472, -597273, 227322, 790998, 1038076, 1011791, 791662, 453805, 73303, -259424, -459340, -509308, -488743, -507490, -606803]
41149f06803j31514p9973N5677K74476N33065P15054P15651N44320K92185L1193
41139B343331j81967k41867n9161K86205N61142O05217M74611L17564J78994l258
41129D280811k58068n17947o86266p12046n98969l82034j07940J72867L99060
41120A589468N01894M54550L21490K15040J87103K00362K13475K41965L16639
41111D241986M38618O01318P94535R50736R57787P86808N54714L96013L19600
41102A0042115K56895J94961J69143J60126J04245N86q4066j17063j19318q5115
41092A0522509J2793J16218Q8246j14964l57816m72597m31874l18723j95242q1944
41082H766606j4742j7128k6043N8769K33230L72308L85714L29290L20327L91577
$$ y = [-606803, -738317, -818290, -762613, -488137, 44928, 759982, 1475633, 2019953, 2312138, 2343331, 2161364, 1919497, 1860336, 2146541, 2707683, 3312900, 3787511, 4105075, 4284069, 4280811, 4022743, 3504796, 2818530, 2106484, 1507515, 1125481, 1017541, 1190408, 1589468, 2091362, 2545912, 2867402, 3082442, 3269545, 3469907, 3683382, 3925347, 4241986, 4680604, 5281922, 6076457, 7027193, 7984980, 8771788, 9326502, 9722515, 10042115, 10299010, 10493971, 10663114, 10823240, 10927485, 10928071, 10844005, 10726942, 10607624, 10522509, 10535302, 10651520, 10739766, 10624802, 10266986, 9794389, 9362515, 9043792, 8848550, 8766606, 8751864, 8734736, 8708693, 8767462, 9000692, 9373000, 9758714, 10088004, 10408331, 10799908]
41072A0799908M86528N73105O95693R04816J180367J442766J610854J639079J542423
41063B0875539J419981J419904J627334J995690K430471K919307L508083M154485
41055D0350794M713868N136106N606076O397474P608448R106508J0700913J2281483
41047A01901670J3806723J5276966J6767649J8402637K0213490K2051271K3693202
41040B32113608K5031120K6131152K7131342K8109361K9010795K9615329K9514891
41033D26657598K8168077K5123396K0341309J4287373P509832j3123q928750j9559885
41025D93585827l0785859m0132746m5296600m5687564m2529145l7660993l2419533
41018B19073387k7450512k3063887j9430026j6542138j4250910j2409295j0923693
$$ y = [10799908, 11286436, 11859541, 12555234, 13460050, 14640417, 16083183, 17694037, 19333116, 20875539, 22295520, 23715424, 25342758, 27338448, 29768919, 32688226, 36196309, 40350794, 45064662, 50200768, 55806844, 62204318, 69812766, 78919274, 89620187, 101901670, 115708393, 130985359, 147753008, 166155645, 186369135, 208420406, 232113608, 257144728, 283275880, 310407222, 338516583, 367527378, 397142707, 426657598, 454825675, 479949071, 500290380, 514577753, 522087585, 522074462, 513145712, 493585827, 462799968, 422667222, 377370622, 331683058, 289153913, 251492920, 219073387, 191622875, 168558988, 149128962, 132586824, 118335914, 105926619, 95002926]
41011I5002926r691232q592660p571200o652163n854919n124472m374791l580175
41003D3561314k813432k209014j882401j844946j969664k056343j967270j724336
40995B7093908j476800j363125j393443j465339j487965j463425j429584j364214
40987A5650013j214119j017183r07035r38629r66258p82227l67804O9728L21303
40978I847789L70218L39478L16365K88278K12063P4597j11363l10791m49999m44289
40968A0132346k76606l0460J81215L13894M06266N10596O27164P03038O79704
40959A3247157N43009L38912J40362j1727j35284k68241m08436n07301n23910
40950A2414541m71144m08274m05564n12789p20506r21611r44111o87301k43593
$$ y = [95002926, 85311694, 76719034, 69147834, 62495671, 56640752, 51516280, 47141489, 43561314, 40747882, 38538868, 36656467, 34811521, 32841857, 30785514, 28818244, 27093908, 25617108, 24253983, 22860540, 21395201, 19907236, 18443811, 17014227, 15650013, 14435894, 13418711, 12511676, 11573047, 10606789, 9824562, 9456758, 9526486, 9847789, 10218007, 10557485, 10873850, 11162128, 11374191, 11448788, 11337425, 11026634, 10576635, 10132346, 9855740, 9825280, 10006495, 10320389, 10726655, 11237251, 11864415, 12567453, 13247157, 13790166, 14129078, 14269440, 14257713, 14122429, 13854188, 13445752, 12938451, 12414541, 11943397, 11535123, 11129559, 10616770, 9896264, 8974653, 8030542, 7343241, 7099648]
40941G099648J54680L36947L23473K44906J82796J38082J19984J74543K98034
40932I073093L91583L63938K50978J71794J72123J72375Q9430m2720j17275r3582
40922A0431737m2978n7696j57228k99518m44943n69068o27820n62910l65780j09564
40912G194232J10124K50513L10237K63234O2331k71119o05654p90843p79975o43617
40902E099463m90285m06858m39494n58852o41662n62743l43687j57931j39045
40893A358906k19364k13165l8052K06330L74245M25207M22051M30333M56627M59676
40883C662794L88021K21143Q144j34292r3864J42533M60880O91615P21326N54985
40873F623285K90818M6830r5301j08454k8256M4787o942k17877m83373o34579
$$ y = [7099648, 7254328, 7591275, 7914748, 8159654, 8342450, 8480532, 8600516, 8775059, 9073093, 9464676, 9828614, 10079592, 10251386, 10423509, 10595884, 10685314, 10642594, 10525319, 10431737, 10388759, 10331063, 10173835, 9874317, 9429374, 8860306, 8232486, 7669576, 7303796, 7194232, 7304356, 7554869, 7865106, 8128340, 8190671, 7919552, 7313898, 6523055, 5743080, 5099463, 4609178, 4202320, 3762826, 3203974, 2562312, 1999569, 1655882, 1497951, 1358906, 1139542, 926377, 888325, 1094655, 1468900, 1894107, 2316158, 2746491, 3203118, 3662794, 4050815, 4271958, 4280102, 4145810, 4051946, 4194479, 4655359, 5346974, 6068300, 6623285, 6914103, 6960933, 6865632, 6757178, 6728922, 6773709, 6766767, 6548890, 6065517, 5430938]
40863E430938n80884l70784j28025M0485Q4992J8210r1306j61513j62339j29838
40853C949936j10620j19658j58917k29013k88498k44628m5649K24727L92633L42923
40843C713236J05968j83630l80737m09126l12207k30665k75567m06467m75757
40834A145048m03039k56237j42841p6545J0122J61157L46110M84706M90036L24324
40824B082841N6356j65077k40702k00892j21132p130J64233L30879L84578L32786
40814B616740L14096M06356N04948M57313K55858K4282j41256k34279k66913k28973
40804C708172j35001n1234m7498j45562l12181m69427n20710m15726k00086K8890
40794A439637K08699L20300L41950K76297K21477L07290N05949N94342L99055
$$ y = [5430938, 4850054, 4479270, 4351245, 4391730, 4476722, 4494932, 4403626, 4242113, 4079774, 3949936, 3839316, 3719658, 3560741, 3331728, 3043230, 2798602, 2752953, 2977680, 3370313, 3713236, 3819204, 3635574, 3254837, 2845711, 2533504, 2302839, 2027272, 1620805, 1145048, 742009, 485772, 342931, 266386, 276508, 437665, 783775, 1268481, 1758517, 2082841, 2139197, 1974120, 1733418, 1532526, 1411394, 1404264, 1568497, 1899376, 2283954, 2616740, 2930836, 3337192, 3842140, 4299453, 4555311, 4579593, 4438337, 4204058, 3937145, 3708172, 3573171, 3521937, 3474439, 3328877, 3016696, 2547269, 2026559, 1610833, 1410747, 1439637, 1648336, 1968636, 2310586, 2586883, 2808360, 3115650, 3621599, 4215941, 4614996]
40785D614996L7140j84212j01683J49281L14293K73646R6305p8105j53755j18968
40775D848938l3517L0850O5718J24973K25111K81474J97724Q672j23366o8303
40765E558274J57594M49316P31177R77188J156633J231578J212004J154584J081865
40756A3710213R44810O97247L71705L9365k76119n84967q41567r43701q54785
40747A2262201o78443n66797n78884o63375p48167p90312p49262n82032l00731
40738F604198l256J90618K33081J69701Q0990J7862j4593l2415m4810m8048l5103
40727G118225L40O5904J57753K40858K66525K28540J81661J77257J96563J80728
40717H814354J13354K8613n7431j63998k72610k91443j41414J45757M56876P08862
$$ y = [4614996, 4652136, 4467924, 4366241, 4515522, 4829815, 5103461, 5199766, 5121661, 4967906, 4848938, 4815421, 4846271, 4911989, 5036962, 5262073, 5543547, 5741271, 5749943, 5626577, 5558274, 5715868, 6165184, 6896361, 7873549, 9030182, 10261760, 11473764, 12628348, 13710213, 14655023, 15352270, 15723975, 15763340, 15487221, 14902254, 14060687, 13116986, 12262201, 11583758, 11016961, 10438077, 9774702, 9026535, 8236223, 7486961, 6904929, 6604198, 6600942, 6791560, 7024641, 7194342, 7275332, 7293194, 7278601, 7246186, 7201376, 7153328, 7118225, 7118565, 7184469, 7342222, 7583080, 7849605, 8078145, 8259806, 8437063, 8633626, 8814354, 8927708, 8956321, 8898890, 8734892, 8462282, 8170839, 8029425, 8175182, 8632058, 9340920]
40707I340920Q90668J006781J034144R54385P92629N91399L54407L9938l82524
40698A4622747q73811j326450j628642j734845j680454j533227j336010j094815
40690C414493q09919n07311k39453n7635J8747Q711m9992j16180j39132o5166
40680A457163J14863L30729M82615N30739N01894M08603K22063m4657k85717l98057
40670C320238l99324l87277l98341l77243k88902j85038j26441r2718j5484J23325
40660A172795K62151L18318K56571J11108m8069j81263l10893m65511n99249o11826
40650i5868m61703k17015K5316K26172L80381M53395L96768K14298k0857k05973
40640F94914k57660j65378k7047J7064o4456j49334j20968k3686J7750j1455j6543
$$ y = [9340920, 10231588, 11238369, 12272513, 13226898, 14019527, 14610926, 14965333, 15005271, 14622747, 13748936, 12422486, 10793844, 9058999, 7378545, 5845318, 4509308, 3414493, 2604574, 2097263, 1857810, 1800175, 1818922, 1827633, 1777641, 1661461, 1522329, 1457163, 1572026, 1902755, 2385370, 2916109, 3418003, 3826606, 4048669, 4004012, 3718295, 3320238, 2920914, 2533637, 2135296, 1758053, 1469151, 1284113, 1157672, 1064954, 1049470, 1172795, 1434946, 1753264, 2009835, 2120943, 2072874, 1891611, 1580718, 1115207, 515958, -95868, -557571, -774586, -749270, -523098, -142717, 310678, 707446, 921744, 900887, 694914, 437254, 271876, 244829, 261893, 197437, 48103, -72865, -96551, -78801, -90256, -106799]
40629a06799K8616K8446p7965k16554k90800l03785k93878k21174j5313K89373
40619a179833N47013O32780N45463L92140K98229L01884L04509J61834j40264
40610A863755m42564n81458n44204m07394k03153N0395K42843K38718N8407j24775
40600A50570j91941j77908j31569P403L10974P09894J024687J130523J046309
40591C878942Q83803P41778O27351M61000J84467j37668l77332n06408o21941
40582E133992p82640r09435r02599p75129n97280l86381j50310J7268O826j54353
40572D99959l21295m04410m34298m48588m08372k63816m2173J65036K71544K47203
40562a139210J37686L2836k1538o6116j40178j88330j35437l1400j2417j03526
$$ y = [-106799, -78183, -49737, -127702, -344256, -635056, -938841, -1232719, -1453893, -1469206, -1179833, -632820, -40, 545423, 937563, 1235792, 1537676, 1842185, 2004019, 1863755, 1421191, 839733, 295529, -111865, -315018, -264623, -21780, 216938, 275345, 150570, -41371, -219279, -350848, -343445, -32471, 677423, 1702110, 2832633, 3878942, 4762745, 5504523, 6131874, 6592874, 6777341, 6639673, 6262341, 5755933, 5133992, 4351352, 3441917, 2539318, 1764189, 1166909, 780528, 630218, 647486, 654312, 499959, 178664, -225746, -660044, -1108632, -1517004, -1780820, -1822993, -1657957, -1386413, -1139210, -1001524, -968688, -990226, -1056342, -1196520, -1384850, -1520287, -1551687, -1564104, -1667630]
40552a667630j64654p2947J31846L32285M73448N46514N06868L10143J2512k35570
40542A72815k99344j43853J49212M05435M46131K31205q0732k50826j41429K13268
40532G01882O54677R77623J025903P99242M60227J83086N639j34739k64154l49017
40522D060369l91286m56788n83995p20852p80502p33032o36533n98675o84493
40513a525787q13400p70906m05235J69844O35318P61706N96903L42393J15379
40504h93785j04311l37937n12908n29070l74546j40632O8552K18138L34019M40144
40494a832336N34592O20993P16204P98914P87370O18083L35487N8764j36897k65971
40484B235203l67481m47559m95590n06175m62654l39290j47375M8534J82355K31163
$$ y = [-1667630, -1832284, -1905231, -1773385, -1441100, -967652, -421138, 85730, 395873, 408385, 172815, -126529, -270382, -121170, 284265, 730396, 961601, 880869, 630043, 488614, 701882, 1356559, 2334182, 3360085, 4159327, 4619554, 4802640, 4808279, 4673540, 4409386, 4060369, 3669083, 3212295, 2628300, 1907448, 1126946, 393914, -242619, -841294, -1525787, -2339187, -3110093, -3515328, -3345484, -2710166, -1948460, -1351557, -1009164, -893785, -998096, -1336033, -1848941, -2378011, -2752557, -2893189, -2824637, -2606499, -2272480, -1832336, -1297744, -676751, 39453, 838367, 1625737, 2243820, 2579307, 2638071, 2501174, 2235203, 1867722, 1420163, 924573, 418398, -44256, -383546, -530921, -482387, -300032, -68869]
40474f8869J95666P2154j26219l41144m91903n23992m32721k61731q8373J5754
40464b051378L1110r264o2141r6324q6099k9480K6807L8755N4860J84761M39627
40453a558766O69245P17795N90468L97837J88215o3300l20452m59979m15839k68619
40443e23395j47893j03797j11288j37526j48255r5421L1353J61659K14078J98383
40433f62102J90056K08194J86085Q1805m3470j00785q7755p3267p9616l2691J50052
40422b63494M41349O87928P13600M56198L0846l41998n02449m68740l89855l83898
40412b0513m34171m34186l01840m1155K73494N45837P05863P36636O59847N05657
40402B195469L21441J95470K03360K99393L24517J85935j2983r6076l9597J2109
$$ y = [-68869, 126797, 198951, 72732, -268412, -760315, -1284307, -1717028, -1978759, -2067132, -2051378, -2020268, -2029532, -2091673, -2187997, -2274096, -2303576, -2276769, -2238014, -2183154, -1998393, -1558766, -889521, -171726, 418742, 816579, 1004794, 941494, 621042, 161063, -254776, -523395, -671288, -775085, -886373, -1023899, -1172154, -1267575, -1236222, -1074563, -860485, -662102, -472046, -263852, -77767, 4038, -39432, -140217, -227972, -301239, -380855, -413546, -263494, 177855, 865783, 1579383, 2035581, 2066427, 1724429, 1221980, 753240, 363385, -20513, -454684, -888870, -1190710, -1231865, -958371, -412534, 293329, 1029965, 1689812, 2195469, 2516910, 2712380, 2915740, 3215133, 3539650, 3725585, 3712602, 3616526, 3576929, 3589038]
40392C589038n3881j97843l17392l62980l29222k21490r0479l0730p7924j56188
40382A750909j82684j70375j66826j52630q2755K1519J14557K14162L31595L42717
40372B020189P8864m18334q56182r71263p69579m38953j21694J40297L16409L73199
40362f47047L42360L09295L18122L44122L60570L70654L62703K97200J75544Q4968
40352B318491J27263K96214M42500L80907O2005l43851n56340m21134m8544K94640
40342B552151M22203L40166J53487o6782k93307m68425m88696k88866O7885L94263
40332B324079M86130K53189k25306p55947j140961j257339j082159o94486k54689
40323b347489P1385K16182K40689K48392K82255L23171L62406M22525M96983N16021
$$ y = [3589038, 3535157, 3337314, 3019922, 2656942, 2327720, 2106230, 2015751, 1985021, 1907097, 1750909, 1568225, 1397850, 1231024, 1078394, 995639, 1017158, 1131715, 1345877, 1677472, 2020189, 2099053, 1680719, 824537, -146726, -916305, -1355258, -1476952, -1336655, -1020246, -647047, -304687, 4608, 322730, 666852, 1027422, 1398076, 1760779, 2057979, 2233523, 2318491, 2445754, 2741968, 3184468, 3565375, 3627380, 3283529, 2727189, 2306055, 2257511, 2552151, 2974354, 3314520, 3468007, 3401225, 3107918, 2639493, 2150797, 1861931, 1929816, 2324079, 2810209, 3063398, 2838092, 2082145, 941184, -316155, -1398314, -2092800, -2347489, -2276104, -2059922, -1819233, -1570841, -1288586, -965415, -603009, -180484, 316499, 832520]
40313H32520M10497J94146m5194k25397l19300l46589l58592m18859n37273o06829
40303a420870m69933j01505L08402N15956M58056K76468J22807J0603j26495l05185
40293g31696m71689n65401n49608m09229j80037K8372J00103K3113j00747j66823
40283c023642j58331j14327m2154J02411L48251O40935Q56411Q97472P84190O32677
40273I23893N26993M32569K70460N8617q4063r2081n4154j15164l10984n46616
40263A009470p10140p48799o47982m18549j38597N4803Q1768J3609k75R6625K08907
40252a199160K13806J10720J4760J1592N5624L5495p4460j71354j59980j03027
40242a265984j70122m14100o52751o34134l05283J35909M48176N46811M99205
$$ y = [832520, 1243017, 1437163, 1391969, 1166572, 847272, 500683, 142091, -276768, -814041, -1420870, -1890803, -1992308, -1683906, -1167950, -709894, -433426, -310619, -300016, -426511, -731696, -1203385, -1768786, -2318394, -2727623, -2907660, -2879288, -2779185, -2756072, -2856819, -3023642, -3181973, -3296300, -3338454, -3236043, -2887792, -2246857, -1390446, -492974, 291216, 923893, 1450886, 1883455, 2153915, 2212532, 2128469, 2036388, 1982234, 1867070, 1556086, 1009470, 299330, -449469, -1097451, -1516000, -1654597, -1599794, -1518026, -1504417, -1504692, -1408067, -1199160, -985354, -874634, -859874, -848282, -792658, -757163, -831623, -1002977, -1162957, -1265984, -1436106, -1850206, -2502957, -3137091, -3442374, -3306465, -2858289, -2311478, -1812273]
40233a812273M09863L60707L97864M89232N12001L63056R8506q8765m9794J93646
40223H74043N00084P33895Q27479P77334O23452M13259J65011j10346l44688m22343
40213D037180k93396m4527J81534L07136L23219K18436j5542l11705n36011o00219
40203C266105n32180m19593l19703k39303j64794q1129K1315J37001K50927L59582
40193B278228M68174N62501O08949N93194N34715M50435L30394J68931k205j35154
40183E858162k04909k07866j42831k7879O9927O2264p6695k62655l61504l14205
40173D391809j99513j56964k44805l93420n00618n29413m84691l53331j50209
40164A378845M702k6583k02972l00517j81733P016M654k41194n22596o24619n24705
$$ y = [-1812273, -1402410, -1041703, -643839, -154607, 357394, 720450, 818956, 730191, 680397, 874043, 1374127, 2108022, 2935501, 3712835, 4336287, 4749546, 4914557, 4804211, 4459523, 4037180, 3743784, 3699257, 3880791, 4187927, 4511146, 4729582, 4714040, 4402335, 3866324, 3266105, 2733925, 2314332, 1994629, 1755326, 1590532, 1509403, 1530718, 1667719, 1918646, 2278228, 2746402, 3308903, 3917852, 4511046, 5045761, 5496196, 5826590, 5995521, 5993316, 5858162, 5653253, 5445387, 5302556, 5274677, 5344604, 5406868, 5330173, 5067518, 4706014, 4391809, 4192296, 4035332, 3790527, 3397107, 2896489, 2367076, 1882385, 1529054, 1378845, 1383547, 1356964, 1153992, 853475, 671742, 678758, 683412, 442218, -80378, -704997, -1229702]
40153a229702l34716j57275m9520m2538j15564j83671j70903q1469L4802J54183
40143b176373K64961L05967J91779p8462l78478n53433n51711m44780l27967k22128
40133c970625p5309J57449M53245P31599R02059R04577P41768M91880K55552N8207
40123F50402j58897m05644n46007m22880p3065K78105M57934M87846M47728L19411
40113A034933P5957j46823j21868K05114O18227Q25889O89592K58562l19448q62228
40103B257907j199023j247950j061938p72913m93655k73996j11242K9519J81492
40094b691799L29980M13200L89914K86574J56897K3417j07560k00839k14128j58831
40084a773175q9698k7741N9196J80727K75778K82353K31314K20957K97052L98390
$$ y = [-1229702, -1564418, -1721693, -1771213, -1813751, -1929315, -2112986, -2283889, -2365358, -2330556, -2176373, -1911412, -1605445, -1413666, -1492128, -1870606, -2424039, -2975750, -3420530, -3748497, -3970625, -4045934, -3888485, -3435240, -2703641, -1801582, -897005, -155237, 336643, 592195, 650402, 491505, 85861, -460146, -883026, -956091, -677986, -220052, 267794, 715522, 1034933, 1110890, 964067, 842199, 1047313, 1665540, 2491429, 3181021, 3439583, 3120135, 2257907, 1058884, -189066, -1251004, -2023917, -2517572, -2791568, -2902810, -2873291, -2691799, -2361819, -1948619, -1558705, -1272131, -1115234, -1091817, -1199377, -1400216, -1614344, -1773175, -1862873, -1890614, -1831418, -1650691, -1374913, -1092560, -861246, -640289, -343237, 55153]
40074E5153M31943L63645K13642O046k20860l72309l39689j16519J72618L94050
40064E87720N22211O00057O24333N37146L23793N7108j68623l06891l59053l53926
40054B063875l38399l40176l21776k14607j4218K07604M01511N84103P45280P90818
40044C564015O62643M74343M26823N87734Q31952J006694J075210J071774R93325
40035A0694513P97174M71033N6790l74116p34428r41766r81901r45237r45309
40026G096753r82835r31355o92044l43106r5462r6713l09078n84656q09547r29755
40016A322202q78558n80280o6772M70407Q06145Q48866O63464L77497J14887k5368
40006C052490j7439N4138O3535l9892k20103m33826o46378p76656p26922n05487
$$ y = [55153, 487096, 850741, 1064383, 1070429, 849569, 477260, 137571, 21052, 193670, 587720, 1109931, 1709988, 2334321, 2871467, 3195260, 3252368, 3083745, 2776854, 2417801, 2063875, 1725476, 1385300, 1063524, 848917, 834699, 1042303, 1443814, 2027917, 2773197, 3564015, 4226658, 4701001, 5127824, 5715558, 6547510, 7554204, 8629414, 9701188, 10694513, 11491687, 11962720, 12019510, 11645394, 10910966, 9969200, 8987299, 8042062, 7096753, 6113918, 5182563, 4490519, 4147413, 4051951, 3955238, 3646160, 3061504, 2251957, 1322202, 443644, -136636, -203408, 266999, 1073144, 1922010, 2585474, 2962971, 3077858, 3052490, 3035051, 3089189, 3152724, 3112832, 2892729, 2458903, 1812525, 1035869, 308947, -196540]
39996a96540k44772n3721Q3329K21582L49482M34876N07497O01286O52966N56361
39986B912346L09347K6817j87383l05306l19175k16969m3836Q8021R8955R395
39976B372212j21923k80486m76020o71410p76664p15705m95568k27524p2849j20622
39966a586559k97414m26210l87523j97761N9988L17342N17657O11445O12932O09616
39956a66487O50183O59171N32646K92788O8108p2080j78255k99057l81895l47919
39946G57203k18329j06654r8679j76920k51390k32268q6432J30565K85414K46965
39936B49475j833l18676m84971l65162j0930L86184O55395P65707P86389P50752
39926B412330O00592K82578j34599m84313o47563o50781o15784o34008o93482
$$ y = [-196540, -441312, -495033, -411704, -190122, 159360, 594236, 1101733, 1703019, 2355985, 2912346, 3221693, 3248510, 3061127, 2755821, 2436646, 2219677, 2175841, 2263862, 2362817, 2372212, 2250289, 1969803, 1493783, 822373, 45709, -669996, -1165564, -1393088, -1465937, -1586559, -1883973, -2310183, -2697706, -2895467, -2835479, -2518137, -2000480, -1389035, -776103, -166487, 483696, 1142867, 1675513, 1968301, 2036409, 1964329, 1786074, 1487017, 1105122, 757203, 538874, 432220, 333541, 156621, -94769, -327037, -413469, -282904, 2510, 249475, 247642, -71034, -556005, -921167, -932097, -545913, 109482, 875189, 1661578, 2412330, 3012922, 3295500, 3160901, 2676588, 2029025, 1378244, 762460, 128452, -565030]
39917e65030p03343n75241l01587K3833K71474L79823L88319L60877L04353J93715
39907b22807N4130l8377m4321J203N4797J18115J92187K27544J78585Q6634N1813
39896F59503J22885K52413L50201L41950J99135k1017j68886j16781Q9456K56506
39886A965365K62443J99019K47371M49974O58371O85352M65971R0935k68545m75417
39876D280839n09741m49036l63030k54990j20330r130K3995q53k1972k8035n1136
39865B496581q0560o0463J6082Q1776R0192P6336Q4367Q1134q737j97181l94169
39854B185358m71396l60055j08815J43370K73325K65164J86072Q4008n1059k22902
39844A923070l73837m15469k87739J4957M29120Q18164J038504J055151R71888
$$ y = [-565030, -1268373, -1843614, -2145201, -2121368, -1849894, -1470071, -1081752, -720875, -416522, -222807, -168677, -207054, -251375, -250172, -195375, -77260, 114927, 342471, 521056, 607690, 659503, 782388, 1034801, 1385002, 1726952, 1926087, 1905070, 1736184, 1619403, 1708859, 1965365, 2227808, 2426827, 2674198, 3124172, 3782543, 4467895, 4933866, 5024801, 4756256, 4280839, 3771098, 3322062, 2959032, 2704042, 2583712, 2574582, 2598577, 2597724, 2575752, 2547717, 2496581, 2416021, 2355558, 2371640, 2453416, 2543608, 2619944, 2704311, 2785445, 2776708, 2579527, 2185358, 1713962, 1353907, 1245092, 1388462, 1661787, 1926951, 2113023, 2197031, 2145972, 1923070, 1549233, 1133764, 846025, 860982, 1290102, 2108266, 3146770, 4201921, 5173809]
39835E173809R25006R70783J083131J208949J295753J314490J295325J293291
39827A4560537J269544J059272N39878j81923q21239j159049j192805j062595
39819A3011620q99607p58964o33690m84744k69951L3533M24539Q64836J240641
39810A2528213J367884J104070M75760l30412j098021j674410j972800j975456
39802H424828j763738j479204j211045r60665p41189o44640p40262r38168j036333
39793a090416r18230o53944l87160j68136N8090L17472N25432N82548N26554N15975
39783f91815O25628P12560N65530J82238j84561k91660j58112j1733l4653k21117
39773D92305m47831n96076n94236m17256j00779K60720N63617P47308P98723P29553
$$ y = [5173809, 6098815, 7069598, 8152729, 9361678, 10657431, 11971921, 13267246, 14560537, 15830081, 16889353, 17429231, 17247308, 16426069, 15267020, 14074215, 13011620, 12112013, 11353049, 10719359, 10234615, 9964664, 9998197, 10422736, 11287572, 12528213, 13896097, 15000167, 15475927, 15145515, 14047494, 12373084, 10400284, 8424828, 6661090, 5181886, 3970841, 3010176, 2268987, 1624347, 884085, -54083, -1090416, -2008646, -2662590, -3049750, -3217886, -3159796, -2842324, -2316892, -1734344, -1207790, -691815, -66187, 646373, 1211903, 1394141, 1209580, 917920, 759808, 748075, 713422, 492305, 44474, -551602, -1145838, -1563094, -1663873, -1403153, -839536, -92228, 706495, 1436048]
39763A436048N68878L65463J71247J4077j06170j92764k32038k05014j15927q96
39753A702904R3176J31490R4038k5972k09754m07847n66533o57050o64392n59698
39743a069638l16962L7154M16207P22940Q83657Q44134N90485K04438j49476l45160
39733A817779l86870l44544k31077j1542K71244M57942M00391R8448l07885o46171
39723A117715p95114p19851m91219k60420j54944j72217j93652j15734M2693J65227
39713a577516J55173K3012j31522k13854k07874j54612p0224Q3137L24492N76504
39703a193284P04997O45448M64461K87152J87929J62491J75825K08602K69296
39694A912917L84234N65737P69437Q99843Q96349Q17710Q09886R74875J286567
$$ y = [1436048, 2004926, 2370389, 2541636, 2555713, 2449543, 2256779, 2024741, 1819727, 1703800, 1702904, 1796080, 1927570, 2021608, 1995636, 1785882, 1378035, 811502, 154452, -509940, -1069638, -1386600, -1349446, -933239, -210299, 673358, 1517492, 2107977, 2312415, 2162939, 1817779, 1430909, 1086365, 855288, 843746, 1114990, 1572932, 1973323, 2071771, 1763886, 1117715, 322601, -397250, -888469, -1148889, -1303833, -1476050, -1669702, -1785436, -1742743, -1577516, -1422343, -1399331, -1530853, -1744707, -1952581, -2107193, -2177417, -2094280, -1769788, -1193284, -488287, 157161, 621622, 908774, 1096703, 1259194, 1435019, 1643621, 1912917, 2297151, 2862888, 3632325, 4532168, 5428517, 6246227, 7056113, 8030988, 9317555]
39685I317555J641601J971231K285156K609823K890322K956220K608534J781245
39677B8061687O30997n52247j531482k211773k577130k622470k393686k042033
39669A4761863j757352j631406j612273j581011j439457j147677p49419l87120
39661D456148k39246l87136p37737j087172j256025j176364q96629n37804k25117
39652b087082k0084R4191J55379J63272J04596L2191P4385L20681O98745J004305
39642E40579J077812R30899O75748L66188k4412m69112q17402r19412p84118n61549
39632A5221l92068l21000l29953l74878l88501l12432j55366J4604J45646K36740
39622a861987K98702L30528L44699L66708L90840L78674L17712K37933J55692
$$ y = [9317555, 10959156, 12930387, 15215543, 17825366, 20715688, 23671908, 26280442, 28061687, 28692684, 28140437, 26608955, 24397182, 21820052, 19197582, 16803896, 14761863, 13004511, 11373105, 9760832, 8179821, 6740364, 5592687, 4843268, 4456148, 4216902, 3829766, 3092029, 2004857, 748832, -427532, -1324161, -1861965, -2087082, -2107166, -2012975, -1857596, -1694324, -1589728, -1557537, -1483152, -1162471, -463726, 540579, 1618391, 2549290, 3225038, 3591226, 3566814, 3097702, 2280300, 1360888, 576770, 15221, -376847, -697847, -1027800, -1402678, -1791179, -2103611, -2258977, -2244373, -2098727, -1861987, -1563285, -1232757, -888058, -521350, -130510, 248164, 565876, 803809, 959501]
39613I59501N5514m4544o5555M4021K23253L45618L35676K17312P4638j2294k7901
39602B105239m4141j47427l17783m26716l86262k43971q6562P9744K73169M20031
39592A225321M12842K76472J64689J63847J88507J13368o2301k33501l20809l27266
39582A601169k95637k60845k30290j70832k6951K05650M21911M61201K44755j46245
39572A803886n37469p95336q83916q12465n86164k48314O7449K10518J66469Q7118
39562a528224J34998L33208N88308P98028Q82593P71961M64619R5753j38200j49994
39552B253050j3813J52234K97586M25534N34051O05860O22607N66107M32249K52268
39542F127733O6889j24136l43187n59162o87073o91917o49668o68674p74170q91838
$$ y = [959501, 1015015, 970471, 904916, 948937, 1172190, 1517808, 1853484, 2070796, 2145434, 2133140, 2105239, 2061098, 1913671, 1595888, 1169172, 782910, 538939, 452377, 532121, 805290, 1225321, 1638163, 1914635, 2079324, 2243171, 2431678, 2545046, 2482745, 2249244, 1928435, 1601169, 1305532, 1044687, 814397, 643565, 616614, 822264, 1244175, 1705376, 1950131, 1803886, 1266417, 471081, -412835, -1225300, -1811464, -2059778, -1992329, -1781811, -1615342, -1528224, -1393226, -1060018, -471710, 326318, 1208911, 1980872, 2445491, 2541244, 2403044, 2253050, 2239237, 2391471, 2689057, 3114591, 3648642, 4254502, 4877109, 5443216, 5875465, 6127733, 6194622, 6070486, 5727299, 5168137, 4481064, 3789147, 3139479, 2470805, 1696635, 804797]
39532H04797r15904p72704m55656m2995L24911N15967M73667K40803n3363k46524
39522a27001k45370j01033M6853J12791J20879J21268J14279Q6392O6376R5433
39512B90867J67077K31618K37950J49766l8456k60920l88254l28104j15693J16152
39502F2003K38318J87492j4559k46305l27592j59330J59306L99071M08756K38881
39492I46041O0521q162J5260M0345J7931k2237l7943l8765m4673k609J80513M90541
39480A596763P45531P34734M05132j04222n69964q01686p22188m16220q6952J01798
39470H82726J48364J51429J57117J28458M9156k3164k8345L0020J19150K32854
39460A847765L71460M85375M79246K89933l8253l62701n46170n63483m93861m08985
$$ y = [804797, -111107, -883811, -1339467, -1382462, -1057551, -541584, -67917, 172886, 119523, -127001, -372371, -473404, -426551, -313760, -192881, -71613, 42666, 129058, 195434, 290867, 457944, 689562, 927512, 1077278, 1038822, 777902, 389648, 61544, -54149, 62003, 300321, 487813, 473254, 226949, -100643, -259973, -100667, 298404, 707160, 946041, 1006562, 998400, 1013660, 1054005, 1071936, 1049699, 1011756, 972991, 928318, 925709, 1106222, 1596763, 2342294, 3077028, 3482160, 3377938, 2807974, 2006288, 1284100, 867880, 780928, 882726, 1031090, 1182519, 1339636, 1468094, 1517250, 1494086, 1465741, 1495761, 1614911, 1847765, 2219225, 2704600, 3183846, 3473779, 3435526, 3072825, 2526655, 1963172, 1469311, 1060326]
39450A060326l07923j80446p8633o5241j18356j54686j42160j27819j48477j72107
39440d35522j49287q2174j9640m371k8887k4976Q5922K90375M45107M00139J64081
39429F40767j06736k87045l86022m58701m92711m34618k77602o5178J62252L71849
39419a333745N10230N27085M31283K91604J80644J38009J76265K85419M18654
39410A625448M93159M29610K12540p2715k74977k88073j50697k4399n5976k57222
39400A636698n02896o20240m96081j57213K25525M54856M73552L99401L66391
39391A779993L54601K21519j03837n02753p58740p46525n20906k42324m0336N4619
39381e04689P9924P7868O4918K9306o1065k20027l81545m06087k05254J41451
$$ y = [1060326, 752403, 571957, 493324, 428083, 309727, 155041, 12881, -114938, -263415, -435522, -584809, -666983, -686623, -690994, -719881, -744857, -658935, -368560, 76547, 476686, 640767, 534031, 246986, -139036, -597737, -1090448, -1525066, -1802668, -1867846, -1705594, -1333745, -823515, -296430, 134853, 426457, 607101, 745110, 921375, 1206794, 1625448, 2118607, 2548217, 2760757, 2688042, 2413065, 2124992, 1974295, 1949896, 1893920, 1636698, 1133802, 513562, 17481, -139732, 85793, 540649, 1014201, 1413602, 1779993, 2134594, 2356113, 2252276, 1749523, 990783, 244258, -276648, -518972, -559308, -504689, -424765, -346897, -281979, -252673, -313738, -533765, -915310, -1321397, -1526651, -1385200]
39371a385200M44314N82734N81385N12919M02099K57035J19452J5387j02149k87445
39361A140531m91939n83094m81597k44888j6886P6253m665k02236m15652n82028
39351a806201o91922p12402n51133j68198L01410O28722P12750O50876N64482
39342a071616M35140J77343j78714m65061n41587m31230k78392k08707k41924
39333b804748l10047l30685k67129j40025K164J21738K15057L14075M60422O55917
39323b083261Q33559R01563Q33646P00496N92443N23244M34436K87836J20660
39314C144622l252p1261j23398j81235k04254j35297K0499J83315K67233K41027
39304C137999J12999j10914m07286o76154p61790n82322k25296J26447L63118
$$ y = [-1385200, -940886, -358152, 223233, 736152, 1138251, 1395286, 1514738, 1530125, 1427976, 1140531, 648592, 65498, -416099, -660987, -677873, -601620, -606285, -808521, -1224173, -1806201, -2498123, -3210525, -3761658, -3929856, -3628446, -2999724, -2286974, -1636098, -1071616, -636476, -459133, -637847, -1102908, -1644495, -2075725, -2354117, -2562824, -2804748, -3114795, -3445480, -3712609, -3852634, -3850470, -3728732, -3513675, -3199600, -2739178, -2083261, -1249702, -348139, 485507, 1186003, 1778446, 2301690, 2736126, 3023962, 3144622, 3141370, 3070109, 2946711, 2765476, 2561222, 2425925, 2446424, 2629739, 2896972, 3137999, 3250998, 3140084, 2732798, 2056644, 1294854, 712532, 487236, 613683, 976801]
39295I76801N06327N99624N99715M27298J06734k05005l56019l45199l09153l72122
39285A629001n24054o40793o05105m02526j15685J50861L31136M02446L64412
39276E89693K32586M1818j62744l36940m33047m03255k40024j1820J76290K72495
39266b74948L06925L24065L21184K72559J74739K9408j82146m42221o24144n55636
39256f50215j96264K83181O31563P09972N47093K58742l2369k26720k80832k42063
39246H02088k09872k26884k26861j19028R0310K91200L77069L23216J60729p4443
39236A187524l31563n21287n63087m63627l09627j73240n5105P3917K15001L41969
39226e99125M21587M12088K84144P9143r0604j47512j30524j26244j45699j29219
$$ y = [976801, 1483128, 2082752, 2682467, 3109765, 3216499, 3011494, 2655475, 2310276, 2001123, 1629001, 1104947, 464154, -140951, -543477, -659162, -508301, -177165, 225281, 589693, 822279, 864097, 701353, 364413, -68634, -471889, -711913, -723733, -547443, -274948, 31977, 356042, 677226, 949785, 1124524, 1153932, 971786, 529565, -94579, -650215, -846479, -563298, 68265, 778237, 1325330, 1584072, 1551703, 1324983, 1044151, 802088, 592216, 365332, 138471, 19443, 109753, 400953, 778022, 1101238, 1261967, 1187524, 855961, 334674, -228413, -692040, -1001667, -1174907, -1230012, -1156095, -941094, -599125, -177538, 234550, 518694, 597837, 507233, 359721, 229197, 102953, -42746, -171965]
39216a71965n6996J7270M9315N6113O6310P5279P5179Q2738J08777J39471J74349
39205F15840K43330L52377M41905M33074L00375Q4400j39148k88345l12337k32155
39195A499316j24658n0162k1624m7174j46408k95773m11079m27531l58021k39940
39185f23054q2417Q2392J61874J05009K686j3385M2385K6748j16705k57562k32876
39174i04905k5164K58795N18763P07583P94054P59372O32902M82947L55919K40305
39164C820571R2961j05785l13773m34150l75101j25271K20199N09754O26548N63811
39154D479764M31051L60379L72760L55516K11475O390r8362n8095j1882j07440
39144E941556l24153n15823n74666m94887l21414j20866P104k3100j90065l65783
$$ y = [-171965, -228961, -211691, -162376, -106263, -39953, 35326, 110505, 193243, 302020, 441491, 615840, 859170, 1211547, 1653452, 2086526, 2386901, 2471301, 2332153, 2043808, 1731471, 1499316, 1374658, 1324496, 1302872, 1255698, 1109290, 813517, 402438, -25093, -383114, -623054, -705471, -623079, -461205, -356196, -353510, -366895, -324510, -297762, -414467, -672029, -904905, -930069, -671274, -152511, 555072, 1349126, 2108498, 2741400, 3224347, 3580266, 3820571, 3913532, 3807747, 3493974, 3059824, 2684723, 2559452, 2779651, 3289405, 3915953, 4479764, 4910815, 5271194, 5643954, 5999470, 6210945, 6217335, 6118973, 6060878, 6048996, 5941556, 5617403, 5101580, 4526914, 4032027, 3710613, 3589747, 3596851, 3573751, 3383686, 3017903]
39134C017903m41629m28163m09904m33332m74504m97865m99895m83803m25685
39125a076877k98188j24861J0407J8465j29169l75380n98130o64257n04537j66048
39115c908575K18966N31135P21033P72058O63020M21983J84677J09412K03576
39106h2715K91345J99285n1912k74102l08543j66104Q085P0645j5032j73670k98989
39095h01707l39668l05502k07309l7548J68446K99726K61422R7669k6967J3464
39085h77974J93941L92945N20865N67436N52365M78687L40225J38654j25053m46906
39075A735185p73907r78861r37366o59035l15220j01664p7839j54019k06956j68095
39065b637777k1100K14115M67576O39593O80801O34020N64125M62655K61537n5670
$$ y = [3017903, 2576274, 2148111, 1738207, 1304875, 830371, 332506, -167389, -651192, -1076877, -1375065, -1499926, -1489519, -1471054, -1600223, -1975603, -2573733, -3237990, -3742527, -3908575, -3689609, -3158474, -2437441, -1665383, -1002363, -580380, -395703, -286291, -82715, 208630, 407915, 356003, 81901, -226642, -392746, -384661, -314016, -329048, -502718, -801707, -1141375, -1446877, -1654186, -1691734, -1523288, -1223562, -962140, -864471, -891438, -877974, -684033, -291088, 229777, 797213, 1349578, 1828265, 2168490, 2307144, 2182091, 1735185, 961278, -17583, -954949, -1613984, -1929204, -2030868, -2108707, -2262726, -2469682, -2637777, -2658877, -2444762, -1977186, -1337593, -656792, -22772, 541353, 1004008, 1265545, 1209875]
39055A209875l87708n82201n66832m04247k08730j7993K15813M86612O37307M88259
39045H70155P2825l37116m89752l85793k10176j00924p1528j14947k52934m50246
39035a470436n77573n27763l24090o4239J99454M61327O71031P21520N54432K38118
39025a18219q4610l05689l93310l55848k12826j2927J55727K17707J82252J39872
39015g87871J69503K56680L11663K54796P5078j68647l72690m33559l23071j37278
39005a155396l3247q4491k11805k77504k33393j53345j34928k03861l16132m15584
38995c219686m62587m25038k82617n9624J61579K85455K71251J51781j0802j68439
38985c758727k80144k90686j56640R6573L64923N29068N27607L78442J56875l5880
$$ y = [1209875, 822167, 239966, -326866, -731113, -939843, -957836, -742023, -255411, 381896, 870155, 942980, 605864, 116112, -269681, -479857, -580781, -652309, -767256, -1020190, -1470436, -2048009, -2575772, -2899862, -2964101, -2764647, -2303320, -1632289, -910769, -356337, -118219, -202829, -508518, -901828, -1257676, -1470502, -1483429, -1327702, -1109995, -927743, -787871, -618368, -361688, -50025, 204771, 279849, 111202, -261488, -695047, -1018118, -1155396, -1188643, -1273134, -1484939, -1762443, -1995836, -2149181, -2284109, -2487970, -2804102, -3219686, -3682273, -4107311, -4389928, -4449552, -4287973, -4002518, -3731267, -3579486, -3590288, -3758727, -4038871, -4329557, -4486197, -4389624, -4024701, -3495633, -2968026, -2589584, -2432709, -2468589]
38975b468589j13020n3726P3479J57128J33754M6358J9157J61983M65516P69822
38965h08138Q61977O52119K66009o1552j96355j91469j71679j84800k01104k10953
38955b45945k43860k87539k60289j04753J27148L19129L97351L67141K76341J83007
38945E27731J37228J48737J80028K03281K41274L06585L28317K13764j8110k39677
38935B029158l63593m12429m17555l41162j60988M0833J59187J94315K17091K37373
38925A182230J94820O5923j10120l12572n52315p79482q64793p28185m39145j47380
38915b491019N0992J52139J99938K49465L44458M83825O17652O96782P09360O57476
38905A671068N32460L36575R6337j70329m63003p43996r17657r15667p77430n93929
$$ y = [-2468589, -2581609, -2635335, -2561856, -2404728, -2270974, -2224616, -2205459, -2043476, -1577960, -808138, 53839, 705958, 971967, 910415, 714060, 522591, 350912, 166112, -34992, -245945, -489805, -777344, -1037633, -1142386, -1015238, -696109, -298758, 68383, 344724, 527731, 664959, 813696, 993724, 1197005, 1438279, 1744864, 2073181, 2286945, 2268835, 2029158, 1665565, 1253136, 835581, 494419, 333431, 374264, 533451, 727766, 944857, 1182230, 1377050, 1442973, 1332853, 1020281, 467966, -311516, -1176309, -1904494, -2343639, -2491019, -2440027, -2287888, -2087950, -1838485, -1494027, -1010202, -392550, 304232, 1013592, 1671068, 2203528, 2540103, 2636440, 2466111, 2003108, 1259112, 341455, -574212, -1351642, -1945571]
38895a945571l91056j28797J84259M33369M80029K80785q0104m51928p09004q09013
38885c137031p77715o40249l86996k3553L68543O55283P34825N94539L20273P8686
38875b213395M2498K55483N68579P65699P62070O39907N04782L82166K67165J89631
38865B164585J70591J60453Q0612q9692l02590m91408n93227n50522l49510o4088
38855A35204J74395K68683K15217Q5073m2953j46100k67777m44232o09938o14574
38845a247002l75045P061L20888M37391M01116L45723L54238M02337M10187L40133
38835A397027K43897J95063J72983O6196j67441l92850m24894k45427j6634J16599
38825I44519J50859J37341P0713p3914k56822l96368m44245l90501k36312k4952
$$ y = [-1945571, -2336627, -2465424, -2281165, -1847796, -1367767, -1086982, -1167086, -1619014, -2328018, -3137031, -3914746, -4554995, -4941991, -4965544, -4597001, -3941718, -3206893, -2612354, -2292081, -2213395, -2170897, -1915414, -1346835, -581136, 180934, 820841, 1325623, 1707789, 1974954, 2164585, 2335176, 2495629, 2576241, 2486549, 2183959, 1692551, 1099324, 548802, 199292, 135204, 309599, 578282, 793499, 878572, 835619, 689519, 421742, -22490, -632428, -1247002, -1622047, -1614986, -1294098, -856707, -455591, -109868, 244370, 646707, 1056894, 1397027, 1640924, 1835987, 2008970, 2075166, 1907725, 1514875, 1089981, 844554, 827920, 944519, 1095378, 1232719, 1303432, 1229518, 972696, 576328, 132083, -258418, -494730, -519682]
38815e19682J31383J30904j0094j74311k57410k24591q6707J04252K43764K41821
38805d20671J23976R295k1352L0087J69136M40458Q12796J116928J187661J024645
38795D472959P36468L74910o9045n25537q30569q93445p97042o84126o04449n14585
38785F65539l64087j23385K19610O11678R03566R40407O95107K83190j35941m36578
38775C259106n50116n01511m28827m82802o63156p99043p25750m48129j10117
38766a450345J47198K58774K16587M7828j88989m28054o22072p30942p10656n50444
38756d011115l04773m9358J80934L69257M55462L74567J74926K8985P3071K65376
38746b442668M43425M98119M49523L74774L24107L13821L39339L54195K71984
$$ y = [-519682, -388299, -257395, -267489, -441800, -699210, -923801, -1010508, -906256, -662492, -420671, -296695, -287400, -308752, -278665, -109529, 330929, 1143725, 2260653, 3448314, 4472959, 5209427, 5584337, 5515292, 4989755, 4159186, 3265741, 2468699, 1784573, 1180124, 665539, 301452, 178067, 397677, 1009355, 1912921, 2853328, 3548435, 3831625, 3695684, 3259106, 2708990, 2207479, 1778652, 1295850, 632694, -166349, -892099, -1340228, -1450345, -1303147, -1044373, -827786, -779958, -968947, -1397001, -2019073, -2750015, -3460671, -4011115, -4315888, -4365246, -4184312, -3815055, -3359593, -2985026, -2810100, -2781115, -2708044, -2442668, -1999243, -1501124, -1051601, -676827, -352720, -38899, 300440, 654635, 926619]
38737I26619M6439k49197m66319n21684m64738l87108l01820j55108O2619K78669
38727a231628M22232M93801N19651M76572L08286O998l47637o19157o72862m48190
38717a091934k4888L97337O33629O35508M70688K28463o290j37888j21296l7820
38707I45509j4021m5894L087J93925M00640M73348M30276L98683M25241M49591
38697C660385M34167M10554L94680L47837K38989P4789j41274m03060o41137p57104
38687C618826p62140q03011r79026j179618j181202q92431m42636k8948K69127
38678b381059N09165P66214J031032J217380J240229J073429P47506L27432q8640
38669D442688l79148m59503l46710j39919O9163K43977L65880L96033L03584J11599
$$ y = [926619, 973058, 723861, 257542, -264142, -728880, -1115988, -1417808, -1572916, -1510297, -1231628, -809396, -315595, 204056, 680628, 988914, 995912, 648275, 29118, -643744, -1091934, -1116822, -719485, -85856, 549652, 1020340, 1248803, 1242513, 1104625, 983329, 945509, 931488, 885594, 888681, 1082606, 1483246, 1956594, 2386870, 2785553, 3210794, 3660385, 4094552, 4505106, 4899786, 5247623, 5486612, 5561401, 5420127, 5017067, 4375930, 3618826, 2856686, 2053675, 1074649, -104969, -1286171, -2178602, -2621238, -2650186, -2381059, -1871894, -1105680, -74648, 1142732, 2382961, 3456390, 4203896, 4531328, 4442688, 4063540, 3604037, 3257327, 3117408, 3186571, 3430548, 3796428, 4192461, 4496045, 4607644]
38659D607644j07147k71015l26110k76924k01429k07108l40046n46186p35987
38650A595692q65438r33777r28812q12657n56836j70307K93110P28398R97480
38641f53147J003595P73865M59669K38301J90763K44002K27253K3959l00749n44904
38631A662607n68242m21366k50089j16976J5160J48559J96856R5077j05325k90565
38621C65696l80674l33460j14650K61835O88781J030833J233317J317048J279960
38612E348686J077708P18057L08358l2232k72633m53266o06313p27864q01918
38603D558583q17750p85298p58565q04667r03673r16664p26452m02412j52843
38594a709741r7588j43522j03141J12328M30130O87561P45855N96990L93375L14188
$$ y = [4607644, 4500497, 4229482, 3903372, 3626448, 3425019, 3217911, 2877865, 2331679, 1595692, 730254, -203523, -1132335, -1944992, -2501828, -2672135, -2379025, -1650627, -653147, 350448, 1124313, 1583982, 1822283, 2013046, 2257048, 2484301, 2508260, 2207511, 1662607, 1094365, 672999, 422910, 305934, 321094, 469653, 666509, 761586, 656261, 365696, -14978, -348438, -463088, -201253, 487528, 1518361, 2751678, 4068726, 5348686, 6426394, 7144451, 7452809, 7420577, 7147944, 6694678, 6088365, 5360501, 4558583, 3740833, 2955535, 2196970, 1392303, 488630, -428034, -1154486, -1556898, -1709741, -1807329, -1950851, -2053992, -1941664, -1511534, -823973, -78118, 518872, 912247, 1226435]
38584A226435L64376L70134K20396L0208k4424L4529K1740j40000l16665l52241
38574A434488k45594r7712J1805L1151r0082l37830n83632o77768n82106l71244
38564a508524j40463L3700Q4544o639j61301k56755k47429j99540j99262k55675
38554b857344k98916k54132j19149J8820N9977J184n8795m7868j7904o9787k13409
38543c857323l62991m54247m94746m93304m10633k13871O1452L31869N19848N74539
38533d799407M84000L02258J37399P4567J16892K18588L50991M97226N92347N27459
38523a497680K59018r3237l00050k07565J29039N01869P22612P22116N18953J72648
38513I27723k03280m51988m74500l13091r0471J20031L18811M93436N76678N12310
$$ y = [1226435, 1590811, 1960945, 2181341, 2211549, 2187125, 2221654, 2243394, 2103394, 1786729, 1434488, 1188894, 1091182, 1102987, 1134138, 1044056, 706226, 122594, -555174, -1137280, -1508524, -1648987, -1615287, -1530743, -1537382, -1698683, -1955438, -2202867, -2402407, -2601669, -2857344, -3156260, -3410392, -3529541, -3510721, -3450744, -3449560, -3508355, -3556223, -3574127, -3643914, -3857323, -4220314, -4674561, -5169307, -5662611, -6073244, -6287115, -6225663, -5893794, -5373946, -4799407, -4315407, -4013149, -3875750, -3801183, -3684291, -3465703, -3114712, -2617486, -2025139, -1497680, -1238662, -1331899, -1631949, -1839514, -1710475, -1208606, -485994, 236122, 755075, 927723, 724443, 272455, -202045, -515136, -605607, -485576, -166765, 326671, 903349, 1415659]
38503A415659L24190J01329o5269j35362j47010j93099l27207m81163n16419l73896
38493c98247j36997P0462K08112L12461M02092M33884L49194J40187j25637l36444
38483I19067m06440l34175j88474l5649J04060K30418L29973L90471M22013M32735
38473A863999L97430K85679J24297K029q917P0402J42208J26161K2869j20905
38463B905252k79985m41810n39435m63807j89593J48854L64542L91113L11140
38454B206271K34381K02699K01875J99771J61187P7617m481k8515n109K829k9993
38443C218532p8038j41294k51794l81590m34591l80312l14161l13421l01475j46046
38433D75810J48676M39898O12421O54613N76755L56783P672l62583o07706o47875
$$ y = [1415659, 1739849, 1841178, 1775909, 1640547, 1493537, 1300438, 973231, 492068, -24351, -398247, -535244, -464782, -256670, 55791, 457883, 891767, 1240961, 1381148, 1255511, 919067, 512627, 178452, -10022, -45671, 58389, 288807, 618780, 1009251, 1431264, 1863999, 2261429, 2547108, 2671405, 2673434, 2664517, 2734919, 2877127, 3003288, 3026157, 2905252, 2625267, 2183457, 1644022, 1180215, 990622, 1139476, 1504018, 1895131, 2206271, 2440652, 2643351, 2845226, 3044997, 3206184, 3283801, 3279320, 3250805, 3245696, 3248525, 3218532, 3140494, 2999200, 2747406, 2365816, 1931225, 1550913, 1236752, 923331, 621856, 475810, 624486, 1064384, 1676805, 2331418, 2908173, 3264956, 3272628, 2910045, 2302339, 1654464]
38423A654464n12680l06469j34008l0670M4479J36924K31569K77463K53423J78335
38413A792830Q2341P362N838Q0008J40451R0857n0852j78756k40398k78942l30616
38402A120123l66629l66861l70307l99194l93769k83489q3972J26762K88931L68901
38392c59504L37103K14707J13247J37117K40404K56578R3372j61743l54391m18940
38382I7950l78529k48676k5366K35307M04423L93538K53250J19410O9856O8035
38372I89198M3589k2436j21912k82362n29186p76952q35663n93840j76161J42687
38362b163038J90420K6208j75176k98481l17462k27470m7756J17366J19387p8228
38352b854230l30052m43277l55619j42968J06216L50359N43162O14621N46027
$$ y = [1654464, 1141784, 835315, 701307, 670637, 715116, 852040, 1083609, 1361072, 1614495, 1792830, 1875171, 1882533, 1888371, 1968379, 2108830, 2199687, 2148835, 1970079, 1729681, 1450739, 1120123, 753494, 386633, 16326, -382868, -776637, -1060126, -1144098, -1017336, -728405, -359504, -22401, 192306, 305553, 442670, 683074, 939652, 1033024, 871281, 516890, 97950, -280579, -529255, -554621, -319314, 85109, 478647, 731897, 851307, 921163, 989198, 1032787, 1010351, 888439, 606077, 76891, -700061, -1535724, -2129564, -2305725, -2163038, -1972618, -1946410, -2121586, -2420067, -2737529, -2964999, -3012755, -2895389, -2776002, -2854230, -3184282, -3627559, -3983178, -4126146, -4019930, -3669571, -3126409, -2511788, -1965761]
38343a965761M13495L11922K63773K38223K31001K77015L91274N35102O42408
38334A338452O56107N45622L19961L2589k39605m28132m93949m49922l79988l99581
38324E01554n50852p45289q43750p83263n92324l03901Q1035N29571R32150J162167
38314f12902J164693R72210O59366L06024j4084k41020l38363l02845j76357m0378
38304A376344L3230M2039M7925R9571J72798K00201J49847N9461p851l2857n4594
38293B086114j08058j59012j32314j4594J07924J44377J03679O4364O2313N6969
38283B211762l372j32473l09257m68278m94138l09167K859K27477K20542L9857
38273I85812j49080k42265k34957j60585p3885o5106k03610m50960o75818p64127
$$ y = [-1965761, -1552266, -1240344, -976571, -738348, -507347, -230332, 160942, 696044, 1338452, 1994559, 2540181, 2860142, 2892731, 2653126, 2224994, 1731045, 1281123, 901135, 501554, -49298, -794587, -1638337, -2421600, -3013924, -3317825, -3236790, -2707219, -1775069, -612902, 551791, 1524001, 2183367, 2489391, 2475307, 2234287, 1895924, 1593079, 1416722, 1376344, 1409574, 1451613, 1499538, 1599109, 1771907, 1972108, 2121955, 2181416, 2173565, 2140708, 2086114, 1978056, 1819044, 1686730, 1672136, 1780060, 1924437, 2028116, 2092480, 2154793, 2211762, 2208390, 2075917, 1766660, 1298382, 804244, 495077, 497936, 725413, 945955, 985812, 836732, 594467, 359510, 198925, 125040, 59934, -143676, -594636, -1270454, -2034581]
38263b034581o85582m63291j31764K54891O04307Q06943P90825N73880K69989
38254a4383J8105j20293j85343k36286k79938l03209l30244l90702m50801m34972
38244b728066l17869j49657J4116J66916L26639M89354O18151O58437N67264L53184
38234a531Q6011j52509l17487l83362l14580j11492J24941K39173J53093p8193
38224g55936l37481n25020n71232m43730j85626Q5465K53079K73775J81389N4450
$$ y = [-2034581, -2720163, -3183454, -3315218, -3060327, -2456020, -1649077, -858252, -284372, -14383, 3722, -116571, -301914, -538200, -818138, -1121347, -1451591, -1842293, -2293094, -2728066, -3045935, -3195592, -3181476, -3014560, -2687921, -2198567, -1580416, -921979, -354715, -1531, 84480, -68029, -385516, -768878, -1083458, -1194950, -1070009, -830836, -677743, -755936, -1093417, -1618437, -2189669, -2633399, -2819025, -2733560, -2480481, -2206706, -2025317, -1970867]
$$ [...]
##END NTUPLES=NMR SPECTRUM
##END=
