##TITLE=31Pdec_39-2021
 H2O, 24 sc
 10.06.2021
##JCAMPDX= 6.0         $$ Bruker NMR JCAMP-DX V2.0
##DATA TYPE= NMR SPECTRUM
##DATA CLASS= NTUPLES
##ORIGIN= UXNMR, Bruker Analytische Messtechnik GmbH
##OWNER= root
$$ XWIN-NMR		Version 3.5
$$ Thu Jun 10 11:07:55 2021 Russian Standard Time (UT+4h)  she@DPX200
##.OBSERVE FREQUENCY= 81.013821
##.OBSERVE NUCLEUS= ^31P
##.ACQUISITION MODE= SIMULTANEOUS
##.ACQUISITION SCHEME= undefined
##.AVERAGES= 24
##.DIGITISER RES= 16
##SPECTROMETER/DATA SYSTEM= spect
##.PULSE SEQUENCE= zgpg30
##.SOLVENT NAME= CDCl3
##.SHIFT REFERENCE= (INTERNAL, CDCl3, 0, 248.564)
##AUDIT TRAIL= $$ (NUMBER, WHEN, WHO, WHERE, WHAT)
$$ ##TITLE= Audit trail, XWIN-NMR		Version 3.5
$$ ##JCAMPDX= 5.01
$$ ##ORIGIN= Bruker BioSpin GmbH
$$ ##OWNER= she
$$ F:/spectra/data/she/nmr/P31/1/pdata/1/auditp.txt
$$ ##AUDIT TRAIL=  $$ (NUMBER, WHEN, WHO, WHERE, WHAT)
(   1,<2021-06-10 11:06:36.85 +0400>,<she>,<DPX200>,
      <created by zg, POWCHK disabled, PULCHK disabled
       configuration hash MD5:
       00 E9 B6 7A A2 85 ED C7 34 08 36 98 17 FE 4E 26
       data hash MD5: 32K
       DD BD 76 F5 27 B9 C8 B7 5B AB 6B E5 FA FC C3 E2>)
(   2,<2021-06-10 11:06:49.23 +0400>,<she>,<DPX200>,
      <Start of raw data processing
       efp BC_mod = 2 LB = 1 FT_mod = 6 PKNL = 1 PHC0 = -5832.169 PHC1 = 3.474823 SI = 64K 
       data hash MD5: 64K
       BD 77 14 90 BF 31 BB 03 77 76 A5 57 23 22 89 25>)
(   3,<2021-06-10 11:07:15.37 +0400>,<she>,<DPX200>,
      <pk PHC0 = -105.0276 PHC1 = 148 
       data hash MD5: 64K
       84 86 B1 FA 90 96 58 F0 44 DE D7 4E B3 44 EB 97>)
(   4,<2021-06-10 11:07:19.43 +0400>,<she>,<DPX200>,
      <abs ABSG = 5 
       data hash MD5: 64K
       0B 09 A3 6B BF E5 5C AA DE 4C FB A8 D5 50 50 19>)
$$ ##END=
$$ 
$$ hash MD5
$$ 15 64 12 CA E0 07 E9 B0 27 9E 08 B5 DA B7 41 B8
##$RELAX= 
##$RELAX= 
##$RELAX= 
##$RELAX= 
##$RELAX= 
##$RELAX= 
##$RELAX= 
##$RELAX= 
$$ Bruker specific parameters
$$ --------------------------
##$DU= <F:/spectra>
##$EXPNO= 1
##$NAME= <P31>
##$PROCNO= 1
##$TYPE= <nmr>
##$USER= <she>
##$AMP= (0..31)
100 100 100 100 100 100 100 100 100 100 100 100 100 100 100 100 100 100 
100 100 100 100 100 100 100 100 100 100 100 100 100 100 
##$AQSEQ= 0
##$AQ_mod= 1
##$AUNM= <au_zg>
##$AUTOPOS= <>
##$BF1= 81.014009
##$BF2= 200.13
##$BF3= 200.13
##$BF4= 200.13
##$BF5= 200.13
##$BF6= 200.13
##$BF7= 200.13
##$BF8= 200.13
##$BYTORDA= 1
##$CFDGTYP= 0
##$CFRGTYP= 5
##$CHEMSTR= <none>
##$CNST= (0..31)
1 1 145 1 1 1 1 1 1 1 1 1 1 1 1 1 1 1 1 1 1 1 1 1 1 1 1 1 1 1 1 1 
##$CPDPRG= <waltz16>
##$CPDPRG1= <>
##$CPDPRG2= <waltz16>
##$CPDPRG3= <>
##$CPDPRG4= <mlev>
##$CPDPRG5= <mlev>
##$CPDPRG6= <mlev>
##$CPDPRG7= <mlev>
##$CPDPRG8= <mlev>
##$CPDPRGB= <>
##$CPDPRGT= <>
##$D= (0..31)
0 1 0 0 0 0 0 0 0 0 0 0.03 2e-05 3e-06 0 0 0 0 0 0 0 0 0 0 0 0 0 0 0 0 
0 0 
##$DATE= 1623308796
##$DBL= (0..7)
120 120 120 11 120 120 24 19 
##$DBP= (0..7)
150 150 150 150 150 150 150 150 
##$DBP07= 0
##$DBPNAM0= <>
##$DBPNAM1= <>
##$DBPNAM2= <>
$$ [...]
##$SUBNAM3= <"">
##$SUBNAM4= <"">
##$SUBNAM5= <"">
##$SUBNAM6= <"">
##$SUBNAM7= <"">
##$SUBNAM8= <"">
##$SUBNAM9= <"">
##$SW= 501.771253377433
##$SWIBOX= (0..15)
0 1 3 0 0 0 0 0 0 0 0 0 0 0 0 0 
##$SW_h= 40650.406504065
##$TD= 32768
##$TD0= 1
##$TE= 0
##$TE2= 300
##$TE3= 300
##$TEG= 300
##$TL= (0..7)
0 120 53 12 22 120 120 120 
##$TP= (0..7)
150 150 150 150 150 150 150 150 
##$TP07= 0
##$TPNAME0= <>
##$TPNAME1= <>
##$TPNAME2= <>
##$TPNAME3= <>
##$TPNAME4= <>
##$TPNAME5= <>
##$TPNAME6= <>
##$TPNAME7= <>
##$TPOAL= (0..7)
0.5 0.5 0.5 0.5 0.5 0.5 0.5 0.5 
##$TPOFFS= (0..7)
0 0 0 0 0 0 0 0 
##$TUNHIN= 0
##$TUNHOUT= 0
##$TUNXOUT= 0
##$USERA1= <user>
##$USERA2= <user>
##$USERA3= <user>
##$USERA4= <user>
##$USERA5= <user>
##$V9= 5
##$VALIST= <valist>
##$VCLIST= <CCCCCCCCCCCCCCC>
##$VD= 0
##$VDLIST= <DDDDDDDDDDDDDDD>
##$VPLIST= <PPPPPPPPPPPPPPP>
##$VTLIST= <TTTTTTTTTTTTTTT>
##$WBST= 1024
##$WBSW= 4
##$XGAIN= (0..3)
0 0 0 0 
##$XL= 0
##$YL= 0
##$YMAX_a= 1161
##$YMIN_a= -1564
##$ZGOPTNS= <>
##$ZL1= 120
##$ZL2= 120
##$ZL3= 120
##$ZL4= 120
##$ABSF1= 248.5645
##$ABSF2= -253.2056
##$ABSG= 5
##$ABSL= 3
##$ALPHA= 0
##$AQORDER= 0
##$ASSFAC= 0
##$ASSFACI= 0
##$ASSFACX= 0
##$ASSWID= 0
##$AUNMP= <proc_1d>
##$AZFE= 0.1
##$AZFW= 0.5
##$BCFW= 0
##$BC_mod= 2
##$BYTORDP= 0
##$COROFFS= 0
##$CY= -3
##$DATMOD= 1
##$DC= 0
##$DFILT= <>
##$DTYPP= 0
##$F1P= 0
##$F2P= 0
##$FCOR= 1
##$FTSIZE= 65536
##$FT_mod= 6
##$GAMMA= 0
##$GB= 0
##$INTBC= 1
##$INTSCL= 5.30512e-09
##$ISEN= 30
##$LB= 1
##$LEV0= 0
##$LPBIN= 0
##$MAXI= 10000
##$MC2= 0
##$MEAN= 0
##$ME_mod= 0
##$MI= 50
##$NCOEF= 0
##$NC_proc= -8
##$NLEV= 6
##$NOISF1= 182.463
##$NOISF2= 159.3651
##$NSP= 0
##$NTH_PI= 0
##$NZP= 0
##$OFFSET= 248.5645
##$PC= 4
##$PHC0= -5937.197
##$PHC1= 151.4748
##$PH_mod= 1
##$PKNL= yes
##$PPARMOD= 0
##$PSCAL= 0
##$PSIGN= 0
##$REVERSE= no
##$SF= 81.014009
##$SI= 65536
##$SIGF1= 159.3651
##$SIGF2= -187.1042
##$SINO= 113.3802
##$SIOLD= 16384
##$SREGLST= <1H.CDCl3>
##$SSB= 0
##$STSI= 65536
##$STSR= 0
##$SW_p= 40650.406504065
##$SYMM= 0
##$S_DEV= 0
##$TDeff= 32768
##$TDoff= 0
##$TI= <>
##$TILT= no
##$TM1= 0
##$TM2= 0
##$TOPLEV= 0
##$USERP1= <user>
##$USERP2= <user>
##$USERP3= <user>
##$USERP4= <user>
##$USERP5= <user>
##$WDW= 1
##$XDIM= 65536
##$YMAX_p= 334766925
##$YMIN_p= -19007502
$$ End of Bruker specific parameters
$$ ---------------------------------
##NTUPLES= NMR SPECTRUM
##VAR_NAME=  FREQUENCY,     SPECTRUM/REAL,   SPECTRUM/IMAG
##SYMBOL=    X,             R,               I
##VAR_TYPE=  INDEPENDENT,   DEPENDENT,       DEPENDENT
##VAR_FORM=  AFFN,          ASDF,            ASDF
##VAR_DIM=   65536,         65536,           65536
##UNITS=     HZ,            ARBITRARY UNITS, ARBITRARY UNITS
##FACTOR=    0.620285442955139, 1,           1
##FIRST=     20137.2065510759, 0,            0
##LAST=      -20513.1999529892, 0,           0
##MIN=       -20513.1999529892, -19007502,   0
##MAX=       20137.2065510759, 334766925,    0
$$ Real data points
##PAGE= N=1
##DATA TABLE= (X++(R..R)), XYDATA
$$ [...]
35601F69408K114043K917493L57962m752034n764921o04647L605980J996786j93727
35592C46343K126522M138254M1994n510779m693677L03414J564183j061961j125979
35583c871686K196376L239991M42644j453482j36020J290468P43283j75229m09171
35574A867174m42708O51122L405725M257269r558n329691m924880J03654K310841
35565A888948m03587k628033j211173R34864J742232K659529L047378q219m423916
35556A598023l853385J785175M604349O77298m244586m500392k096905l76642
35548f407065J913486N108802M789719m98417m452004k270043J597255J521486
35540A303219J29524K037957M050876O29220n165972n727539j249542J323110
$$ y = [669408, 2783451, 5700944, 6058906, 1306872, -4458049, -5062696, -1456716, 540070, 346343, 2472865, 6611119, 6653113, 1142334, -3551343, -3247929, -1683746, -2745707, -3871686, -1675310, 1564681, 2007325, 553843, 417823, 1708291, 2451574, 2276345, 1867174, 1424466, 2075588, 5481313, 9738582, 9729024, 4399333, -525547, -421893, 1888948, 1485361, -1142672, -2353845, -1418981, 323251, 2982780, 6030158, 6021939, 1598023, -2255362, -470187, 4134162, 4811460, 566874, -3933518, -6030423, -6407065, -4493579, 615223, 5404942, 4906525, 454521, -1815522, -218267, 1303219, 1432743, 3470700, 7521576, 8150796, 2984824, -2742715, -3992257, -2669147]
35532b669147K51427O06220L836909M632311J95141m590102m241362J90739L775507
35523A987643L858345J517885o04839p36152K23374l53817k643144l137255o9170
35514D2870K731082J233404k247063k740771n72017l0898j760780k537860j708044
35505g590077j562476j622789R50132M845976N073358J155798j491569k22205
35497d63852J043863o74461k140874O1385L290439L227439P40268l42417L45810
35488E087600J91038j094313j145753M72106J212143l66495k361654k491758j305066
35479a802152r41898j761874j962453n39847J115757J526533J410496J774508
35471a180930J206688j787217m581509k889192K192655M502957J747368j115355
$$ y = [-2669147, -2417720, -1811500, 2025409, 6657720, 6852861, 2262759, -1978603, -1787864, 1987643, 5845988, 7363873, 6759034, 6022882, 6246256, 5892439, 3249295, 112040, 42870, 2773952, 4007356, 1760293, -980478, -1552495, -1583393, -3344173, -5882033, -7590077, -9152553, -10775342, -9825210, -4979234, 94124, 1249922, -241647, -463852, 580011, -94450, -2235324, -2173939, 1116500, 4343939, 5084207, 4741790, 5087600, 5278638, 4184325, 3038572, 3510678, 4722821, 4356326, 1994672, -497086, -1802152, -2744050, -4505924, -6468377, -7008224, -5892467, -4365934, -2955438, -1180930, 25758, -1761459, -6342968, -9232160, -7039505, -2536548, -789180, -1904535]
35463a904535j06166J669007K89765j887605r74260J096726M44975j144609L92086
35454b124616L151791K032712j948371k819234N87244L352724K721434P96767
35446E750451p08200j731314n38515L758403O252886J756923n457203o348127
35438B735304j297793M90000l377567m712276N12363N074706L225514l1714J058834
35429C677371L050823Q68833k672505k868282j776875k910942l465699Q299L699585
35420b389392K580781n68914m75512R79798q10538l302612r01195M035976M074478
35411C222870r83203m000196k131171K45793L62487N43328J941207K227972Q81468
35402B310555L37590P58709l29180k319993j549102J843527L081043M01122k049810
$$ y = [-1904535, -2010701, -341694, -51929, -1939534, -2913794, -1817068, -1372093, -2516702, -2124616, 1027175, 3059887, 1111516, -1707718, -1120474, 2232250, 4953684, 5750451, 5042251, 3310937, 2772422, 6530825, 12783711, 14540634, 9083431, 2735304, 1437511, 1927511, -1450056, -6162332, -5649969, -575263, 2650251, 2618537, 3677371, 6728194, 7597027, 4924522, 2056240, 279365, -2631577, -6097276, -6088977, -2389392, 191389, -377525, -853037, 126761, -683777, -3986389, -4887584, -851608, 3222870, 2239667, -1760529, -3891700, -3645907, -3283420, -2740092, -798885, 1429087, 2310555, 2648145, 3406854, 3077674, 757681, -791421, 1052106, 4133149, 4534271, 2484461]
35393B484461j002329J228711J140930r39947k459162k095765n2778K496439L504967
35384D305527K041722N800p76291j824205m594623n705155j250263N095403N300506
35375B598421q87442m309128L92508O635499N521874j547774n618874k725142
35367E9942K014203K333320j615249m730338l517713L69247K675650J684670j78091
35358i04359j74463R34413O35868j070526j832364q93355J627j30786q4448R18544
35348b599849J502886K58858j893863k586787o23534K727139M806021M153813
35340E744684K074108P15002j44815k241570m651373l955183k3498K293768Q1048
35331a07829k775232j517206J999311K576777r1516j850457j181641m33301p22422
$$ y = [2484461, 1482132, 2710843, 3851773, 2911826, 452664, -1643101, -1695879, 800560, 4305527, 6347249, 6353049, 5576758, 3752553, -842070, -6547225, -7797488, -2702085, 2598421, 1710979, -2598149, -2205641, 4429858, 9951732, 8403958, 2785084, 59942, 2074145, 4407465, 2792216, -1938122, -5455835, -5086588, -2410938, -726268, -904359, -1078822, -144409, 491459, -579067, -2411431, -3304786, -3303159, -3433945, -3518393, -2599849, -1096963, -838105, -2731968, -5318755, -5942289, -3215150, 1590871, 5744684, 7818792, 8533794, 8388979, 6147409, 1496036, -2459147, -2482645, -188877, -107829, -2883061, -4400267, -2400956, 175821, 84305, -1766152, -2947793, -3381094, -4103516]
35322d103516p24340j94935o1362M40644K116274K325150j482844n613395l848825
35313a1147149K581026N508680J573527l226078l058849L7349J440139J257251
35305e034104J827861K290314P01785j271551o82936J278545O58251k995678n545274
35296h772787l924939p5944J952442J174488K92090J391543K792354J750958o61334
35287d081129m15849L115900N229047K579738j477205j747071J213901K625009
35279G042341Q41454j341662j796307j161864l34162L19501j66703j786743k046946
35270d31091L08174J909947l77809l309970j682383K703328L226367r33420l531637
35261b118494j335990J527888J149836n09312j01765K008488L514325L051382
$$ y = [-4103516, -4827856, -5022791, -5084153, -4643509, -2527235, -202085, -1684929, -7298324, -11147149, -8566123, -3057443, -1483916, -4709994, -7768843, -7731494, -6291355, -5034104, -3206243, -915929, -214144, -1485695, -2168631, -890086, -231835, -3227513, -8772787, -12697726, -12773670, -10821228, -9646740, -9354650, -7963107, -5170753, -3419795, -4081129, -4496978, -1381078, 3847969, 6427707, 4950502, 3203431, 4417332, 7042341, 7883795, 6542133, 4745826, 3583962, 3249800, 3569301, 3402598, 1615855, -431091, -122917, 1787030, 1409221, -1900749, -3583132, -879804, 2346563, 1413143, -2118494, -3454484, -1926596, -776760, -1286072, -1387837, 620651, 4134976, 7186358]
35253G186358L8989m406388o175933k531713K460494K526694j199956k032603
35245d134058R66808J932198n35511n63517L572076M963532J2865m250666j526157
35236D37570L015243J424588l893254m690511k51711K711501J245065r82425j213798
35227b197732r63368j562200j821131q25205O97934J943560K358479J221764r34858
35218b082757k051014j547878j205705j261228P78005M852225O125760J869500
35210E476908l363474m039227j649315j190669k508039j186423L235978N826705
35202F02444L421848j172707l193060j406559J290554J516863o08392j350429
35194h99438J560806M823186L771178j82616j349425R54917J357375j887873l426099
$$ y = [7186358, 7225347, 2818959, -3356974, -5888687, -3428193, -901499, -2101455, -4134058, -3167250, -1235052, -1770563, -2334080, 1237996, 6201528, 6214393, 1963727, 437570, 3452813, 4877401, 984147, -3706364, -3958075, -1246574, -1509, -983934, -2197732, -3161100, -4723300, -6544431, -7369636, -6671702, -4728142, -2369663, -1147899, -2082757, -4133771, -5681649, -6887354, -8148582, -7370577, -2518352, 3607408, 5476908, 2113434, -1925793, -3575108, -4765777, -7273816, -8460239, -5224261, 602444, 4024292, 2851585, -341475, -1748034, -457480, 1059383, 450991, -899438, 661368, 5484554, 9255732, 9073116, 7723691, 8678608, 10035983, 8148110, 4722011]
35185D722011k37746K700099R02824k216263k141693j141172k647199l497121
35177c556260L88257N127700M086269j191134l481915j120191J157642R83557
35169B393925K89091m75855k563500l836684o95928M690108N798763J174583l503194
35160C271309l753186j400862j56171n74655q56748L82691K831939M114178J702680
35151E561175k966461m774654j820592J372952Q76829n59820J044261L626460
35143B360150K900114k45613k162564k828891l752156l176101J22308K180486
35135d602267L9934j746334J248253L999537Q2344n410794k794355N216818O525575
35126B558711j021647o669638m347773j46837O51618J405099M466437N241602
$$ y = [4722011, 4484265, 7184364, 8087188, 5870925, 3729232, 2588060, -59139, -3556260, -3168003, 1959697, 6045966, 4854832, 1372917, 252726, 1410368, 2393925, 2683016, 2207161, -356339, -4193023, -4888951, -198843, 5599920, 6774503, 3271309, -481877, -1882739, -2038910, -2613565, -3470313, -3087622, -255683, 3858495, 5561175, 2594714, -2179940, -4000532, -2627580, -1750751, -2310571, -1266310, 2360150, 5260264, 5014651, 2852087, 23196, -3728960, -6905061, -6782753, -4602267, -4562333, -6308667, -5060414, -1060877, -978533, -6389327, -9183682, -3966864, 2558711, 1537064, -5132574, -9480347, -9627184, -8975566, -7570467, -3104030, 2137572]
35118B137572J559308j035240Q19485K215551m52764k657657o24863J408517m61458
35109B908451k105675O73753L586802J117380l621277m212916j229696M31823
35101b451355L57181J351411K739862J946662J75254K88458J320760N77454j210102
35092E095585j831224j988260k890192k456453R65118L947384K326757k172411
35084I96304m482313k987977N50399M806252P932553O258834n29373n996740m676722
35075A871217l79525l77912l839616l567388J856904N593076L101310j754295
35067B503771l374606j713724n7132M60607R40153J555308J070789r39721k760664
35058b315219j924765J650822M388510K771113j555120l224280m99562K406087
$$ y = [2137572, 3696880, 2661640, 3481125, 5696676, 5243912, 2586255, 1961392, 3369909, 2908451, 802776, 1476529, 5063331, 6180711, 2559434, -1653482, -2883178, -2451355, -2094174, -742763, 1997099, 3943761, 4119015, 4407473, 5728233, 6305687, 5095585, 3264361, 1276101, -1614091, -4070544, -3105426, 841958, 3168715, 996304, -3486009, -6473986, -5923587, -1117335, 6815218, 13074052, 12544679, 6547939, 1871217, 1491692, 1113780, -2725836, -6293224, -4436320, 1156756, 4258066, 2503771, -870835, -2584559, -2641691, -2181084, -1240931, 314377, 1385166, 445445, -2315219, -4239984, -2589162, 1799348, 4570461, 3015341, -208939, -708501, 1697586]
35050A697586K053840O70431J332975K361313Q13629j719033j836527n25301j383195
35041C465718m071425m710909k226269M40958J337904J453288J553311R80827
35033a776597J3007N4819J068273J596523J336150R93828j897k541180m810129
35024d067203l593410R51510M734672M675777J890188o57614j603493j538879
35016G91548j446966j542262j076707O33782K682613L030312J144148j080437
35008C136031j844706j417561p70889q2066M13628J05891m13460L01257J679021
34999A107146J350476p07052j527288J5408J527556J823715K711807L774747R15892
34990A0992407n999696r619145m748324L139792N390850K198055P4592O38636
$$ y = [1697586, 3751426, 4421857, 5754832, 8116145, 8929774, 7210741, 5374214, 4848913, 3465718, -605707, -5316616, -7542885, -7101927, -5764023, -4310735, -2757424, -1776597, -1763590, -1708771, -640498, 956025, 2292175, 3286003, 3284106, 742926, -4067203, -7660613, -6709103, -1974431, 2701346, 4591534, 3933920, 2330427, 791548, -655418, -2197680, -3274387, -2640605, 42008, 3072320, 4216468, 3136031, 1291325, -126236, -897125, -979191, -565563, -459672, -873132, -571875, 1107146, 2457622, 1750570, 223282, 238690, 1766246, 3589961, 6301768, 10076515, 10992407, 4992711, -4626434, -9374758, -6234966, -844116, 1353939, 1428531, 2067167]
34982B067167P1789k082974k049023N37524J931255J575439K599422M363127K323742
34973A1337468l030121m957552r87913K748561J506696p77493P37352K942505
34965I519503L54998m765108n300161l53018L578472K459801m64560j205818j080483
34956B743626l040750n544233m454441J63567L493816K843064J097658J234033
34948a463660J184210j781427m516752j898464L859783M992810J71076l037111
34940b489535m36138K273001K59480j332935L169847Q334036N472427k572346
34932A2677837n640834k552571j377119m181150l900767J798036N510978K957488
34924E291898J20079K040619L931425J97029n442662o135146k220357J451015
$$ y = [2067167, 2138956, 55982, -1993041, -1455517, 475738, 2051177, 4650599, 9013726, 11337468, 8307347, 3349795, 2361882, 5110443, 6617139, 5839646, 6576998, 9519503, 9874501, 5109393, -190768, -543786, 3034686, 5494487, 5029927, 3824109, 2743626, -297124, -5841357, -10295798, -10132231, -6638415, -3795351, -2697693, -1463660, -279450, -2060877, -6577629, -8476093, -4616310, 376500, 547576, -2489535, -2925673, -652672, -393192, -1726127, 1443720, 9777756, 15250183, 12677837, 7037003, 4484432, 3107313, -1073837, -4974604, -3176568, 2334410, 5291898, 5411977, 7452596, 11384021, 11581050, 6138388, 3242, -2217115, -766100]
34916g66100L415789M392269K964902j017512l008077k01578K580395N9477m325923
34907D093642l801361L45933J012146k607750l596899J352417O504458N325693
34899H628279r10533n425821l991878J123084L950361J141085m081625n562469
34891e129517k039752J758456K635022K705978L415792J794904k841141m488451
34883b188709O82704O130562L541979m242669p620425m623124j411832k85663
34875a0017177K283132N815979M938288O5393j457265K080095L143299j830057
34867E021687n477984j775330L644636K941801j468379k284779M72699J380038
34859B454389k07466n06846N95595j85172k520454k864642r82410K90902Q25460
$$ y = [-766100, 2649689, 7041958, 10006860, 8989348, 5981271, 5779693, 8360088, 8419565, 4093642, 292281, 638214, 1650360, -957390, -4554289, -3201872, 3302586, 8628279, 7717746, 2291925, -1699953, -576869, 3373492, 4514577, 432952, -5129517, -7169269, -5410813, -2775791, -69813, 3345979, 5140883, 2299742, -2188709, -1506005, 4624557, 8166536, 3923867, -3696558, -8319682, -9731514, -10017177, -7734045, -1918066, 3020222, 3085615, 1628350, 3708445, 6851744, 5021687, -456297, -2231627, 1413009, 4354810, 2886431, 601652, 1074351, 2454389, 2246923, 1740077, 2335672, 2150500, -369954, -3234596, -4217006, -3926104, -3100644]
34850c100644K481399L620163R19934l779609n061793k371019k57575O3509K154888
34841e330747O016832N879043m22290o347727n298528N90263M726178N018428
34833D831452L888277K535491J80244k673458m433307m947203m726216k913307
34825h258027R40895M331490M230642J375496o50842j20460J389730J639478k21198
34816D657204l333666m940504k026491M333501P997743M604592j883981l731225
34808E677173J8242K536281m45545m662828m373266o60354J643138J907036L032953
34799D672830M508960K433719k924324n622026k675422R59057J12072k174991
34791g10125K44686N759970O497221N83272m526468l284802K05594o5261k423851
$$ y = [-3100644, -619245, 3000918, 3920852, 141243, -4920550, -7291569, -7549144, -7485635, -5330747, 686085, 6565128, 6142838, -204889, -5503417, -4913154, -186976, 4831452, 8719729, 11255220, 11435464, 8762006, 4328699, -618504, -5344720, -8258027, -7317132, -2985642, 1245000, 2620496, 1969654, 1849194, 3238924, 4878402, 4657204, 1323538, -3616966, -5643457, -1309956, 6687787, 11292379, 9408398, 5677173, 5695415, 8231696, 7786151, 3123323, -1249943, -1910297, -267159, 1639877, 4672830, 9181790, 11615509, 8691185, 3069159, 393737, 1352794, 1464866, -710125, -465439, 5294531, 11791752, 12375024, 7848556, 4563754, 4769348, 4704087, 2280236]
34782B280236j756765R56956P58414j892856j702546J727051K478829j763609
34774A085710n344746l227959J727372L793090K210237J61656o06378n11856j96080
34765i08954p42535l117981n150274k645681L856164P631212M619549m39282j074060
34756B028158J684904K393108J21575j700327j957862k205555j989460J27214
34748a498245K062460P42791j849433j304875J391082J343086j374225j712175
34740b199534R42060J236955k334776l947784k00993L819023K861502l18361o05831
34731g47739Q38469j18452k423421j720310J642421K916684P41855j026950J03601
34722B06158J552033J47678k971631m127682k197767L2119l46555k349942k196365
$$ y = [2280236, 523471, 1480427, 2238841, 345985, -1356561, 370490, 2849319, 1085710, -4259036, -7486995, -5759623, -1966533, 243704, 405360, -201018, -712874, -908954, -1651489, -4769470, -9919744, -12565425, -8709261, -1078049, 3541500, 3102218, 2028158, 3713062, 6106170, 6227745, 4527418, 2569556, 364001, -1625459, -1498245, 564215, 1307006, -542427, -1847302, -456220, 886866, -487359, -2199534, -1257474, -20519, -2355295, -6303079, -6504072, -2685049, 176453, -141908, -747739, 90730, -27722, -2451143, -4171453, -2529032, 387652, 1129507, 102557, 206158, 1758191, 1905869, -1065762, -5193444, -7391211, -7359092, -7705647, -10055589, -12251954]
34713a2251954J277997M239384K891438q25012j962702K3342J065246l10631p54195
34704f607087J528007L362361K228803O10618J272731K261719O51297k049043
34696C259406k544721j254996q91664j480021q71817J141030K772608L140614
34688C270439K368803L81877j779169j577238J245751K954416R36586k245795
34680E555670l274309l179072l800603k836274J885380O212051M516964j138311
34672C941496l781822k306526j824504l557451k873594J120157K626210p75244
34664g431278k949871Q76529N767338N014173J065366Q62515L682529K325981
34656I213282m118373p271750j867176N607845N604977j162629n051748j075539
$$ y = [-12251954, -10973957, -6734573, -3843135, -4668147, -6630849, -6607507, -5542261, -5852892, -6607087, -5079080, -1716719, 512084, 1122702, 2395433, 4657152, 5308449, 3259406, 714685, -540311, -1431975, -2911996, -3783813, -2642783, 129825, 3270439, 5639242, 6021119, 4241950, 2664712, 3910463, 6864879, 7801465, 5555670, 2281361, -897711, -4698314, -7534588, -5649208, 562843, 5079807, 3941496, 159674, -2146852, -3971356, -7528807, -10402401, -9282244, -6656034, -7431278, -10381149, -9504620, -3737282, 1276891, 2342257, 3204772, 6887301, 9213282, 5094909, -2176841, -4044017, 1563828, 7168805, 6006176, 954428, -121111]
34648a21111M750151M491510r44659m297108k668370l12165p47075j772211p19509
34639b340547L12818j257084k705928q0037M100489L581921j561193m159790o56621
34630d765972L583061K737523r21623j439902J521174L084776J127743j324929
34622C601851j658921j218099k044605l302314k885136o79471J669596L157927
34614c359172L804283L203795P07613k548221l596641j040949K479814L012773
34606B663295J72968k573613k608300j047767k95767q59244j799638k394798j890049
34597a0632913M83365L513516M006211R36807k224575j811771J098766K767404
34589a863190K140481R43944j00505j450252k050875l61310K255256K819887J246451
$$ y = [-121111, 4629040, 9120550, 8175891, 3878783, 1210413, 898248, 151173, -1621038, -2340547, -2027729, -3284813, -5990741, -6070778, -1970289, 1611632, 50439, -4109351, -4765972, -1182911, 1554612, 632989, -806913, 714261, 3799037, 4926780, 3601851, 1942930, 724831, -1319774, -4622088, -7507224, -8186695, -6517099, -3359172, 445111, 3648906, 4356519, 1808298, -1788343, -2829292, -349478, 2663295, 2836263, 262650, -2345650, -3393417, -3689184, -4548428, -6348066, -8742864, -10632913, -10149548, -6636032, -2629821, -1693014, -3917589, -5729360, -4630594, -1863190, 277291, 1221235, 1120730, -329522, -2380397, -2741707, -486451, 2333436, 3579887]
34580C579887Q9296J74484K22185L15209J428595J846637r76238m875952m859749
34571c055646j207748N02224j055910m45848M404419O977231K403844l598818
34563D923748l155695J429063K081479j662370k964467j38946Q52375k392820
34555a027633m077294l01026L834246K424829j649024j544639K677489M502968
34547D839916J061990l042002k786022O45107K225633j66175l424018l339403
34539c984974M9747K245089m911l971432m100378N10338M890868N055854K553861
34530C244062N88507o21569j836073j728171L03524J240493j084110l188944r49702
34521d031983K790837K122228j716298j751698K779361M463023J61737l173244
$$ y = [3579887, 3669183, 3843667, 4065852, 4381061, 5809656, 7656293, 6680055, 1804103, -3055646, -4263394, -3761170, -4817080, -5262928, -858509, 6118722, 8522566, 4923748, 1768053, 3197116, 5278595, 3616225, 651758, 512812, 1365187, -1027633, -5104927, -5405953, -1571707, 853122, -795902, -2340541, 336948, 4839916, 5901906, 2859904, 73882, 718989, 2944622, 2778447, -645571, -3984974, -3935227, -1690138, -1695049, -5666481, -9766859, -9256521, -4365653, 690201, 3244062, 3832569, 3211000, 1374927, -353244, -49720, 1190773, 106663, -3082281, -4031983, -1241146, 881082, -835216, -2586914, 192447, 4655470, 4817207, 1643963]
34513A643963K6590M367194K223665l940717n956534k523318Q71349J936917L103330
34504A752439M380515K909754m08418j366859K1752m14983k815752k544526J048763
34495B562685K616026j63283k686773j573212J3990j157226k773308k044175r24922
34486f130198j793240k596550p24603K278322L769970L947623L424786J149327
34478C325437k032854k479687J88801J297663j032985k145711P17143K754156
34470E91963O3960k678459n7633M269757L562601q84348k843305j435581j29880
34461D59075P97565K462983J876266k836302n628792q60314N376986L531178l118090
34452B060555l512620J885455J902281m726438n837744K919369R139376L459121
$$ y = [1643963, 1670553, 6037747, 8261412, 4320695, -1635839, -4159157, -3287808, -1350891, 1752439, 6132954, 9042708, 8634290, 7267431, 7289183, 6874200, 4058448, 1513922, 2562685, 5178711, 5015428, 2328655, 755443, 769433, -387793, -3161101, -5205276, -6130198, -7923438, -10519988, -11244591, -8966269, -5196299, -1248676, 2176110, 3325437, 1292583, -1187104, -998303, 299360, -733625, -2879336, -2162193, 591963, 655923, -2022536, -2080169, 2189588, 5752189, 4867841, 2024536, 588955, 459075, 1256640, 3719623, 5595889, 2759587, -2869205, -3729519, 1647467, 5178645, 2060555, -1452065, 433390, 2335671, -2390767, -8228511, -5309142, 3830234, 7289355]
34444G289355n617622o352696j364978N36914J61035L003419N983757K467514
34436F106698m107200m623858L04401J810187j461541j601717L517351N621701
34428E566022J59565n560931m123571N75771P98722k340755j845939K858578M931307
34419A018769J070922l709011m030517j270714L15168L25934Q82722J343046m90890
34410d544571k777694q22813N032799P979594M010440j900875k973153k32245
34402C771482L52191k251352l473330j529510Q5741o01085p47650J582703L430429
34393F19619J742807j562789k552785p09142J432083K194321J887522J301144
34385D352780Q90048O36920j24061j710514k771729j602192J144637K914327K423605
$$ y = [7289355, 1671733, -4680963, -6045941, -5509027, -5347992, -2344573, 3639184, 6106698, 1999498, -2624360, -2319959, -509772, -1971313, -3573030, -55679, 5566022, 5725587, 164656, -3958915, -3383144, -2584422, -4925177, -6771116, -3912538, 1018769, 2089691, -1619320, -5649837, -6920551, -6605383, -6279449, -5396727, -4053681, -4544571, -7322265, -8145078, -3112279, 4867315, 8877755, 6976880, 4003727, 3771482, 4123673, 1872321, -1601009, -3130519, -3044778, -3645863, -4393513, -2810810, 619619, 2362426, 799637, -1753148, -2462290, -1030207, 1164114, 3051636, 4352780, 5242828, 5879748, 5755687, 4045173, 1273444, -328748, 815889, 3730216, 6153821]
34376F153821N19745j683579l281965k901457l44369J715124P87155j327361r72272
34367a335158J435815J947880o02414l009284k745367p08969J414239K839445
34359g63813K602276M15609j601913j628392j542084l443336m616025j610811
34351a2188489K452493J877667j383059n6431N645976P092813J319544l522435
34343A238079r50886M294256M885769J573216q74246j974366l285676l064870
34335A841276L07242L458050K369679j546541m331716n009705m235546j512041
34327h659302K046224K479604j016001l105984Q8780M642697M796999J164418
34319B437435j853876k886935k988387j978405q4205L45369j069841r02085K034024
$$ y = [6153821, 6673566, 4989987, 1708022, -1193435, -1537804, 177320, 964475, -362886, -1335158, 100657, 2048537, 1446123, -1563161, -4308528, -5017497, -3603258, -763813, 1838463, 2254072, 652159, -976233, -2518317, -5961653, -10577678, -12188489, -9735996, -7858329, -9241388, -9297819, -3651843, 3440970, 4760514, 1238079, 287193, 4581449, 9467218, 11040434, 10166188, 8191822, 4906146, 1841276, 2148518, 5606568, 7976247, 6429706, 2097990, -2911715, -7147261, -8659302, -6613078, -4133474, -5149475, -8255459, -8166679, -3523982, 1273017, 2437435, 583559, -2303376, -5291763, -7270168, -7354373, -7009004, -8078845, -8980930, -6946906]
34310f946906L617913J455558o11868L55107J018590r64947j154375L225336N890295
34301E884703J199998m809654l135631L235141M173354q93691k913337J018837
34293C759720L412448m46991n129279m271347L98438L014215J426114j850286
34285C13032l183040q37819L162674M425744J697659q67990J49601K019547O24437
34276G503845k640577l738099k693493j954551r38437J931069M285615K818494
34268D573866r39825l162633l439720l017590r76306K476013L302082J68164j504242
34259b520191J335857K588195k241949n627906M68594Q964190P104880k794925
34251G276745o972471k241109J328222n33775q39240K829043L016459k397485
$$ y = [-6946906, -3328993, -1873435, -2485303, -2130196, -1111606, -2076553, -3230928, -5592, 5884703, 7084701, 2275047, -860584, 2374557, 6547911, 5654220, 2740883, 3759720, 7172168, 6725177, 1595898, -2675449, -2277011, 737204, 2163318, 313032, -2870008, -3707827, -545153, 3880591, 5578250, 4710260, 4859861, 6879408, 7503845, 4863268, 1125169, -1568324, -3522875, -4461312, -2530243, 1755372, 4573866, 3634041, 471408, -2968312, -5985902, -6962208, -4486195, -1184113, -1015949, -2520191, -1184334, 1403861, -838088, -6465994, -5997400, 2966790, 10071670, 7276745, 304274, -1936835, -608613, -1142388, -1981628, 847415, 3863874, 1466389]
34243A466389m427069J170950N472182J382794m519350l468757J995895M498008
34235C571042L469955K096434k50357m551166p045912m866755j713842j704200
34227a0994801k556258n92131K484047L337047K847750L118270L063541J472565
34219B180030M8572l56407j673519l593237k415306J738056L134996k09210k352498
34210c498523P58450M360811L172140k14544j261928j388267l356637m514698
34202e943196j530677K848931M137254K903890J685868j48442l015639l751961
34194b813972j253972r8338k736252l939060M85272N483232M709921J011380P50748
34185A598959K755034J792465j118764j065773J244723J207308r77489j706419
$$ y = [1466389, -2960680, -1789730, 3682452, 5065246, 545896, -2922861, -926966, 3571042, 7040997, 9137431, 8887074, 4335908, -2710004, -7576759, -9290601, -10994801, -13551059, -14143190, -11659143, -8322096, -5474346, -2356076, 707465, 2180030, 2228602, 1872195, 198676, -3394561, -5809867, -4071811, -936815, -1146025, -3498523, -2740073, 1620738, 4792878, 4578334, 3316406, 1928139, -1428498, -5943196, -7473873, -4624942, -487688, 2416202, 4102070, 3953628, 937989, -2813972, -4067944, -4166282, -6902534, -10841594, -10356322, -4873090, -163169, 848211, 1598959, 4353993, 6146458, 5027694, 3961921, 5206644, 6413952, 5436463, 3730044]
34177C730044j539794l011970l586290K50058M251390J513540n150197o110310
34169i653529L3689M515330K557544m86006L50326K111234P97932j660912j697742
34160c132134J66369J564957J808288N90154k399767m599188k162183L477780
34152d685724N707930J969044k123239j107652K529486K955885k56821k556812
34144B432097j470657R71809K058614J400487K03847l81888j60336j26984j294115
34135C632874k753618k212448O25877K748852J481486j705967l118022k094501
34127c395467j789271l881717n101221j687361M097241N913344K287867q25760
34119d382345J154847M382034K745563k226008l706062k76112K356445N88142
$$ y = [3730044, 2190250, -821720, -4408010, -4157952, 93438, 1606978, -3543219, -9653529, -9619840, -5104510, -2546966, -3032972, -2682646, -571412, 226520, -1434392, -3132134, -2965765, -1400808, 407480, 997634, -1402133, -6001321, -8163504, -4685724, 1022206, 2991250, 868011, -239641, 2289845, 5245730, 4988909, 2432097, 961440, 1933249, 3991863, 5392350, 5596197, 5214309, 5053973, 4926989, 3632874, 879256, -1333192, -707315, 2041537, 3523023, 1817056, -1300966, -3395467, -5184738, -9066455, -14167676, -15855037, -11757796, -5844452, -3556585, -4382345, -3227498, 1154536, 3900099, 1674091, -2031971, -2308083, 48362, 636504]
34111F36504k387266k509881j12180K387968L429006J856647j839760l483220
34103b022182J86346M900413L563758k333127m309960q27347L80156l381608m309421
34094h152972J689483O478673L230078j719485l01986L008149j47248o359369
34086b274677o214823o36191J574920o72800n42336K987460L758720O88460m61019
34077a792286J554922J430754j796801k411958J048460K420277j379460n126855
34069f052947m268529j298084K79732J260302K635777K564630O80558p0479J532609
34060b736431L042770K918028K005073N6790l386030m895470j057651L812343
34052b40578K358709l164880k919974M223453P556620J587886m956068l453066
$$ y = [636504, -1750762, -4260643, -4372823, -1984855, 1444151, 3300798, 1461038, -2022182, -1835836, 3064577, 6628335, 4295208, -14752, -842099, -461943, -3843551, -8152972, -6463489, 15184, 3245262, 1525777, 1223791, 4231940, 4084692, -2274677, -8489500, -9125691, -7550771, -8223571, -8765907, -5778447, -2019727, -1331267, -1792286, -237364, 1193390, -603411, -3015369, -1966909, 453368, -926092, -6052947, -10321476, -11619560, -11339828, -10079526, -7443749, -4879119, -4198561, -4269040, -2736431, 306339, 3224367, 5229440, 5286230, 1900200, -2995270, -4052921, -240578, 2118131, -1046749, -3966723, 256730, 7813350, 9401236, 4445168, 992102]
34044I92102J500196J533510j497515o88858K935396K852090j204889l402223
34036C019809j859012k67878l95719k78462L21190q56568l390011l656538m52713
34027g815902L047753L867022K552732J229656P42153L31456j154090l595418
34019g94638m693178k232255K129062L869030J697152l69039R05623K966736J681942
34010E160435j948142l162548m23167K536816J830294j784820l974383j839348
34002c604863K686729M948164L200841M58694m52628q64860k336743k142663J901992
33993C794663M788473J13278q345319r737308k060714M383413K699618r41230
33985e305126J045490N154998L968487r30314k469034j34614P02480j127840j911685
$$ y = [992102, 2492298, 4025808, 2528293, 1839435, 4774831, 7626921, 6422032, 3019809, 1160797, 892919, 497200, 218738, 539928, -316640, -3706651, -7363189, -7815902, -4768149, -901127, 1651605, 2881261, 3623414, 3954870, 2800780, -794638, -5487816, -7720071, -5591009, -1721979, -24827, -393866, 511757, 3478493, 5160435, 3212293, 49745, -373422, 2163394, 3993688, 2208868, -1765515, -3604863, -918134, 4030030, 7230871, 7689565, 7236937, 6372077, 4035334, 1892671, 3794663, 8583136, 8696414, 351095, -9386213, -11446927, -7063514, -4363896, -5305126, -4259636, 895362, 4863849, 3933535, 1464501, 1329887, 2032367, 904527, -1007158]
33976a007158r89478j200033k053260k25365L115712K955495q56850k662305k30588
33967c153830J790353K2573k136233m93199L269430M650923K714051L0675j385239
33958E309504j248010J34447J783505K049959M57342j359695j656241n70782N65551
33949E465580Q96170N69849M82274J386072K258410M19122m781257r219248p841465
33940a0364493j301085M253967M731474K482725J804080K898586K750722K65705
33932G521681k295252k686102j272848J77146Q30025J045822R99133J05784j902892
33923B522497l963480m482793l070134p61417J443383L239151L983584K459067
33915A369858j147805l930938k613344K559530P268939P047230J671799m412376
$$ y = [-1007158, -1996636, -3196669, -5249929, -5475294, -2359582, 595913, -260937, -2923242, -3153830, -1363477, -1340904, -3477137, -3970336, -700906, 3950017, 6664068, 6694743, 5309504, 4061494, 4195941, 5979446, 8029405, 8486747, 7127052, 5470811, 4900029, 5465580, 6361750, 6931599, 7413873, 8799945, 11058355, 11477477, 6696220, -2523028, -10364493, -11665578, -7411611, -2680137, -197412, 1606668, 4505254, 7255976, 7521681, 5226429, 2540327, 1267479, 1444625, 2274650, 3320472, 4319605, 4425389, 2522497, -1440983, -5923776, -8993910, -9755327, -8311944, -5072793, -1089209, 1369858, 222053, -3708885, -6322229, -3762699, 3506240, 10553470, 12225269, 7812893]
33907G812893o129372k536171K357874L736946Q22520k741508l069833o1747K662583
33898B854185J605863k558113n075069k496733K325883L335267K6937r39267M211284
33889C290237Q934337M668004n886814j1038936n708921K507142M833938K045282
33881C644269O400L03704M78868k51216p74783j331005k548043k900186q66091
33872d238083J891299K748452J893217R50510j24149j676654k119620n24970P23503
33863d76495m46089j746155k39763K059770J147787j987248k662750p0724J851516
33854b570151J211462N42196J478137J939945L33593j512960j619345q48802p72849
33845a818774j159737j147116o56125M92186K580250M203719K968793r30704m146496
$$ y = [7812893, 1683521, -852650, 1505224, 5242170, 6064690, 3323182, 253349, 191602, 2854185, 4460048, 1901935, -3173134, -5669867, -3343984, -8717, 18220, -921047, 3290237, 12224574, 16892578, 11005764, -33172, -5742093, -3234951, 1598987, 3644269, 3650669, 3954373, 4433241, 4182025, 3407242, 2076237, -471806, -3371992, -4238083, -2346784, 401668, 2294885, 3245395, 3121246, 1444592, -675028, -1199998, -476495, -922584, -2668739, -2908502, -848732, 299055, -1688193, -4350943, -4421667, -2570151, -1358689, -816493, 661644, 2601589, 2935182, 1422222, -197123, -1045925, -1818774, -2978511, -4125627, -4781752, -4289566, -1709316, 2494403, 5463196, 4532492, 385996]
33836C85996m200458j874864J080128L861012N192735L125520j731422n275454
33828E63193m547801j439640M29549P08043J534515L127549L378010J711884L65218
33819E830520Q30203J293641o03745l693677m221775r71214K590527K502534p53632
33810B803382l359066l335313k130550j149027K63980K271822K859987Q51143
33802i23642j464429j127721J506627L781066M292363L219747P49667k125862
33794G907816k796121k62812K001012O6691m310593n594906k415020P40763O53666
33785d009504j46930J741688M688937M254625l08585m755901m972155j615877
33777e123702R72159R0010j889771o45005L584017N296907J315172l901178m132773
$$ y = [385996, -3814462, -5689326, -4609198, -748186, 4444549, 7570069, 5838647, 563193, -3984608, -5424248, -4994699, -4286656, -2752141, 375408, 3753418, 5465302, 5830520, 6660723, 7954364, 7350619, 3656942, -564833, -1536047, 1054480, 3557014, 2803382, -555684, -3890997, -6021547, -7170574, -6906594, -4634772, -1774785, -923642, -2388071, -3515792, -2009165, 1771901, 6064264, 9284011, 10033678, 7907816, 5111695, 4848883, 6849895, 6916586, 2605993, -2988913, -5403933, -4663170, -4009504, -4156434, -2414746, 2274191, 6528816, 6220231, 1464330, -3507825, -5123702, -4151543, -4061533, -5951304, -6596309, -3012292, 2284615, 3599787, -301391, -4434164]
33768d434164k62296J802785P97802J339877M867908O108694J550534m256129
33760G515011n140963j725893J254056K468266L534417L604526L50415m454150
33752G405685n837598k608363J013890J598739N05292N07346J692666K258795
33744F536452J074859j662299m422034m575974r95524L203767L344945n72261
33736A931931l339356j576673J810559K275952j71539k263544k661184k412149
33728f406003j650877M69833K947011L382091J519009m53633j401347k285606
33720c879522l228649k408392R73496M896083O777677N622426J488329m438326
33712E803122q479141o716501n41068L422966J566617j812405j205926J909697
$$ y = [-4434164, -4696460, -2893675, -2095873, -755996, 4111912, 10220606, 11771140, 7515011, 2374048, 648155, 1902211, 4370477, 7904894, 11509420, 11859835, 7405685, 1568087, -1040276, -26386, 1572353, 2077645, 2584991, 4277657, 6536452, 7611311, 5949012, 1526978, -3048996, -4044520, -840753, 2504192, 1931931, -1407425, -2984098, -1173539, 1102413, 930874, -1332670, -3993854, -6406003, -8056880, -7587047, -4640036, -1257945, 261064, -192569, -1593916, -3879522, -7108171, -9516563, -8543067, -3646984, 3130693, 8753119, 10241448, 5803122, -2676019, -9392520, -9933588, -6510622, -4944005, -6756410, -7962336, -6052639]
33704f052639K358174J45400l8177K669946L662397N96164k952116l425037j944727
33695d980615p45923N93319K606840L474020K063442K81621k34327o46446j703817
33686G08114j487622Q13955K405774J324366j40767J45490J62796j813350k800863
33677f82107l07443J795508j052666n395695m063474K203622N136342J250246
33669a115667l461666k841287J584412M473437L526445J00238l230836l917415
33661d882339j409521J240032R19225n74455P98109M202942M764597J488559j556540
33652D990609k395626l003715l216661k27911M020204L082543l089133n744762
33644e584452m62329N467685M771501J331446J845199L563368J21187n600906
$$ y = [-6052639, -3694465, -3549065, -3587242, -917296, 2745101, 3341265, 389149, -3035888, -4980615, -5726538, -5133219, -2526379, 947641, 3011083, 3292704, 3058377, 2411931, 708114, -779508, 34447, 2440221, 3764587, 3623820, 3769310, 3932106, 2118756, -682107, -989550, 805958, -246708, -5642403, -9705877, -7502255, -2365913, -1115667, -4577333, -7418620, -5834208, -1360771, 2165674, 2265912, -964924, -4882339, -6291860, -5051828, -4132603, -4707058, -3908949, 293993, 5058590, 6547149, 4990609, 2594983, -408732, -3625393, -3853304, 166900, 3249443, 160310, -5584452, -6046781, -579096, 4192405, 5523851, 7369050, 10932418, 11053605, 5452699]
33636E452699n299447P25261L832509N33218l747784m525664l211261j549613
33628g790082Q58794K462480O62091k180405r47219L102824L151026j831961m716263
33619g228715j615920K375747K262315M17186O30643J717740J590700J544810
33611A694506K016781J07820m088620m920543o1588M306593K998805J56623J164115
33602C374492K459872j871483q169851p770964q22830M208242L599322J584403
33594c408797Q63008o66980k644041q00771M613737O896731K837108k082945k199421
33585C407629L72454M11206k372699m142732k649784J051138M186779L812287
33577D076278l65764l874521k115882K234044J778897m189496p223592j914989
$$ y = [5452699, 153252, 878513, 4711022, 5244240, 1496456, -3029208, -6240469, -7790082, -6931288, -4468808, -3806717, -5987122, -6934341, -3831517, -680491, -2512452, -7228715, -8844635, -6468888, -4206573, -3789387, -3158744, -1441004, 149696, 1694506, 3711287, 3819107, -269513, -5190056, -5251644, -945051, 2053754, 2210377, 3374492, 5834364, 3962881, -4206970, -11977934, -12800764, -8592522, -4993200, -3408797, -2545789, -3212769, -5856810, -6657581, -2043844, 4852887, 7689995, 5607050, 3407629, 3780083, 4191289, 1818590, -2324142, -4973926, -3922788, 263991, 4076278, 3710514, -164007, -2279889, -45845, 1733052, -2456444, -9680036, -11595025]
33569a1595025N682834O792956J974677j479056n01180J687929K298515J791096
33561F652746Q74267l65611p52476N79117J623243j90887l849822n990813n301298
33552f721534k939266j26680J800825R87143k011374l162249m66176K167989R72194
33543i499128p92825K072066P085495O854465P64489l706375k264417Q09591N84577
33534A907938j781939l051072k801274j182048K715552O728032N362257j841589
33526F055857o685741k588031N447278P319775J584617l908042l843861j100859
33518B280993K877j13421O39125J276615m38673l658484m981491k709637J357610
33509f344486M301422M985692M170968K437009p41019n017691p393766m806315
$$ y = [-11595025, -5912191, 880765, 2855442, 1376386, 875206, 2563135, 4861650, 6652746, 7527013, 7161402, 6408926, 6988043, 8611286, 8420399, 4570577, -1420236, -6721534, -9660800, -9787480, -7986655, -6999512, -9010886, -12173135, -12639311, -10471322, -9499128, -10291953, -8219887, -1134392, 5720073, 6484562, 2778187, 513770, 1323361, 1907938, 125999, -2925073, -5726347, -6908395, -4192843, 2535189, 7897446, 6055857, -629884, -3217915, 2229363, 9549138, 11133755, 7225713, 3381852, 2280993, 2283870, 2170449, 2809574, 4086189, 3647516, -10968, -4992459, -7702096, -6344486, -2043064, 2942628, 7113596, 9550605, 8809586, 3791895, -3601871, -8408186]
33501h408186J209349N099950L856732M87365r96080j286476l160801n285395
33493h483542l388197K521892O722376N073926K66912k259486r55618J569682
33485A067945K778592K041464l77776l373697m587190k527991Q51938J959963
33477b166752K51562j049201L87370K752387K874693N36166j796055k443508j778437
33468b431775o35150N59570J204107Q29594Q1717k7346L15897L78642N10946J041715
33458A827917L07530l022024n851017l198381L903273P638822L425534l327001
33450A704653m468383J62863M103567L912531J864046K94573q34587q47807J380801
33441G272257L359696Q48555m779563o733120k675460J246468k54289l523513
$$ y = [-8408186, -7198837, -2098887, 1757845, 2245210, 1249130, -37346, -3198147, -8483542, -11871739, -9349847, -2627471, 2446455, 2713367, 453881, -501737, 1067945, 3846537, 5888001, 5510225, 2136528, -2450662, -4978653, -4126715, -2166752, -1915190, -2964391, -2577021, 175366, 3050059, 3586225, 1790170, -653338, -2431775, -3066925, -2507355, -1303248, -473654, -391937, -419283, -103386, 275256, 786202, 1827917, 2135447, -886577, -6737594, -9935975, -6032702, 1606120, 5031654, 1704653, -2763730, -2600867, 1502700, 5415231, 7279277, 7573850, 6739263, 5891456, 7272257, 10631953, 11480508, 6700945, -32175, -2707635, -1461167, -1715456, -5238969]
33433e238969k206749K536730M183631J028331k055718j716952l07416p57426
33425d534538j854148r68177J498698L019906K794586K334110K513864J907959
33417F712260j047283m956410o058762k721410J832158L078407R16568n67980
33409b812452Q94661K982471L023602J866330J386062Q80680j030445k876677
33401D314232k190272J68353J030027j51266q58660j63842k21605j994736k824177
33392b891946n17808K544330K364182p61247k444426m64621K129798J569874j278858
33383B49278k561208j201173P4683m74497j073447l8470J048127K33787r65532
33374d708452K18321L074439M243579K675107M98747q40897k039947l300533l401023
$$ y = [-5238969, -7445718, -4908988, -725357, 302974, -1752744, -3469696, -3777112, -4534538, -6388686, -7356863, -5858165, -2838259, -43673, 2290437, 4804301, 6712260, 5664977, 708567, -5350195, -8071605, -6239447, -3161040, -2244472, -2812452, -1917791, 1064680, 4088282, 5954612, 7340674, 8221354, 7190909, 4314232, 2123960, 2292313, 3322340, 3171074, 2312414, 2148572, 1926967, -67769, -2891946, -3409754, -865424, 1498758, 737511, -1706915, -2171536, -41738, 1528136, 249278, -2311930, -3513103, -3438420, -3912917, -4986364, -5024834, -3976707, -3742920, -4708452, -4490131, -1415692, 2827887, 5502994, 6001741, 5160844, 3120897, -179636, -3580659]
33365c580659k046664m95437N81240J351126J069653q03153j945448M05863M066432
33356a397047L497535j991159o241006m444903R62478M912430N813118M234127
33348E345573K4005n341651p364000l951046O44657J545137J02921N52853K549142
33339e892409K423934J83884m39698J442335K419175M67319k099172k334811j80894
33330d010337K493512L985247L559113K028908J278341J672205J143534j312091
33322A0838432l200377k217552k13306p7483p74663L37875K004089Q57670k214520
33313E340165k825495k31317J507304K60537j327461j167060j065007k468982
33305a977316l118627r64122J811343J966515J60216m74362O82429J271560O5445
$$ y = [-3580659, -5627323, -6122760, -5541520, -4190394, -3120741, -3923894, -5869342, -5463479, -1397047, 2100488, 109329, -6131677, -10576580, -9614102, -4701672, 1111446, 5345573, 5369578, 27927, -7336073, -11287119, -10642462, -9097325, -8994404, -8441551, -5892409, -3468475, -3284591, -3724289, -2281954, 137221, 604540, -1494632, -3829443, -4010337, -1516825, 2468422, 6027535, 8056443, 9334784, 11006989, 12150523, 10838432, 7638055, 5420503, 5207197, 5129714, 4355051, 4692926, 6697015, 7554685, 5340165, 2514670, 2283353, 3790657, 4051194, 2723733, 1556673, 491666, -1977316, -5095943, -6060065, -4248722, -2282207, -2121991, -2596353, -1913924, -642364, -576919]
33296e76919j137526l60323J511243J804375k32138k090266j170992J531205K572246
33287A850905P80247j293270j255645Q4558P82236O36538L88171Q2819j26635
33278A929924L26612M68022j645116m615803l752658J595956M872403J030386
33270B09726n147013n265934O44703M888989L645610Q38890K97578P39854J63353
33261A015756m56774j27157k3063o38386n45905L22240j32561k056350k357116
33252d999316N40692L819236M093062J564573j203721k442851j940389o09865
33244a178579L4913l85268k59043J195216J686150n23754k598521j075809J832882
33235a271813J367482j500330j417363J974493L280102Q69000n26537J149042
$$ y = [-576919, -1714445, -2074768, -563525, 1240850, 1008712, -1081554, -2252546, -721341, 1850905, 2631152, 1337882, 82237, 166795, 949031, 1585569, 1973740, 2056559, 1929924, 2256536, 2724558, 1079442, -3536361, -7289019, -5693063, -820660, 209726, -4937287, -10203221, -9558518, -4669529, -1023919, -185029, 112549, 852403, 1015756, 558982, 431825, 408762, -229624, -775529, -453289, -585850, -2642200, -4999316, -4458624, -639388, 3453674, 5018247, 3814526, 1371675, -568714, -1178579, -1143666, -1528934, -1787977, -592761, 1093389, 569635, -2028886, -3104695, -1271813, 95669, -1404661, -2822024, -847531, 2432571, 3301571, 2775034, 3924076]
33227C924076J520399j394595k336621K065916O191757L889088j525647k912159
33219I422214o92398q38985m104166n113507j545196K620387L507474J603025
33211D858848r09481k434169j254070K917940O151446L673161k775957n428589
33203D799129n65978N679213M902759k590093q317050o535381p05874K314444
33195a018831J266524K21187Q80056K27114k833802l690217R35162N915171L782380
33186E684744l779094p237925k306347M806085O818096L787629n44635m681749
33178B546804p515435n814448J019914P141135O541630J032818k599159j547286
33170H05973J240009K620671K195709O14724j110635j176376Q13324K017355q3342
$$ y = [3924076, 5444475, 4049880, 1713259, 3779175, 9970932, 13860020, 12334373, 9422214, 8729816, 7890831, 3786665, -1326842, -2872038, -251651, 3255823, 4858848, 3949367, 1515198, 261128, 3179068, 9330514, 13003675, 10227718, 4799129, 4233151, 9912364, 14815123, 12225030, 3907980, -2627401, -3333275, -1018831, 247693, 468880, 1348936, 1576050, -1257752, -4947969, -4012807, 1902364, 5684744, 1905650, -5332275, -7638622, -2832537, 3985559, 7773188, 7228553, 2546804, -4968631, -10783079, -9763165, -2622030, 3919600, 4952418, 2353259, 805973, 2045982, 4666653, 6862362, 7477086, 6366451, 5190075, 6003399, 8020754, 7937412]
33161G937412l310299l446772m69177J621283R29958j74020M30087J383366N48556
33152E450394j441528k103456n42351J360686J236532p36260j741930O8864K706753
33143D257704K849946O70500n95913N9941J28124j442919k012656j76524J040023
33134D778226p64698k632879r13425K004140Q38533l963428o205364k872774J809028
33125g922641K838656J025080N69342K649554M443242L598075R74548j344457
33117F831399k626866k858212j191980K584827N642604M385902j14124k503243
33109A0150307q35406J31893l206149o348242l286738L067313M443022j64036
33101C951964l519364k028042j31234j020005j386305J146297L101395K021261
$$ y = [7937412, 4627113, 1180341, 711164, 2332447, 3262405, 3088385, 3518472, 4901838, 5450394, 4008866, 1905410, 1363059, 2723745, 3960277, 3224017, 1482087, 1550951, 4257704, 7107650, 7778150, 7182237, 7242178, 7370302, 5927383, 3914727, 3738203, 4778226, 4013528, 1380649, 467224, 2471364, 3309897, -653531, -6858895, -9731669, -7922641, -5083985, -4058905, -3489563, -840009, 3603233, 7201308, 8175856, 6831399, 4204533, 1346321, 154341, 2739168, 8381772, 12767674, 12653550, 10150307, 9314901, 9446794, 6240645, -107597, -3394335, -327022, 4116000, 3951964, 432600, -1595442, -1726676, -2746681, -4132986, -2986689, 114706, 2135967]
33093B135967J204829K749151K691137j317679m017679p80961L873864L159584
33085I698213j351302l263251j484878L98411J301619K092870J247011j916414
33077F722279l105785N89829L916912R48681m371635m148029L11624J363200j325766
33068I01310j127304K462937K792891j081653k173679J407705K617546j389355
33060D410398l232790J831371O810225M031897k671998m931253k790425k113784
33052A343641l263852j152466M990836R433593P935232K740874j215629j717029
33044A9095200j76946R52695J210937K571008N928230Q311217O712696L818555
33036D8423592N122204J0281574J3256197J2165157J2022985J4786930J4216524
$$ y = [2135967, 3340796, 6089947, 8781084, 7463405, 3445726, 2664765, 6538629, 9698213, 8346911, 5083660, 3598782, 3997193, 5298812, 7391682, 8638693, 6722279, 3616494, 4206323, 8123235, 9071916, 4700281, 552252, 863876, 2227076, 901310, -225994, 2236943, 5029834, 3948181, 1774502, 3182207, 5799753, 4410398, 1177608, 3008979, 9819204, 13851101, 11179103, 6247850, 3457425, 1343641, -1920211, -3072677, 1918159, 11351752, 19286984, 22027858, 20812229, 19095200, 18918254, 19870949, 21081886, 23652894, 29581124, 37892341, 44605037, 48423592, 53545796, 63827370, 77083567, 89248724, 101271709, 116058639, 130275163]
33029A30275163O050839l272870n459620l202521n751771j4265323k0405931j9182037
33021F4785929j4798396j2130727r881622n640059j816835j762536l631680l016642
33013A2107432J27402J701616N8719j864756j813751j752375l717726n038221
33005a91660j770125M019274N251655m15987o221488m992391J138856M307528
32997A125662K001547j087843j575281j278221j285513J367683P361813J0594995
32989A7224842N479820m104786q783625n567006n39866N04504r86501p39502J068156
32980C556036P21771k533947m893111l421145o1197J572742J325935J700306K944079
32971I11469K467841l17605k148461q12229J118247L01480j982406j993801M33032
$$ y = [130275163, 136326002, 133053132, 127593512, 124390991, 118639220, 104373897, 83967966, 64785929, 49987533, 37856806, 27975184, 22335125, 20518290, 18755754, 15124074, 12107432, 12234834, 13936450, 13995169, 12130413, 10316662, 8564287, 4846561, -191660, -1961785, 2057489, 7309144, 6893157, 671669, -4320722, -3181866, 1125662, 3127209, 2039366, 464085, -814136, -2099649, -731966, 6629847, 17224842, 22704662, 18599876, 9816251, 4249245, 3709379, 4213883, 3227382, 2487880, 3556036, 4277807, 1743860, -3149251, -6570396, -6631593, -5058851, -3732916, -2032610, 911469, 3379310, 3061705, 913244, 101015, 1219262, 1520742, -461664, -2455465, -2022433]
32962b022433J911255R69879l01459k16955L70288N24541P69628J236670P87917
32953D029331r70413k658756k810567j220002J329627L162543K169401j756422
32945A274742n339076n202600j890040J532543L623228M565457L564617j7879
32937B110992l818238m574499k470908Q0041K551497M913436M137418j784462
32929A145277p436628n039241L570995P844819L364776k193541j465807K132707
32921A923357J926847p94795m72584K298316J987639k267124n453523m645215
32913e497082k218044q08793q2118O05831M50532n37191n27042J414815L542485
32904c656607L569334J497690n47397r33540m58333j191322l186946l619616o47703
$$ y = [-2022433, -111178, 858701, 557242, 340287, 710575, 1235116, 2004744, 3241414, 4029331, 3058918, 400162, -2410405, -3630407, -2300780, 861763, 3031164, 1274742, -4064334, -9266934, -11156974, -9624431, -6001203, -1435746, 2128871, 2110992, -1707246, -6281745, -8752653, -8672612, -6121115, -1207679, 2929739, 1145277, -6291351, -11330592, -7759597, 85222, 3449998, 1256457, -209350, 1923357, 3850204, 3055409, 2582825, 4881141, 6868780, 4601656, -851867, -5497082, -7715126, -8523919, -8606037, -8000206, -7549674, -8086865, -8613907, -7199092, -3656607, -87273, 1410417, 863020, -70520, -528853, -1720175, -4907121, -8526737, -9174440]
32895i174440L204272M077977K177849Q31841Q85109J55142j635709k082330q91868
32886b452157o06222j436180m84044K312388K916713J09547j916428p00539M81922
32877a775000p84003j420010P76714K049169n75196k969324p30503K586411J297339
32868a544403k408222k194746J633908L204094J058393q37761q27448n59425P50259
32859a725351M945170Q203494M301294m558431q692744m644818K52132j34974
32851b054228k260114p85634K225817J910053p59219j174585J153662K571859
32843H27611J295421r13008k005024j422131L01106J457098K36501k301873k495189
32834e019488P64011L695895K791391l29266j970547j733132j538276j394382
$$ y = [-9174440, -5970168, -1892191, 285658, 1117499, 2002608, 2157750, 522041, -1560289, -2452157, -3058379, -4494559, -4978603, -2666215, 250498, 360045, -1556383, -2256922, -1775000, -2559003, -3979013, -3202299, -1153130, -1728326, -4697650, -5428153, -2841742, -1544403, -3952625, -6147371, -4513463, -1309369, -250976, -1088737, -1916185, -2475610, -1725351, 3219819, 11423313, 15724607, 11166176, 2473432, -2171386, -1919254, -2054228, -4314342, -5099976, -2874159, -964106, -1723325, -2897910, -1744248, 827611, 2123032, 1210024, -795000, -2217131, -1916025, -458927, -222426, -2524299, -5019488, -4255477, -559582, 2231809, 1902543, -68004, -1801136, -3339412, -4733794]
32826d733794R1242K173434K538516R25778p73475j551579j718659r69793R91007
32817c027323K300793O88157k411247k761460P26746L947172L078487m02373k345829
32808b06877j677742p82251j021872r12189P03210K169053J322848j147969k595457
32799d149246k111431j315014j232756n12440J903381L881732K254329k268872
32791c550317m756774j904872L340490N060195J769377j869621j480255J278217
32783b113560J650595j052250k710277r34490J397693R18915j134411j518875
32775e496660k44055L85437L18563J199804K134131N54170k587178l046796L36706
32766f445878L670234L672920J356355j200581l414270l967924r28918L508158
$$ y = [-4733794, -4642552, -2469118, 69398, 995176, 221701, -1329878, -3048537, -4018330, -3027323, -726530, -38373, -2449620, -5211080, -4484334, -537162, 2541325, 2138952, -206877, -1884619, -2666870, -3688742, -4600931, -3897721, -1728668, -405820, -1553789, -4149246, -6260677, -7575691, -8808447, -9320887, -7417506, -3535774, -1281445, -3550317, -8307091, -10211963, -6871473, -1811278, -41901, -1911522, -3391777, -2113560, -462965, -1515215, -4225492, -5159982, -3762289, -2843374, -3977785, -5496660, -5740715, -5355278, -5036715, -3836911, -1702780, -1148610, -3735788, -6782584, -6445878, -2775644, 897276, 2253631, 1053050, -2361220, -6329144, -7258062, -3749904]
32758c749904L607512j164516l339652J849373Q042685O394560j258677n331468
32750E049913k369491J724447J699003j170738l732659m809831l301373J436949
32742e473780N901114M930825m82569l511777j306009J457811R92687o9639J062873
32733C501536J854691j06636j705017Q1670J842164o52431m249211k915595K035049
32724c13780L754646Q73814r52063R55186K187806n70122l726590k807719N97314
32715a508K032454P27847j138878k922924m939237n324085j956003L208362N716497
32706d597475M448404K341713J258990p9112k210476k797172m39859K254321K004303
32697B183637o11107k381330j800570J53499K293436L743672L206005M72059j948169
$$ y = [-3749904, -142392, -1306908, -4646560, -2797187, 5245498, 11640058, 10381381, 5049913, 2680422, 4404869, 6103872, 4933134, 1200475, -3609356, -6910729, -5473780, 427334, 5358159, 4875590, 1363813, 57804, 1515615, 2508302, 2438663, 3501536, 5356227, 5249591, 3544574, 3626244, 5468408, 4815977, 566766, -2348829, -313780, 3440866, 4314680, 3362617, 4317803, 6505609, 5935487, 2208897, -598822, -1508, 2030946, 2758793, 1619915, -1303009, -6242246, -11566331, -13522334, -10313972, -4597475, -149071, 2192642, 3451632, 3372520, 1162044, -1635128, -2074987, 179334, 2183637, 1572530, -808800, -2609370, -2455871, -162435, 3581237, 6787242, 7259301, 5311132]
32688E311132j534341L42879K94751j598202j897845J65756J032563j139136k875433
32679a897876p53467L003765L960698J975728K33217m01748j634762l329781l412473
32670b256699k030091j355743r34532K001418O390611O600986N88785n627242
32662C377493n597102j103536J543933J226917J987381M194088K776707l659672
32654D746209q178303m526363L296903O126527K133061j923678j575283j45179
32646d6106j327185k420824M53134M637257M359935j01985k741445j100840N73519
32637B285460j193622l669026k727798P50652K654776J316921j637182m225079
32629f444898n045820k909971J456491M398245K977074q42131k283254J34703
$$ y = [5311132, 3776791, 4119670, 4414421, 2816219, 918374, 1084130, 2116693, 977557, -1897876, -2651343, 352422, 4313120, 6288848, 6522065, 6120317, 4485555, 1155774, -2256699, -4286790, -5642533, -6577065, -4575647, 1814964, 8415950, 9004735, 3377493, -2219609, -3323145, -1779212, -552295, 1435086, 5629174, 8405881, 4746209, -3432094, -7958457, -4661554, 1464973, 3598034, 1674356, 99073, -46106, -1373291, -3794115, -3340981, 1296276, 5656211, 5554226, 2812781, 1711941, 2285460, 1091838, -2577188, -5304986, -4554334, -1899558, -582637, -2219819, -6444898, -11490718, -14400689, -12944198, -8545953, -5568879, -6411010, -8694264, -8559561]
32621h559561L021858K868020K28361j552702m01728K464762L977488K362083
32613D408581r59879k873452k064332k22247N14647J62375K54436J630648L628216
32604D478993M682953L362853j24019l269363l588101j768339o63547j080084
32596B031346j122516r5986K25141o48926n12438J241219J598569r65771k829521
32587a078883l95419L849331M597369J064230k934007m544398l611836o12839
32579c666452K929777L594330J76030k780644m86759M346121M877728M74928k703139
32570F761920j705526m92833j903824k707855j26102K439111P62864l259998m703571
32561d935814k690889n4163J707302K879593K779497Q22229p81202N09619K913655
$$ y = [-8559561, -5537703, -2669683, -2441322, -3994024, -4395752, -1930990, 2046498, 4408581, 3448702, 575250, -1489082, -1711329, -1196682, -1034307, -779871, 850777, 4478993, 9161946, 12524799, 12400780, 9131417, 5543316, 3774977, 3111430, 2031346, 908830, 812844, 1037985, 389059, -123379, 1117840, 2716409, 1750638, -1078883, -1474302, 2375029, 6972398, 8036628, 5102621, 558223, -3053613, -3666452, -736675, 2857655, 3033685, 253041, -233718, 4112403, 8990131, 9465059, 6761920, 5056394, 4563561, 2659737, -48118, -174220, 2264891, 3027755, -232243, -4935814, -7626703, -7680866, -5973564, -3093971, -314474, 507755, -273447, 236172, 3149827]
32552C149827K055163k481040n896732m415143J09890L197762L164684J751312
32544F35723O47929m13710j878328k314678K32400M824891P316090M899428j01056
32535A3848689l098020l258807l698650n462912n181402q26008L680028L417816
32527e79266q8699j075959J458006K216350j601685n039525k461761L717492O269604
32518B814557L333375o8691n80448p62126k831201l635921p2299M397089M038241
32509F632576m54637l167918j988192o41100j495218k247096j343204j112538
32501e817327k743338k975035O70726N171148O100971L374591k08760k949060
32493F23916l794585j630242J572717J044314l247547m045709K696860R516663
$$ y = [3149827, 5204990, 2723950, -3172782, -7587925, -7478035, -4280273, -1115589, 635723, 1283652, 869942, -1008386, -3323064, -3090664, 1734227, 9050317, 13949745, 13848689, 10750669, 7491862, 3793212, -1669700, -6851102, -7677110, -3997082, -579266, -667965, -1743924, -285918, 1930432, 328747, -4710778, -7172539, -3455047, 2814557, 6147932, 6079241, 5498793, 4736667, 1905466, -1730455, -1802754, 2594335, 6632576, 6177939, 3010021, 1021829, 380729, -1114489, -3361585, -4704789, -5817327, -8560665, -11535700, -10864974, -5693826, 407145, 3781736, 3572976, 623916, -3170669, -4800911, -3228194, -2183880, -5431427, -9477136, -6780276, 2736387]
32485B736387P140528j189894m269040M2170K694629r33792l986355n78255M018486
32476E674864K120163l987162n846743j354766L488259L892417J490218J08429
32468E585679O13250J057801k58160k699879l693532j606238J700152K650200
32460C349273N07160j875176k238288j343790m55380P51966K332141K744925J284627
32451E057458j86230K76165K008487K838916J460095j930517n489914n942349
32443a907889j611947M118934N433985J203418l645040m921217l575922j715308
32435f620986J270967N380006O814337K768501l044365m446812j153046J446960
32427B415562M05045j375445o05358J431259J440663p37993k019649m53797K196570
$$ y = [2736387, 9876915, 8687021, 4417981, 4460151, 7154780, 6220988, 2234633, 1656378, 5674864, 7795027, 3807865, -2038878, -3393644, 94615, 3987032, 5477250, 5585679, 6198929, 7256730, 6998570, 4298691, 605159, -1001079, 699073, 3349273, 3856433, 1981257, -257031, -1600821, -2056201, -1304235, 1027906, 3772831, 5057458, 4871228, 5147393, 7155880, 9994796, 11454891, 9524374, 4034460, -1907889, -3519836, 599098, 6033083, 7236501, 3591461, -1329756, -4905678, -6620986, -5350019, 29987, 6844324, 9612825, 6568460, 2121648, 968602, 2415562, 2820607, 1445162, 839804, 2271063, 3711726, 2973733, 954084, 500287, 2696857]
32418B696857K840572J088274l97517K10386J175342j97439l256330m539839k464925
32409b844619P58555K257343J550029N94r29698l73647J319325K289875J066296
32400E094053j233141k268578j615181m59664R68508K738526K878386l34149l983775
32391A784985l073512J818170M246721Q56429l982873m681050j268337K750759
32383a548708N150425M698343L24810n806417q037856l961878J556587K747399
32375d877295K63699j619811j763662j497047k07665K924591M825497J987594
32367C5901k899735l496205R88276M515659L007600n13823j351411L81129J272679
32358A940070k3054j584451j300155O44280K176760J604128m89678j835692j132303
$$ y = [2696857, 5537429, 6625703, 6228186, 6438572, 7613914, 7416475, 4160145, -379694, -2844619, -2086064, 171279, 1721308, 1721902, 792204, 418557, 1737882, 4027757, 5094053, 3860912, 1592334, -22847, -482511, 485997, 3224523, 6102909, 5768760, 1784985, -1288527, 529643, 4776364, 5632793, 1649920, -3031130, -4299467, -1548708, 3601717, 8300060, 8624870, 2818453, -5219403, -9181281, -7624694, -4877295, -4613596, -6233407, -7997069, -9494116, -9701781, -6777190, -1951693, 35901, -2863834, -6360039, -5371763, -856104, 2151496, 1637673, 286262, 667391, 1940070, 1917016, 332565, -967590, -323310, 1853450, 3457578, 2967900, 1132208, -95]
32349i5P02247K174602K670130J767333p91643l328456k871582N95844K956730
32340C875110J363040j624854k201229j123810j450475k395761l97553M069225
32332A13693N742905J925025l291278m221621n26708L127441K958293j52878k419094
32323C255778j675449L04675L50405j673114k604533o24380K023670K422382J018765
32314B798199J23462J40686j20712p45323j084850j718353l105687l229000M0975
32305f900603M549608N388183J394536k961678l225430Q2811L321744M139859
32297E789030K376111j401907n775017p739681m879422R28237M052056J366669
32289e283924l038015k310404L722682P296893L198788l234009l320757K233898
$$ y = [-95, 702152, 2876754, 5546884, 7314217, 6522574, 3194118, 322536, 918380, 3875110, 5238150, 3613296, 1412067, 288257, -1162218, -3557979, -3955532, 113693, 5856598, 7781623, 4490345, 268724, -257984, 2869457, 5827750, 5674872, 3255778, 1580329, 1885004, 2235409, 562295, -2042238, -2666618, -642948, 1779434, 2798199, 2921661, 3062347, 2941635, 2196312, 1111462, -606891, -3712578, -6941578, -6900603, -2350995, 3037188, 4431724, 1470046, -1755384, -1672573, 1649171, 5789030, 8165141, 6763234, 988217, -6751464, -11630886, -10702649, -6650593, -5283924, -8321939, -10632343, -6909661, 387232, 3586020, 352011, -2968746, -734848]
32281g34848M461445j96778m780703k929032J701098J936760k048524m282813
32273f873395k390984L98602J287950R51699Q90641J425138K087135J672671q51115
32264a401658l610054k644237J977781M436539J373950k051494K33150M932875
32256C246852L856451l015010o901086l220766K297349K924908O3093o83803J885778
32247D53766M096712L196324J96798k180293k328425r05883J5619o65068j762319
32238A17231j608231k34646J411905K919383L448739J479741k051849k951979
32230B530294L62609K838527n00151n908204n208528J920723O757885L794438
32222F587593k255057m336835k399860j001149j653231k078936j028742J74220
$$ y = [-734848, 3726597, 3529819, -1250884, -4179916, -2478818, -542058, -2590582, -6873395, -9264379, -8865777, -7577827, -6626128, -5735487, -4310349, -2223214, -550543, -1401658, -5011712, -7655949, -5678168, -1241629, 132321, -1919173, -1686023, 3246852, 7103303, 4088293, -2812793, -6033559, -3736210, -811302, -748209, -1432012, 453766, 4550478, 7746802, 7943600, 5763307, 3434882, 2528999, 2544618, 1879550, 117231, -1491000, -1725646, -313741, 2605642, 6054381, 7534122, 5482273, 2530294, 2892903, 5731430, 5231279, -676925, -5885453, -3964730, 2793155, 6587593, 4332536, -4299, -2404159, -3405308, -5058539, -7137475, -8166217, -7991997]
32214g991997M44725N70108J681627L357683L805649K107196Q4753N17924K879175
32205G456843L133534m86874m202262m007231j500390n33735p84443K23112R79359
32196B77913j686242n234901l564488K967285O698114L558288j626807l090104
32188a700942j391187J86165J059715J784833J589634N79462M58211Q55548n66467
32179B854972k608809r53528L523348L784797k125853o235407k746150K206812
32171b299818O49483l750144k283320L123411K631548m369311p088082m84016
32163a3870249O591169N377907m832q47687K126638J788377k337811l377160J098309
32154c455339M922382L010196j360298k437598l53796P90662l6861o57964q90107
$$ y = [-7991997, -7547272, -6977164, -5295537, -1937854, 1867795, 3974991, 4059744, 4577668, 7456843, 10590377, 10103503, 5901241, 1894010, 393620, -140115, -924558, -701446, 277913, -1408329, -6643230, -10207718, -7240433, -542319, 3015969, 1389162, -1700942, -3092129, -2905964, -1846249, -61416, 1528218, 2107680, 2565891, 3421439, 2854972, 246163, -707365, 2815983, 6600780, 4474927, -1760480, -4506630, -2299818, -1650335, -5400479, -7683799, -4560388, -1928840, -6298151, -13386233, -13870249, -7279080, -1901173, -1906005, -2753692, -627054, 1161323, -1176488, -4553648, -3455339, 1467043, 4477239, 3116941, 679343, 325547, 1116209, 1079348, 421384, -468723]
32145d68723k579439m513368k639859L014275O391211L326522k330132m172842
32137c972355j793524M03501O00203P46512J554171J579774J191696K411423M298472
32128G019873L428953p2430k026292j197389j409140m188206m896518l56494M495792
32119G98149L206547k170576l936698j73129L064878J344412k155962k350070
32111b372449M73718K238983J349264J9460K31881J170027J084656o7146q54318
32102C274076n04436K31743L36339k10810q55962j510294k405615l200757k990441
32093g836157j244873J534767L822339L729007O91812l078545m215147k115842
32085h712639L05741Q86312J073740K504603L142519M00455l341944k862690K063140
$$ y = [-468723, -3048162, -7561530, -10201389, -7187114, -795903, 2530619, 200487, -3972355, -5765879, -5362378, -4762175, -4015663, -2461492, -881718, 309978, 2721401, 7019873, 10448826, 10376396, 8350104, 7152715, 5743575, 1555369, -3341149, -3697643, 798149, 4004696, 1834120, -2102578, -2275707, 789171, 2133583, -22379, -2372449, -1898731, 340252, 1689516, 1708976, 1940857, 3110884, 4195540, 4128394, 3274076, 2769640, 3001383, 3337722, 3126912, 2270950, 760656, -1644959, -4845716, -7836157, -9081030, -7546263, -3723924, 5083, 696895, -2381650, -6596797, -8712639, -8406898, -7520586, -6446846, -3942243, -799724, -399269, -3741213, -6603903, -4540763]
32076d540763N269281K274637l545086n298864j251113L344298K883530j725633
32068b589713m071005m63382M503766L575975k479707m938120R4137M944970J619229
32059A96150n434227n755203R44898M578481M75123m316984k958738J648654L535186
32050g086660K698823K175830J586475p35342k976715k365851J93326K107610
32042d402504L176407M093460L520108L39509l318139m589692l591364k038621
32034f810836k63886J964461L687123L910427K722253K65779k843143l823508
32026a191330m30993M162969M213099N6243j998421R5018J047177j924943l961126
32017F7693j571988R22461m17248j951237j21946R43876k558092n323069j470226
$$ y = [-4540763, 728518, 3003155, -541931, -5840795, -7091908, -3747610, -864080, -2589713, -6660718, -7124100, -2620334, 955641, -1524066, -6462186, -6368049, -1423079, 196150, -5238077, -10993280, -10048382, -5469901, -4994778, -9311762, -12270500, -10621846, -7086660, -4387837, -2212007, -625532, -1360874, -4337589, -6703440, -6510114, -4402504, -1226097, 2867363, 6387471, 6726980, 3408841, -1180851, -4772215, -6810836, -7074722, -5110261, -1423138, 2487289, 5209542, 5475321, 2632178, -1191330, -1622323, 2540646, 6753745, 6809988, 4811567, 4906585, 5953762, 4028819, 67693, -1504295, -581834, -999082, -2950319, -3072265, -2128389, -4686481, -10009550, -11479776]
32008a1479776M099938L322545j049076o09979L399189K724242k063754k024893
32000c681564L606111N094204r32397n414673k437412J149239j580175n623188
31992i819855l039134L861986O931144M284167J86834k789593m234670k214165
31984f833286L657061Q048129N584978r77470m224802k287944J50717m4713j206258
31975A866412j562290j751720j853213n02195J752766K030672l85943k291929
31967b697440j135291J172284J244864o72087j207738R34877K833096J444667
31959A917232j871510k980279n33384K533675L418596K667005J753383M09406
31951G314124j329482j350225Q36845J304050k756324o777465m028269L662624
$$ y = [-11479776, -7379838, -4057293, -5106369, -5716348, -2317159, 407083, -1656671, -3681564, -75453, 5018751, 4086354, -1328319, -3765731, -2616492, -4196667, -9819855, -12858989, -8997003, -2065859, 2218308, 2405142, -384451, -4619121, -6833286, -3176225, 4871904, 10456882, 9479412, 5254610, 2966666, 3117383, 3072670, 1866412, 304122, -1447598, -3300811, -3803006, -2050240, -19568, -405511, -2697440, -3832731, -2660447, -1415583, -2087670, -3295408, -2360531, 472565, 1917232, 45722, -2934557, -3467941, -934266, 2484330, 5151335, 6904718, 7314124, 5984642, 4634417, 5471262, 6775312, 4018988, -2758477, -6786746, -3124122]
31943c124122P076708K455877l491459l868792n04535J337398J502417K701589
31935D085081L729742J269659l308341m791866j632286K007085K235109j11933
31927C482250j827276j463198q7710M90955m37345j763942j822715o39438J50119
31918c918300q833J64278J066066J153632L6233r0544J709543K584176K55054
31909B951305k516586j678485J596544K487918j36628k393244j554250O20620
31901f22806J620161J520474J148243R6111j585873k211911q77944Q27748J191187
31892A105390P94060J022151J691309J763364J149041K88887q88718k134362k206280
31883B584842o62498P68846M57016m03352M87903K556839K601661n15789l621667
$$ y = [-3124122, 3952586, 6408463, 2917004, -951788, -1456323, -118925, 1383492, 4085081, 7814823, 9084482, 5776141, 984275, -648011, 1359074, 3594183, 3482250, 1654974, 191776, 104066, 595021, 157676, -1606266, -3428981, -4068419, -3918300, -3927133, -3762855, -2696789, -1543157, -1506924, -1597468, 112075, 2696251, 2951305, 434719, -1243766, 352778, 2840696, 2704068, 310824, -1243426, -622806, 997355, 2517829, 3666072, 3762183, 2176310, -35601, -913545, -85797, 1105390, 1899450, 2921601, 4612910, 6376274, 7525315, 7814202, 6925484, 4791122, 2584842, 1922344, 2691190, 3148206, 2744854, 3232757, 5789596, 8391257, 7875468, 4253801]
31874D253801k980629R70962M087931L276878l84698l396279l815674k736366
31866g24074j909042j054629J158495L876538M028800O15168k964796k997240
31858B9220m97217N50708q42080j789792n70134J158021J988840K752791L236639
31849F016996J025036l575807n425694j470528L519315L223372p72345j900457
31841F39888N72968R51941k351367l454281J059998N697507M066222j865769n619864
31832c02757n340099l747293k085431J71217J606230N89527m32798K050155N920422
31823a570827N516251O19860k585656q87551J464545K46652k195501j946822n72201
31814a911250j725756l651866j558707L325921L965599j495373n305430r25098
$$ y = [4253801, 1273172, 2244134, 6332065, 9608943, 9224245, 5827966, 2012292, -724074, -2633116, -3687745, -2529250, 1347288, 5376088, 5991256, 3026460, 29220, -467997, 82711, -759369, -2549161, -3119295, -1961274, 27566, 2780357, 6016996, 7042032, 3466225, -1959469, -3429997, 89318, 3312690, 2540345, 639888, 1212856, 2164797, -186570, -3640851, -2580853, 3116654, 7182876, 5317107, -302757, -5642856, -9390149, -11475580, -11304363, -9698133, -9108606, -9541404, -7491249, -1570827, 3945424, 4565284, 1979628, 1092077, 2556622, 2803274, 607773, -1339049, -1911250, -3637006, -7288872, -8847579, -5521658, -1556059, -3051432, -8356862, -9281960]
31806i281960O486218O662745j015861o656461m137499J112983J752191o19770
31798e697414O4632L533573M080103M31230k415600j356367J027880J847145J582106
31789C097288J006481m94941j917080p75053K010932K160197j183525l637667
31781B66632k615741r69426j113950j014331P82549J645486K45881N298K666632
31772a00970L758951j97598m834840m269826j61901J786709Q65123N63048J644783
31763i46521K149383J925439J711248L26764k247942k531559N26028J779881j892773
31754G99948m888357j826745K416493Q26589k976828j185887L457497K312287
31746a065003k673526j562882N185835O206424j078606n511184j151179L474013
$$ y = [-9281960, -2795742, 3867003, 2851142, -3805319, -7942818, -6829835, -5077644, -5697414, -5632782, -2099209, 1980894, 2412124, -3476, -1359843, -331963, 1515182, 3097288, 4103769, 3608828, 1691748, 916695, 2927627, 5087824, 3904299, 266632, -2349109, -3318535, -4432485, -5446816, -4664267, -3018781, -2772900, -2767602, -100970, 3657981, 3460383, -1374457, -5644283, -5806184, -4019475, -3154352, -2591304, -946521, 1202862, 3128301, 4839549, 5166313, 2918371, 386812, 912840, 2692721, 799948, -4088409, -5915154, -3498661, -2672072, -5648900, -6834787, -3377290, -1065003, -3738529, -5301411, -115576, 6090848, 5012242, -498942, -1650121, 1823892]
31738A823892J336956j615253Q23074L258632n39611n303846l395769J948108
31730a663817L140554J154332J324268K089581j155689n352826l808640J819159
31722b453078L738495N77443j692083n55906J52959j578378k649002q80316J678193
31713c661673K575485J632935m22619k296182j754145J657450M765270M693042
31705G189563K592158O30635j479201l586235k966203M75593J434522k821725
31697A469107o266737k593858M219028N565187J239356j634750o88415m90355
31689H18563l067277m537413k183910J808227M625224N361963L313429q44111
31681E294695k778806P81789N767595N258389m66273m665092m146250j833930
$$ y = [1823892, 3160848, 1545595, 2368669, 5627301, 5087690, -216156, -3611925, -1663817, 1476737, 2631069, 3955337, 6044918, 4889229, -463597, -4272237, -2453078, 1285417, 1862860, 170777, -385129, -232170, -1810548, -4459550, -5339866, -3661673, -1086188, 546747, 124128, -2172054, -3926199, -2268749, 2496521, 7189563, 9781721, 10412356, 8933155, 5346920, 2380717, 2856310, 4290832, 1469107, -4797630, -7391488, -3172460, 2392727, 3632083, 1997333, 1308918, 818563, -2248714, -6786127, -8970037, -7161810, -2536586, 2825377, 6138806, 5294695, 2515889, 3297678, 9065273, 14323662, 13857389, 9192297, 5046047, 3212117]
31673C212117Q73J821167K350140m15959l431215j556144L081126K820946l146766
31664D736285o704547l521617P12869M78845j212318K98295K883634K013727j374697
31655a689524l054996k090176n32309O80293J731835K252412K412588L147762
31647B857885L478727J049362k947580l654613K57186L586212J754363k855512
31639C526030m783959k453353J509664M012955L392167L56473j620371M900K400038
31630F344544R44268k840767l109119M8277O4675m213210n055747J207721O622600
31621A3242L779258k211986k399973J606931J677754k665901m469324j772464
31613f442463J27186j204004j813633P70522L566637L817734K567046R41001j717112
$$ y = [3212117, 3212990, 5034157, 7384297, 6968338, 3537123, 1980979, 5062105, 7883051, 4736285, -1968262, -5489879, -4777010, -4298165, -5510483, -5212188, -2328554, -314827, -1689524, -4744520, -6834696, -7367005, -6686712, -4954877, -2702465, -289877, 2857885, 6336612, 7385974, 4438394, 783781, 1040967, 4627179, 6381542, 3526030, -1257929, -3711282, -2201618, 1811337, 5203504, 5559977, 3939606, 3944506, 6344544, 7288812, 4448045, 1338926, 1387203, 1451878, -2761332, -7817079, -6609358, 13242, 3792500, 1580514, -819459, 787472, 2465226, -200675, -4669999, -6442463, -6315277, -7519281, -9332914, -8562392, -4995755, -1178021, 1389025, 2330026, 612914]
31604F12914m404685m106604o83801K041028J647685o2817q01692q21320r68455
31595g547747q12539O1533J229171K398193L159900K231132n83203k664231j860926
31586d388717k49282r79709k796727k171155L49071J242469P00701K041331M316772
31577a935246K444194l607370o688308k781092K749361L544130J454814J926937
31569b892580M467769M193126N59087j917507j121047J58365k66482q36503K0159
31560B364387J004298P05337J33668L62497J61821j557310k920428j675451O14100
31551h07081M39665j752663j473742K593642N187964J605376m612492n923676
31543d743007j467476K099017R00831j055272M34002K723302J504960j412984
$$ y = [612914, -3791771, -7898375, -8582176, -6541148, -4893463, -4956280, -5757972, -6579292, -7547747, -8360286, -8298753, -7069582, -4671389, -1511489, 719643, 136440, -2527791, -4388717, -4637999, -5617708, -8414435, -10585590, -10236519, -8994050, -8293349, -6252018, -1935246, 508948, -3098422, -9786730, -12567822, -9818461, -6274331, -4819517, -2892580, 1575189, 5768315, 6327402, 4409895, 3288848, 3447213, 3180731, 2344228, 2364387, 3368685, 4074022, 4207690, 4570187, 4732008, 3174698, 254270, -1421181, -807081, -367416, -2120079, -3593821, -1000179, 4187785, 5793161, 1180669, -4743007, -6210483, -4111466, -3210635, -4265907, -3831905, -1108603, 396357, -1016627]
31535a016627j381062Q58416O61252k034176k287947J413816M346252K716588
31527C276512j373944m042319m294856k550533J272723N574749O610406L176670
31519G649408j051368k516027k340437l085879l757401j797713J670192K634485
31511b594740m1937k925538k612465L06759K728558K934813J893391J223979R47357
31502A860177j52917k293195l975531l897863k336548k6137K581238L960104K034387
31493b246285j838857k406511K446004O971161M662677k085507n273813k890851
31485b661982m08710q98264j138998J026940K766942K214691J685003K124897
31477D710519R46870j613350j090519K602715K855440k538793o004464k255143
$$ y = [-1016627, -2397689, -1539273, -878021, -2912197, -5200144, -3786328, 559924, 3276512, 1902568, -2139751, -6434607, -8985140, -7712417, -2137668, 4472738, 7649408, 6598040, 4082013, 1741576, -1344303, -5101704, -6899417, -5229225, -2594740, -2636677, -5562215, -8174680, -7867921, -5139363, -2204550, -311159, 912820, 1860177, 1707260, -585935, -4561466, -8459329, -10795877, -10822014, -8240776, -4280672, -2246285, -4085142, -6491653, -4045649, 2925512, 7588189, 5502682, 228869, -2661982, -3070692, -3968956, -5107954, -4081014, -1314072, 900619, 2585622, 4710519, 5657389, 4044039, 2953520, 5556235, 8411675, 5872882, -131582, -2386725]
31469b386725K254845O8403m443160k852068K756114M069032R41203k22795O71843
31460H56692j460626m627970j630123N692148P112315P68710l448541n29053K153356
31451D886908j018746m152923j175688L379275K952477j48484o73735p5326j970703
31442B003055m036974k513687L28187O80121K15988J559345K101081k22111p54688
31433f39683L730638O425647K18935q586316p917780J332608O408226K027995
31425C000270l469931k976712j86815m84794j974751r17068J205217J453706Q65024
31416c485854J396385J735259K29812j494693j228785M27116J834011K616546
31408B029797K428407N73306j666255j673337K98451J132480k4340p82077n65850
$$ y = [-2386725, -131880, -63477, -4506637, -7358705, -4602591, -533559, 407644, 184849, 856692, -603934, -5231904, -6862027, -1169879, 5942436, 6711146, 3262605, 2733552, 4886908, 3868162, -284761, -1460449, 1918826, 4871303, 4722819, 4049084, 3973758, 2003055, -2033919, -4547606, -4219419, -3539298, -3323310, -1763965, 337116, 115005, -639683, 3090955, 9516602, 9735537, 1149221, -6768559, -5435951, 972275, 3000270, -469661, -3446373, -3633188, -4117982, -6092733, -7009801, -5804584, -4350878, -3485854, -2089469, -354210, -124398, -1619091, -2847876, -2420760, -586749, 2029797, 4458204, 5031510, 3365255, 1691918, 1990369, 3122849, 3098509, 2316432, 1750582]
31399A750582j728168m069164l613399O38967L935747K914684N92163N38895R28001
31390A888308r90284k788708q35946K714102K826517l72389k275458j623440j822761
31381c280059m044499m500710o04669M330550N457627K875806O17129L90090l02522
31372I38743l214530n434894l018045K602594N351083K542750j229896p44168
31364b206363K230127J991314k052594m344795j399289L421502M765325J592718
31356C997945k865049m885125k899293J366717L748636J835359j630862k075837
31348c407509O27321K510617J669982l9511j324268k695130k981358Q6458M534516
31339a018882M804258j10578m232555k851699J508258M060327M042685L029428
$$ y = [1750582, 22414, -4046750, -7660149, -7021182, -3085435, -170751, 421412, 960307, 1888308, 898024, -1890684, -2726630, -12528, 2813989, 2441600, 166142, -1457298, -3280059, -7324558, -11825268, -12429937, -8099387, -2641760, 234046, 851175, 1241265, 938743, -2275787, -7710681, -10728726, -8126132, -2775049, -232299, -1462195, -2206363, 23764, 2015078, -37516, -4382311, -5781600, -2360098, 2405227, 3997945, 1132896, -3752229, -6651522, -5284805, -1536169, 299190, -1331672, -3407509, -2780188, -269571, 1400411, 1360900, 36632, -2658498, -5639856, -5553398, -1018882, 3785376, 3674798, -557757, -3409456, -1901198, 2159129, 6201814, 9231242]
31331I231242J317621q12539j983989k321977l206491l026433J135661N900641
31323F233736L413009n636344r535582k224336O156314M039662l850053m716902
31315f120496J831224M576953j99145l769938l91166M263440L695932j06505k387654
31306A392645k750904k109270O18901M170589L449797k601101o864047l176045
31298g869435M462488P285707L455212j057959j631022Q4035L00330j758383l826174
31289e55201l657788j292266J152312J909604J570860J695967J894141L91846
31281C109475k331786l113140n16057K522195K289450q03993k859488j577380
31273c280724R79442J267653j005085k438081o99568J864688J379203j873248
$$ y = [9231242, 10548863, 9736324, 7752335, 5430358, 2223867, -802566, 333095, 6233736, 9646745, 4010401, -5525181, -7749517, -1593203, 2446459, -1403594, -6120496, -4289272, 287681, 88536, -3681402, -4072568, 190872, 3886804, 3780299, 1392645, -1358259, -3467529, -2848628, 1321961, 4771758, 2170657, -4693390, -7869435, -3406947, 3878760, 7333972, 6276013, 4644991, 4729026, 5029356, 3270973, -555201, -4212989, -5505255, -4352943, -2443339, -872479, 823488, 2717629, 3109475, 777689, -2335451, -2851508, -329313, 1960137, 1156144, -1703344, -3280724, -2301282, -1033629, -2038714, -4476795, -5176363, -3311675, -1932472, -3805720]
31265c805720m017652l435978j985952j04363L935305Q132068O481222j364676
31257C834254o281041j618890O161554O370817l91630m495283k602603p27191
31249B49987k126606k276258J675851N212755M020969L57171j922459k768963
31241B422447k916945j181492J588183J354334k356081l794942M75181N263977
31233H54662M093811j141418l423491p41391K488142K568740K61004j967389k596953
31224C95717j274658P90537J138984j009354k935200j569629K335290M992020
31216B863707L913032J88784k888869k738467R6426K197747J100649j455455j896408
31207A381146J66730J813131J258762m66646j939530k406764j012430J687375
$$ y = [-3805720, -7823372, -11259350, -13245302, -13349665, -9414360, -1282292, 5198930, 3834254, -2446787, -4065677, 2095877, 8466694, 8075064, 3579781, 977178, 249987, -1876619, -4152877, -2477026, 2735729, 6756698, 7113869, 5191410, 2422447, -494498, -1675990, -87807, 1266527, -1089554, -4884496, -4409315, 854662, 4948473, 3807055, 383564, -357827, 2130315, 4699055, 4960059, 2992670, 395717, -878941, -88404, 1050580, 41226, -2893974, -4463603, -2128313, 2863707, 6776739, 6965523, 4076654, 1338187, 1434613, 3632360, 4733009, 3277554, 1381146, 1547876, 3361007, 4619769, 4153123, 2213593, -193171, -1205601, 481774]
31199D81774K415122n95105l362098j266941K870776K301236k616886m497845
31191d269967p40513K929538K679775J863305K826145J885259k768938n893600
31183a488996l535187L04700J069130R70371K780495L202279l73764l031327l89573
31174d91872K505789n76201n328209l690744J917317K524434j801976k296649
31166g238111L029070O176120L074911m32613O5643L23002l362816o225448k873118
31157g463360L000645L746832q39684l588848j81777N596086P141115K669932
31149A0080941l291891n091632j965762J725978K230930M21232r95404j546093
31141A568299j813326r81383Q74391O08325l411822o687664l861314K775940N818550
$$ y = [481774, 2896896, 2301791, -1060307, -2327248, 543528, 2844764, 227878, -4269967, -5010480, -2080942, 598833, 2462138, 5288283, 7173542, 4404604, -1488996, -5024183, -4719483, -3650353, -2679982, 100513, 3302792, 2929028, -102299, -491872, 2013917, 1437716, -3890493, -7581237, -5663920, -3139486, -4941462, -7238111, -4209041, 1967079, 5041990, 4609377, 4675020, 4998022, 1635206, -4590242, -7463360, -4462715, -715883, -1555567, -5144415, -5326192, 269894, 7411009, 10080941, 6789050, 1697418, -268344, 1457634, 3688564, 4109796, 3114392, 1568299, -245027, -1226410, -352019, 256306, -3155516, -9843180, -13704494, -10928554, -5110004]
31132e110004L241686L57153R30302K414862J643153j14304l26459N33854M45088
31123D015331j051849k833202l334168j322441K300170M010712J855966q65167
31115B775352J17930L077927K392262k575320n896445l356226K213372N242534
31107C991386L438041j404708n271715m281648J399030O060719M444028j376418
31099F998715n062411m613783k740115j56159M555677Q648151O602701o61378
31091A3571398n315815l662076o29800n38263o80909J857119L779784J283981
31083I665419l040697m357219k660342j036559l46415J84072K82093J26495J279219
31074I6066L191716K665039m17879j531458J074884K693626k2244l059034j962871
$$ y = [-5110004, -1868318, -1511165, -580863, 1833999, 3477152, 3362848, 3036389, 3570243, 4015331, 2963482, 130280, -3203888, -4526329, -2226159, 1784553, 3640519, 2775352, 2893282, 5971209, 8363471, 5788151, -108294, -3464520, -1251148, 3991386, 7429427, 6024719, 753004, -3528644, -2129614, 3931105, 8375133, 6998715, 1936304, -2677479, -5417594, -5573753, -1018076, 7630075, 14232776, 13571398, 8255583, 4593507, 3963707, 3425444, 2744535, 4601654, 8381438, 9665419, 6624722, 2267503, -392839, -1429398, -1775813, -1591741, -1309648, -1183153, 96066, 3287782, 5952821, 5534942, 4003484, 5078368, 7771994, 7749750, 4690716, 2727845]
31065B727845M66920n80130l522324l724767j434009K15670J654802M494473N933954
31056F232434K945804o86389N60794L944335K067625m592637p769649m287710
31048a585393Q4548J155872J827381M072873L799815j353321n812603l645014
31040a455842K252965M389910J038029l013008l999531k464536j13137K007155
31032a357995K341036k36567l731952m324197j243864K000211K303491Q11138
31024c438699N21700J623258J618123k40110j347888K26399K356682J826899p57262
31015B389102k088622j512385j540766k742370k311914P46398L126306K427845
31007a506406J043567J578103K031044j95932k632897j362335J815930J724151
$$ y = [2727845, 3194765, 2614635, -907689, -4632456, -6066465, -5850795, -4195993, 298480, 6232434, 9178238, 8491849, 9052643, 12996978, 15064603, 10471966, 2702317, -1585393, -1500845, -344973, 1482408, 5555281, 9355096, 8001775, 2189172, -1455842, 797123, 5187033, 6225062, 3212054, -787477, -3252013, -3365150, -1357995, 983041, 746474, -2985478, -7309675, -8553539, -6553328, -4249837, -3438699, -2916999, -1293741, 324382, 84272, -1263616, -1037217, 1319465, 3146364, 2389102, 300480, -1211905, -2752671, -5495041, -7806955, -7060557, -3934251, -1506406, -462839, 1115264, 3146308, 2950376, 317479, -1044856, 771074, 2495225]
30999B495225j600262k763718J30008K415672M37109k900473k908859L02252K956048
30990a436998K750736L37999k457442l830400k828732m62827J245435J963137
30982d719092K955805L851334K250248k072970n300116m152874m01193J683834
30974e905024J047700L39704J215235J932781M33788k128397k643624k97213K157499
30965c847551K013233J42488n81225M68774J243035O57952o3089k38980q83181
30956a088544j790128q42632J699360J816600k149512n355742k770120K999306
30948g481412N247512K783740N00969J127117K039135O63249j934578l692576
30940g46844l701446j404553K345565L742427K04683m269229l317555K322254
$$ y = [2495225, 894963, -1868755, -1738747, 676925, 1114034, -1786439, -4695298, -4393046, -1436998, 1313738, 1651737, -805705, -4636105, -7464837, -7927664, -6682229, -4719092, -1763287, 2088047, 4338295, 2265325, -3034791, -7187665, -7588858, -5905024, -4857324, -4517620, -3302385, -1369604, -935816, -3064213, -5707837, -6005050, -3847551, -1834318, -1691830, -2273055, -1804281, -561246, 96706, 33617, -205363, -1088544, -2878672, -3721304, -2021944, -205344, -2354856, -7710598, -10480718, -7481412, -2233900, 549840, 1050809, 2177926, 4217061, 4880310, 2945732, -746844, -4448290, -5852843, -3507278, 235149, 439832, -3829397, -7146952, -4824698]
30932d824698N609639L693898P73593l67574j857866l677742j574757M076513
30924A851006N612755k24422n524674k844487L223539L938022k4803j774652m14572
30915C817712m51454j945017q99449J962268J897680j047839k357822j504638
30907e28559j629653j577028K338803O792795M221801l570892n793016K05109
30899D59360L697017k006200q033455m156076M796307P139900K378558k86863
30891C988548K230787L841201J058521k218812k700249k203658k378750j736988
30883a19400j0973K37862j490185k006388J77466K057831R14696j639259k489471
30874d367821j130224Q15887K014363K083556J478487J138861Q81301r25649l948781
$$ y = [-4824698, 784941, 4478839, 5252432, 4884858, 3026992, -650750, -2225507, 1851006, 7463761, 7239339, 1714665, -1129822, 2093717, 6031739, 6006936, 4232284, 3817712, 3366258, 1421241, 521792, 2484060, 4381740, 3333901, 976079, -528559, -2158212, -3735240, -1396437, 5396358, 9618159, 6047267, 254251, 459360, 4156377, 2150177, -5883278, -10039354, -5243047, 1896853, 4275411, 3988548, 6219335, 10060536, 11119057, 8900245, 6199996, 3996338, 1617588, -119400, -130373, 107489, -1382696, -3389084, -3211618, -1153787, -239091, -1878350, -4367821, -5498045, -4682158, -2667795, -584239, 894248, 2033109, 2914410, 1988761, -1960020]
30865a960020m148914O62126N344086L087102m036852o684036j397632M579887
30857d554253M270785L10661r10959R60455J840368Q33381L19804M72318p20418
30848B822142k703901k465666N07031L196846L298618J459942q49213k862986
30840B402813l570212j819903J702529M155419L039574j350471n781163o311639
30832g533053j841484M137127O728707M838798J339224j698856m490354n826534
30824d346425k802295L337977N996790J901702l212344k578248J576214K018938
30816A892309k080745m609443k353464J373008L174035L448312K806469K24497
30808C874978l487028m904687k468533J586796M469285M797001J807766l240217
$$ y = [-1960020, -6108934, -5446808, -102722, 2984380, -1052472, -7736508, -9134140, -4554253, -283468, 27193, -883766, 76689, 1917057, 2750438, 3070242, 3542560, 2822142, 118241, -2347425, -1840394, 1356452, 4655070, 6115012, 5265799, 2402813, -1167399, -2987302, -1284773, 2870646, 5910220, 4559749, -1221414, -7533053, -9374537, -5237410, 1491297, 6330095, 7669319, 5970463, 1480109, -4346425, -7148720, -3810743, 2186047, 4087749, 875405, -1702843, -126629, 1892309, -188436, -4797879, -7151343, -5778335, -2604300, 844012, 3650481, 3874978, 387950, -4516737, -6985270, -5398474, -929189, 3867812, 5675578, 2435361]
30800B435361n609982k074597L259026L835654O04683M8358K587622J783830l404248
30791C465707n334572n41901L569252Q15837l516890k066580K246379K120738
30783G57970j419695j787212J344219K407184N8271j801805j890121k355017k638211
30774g324417l22859K494563J380986k197498k519631N90769J648617l41117j29266
30765f719853L755034N697935K654491o52134K193J755708O63329j716447k276457
30756C163799j672248j205500P28775M416395N570640J426722l633737l777328
30748E017518j12033J703578l1730j931858j498926K28527J352800J016284q36303
30739D907857l128636l951082k906023j677187j092267j05042J127162O86139
$$ y = [2435361, -3174621, -5249218, -1990192, 1845462, 2450145, 2498503, 5086125, 6869955, 3465707, -1868865, -2410766, 1158486, 1974323, -1542567, -3609147, -1362768, 757970, -661725, -2448937, -1104718, 1302466, 1360737, -441068, -2331189, -4686206, -7324417, -7647276, -5152713, -3771727, -5969225, -8488856, -7898087, -6249470, -6590587, -6719853, -2964819, 2733116, 5387607, 4735473, 4737666, 6493374, 7156703, 5440256, 3163799, 1491551, 286051, 1014826, 5431221, 11001861, 12428583, 8794846, 5017518, 4905485, 6609063, 6577333, 4645475, 3146549, 3375076, 4727876, 5744160, 4907857, 1779221, -2171861, -5077884, -6755071, -7847338, -7952380, -6825218, -6139079]
30731f139079q89424j32087L137720M015338M27817k435300m47745K009206n38208
30722i91762m413758k219273M392438O520661J800558k627995j870938M06517
30714I96448k49813k416632l147351k760370j821462J102018N035428N182864
30706A921130J64315l908396j420276M269300N454529P27612m060693m166853
30698a019332p17522K472330L041447Q82460k311985l915911k659813j22639J229142
30689c121823Q93561J89143K88639J433107K852946K657125l66160l978415m087234
30680c239111m36465K473462K156720J940262M562653O057825J583484n421480
30672I677350o836847j839386J910136k7565l134795k529144m88119q49461j574042
$$ y = [-6139079, -7028503, -7160590, -4022870, -7532, 420285, -2015015, -2462760, -453554, -991762, -5405520, -7624793, -3232355, 3288306, 5088864, 2460869, 589931, 996448, 746635, -1669997, -4817348, -7577718, -9399180, -8297162, -3261734, 1921130, 2085445, -1822951, -3243227, 1026073, 6480602, 7208214, 3147521, -1019332, -1736854, 735476, 3776923, 4659383, 2347398, -1568513, -4228326, -4350965, -3121823, -2228262, -2039119, -1750480, -317373, 2535573, 5192698, 4826538, 848123, -3239111, -3675576, -1202114, 954606, 2894868, 7457521, 13515346, 15098830, 9677350, 2840503, 1001117, 2911253, 2883688, -251107, -2780251, -3268370, -4117831, -5691873]
30663e691873R46854M078043K538569k111435k976977J176700L702585P26420
30655B388886k762801j318401K156394J677302j566292j175782L514299N610344
30647H523949J141528m749492n337277j459214J207317R84420J158507L158063
30639D627801L944935J285266k333356l198165j272458O56608J087541P14763
30631E512935Q8723j211508k864763l189545j268916J248953J683993l80028k274620
30622b654776j287484J997177M316587L577164R27454j289645k182565j956838
30614A447074m70092J975344L371976J898677j188158k877744k593260k458743
30606h94926l072418k211734Q42448K858830J157730j819225j761375J129515
$$ y = [-5691873, -4745019, -666976, 1871593, -239842, -3216819, -2040119, 1662466, 2388886, -373915, -1692316, 464078, 2141380, 575088, -600694, 2913605, 8523949, 9665477, 4915985, -421292, -1880506, -673189, 311231, 1469738, 4627801, 8572736, 9858002, 7524646, 4326481, 3054023, 3710631, 4798172, 5512935, 5601658, 4390150, 1525387, -1664158, -2933074, -1684121, -128, -380156, -2654776, -3942260, -1945083, 2371504, 5948668, 6876122, 5586477, 3403912, 1447074, 976982, 2952326, 6324302, 8222979, 7034821, 4157077, 1563817, -894926, -3967344, -6179078, -5336630, -2477800, -1320070, -3139295, -4900670, -3771155]
30598c771155K669835J141392n36148L06018K389772L145186K348017J149688
30590H842605m16844k590347l939485k914289q09011n78239k457763l203050p44971
30581h811394K444694K522218m38837k732106k308721j068354r54231m76321K365564
30572i457488N442629M484027l12358l499108j749514J428155J186000j240769
30564c718426q69878K566786L659719k21319m213841k617135K888309N442168
30556B916383K009546l453553n690819l864044q11766J002988J342030J165479
30548e383756J061482O72269m39508j358504k91882K554851L968813J697770j723533
30539G58002k226824o08921j290927m142906l143362L824781R351717O234322
$$ y = [-3771155, -1101320, 40072, -496076, -190058, 2199714, 5344900, 7692917, 8842605, 8425761, 5835414, 1895929, -1018360, -1827371, -2405610, -4863373, -8066423, -8811394, -6366700, -3844482, -4283319, -7015425, -9324146, -10392500, -11346731, -11823052, -9457488, -4014859, 469168, 156810, -3342298, -5091812, -3663657, -2477657, -3718426, -4588304, -2021518, 1638201, 1416882, -2796959, -5414094, -2525785, 2916383, 4925929, 1472376, -4218443, -8082487, -8894253, -7891265, -6549235, -5383756, -4322274, -3650005, -4089513, -5448017, -5739899, -3185048, 783765, 2481535, 758002, -1468822, -2077743, -3368670, -7511576, -10654938, -6830157, 2521560, 8755882]
30531H755882j256959l207107J105368K936043j305723m747667k305575J079519
30523A053781Q8009j416363J558579M407286M33821n671921l794735M167656N751974
30514F578087k094156p593383l018091L432984K137722k348351n92558M789511
30506A291765L883445l052897n436989Q98674P797135P210558P35499n407203
30498G919987p529325m566952K137052O910326M008780l837388p244492k865996
30490e068008K218297J755036r64063k44197K350688J667959j911097l428682
30482c624067j162113J958349L370266K906890R49997j721468l225959k632402
30474c180507j445127q43318L52490K633942L702389K416287J635223L413504
$$ y = [8755882, 7498923, 4291816, 5397184, 8333227, 7027504, 2279837, -25738, 1053781, 1141790, -274573, 1284006, 5691292, 6125113, 453192, -3341543, 826113, 6578087, 4483931, -3109452, -6127543, -2694559, -556837, -2905188, -3497746, 1291765, 5175210, 2122313, -3314676, -2416002, 5381133, 12591691, 13327190, 7919987, 390662, -4176290, -2039238, 4871088, 8879868, 5042480, -2202012, -5068008, -2849711, -1094675, -2058738, -2302935, 47753, 1715712, -195385, -3624067, -4786180, -2827831, 542435, 3449325, 4399322, 2677854, -548105, -3180507, -4625634, -5468952, -5116462, -2482520, 1219869, 3636156, 5271379, 8684883]
30466H684883M506952J133213m447945o927260n356567k752026m01001K205071
30458c354680L566904J996474J4076J125093L110698P66852m909095o896051k434359
$$ y = [8684883, 13191835, 14325048, 9877103, 2949843, -2406724, -5158750, -5559751, -3354680, 212224, 2208698, 2222774, 3347867, 6458565, 7225417, 2316322, -4579729, -7014088]
$$ [...]
##END NTUPLES=NMR SPECTRUM
##END=
