##TITLE=31Pdec_38-2025-Bay
 DMSO-d6, 24 sc
 26.3.2025
##JCAMPDX= 6.0         $$ Bruker NMR JCAMP-DX V2.0
##DATA TYPE= NMR SPECTRUM
##DATA CLASS= NTUPLES
##ORIGIN= UXNMR, Bruker Analytische Messtechnik GmbH
##OWNER= root
$$ XWIN-NMR		Version 3.5
$$ Wed Mar 26 15:51:56 2025 Russian Standard Time (UT+4h)  she@DPX200
##.OBSERVE FREQUENCY= 81.013821
##.OBSERVE NUCLEUS= ^31P
##.ACQUISITION MODE= SIMULTANEOUS
##.ACQUISITION SCHEME= undefined
##.AVERAGES= 24
##.DIGITISER RES= 17
##SPECTROMETER/DATA SYSTEM= spect
##.PULSE SEQUENCE= zgpg30
##.SOLVENT NAME= CDCl3
##.SHIFT REFERENCE= (INTERNAL, CDCl3, 0, 198.062)
##AUDIT TRAIL= $$ (NUMBER, WHEN, WHO, WHERE, WHAT)
$$ ##TITLE= Audit trail, XWIN-NMR		Version 3.5
$$ ##JCAMPDX= 5.01
$$ ##ORIGIN= Bruker BioSpin GmbH
$$ ##OWNER= she
$$ F:/spectra/data/she/nmr/P31/2/pdata/1/auditp.txt
$$ ##AUDIT TRAIL=  $$ (NUMBER, WHEN, WHO, WHERE, WHAT)
(   1,<2025-03-26 15:50:44.67 +0400>,<she>,<DPX200>,
      <created by zg, POWCHK disabled, PULCHK disabled
       configuration hash MD5:
       00 E9 B6 7A A2 85 ED C7 34 08 36 98 17 FE 4E 26
       data hash MD5: 32K
       F7 C3 03 28 C6 98 17 E2 B3 48 89 2C B7 BA 71 4C>)
(   2,<2025-03-26 15:50:47.10 +0400>,<she>,<DPX200>,
      <Start of raw data processing
       efp BC_mod = 2 LB = 1.5 FT_mod = 6 PKNL = 1 PHC0 = 1314.703 PHC1 = 361.8942 SI = 64K 
       data hash MD5: 64K
       9E 3B E7 3F 7B 44 B5 0C 30 F1 FC 4A 71 A2 BC 25>)
(   3,<2025-03-26 15:51:20.51 +0400>,<she>,<DPX200>,
      <pk PHC0 = 35.0567 PHC1 = -177.4 
       data hash MD5: 64K
       50 92 23 03 90 FD C0 4E 07 55 A5 4E C2 B2 BC EC>)
(   4,<2025-03-26 15:51:24.03 +0400>,<she>,<DPX200>,
      <abs ABSG = 5 
       data hash MD5: 64K
       F2 58 0A 53 E9 08 E4 BE BD F0 CA 81 B5 8E F2 40>)
$$ ##END=
$$ 
$$ hash MD5
$$ 9A F6 35 5F 42 A2 CE 3A CA 21 99 F7 A9 03 98 14
##$RELAX= 
##$RELAX= 
##$RELAX= 
##$RELAX= 
##$RELAX= 
##$RELAX= 
##$RELAX= 
##$RELAX= 
$$ Bruker specific parameters
$$ --------------------------
##$DU= <F:/spectra>
##$EXPNO= 2
##$NAME= <P31>
##$PROCNO= 1
##$TYPE= <nmr>
##$USER= <she>
##$AMP= (0..31)
100 100 100 100 100 100 100 100 100 100 100 100 100 100 100 100 100 100 
100 100 100 100 100 100 100 100 100 100 100 100 100 100 
##$AQSEQ= 0
##$AQ_mod= 1
##$AUNM= <au_zg>
##$AUTOPOS= <>
##$BF1= 81.014009
##$BF2= 200.13
##$BF3= 200.13
##$BF4= 200.13
##$BF5= 200.13
##$BF6= 200.13
##$BF7= 200.13
##$BF8= 200.13
##$BYTORDA= 1
##$CFDGTYP= 0
##$CFRGTYP= 5
##$CHEMSTR= <none>
##$CNST= (0..31)
1 1 145 1 1 1 1 1 1 1 1 1 1 1 1 1 1 1 1 1 1 1 1 1 1 1 1 1 1 1 1 1 
##$CPDPRG= <waltz16>
##$CPDPRG1= <>
##$CPDPRG2= <waltz16>
##$CPDPRG3= <>
##$CPDPRG4= <mlev>
##$CPDPRG5= <mlev>
##$CPDPRG6= <mlev>
##$CPDPRG7= <mlev>
##$CPDPRG8= <mlev>
##$CPDPRGB= <>
##$CPDPRGT= <>
##$D= (0..31)
0 1 0 0 0 0 0 0 0 0.06 0 0.03 2e-05 3e-06 0 0 0.0002 0 0 0 0 0 0 0 0 0 
0 0 0 0 0 0 
##$DATE= 1742989844
##$DBL= (0..7)
120 120 120 11 120 120 24 19 
##$DBP= (0..7)
150 150 150 150 150 150 150 150 
##$DBP07= 0
##$DBPNAM0= <>
##$DBPNAM1= <>
$$ [...]
##$SUBNAM3= <"">
##$SUBNAM4= <"">
##$SUBNAM5= <"">
##$SUBNAM6= <"">
##$SUBNAM7= <"">
##$SUBNAM8= <"">
##$SUBNAM9= <"">
##$SW= 400.765351723535
##$SWIBOX= (0..15)
0 1 3 0 0 0 0 0 0 0 0 0 0 0 0 0 
##$SW_h= 32467.5324675325
##$TD= 32768
##$TD0= 1
##$TE= 0
##$TE2= 300
##$TE3= 300
##$TEG= 300
##$TL= (0..7)
0 120 53 12 22 120 120 120 
##$TP= (0..7)
150 150 150 150 150 150 150 150 
##$TP07= 0
##$TPNAME0= <>
##$TPNAME1= <>
##$TPNAME2= <>
##$TPNAME3= <>
##$TPNAME4= <>
##$TPNAME5= <>
##$TPNAME6= <>
##$TPNAME7= <>
##$TPOAL= (0..7)
0.5 0.5 0.5 0.5 0.5 0.5 0.5 0.5 
##$TPOFFS= (0..7)
0 0 0 0 0 0 0 0 
##$TUNHIN= 0
##$TUNHOUT= 0
##$TUNXOUT= 0
##$USERA1= <user>
##$USERA2= <user>
##$USERA3= <user>
##$USERA4= <user>
##$USERA5= <user>
##$V9= 5
##$VALIST= <valist>
##$VCLIST= <CCCCCCCCCCCCCCC>
##$VD= 0
##$VDLIST= <DDDDDDDDDDDDDDD>
##$VPLIST= <PPPPPPPPPPPPPPP>
##$VTLIST= <TTTTTTTTTTTTTTT>
##$WBST= 1024
##$WBSW= 4
##$XGAIN= (0..3)
0 0 0 0 
##$XL= 0
##$YL= 0
##$YMAX_a= 6474
##$YMIN_a= -6059
##$ZGOPTNS= <>
##$ZL1= 120
##$ZL2= 120
##$ZL3= 120
##$ZL4= 120
##$ABSF1= 198.0616
##$ABSF2= -202.7028
##$ABSG= 5
##$ABSL= 3
##$ALPHA= 0
##$AQORDER= 0
##$ASSFAC= 0
##$ASSFACI= 0
##$ASSFACX= 0
##$ASSWID= 0
##$AUNMP= <proc_1d>
##$AZFE= 0.1
##$AZFW= 0.5
##$BCFW= 0
##$BC_mod= 2
##$BYTORDP= 0
##$COROFFS= 0
##$CY= -3
##$DATMOD= 1
##$DC= 0
##$DFILT= <>
##$DTYPP= 0
##$F1P= 0
##$F2P= 0
##$FCOR= 1
##$FTSIZE= 65536
##$FT_mod= 6
##$GAMMA= 0
##$GB= 0
##$INTBC= 1
##$INTSCL= 9.790993e-09
##$ISEN= 30
##$LB= 1.5
##$LEV0= 0
##$LPBIN= 0
##$MAXI= 10000
##$MC2= 0
##$MEAN= 0
##$ME_mod= 0
##$MI= 50
##$NCOEF= 0
##$NC_proc= -6
##$NLEV= 6
##$NOISF1= 182.463
##$NOISF2= 159.3651
##$NSP= 0
##$NTH_PI= 0
##$NZP= 0
##$OFFSET= 198.0616
##$PC= 4
##$PHC0= 1349.76
##$PHC1= 184.4942
##$PH_mod= 1
##$PKNL= yes
##$PPARMOD= 0
##$PSCAL= 0
##$PSIGN= 0
##$REVERSE= no
##$SF= 81.0140089999434
##$SI= 65536
##$SIGF1= 159.3651
##$SIGF2= -187.1042
##$SINO= 113.3802
##$SIOLD= 16384
##$SREGLST= <1H.CDCl3>
##$SSB= 0
##$STSI= 65536
##$STSR= 0
##$SW_p= 32467.5324675325
##$SYMM= 0
##$S_DEV= 0
##$TDeff= 32768
##$TDoff= 0
##$TI= <>
##$TILT= no
##$TM1= 0
##$TM2= 0
##$TOPLEV= 0
##$USERP1= <user>
##$USERP2= <user>
##$USERP3= <user>
##$USERP4= <user>
##$USERP5= <user>
##$WDW= 1
##$XDIM= 65536
##$YMAX_p= 489415420
##$YMIN_p= -3540734
$$ End of Bruker specific parameters
$$ ---------------------------------
##NTUPLES= NMR SPECTRUM
##VAR_NAME=  FREQUENCY,     SPECTRUM/REAL,   SPECTRUM/IMAG
##SYMBOL=    X,             R,               I
##VAR_TYPE=  INDEPENDENT,   DEPENDENT,       DEPENDENT
##VAR_FORM=  AFFN,          ASDF,            ASDF
##VAR_DIM=   65536,         65536,           65536
##UNITS=     HZ,            ARBITRARY UNITS, ARBITRARY UNITS
##FACTOR=    0.49542278885378, 1,            1
##FIRST=     16045.7642231865, 0,            0
##LAST=      -16421.768244346, 0,            0
##MIN=       -16421.768244346, -3540734,     0
##MAX=       16045.7642231865, 489415420,    0
$$ Real data points
##PAGE= N=1
##DATA TABLE= (X++(R..R)), XYDATA
$$ [...]
38964B81234K98259J31393k12814l54484k33692r9025n3235j2775k1727j84705
$$ 281234 579493 710886 498072 143588 -90104 -189129 -242364 -255139 -276866 -461571
38954d61571l37574k02987J41417L52768L61820L92412M49960K81681q5816k78917
$$ -461571 -799145 -1002132 -860715 -507947 -146127 246285 696245 977926 892110 613193
38944F13193j89346j56875l47008m46598k41218p730l357k7254J26883K32054
$$ 613193 423847 266972 -80036 -526634 -767852 -775582 -778939 -806193 -679310 -447256
38934d47256Q9130j3043J63914K24277k40162p71178n76626K21646P07315N22539
$$ -447256 -358126 -371169 -207255 17022 -223140 -994318 -1570944 -1349298 -641983 -119444
38924a19444K42109K62064K12197j56494l36126P5533N16891K17296n87320r62366
$$ -119444 122665 384729 596926 440432 104306 179839 696730 914026 326706 -635660
38914f35660n96217p4049J16330J33886K19863K25399m529k35400j77598P0505
$$ -635660 -1231877 -1305926 -1189596 -1055710 -835847 -610448 -614977 -850377 -1027975 -957470
38904i57470K15666K03833J94160K45536K74180K39310J76318J00128J2198o2257
$$ -957470 -741804 -537971 -343811 -98275 175905 415215 591533 691661 703859 641602
38894F41602j38123k59382l36666j78605J61136K86175k5093l80080k21287L57417
$$ 641602 503479 244097 -92569 -271174 -110038 176137 151044 -229036 -450323 -92906
38884i2906O72593L88664m4881r9075Q5191R103l85442o70890o01694m00467l22077
$$ -92906 579687 968351 923470 824395 909586 918689 533247 -137643 -739337 -1139804 -1461881
38873a461881k92884j42968O0932J24023L0125m0714N0274K55320L97499L19580
$$ -1461881 -1754765 -1897733 -1836801 -1712778 -1682653 -1723367 -1673093 -1417773 -1020274 -700694
38863g00694L3155k43228k68618l7438K22485L21681K66009J22028j09398l86218
$$ -700694 -667539 -910767 -1179385 -1216823 -994338 -672657 -406648 -284620 -394018 -780236
38853g80236n29288l93070q6281J13197P8857r323J18716M56657O39344L43171
$$ -780236 -1309524 -1702594 -1788875 -1675678 -1596821 -1606144 -1487428 -1030771 -391427 -48256
38843d8256k33410n04002k31255J31742J09473o1965J48451N94830N83831K2890
$$ -48256 -281666 -785668 -1016923 -885181 -775708 -837673 -689222 -94392 489439 512329
38833E12329l31557p2319J79270j58146n69344k63377M39661N29829r7586n02626
$$ 512329 180772 108453 287723 129577 -439767 -703144 -263483 266346 168760 -333866
38823c33866k03526J82792Q3393j53572r157L07733L11229O5201m1642K8245O2382
$$ -333866 -537392 -354600 -271207 -424779 -433936 -126203 185026 250227 208585 236830 299212
38812B99212O7848J14762p821m23310o79369k39355O27350J034190N97159j25409
$$ 299212 367060 481822 474001 50691 -628678 -868033 -240683 793507 1390666 1265257
38802A265257m05010j38447K61021M23929K94062M7264j10445j47552k27552m53228
$$ 1265257 860247 721800 982821 1406750 1700812 1748076 1637631 1490079 1262527 809299
38792H09299o83475p34753o30397m74333k39702R2755L62392M64439N70461P92836
$$ 809299 125824 -608929 -1239326 -1713659 -1953361 -1860606 -1498214 -1033775 -463314 329522
38782C29522Q37217M12853j74985l55731j42253q8843l78998n52908l07567L880
$$ 329522 1166739 1579592 1404607 1048876 906623 817780 438782 -114126 -421693 -417813
38772d17813k5027k24310k07269j1811M1088q1317r9113J13653L61298M28572
$$ -417813 -442840 -667150 -874419 -886230 -845142 -926459 -1025572 -911919 -550621 -122049
38762a22049L37948K68924L12820L32707J09457l01992m88959j78111K93489L51783
$$ -122049 215899 484823 797643 1130350 1239807 937815 448856 270745 564234 916017
38752I16017j5397k63779j24765P6933P3967O3126J82528J46835j63494k68575
$$ 916017 900620 636841 512076 589009 662976 726102 908630 1055465 891971 623396
38742F23396J72384O11712L19354m30844o84328k32159J23938j42835n44664m67371
$$ 623396 795780 1407492 1726846 1296002 611674 379515 503453 360618 -184046 -651417
38732f51417r9691M6940K2773K00543M61324L14763k29459n42287k54695K45881
$$ -651417 -751108 -704168 -681395 -480852 -19528 295235 65776 -476511 -731206 -485325
38722d85325M15053K38354L3951q3284j49968j0092M80867R72778Q60912J24168
$$ -485325 -70272 168082 202033 118749 -31219 -41311 439556 1412334 2273246 2397414
38712B397414n36008o10995m08504m31405n39597k46224L90746P66971N77816
$$ 2397414 1861406 1250411 841907 410502 -129095 -375319 15427 782398 1360214
38703A360214J33396k04032l93232m43112k76523l1220l7076k88260l53433j5503
$$ 1360214 1493610 1289578 896346 453234 176711 145491 108415 -179845 -533278 -548781
38693e48781M05991N62254M66054J87896l12610p91396p45994k09376R3451j52338
$$ -548781 -142790 419464 885518 1073414 760804 -30592 -776586 -985962 -892511 -1044849
38683a044849k69419K48231P00727K45976n73276n49618K50059N85836P3639k69608
$$ -1044849 -1314268 -1066037 -365310 -119334 -692610 -1242228 -992169 -406333 -332694 -602302
38673f02302J56941N08758j4274p57198o56562Q0062M08083R5572j27833J09598
$$ -602302 -445361 63397 49123 -708075 -1364637 -1284575 -876492 -780920 -908753 -799155
38663g99155L46187K03390n1882j01936j01052k79165m68921l79171o9818J65648
$$ -799155 -452968 -249578 -301460 -403396 -504448 -783613 -1252534 -1631705 -1701523 -1535875
38653a535875K48556L64680N92430P12008M90622N3247j96297n5804K29148L20893
$$ -1535875 -1287319 -922639 -330209 381799 872421 925668 729371 673567 902715 1223608
38643A223608K43168K55236L74089L38433N8867k14253k59695j50207n6908n0996
$$ 1223608 1466776 1722012 2096101 2434534 2493401 2279148 2019453 1869246 1812338 1761342
38633A761342j84174m78588p28882o13129j36387L15801M70317L93944J57235
$$ 1761342 1577168 1098580 369698 -243431 -379818 -64017 406300 800244 957479
38624I57479k75685o51907m65198K57153O95029K52802n52402p68630k65747K88669
$$ 957479 681794 29887 -435311 -178158 516871 769673 217271 -551359 -817106 -528437
38614e28437M78127M80383M39456J88093k80968o19872n92490l36516l5446K79206
$$ -528437 -50310 430073 869529 1057622 776654 156782 -435708 -772224 -807670 -528464
38604e28464M78840L10656j64570m44957j59632M42520P87271O07889J26738k65616
$$ -528464 -49624 261032 96462 -348495 -508127 -65607 721664 1329553 1456291 1190675
38594A190675l71384k94405k66015l41650l24463p8820K00097K26156M1290n5982
$$ 1190675 819291 524886 258871 -82779 -407242 -486062 -285965 -59809 -18519 -74501
38584g4501L8434J17745J0676j87366k66256j21671J59978L04401N2416m52582
$$ -74501 -36067 81678 92354 -95012 -361268 -482939 -322961 -18560 33856 -418726
38574d18726o62446k95334J94722K21162n2282J1460M40701N31477m4961o64217
$$ -418726 -1081172 -1376506 -1181784 -960622 -1012904 -1001444 -560743 -29266 -74227 -738444
38564g38444o22414p2662L40070L91263L48347L80785L75283K42849L5834j97095
$$ -738444 -1360858 -1433520 -1093450 -702187 -353840 26945 402228 645077 680911 483816
38554D83816l94167l89036j02819K28816K76330M1346j58188j15704N0125J22590
$$ 483816 89649 -299387 -402206 -173390 102940 144286 -13902 -129606 -79481 43109
38544D3109O0308n040N2147K17353L53997L51604K36437R1026p4153k45174k69112
$$ 43109 103417 98377 150524 367877 721874 1073478 1309915 1400941 1326788 1081614 812502
38533H12502j7494L10358L08740j16562n76621o67117m11700j13557M1069P4103
$$ 812502 795008 1105366 1414106 1297544 720923 53806 -357894 -471451 -430382 -356279
38523c56279O4446O3610O9461K481j78899l18902k13263N1296J57483K4910o8715
$$ -356279 -291833 -228223 -158762 -156281 -335180 -654082 -867345 -816049 -658566 -633656 -702371
38512g02371N8208K25914K34953J47973L4453k16245n56406o03563j69965L14182
$$ -702371 -644163 -418249 -183296 -35323 -870 -217115 -773521 -1377084 -1547049 -1232867
38502a232867L21147m2242k42514q1844J88234L68596M45832L13575j16703n21574
$$ -1232867 -911720 -953962 -1196476 -1278320 -1090086 -721490 -275658 37917 -78786 -600360
38492f00360m06972J48444M69475J80883k96381l70425k3686L40813M79299M12315
$$ -600360 -1007332 -858888 -389413 -208530 -504911 -875336 -899022 -558209 -78910 333405
38482C33405J91459q8682j93974j1210J68616l3245m79729n71484l6675O02088
$$ 333405 524864 436182 242208 230998 399614 366369 -113360 -684844 -721519 -119431
38472a19431O02036p3984o84844o01420k9452L20689J30302k20110k23032J42795
$$ -119431 482605 408621 -276223 -877643 -907095 -586406 -456104 -676214 -899246 -756451
38462g56451M87116N06733K39288p6807k29016j56141K9006J47436J31416M9289
$$ -756451 -269335 237398 476686 399879 170863 14722 43728 191164 322580 371869
38452C71869m8787j78217k77311k01918L2345J80118Q2365j06773j62759r4193
$$ 371869 323082 144865 -132446 -334364 -302019 -121901 -39536 -146309 -309068 -403261
38442d03261k6844M0812J44470J70137J3680j94178k63778k26033j91641q4330
$$ -403261 -430105 -389293 -244823 -74686 -61006 -255184 -518962 -744995 -936636 -1020966
38432a020966J80820L95929L06973O7377L6795J72313P2193l38051o33730n40238
$$ -1020966 -840146 -444217 -137244 -69867 -33072 139241 211434 -126617 -760347 -1300585
38422a300585l12483k44285j91941J00114M83800N74391K98623j8317p4631Q7013
$$ -1300585 -1613068 -1857353 -2049294 -1949180 -1465380 -890989 -592366 -610683 -685314 -598301
38412e98301J68718m6417m03895m58277q059N07375M52373j41738n48568l18491
$$ -598301 -429583 -476000 -879895 -1338172 -1346231 -838856 -386483 -528221 -1076789 -1395280
38402a395280J46484K63093J03992J30785L78701M42652J78685q5285p7432Q5634
$$ -1395280 -1248796 -985703 -881711 -750926 -372225 70427 249112 163827 86395 172029
38392A72029J70494R5673j34025m34538n21247j44176M35050N81126J05709m12706
$$ 172029 342523 438196 304171 -130367 -651614 -795790 -360740 220386 326095 -86611
38382h6611m16588j29333j16714l71955m03292j26893k2503k67711l39516J60212
$$ -86611 -503199 -632532 -749246 -1121201 -1524493 -1651386 -1673889 -1941600 -2281116 -2120904
38372b120904P72286P87602K74663q0251j728J24195K1263q9578l8390n3187k51297
$$ -2120904 -1348618 -561016 -286353 -366604 -368332 -244137 -222874 -312452 -350842 -404029 -655326
38361f55326k91903M9139L72588K19373j69946k08515J28444L31561J98976N1481
$$ -655326 -947229 -898090 -525502 -306129 -476075 -684590 -556146 -224585 -25609 25872
38351B5872P8366M6988j80750l40427k01695P8935K62500L41054L40580J58367
$$ 25872 104238 151226 -29524 -369951 -571646 -492711 -230211 110843 451423 609790
38341F09790j57493k88216q6691J38568P9433q8585k0012K12852K38710j2409
$$ 609790 452297 164081 77390 215958 295391 206806 186794 399646 638356 625947
38331F25947k16176j60678j5369k1176j59941k42827j73737j7678J20647K06239
$$ 625947 409771 249093 233724 212548 52607 -190220 -363957 -381635 -260988 -54749
38321e4749K60946K69171J61505l8935j27058N9999L50509L87833J10155j57330
$$ -54749 206197 475368 636873 597938 470880 530879 881388 1269221 1379376 1222046
38311A222046j77653j15515k16881m05220m22768k27773l4127l4024k27170m41037
$$ 1222046 1044393 928878 711997 306777 -115991 -343764 -377891 -411915 -639085 -1080122
38301a080122m32347j09918K63812K92996k8339k60186j24214J23775J36766k0693
$$ -1080122 -1512469 -1622387 -1358575 -1065579 -1093918 -1354104 -1478318 -1354543 -1217777 -1238470
38291a238470j05287j32474k09200j86455Q4357L49085K85776R0575J95775M91595
$$ -1238470 -1343757 -1476231 -1685431 -1871886 -1787529 -1438444 -1152668 -1062093 -866318 -374723
38281c74723M31968n1705l70296j83758J07281P8985m0938J46731M64659M22766
$$ -374723 57245 5540 -364756 -548514 -441233 -362248 -403186 -256455 208204 630970
38271F30970J1809k85770k11443l553P1718O5470J01533R4701r1430l72835n10987
$$ 630970 642779 357009 145566 142013 213731 279201 380734 475435 384005 11170 -499817
38260d99817l88022j08579J28358J81560L5790j87290k86272j36149J61063L35914
$$ -499817 -887839 -996418 -868060 -686500 -650710 -838000 -1124272 -1260421 -1099358 -763444
38250g63444K42841O5947J14800L91487N13331J81951l88485o84995m79874j7343
$$ -763444 -520603 -454656 -339856 51631 564962 746913 358428 -326567 -806441 -823784
38240h23784L52453N02239M54156K21497j19317l51743l10077r9232L1231J8188
$$ -823784 -471331 30908 485064 706561 587244 235501 -74576 -173808 -142577 -124389
38230a24389M4773K35747M24092L36718k7966l41027l14359l6076J67585J39731
$$ -124389 -79616 156131 580223 916941 888975 547948 233589 197513 365098 504829
38220E04829Q959p8604j37982j98891j93007j15578j04861j84476j18630K26328
$$ 504829 513788 435184 297202 98311 -94696 -210274 -315135 -499611 -618241 -391913
38210c91913N33466L73822j75939n91617n69432k96955k8097K31867M85627N50780
$$ -391913 141553 515375 339436 -252181 -821613 -1118568 -1146665 -914798 -429171 121609
38200A21609L41025P2213n0878j18644k39816k24714J21012N53563O14836K31883
$$ 121609 462634 534847 483969 365325 125509 -99205 21807 575370 1190206 1422089
38190A422089k41066n27722o26707n34814j93028K07034K74097l8292k93254k02703
$$ 1422089 1181023 653301 26594 -508220 -701248 -494214 -220117 -258409 -551663 -754366
38180g54366l9416j00681j16423L13451R04189R10936J77484n96866p82442n13177
$$ -754366 -793782 -894463 -1010886 -697435 206754 1117690 1295174 698308 -84134 -597311
38170e97311k29752j2388K55240M29866K92116q861j25565j3067J08552J68632
$$ -597311 -827063 -839451 -584211 -154345 137771 128910 3345 -9722 98830 267462
38160B67462K40698K40372M9671j38275m5380J70639R8225k42782m15549k91657
$$ 267462 508160 748532 798203 659928 614548 785187 883412 640630 225081 -66576
38150f6576j93534k20664n7872L43841N34772L24515J46985K69044K63513k00016
$$ -66576 -260110 -480774 -538646 -194805 339967 664482 811467 1080511 1344024 1144008
38140A144008o37281n01840j57094k97592p57093p72483k50923J24574M5103j8648
$$ 1144008 506727 4887 -152207 -449799 -1206892 -1979375 -2230298 -2105724 -2060621 -2079269
38130b079269L00274P14038Q26162O18438K00979l55386p52754n93817R04M00639
$$ -2079269 -1778995 -1064957 -238795 379643 580622 225236 -527518 -1121335 -1120431 -719792
38120g19792K81791m2823k48165l87019m69716k65443J83187M07885K05137l7198
$$ -719792 -438001 -480824 -728989 -1116008 -1585724 -1851167 -1667980 -1260095 -1054958 -1092156
38110a092156j3025M8304o4337j29449m2202j60768n86919p08382j02910O43679
$$ -1092156 -1105181 -1056877 -1121214 -1250663 -1292865 -1453633 -2040552 -2748934 -2851844 -2208165
38100b208165P63038M73273M75621O64018L35783m57738q04128l03914L34585
$$ -2208165 -1445127 -971854 -496233 167785 503568 45830 -758298 -1062212 -727627
38091g27627L56762q5791l71795k48810Q2312L07420J93450k00916m01033k3095
$$ -727627 -370865 -456656 -828451 -1077261 -994949 -687529 -494079 -694995 -1096028 -1119123
38081a119123N41261M98969j68543n62107j68153L87117L57577J7986J01515N42554
$$ -1119123 -577862 -78893 -247436 -809543 -977696 -590579 -233002 -215016 -113501 429053
38071D29053O00843P4049m07114l55864k4452J67285K24016K91813K32734j19859
$$ 429053 1029896 1103945 696831 340967 316515 483800 707816 999629 1232363 1112504
38061A112504n48885o82026m95315k65256j18002M6141K19454K24167M3046r5106
$$ 1112504 563619 -118407 -613722 -878978 -996980 -950839 -731385 -507218 -464172 -559278
38051e59278q3504j11333k84959l35475Q524N21679O86395L42171j60594m27734
$$ -559278 -642782 -754115 -1039074 -1374549 -1366025 -844346 -157951 184220 23626 -404108
38041d04108l59531n2694L01567L97418M9993m57915o03836l04122k724L2980
$$ -404108 -763639 -816333 -514766 -117348 -67355 -525270 -1129106 -1433228 -1435952 -1402972
38031a402972N5064K57467L59995J50499k5241J63180L59549O5296m28161m00028
$$ -1402972 -1347908 -1090441 -730446 -579947 -605188 -442008 -82459 -17163 -445324 -845352
38021h45352J30066L90820O8197k67009j52978R6413R3062P2474L63346O74350
$$ -845352 -715286 -324466 -256269 -523278 -676256 -579843 -486781 -414307 -50961 623389
38011F23389N20476L0069k66640k41296j98694k46984j97367m6616k8760j50329
$$ 623389 1143865 1173934 907294 665998 467304 220320 22953 -23663 -52423 -202752
38001b02752j56263l3908p7805l13658l30781N7239L95607J93635l36834n51714
$$ -202752 -359015 -392923 -470728 -784386 -1115167 -1057928 -662321 -468686 -805520 -1357234
37991a357234k32040K13424L43925J33962j78132l63467k64861J18707N01544
$$ -1357234 -1589274 -1375850 -1031925 -897963 -1076095 -1439562 -1704423 -1585716 -1084172
37982a084172N20653K03743j5773R6675K25401j232m07931n13681k35702M4101
$$ -1084172 -563519 -359776 -375549 -278874 -53473 -54705 -462636 -976317 -1212019 -1167918
37972a167918Q5902O1625J42994J98804Q2883p3652q5356j5713k9045q7716j4767
$$ -1167918 -1082016 -1020391 -877397 -678593 -595710 -669362 -754718 -770431 -799476 -887192 -901959
37961i01959K19317M30248L99381P3074l10756l16263K25953Q25414P51381k6231
$$ -901959 -682642 -252394 146987 220061 -90695 -406958 -181005 644409 1395790 1369559
37951A369559p03196o72457k67077j16146j87844l4807K99685L18003n3198k96489
$$ 1369559 666363 -6094 -273171 -389317 -577161 -611968 -312283 5720 -47478 -343967
37941c43967j23618J29276J31589O4350J98760L79789K86384n6377l38559l58063
$$ -343967 -467585 -338309 -206720 -142370 56390 436179 722563 666186 327627 -30436
37931c0436j15993K85048N96914M77529j08565o51922n76096M9553N40452M07072
$$ -30436 -146429 138619 735533 1213062 1104497 452575 -123521 -73968 466484 873556
37921H73556q3526l05751q8310J33610Q938j90704o285M16107M43061p8987m94409
$$ 873556 790030 484279 395969 529579 538517 347813 341528 757635 1200696 1121709 627300
37910F27300k64743K32409K86853j11923l92338l17090j41033L6209L78194P25489
$$ 627300 362557 594966 881819 769896 377558 60468 -80565 -44356 333838 1059327
37900A059327N91505m5061n25698l64933J53529M78377M32651J09822l97822q58598
$$ 1059327 1650832 1605771 1080073 715140 868669 1347046 1779697 1889519 1491697 633099
37890F33099r14297n59159k33232j63858m6339L11071N24388K59803j29717j31976
$$ 633099 -281198 -840357 -1073589 -1237447 -1283786 -972715 -448327 -188524 -318241 -450217
37880d50217J25279J87096Q7976K03955M55476L34391k58773p75810p30021k23061
$$ -450217 -324938 -137842 -49866 154089 609565 943956 685183 -90627 -820648 -1043709
37870a043709L29527O49992O88454N40482L58263J87582p2054m17884o24037n65043
$$ -1043709 -714182 -64190 624264 1164746 1523009 1710591 1638537 1220653 596616 31573
37860C1573m29322l58155j66241K29775M42480J71796j65778K464M19168L12043
$$ 31573 -397749 -755904 -922145 -692370 -249890 -78094 -243872 -241408 177760 489803
37850D89803l56899p50491l98097J78902L67909L06040L92904N15573K94441k28183
$$ 489803 132904 -617587 -1015684 -836782 -468873 -162833 230071 745644 1040085 811902
37840H11902o25599o27721k83643K20912O07493N71453J17389l24304l74217j36028
$$ 811902 186303 -441418 -725061 -504149 103344 674797 792186 467882 93665 -42363
37830d2363O7101J56336K05586J12025k48822o41877o34589j54451M04611O54688
$$ -42363 24738 181074 386660 498685 249863 -392014 -1026603 -1181054 -776443 -121755
37820a21755N53694K71073k7467j99754j52917L6164J55064R6101l0095q0841
$$ -121755 431939 703012 675545 475791 322874 359038 514102 610203 580108 499267
37810D99267q3859j59205k88789k86311n0755K23688K24716o3337k76101j31519
$$ 499267 415408 256203 -32586 -318897 -369652 -145964 78752 15415 -260686 -392205
37800c92205J57650J64768j22190k60894L405L73358M45682K48980P8537o169
$$ -392205 -234555 -69787 -191977 -452871 -449466 -76108 369574 618554 697091 690922
37790F90922j94109n15764p42317p05241m59074j00308L13318O00085N03496Q0221
$$ 690922 496813 -18951 -761268 -1466509 -1925583 -2025891 -1712573 -1112488 -608992 -528771
37780e28771j98059J4572M50227N75400L31275J50425K08278J05538m42601r70044
$$ -528771 -726830 -712258 -262031 313369 644644 795069 1003347 1108885 666284 -303760
37770c03760p83801J9000N80634L96215q2888j81752P7162J68201q2633l05273
$$ -303760 -1087561 -1068561 -487927 -91712 -174600 -356352 -279190 -110989 -193622 -498895
37760d98895j98992P6755K24026K23561K65863M25573N55375M59784J14767k66974
$$ -498895 -697887 -621132 -397106 -173545 92318 517891 1073266 1533050 1647817 1380843
37750A380843m09402k60657n7466k9760j15346q7130R4228K08682O4653k51020
$$ 1380843 971441 710784 653318 623558 508212 421082 515310 723992 788645 537625
37740E37625m45832l20678p844J29109o1830k45279j0997M52812M93167n0123
$$ 537625 91793 -228885 -236729 -107620 -169450 -414729 -425726 27086 520253 470130
37730D70130m75081j69073M67600N93050J56828j10607J18262L08561k8359n73942
$$ 470130 -4951 -174024 293576 886626 1043454 932847 1051109 1359670 1331311 757369
37720G57369p00490l16772J56234L86312L66876K22481P2175J1618L9891N5229
$$ 757369 56879 -259893 -103659 282653 649529 872010 944185 955803 995694 1050923
37710A050923O308n8692j30308k51298l48257k61824j1269J89053K36800K20814
$$ 1050923 1057231 998539 868231 616933 268676 6852 -4417 184636 421436 642250
37700F42250J45902j02032m07307m01809j048L62290L06397J3545j30097j38184
$$ 642250 788152 686120 278813 -122996 -124044 238246 544643 558188 428091 289907
37690B89907k74875m79273l92083N3464M58896M84258K70118J85914L17718L72863
$$ 289907 15032 -464241 -856324 -802860 -343964 140294 410412 596326 914044 1286907
37680A286907P5190m45690p43987n62707j51381M8826m1242j15919J2825J77693
$$ 1286907 1362097 916407 172420 -390287 -541668 -492842 -534084 -650003 -637178 -459485
37670d59485J87538J05347N5142J0968n3576n3242j5944j55935m73890n38981
$$ -459485 -271947 -166600 -111458 -100490 -154066 -207308 -223252 -379187 -853077 -1392058
37660a392058j3608P62140J073843O62885n8178n78854p53795o68880l75249P2771
$$ -1392058 -1405666 -643526 430317 1093202 1035024 456170 -297625 -966505 -1341754 -1268983
37650a268983M88597O44314M81148J80817K8281J72615M77897O34331M51680J9445
$$ -1268983 -780386 -136072 345076 525893 554174 726789 1204686 1839017 2290697 2310142
37640B310142m13061o38399n88562l62917j79578j66271j83465p652L07497M59516
$$ 2310142 1897081 1258682 670120 307203 127625 -38646 -222111 -229763 77734 537250
37630E37250L13934M9841j66256l60900m92893l43144R8746M11434K18052k82076
$$ 537250 851184 901025 734769 373869 -119024 -462168 -363422 48012 266064 -16012
37620a6012n59603m24466j56941k2567N6248K87696O50686Q50364O18116M3947
$$ -16012 -575615 -1000081 -1157022 -1179589 -1123341 -835645 -184959 665405 1283521 1327468
37610A327468m49593n55061m16816l41964k90864R023M75728O39562L13038j21587
$$ 1327468 877875 322814 -94002 -435966 -726830 -717807 -242079 397483 710521 588934
37600E88934k74978k00585p0840J60396M62006M99759J02710l60901m64524k98898
$$ 588934 313956 113371 42531 202927 664933 1164692 1267402 906501 441977 143079
37590A43079j91024j44360J7978K12114K36133J39159M6262j38912m41907n18837
$$ 143079 -47945 -192305 -174327 37787 273920 413079 459341 320429 -121478 -640315
37580f40315j42948K78100K17551j67285l14895j19249J06835L09315O18508P45586
$$ -640315 -783263 -505163 -287612 -454897 -769792 -889041 -782206 -472891 145617 891203
37570H91203K58873n39978q17145l91899L9006K4022o5320J55031M36839M54339
$$ 891203 1150076 610098 -207047 -598946 -559940 -535918 -601238 -446207 -9368 444971
37560D44971L59017L36033J71754k44658m79650j72696K68563J69838m24455q00534
$$ 444971 803988 1140021 1311775 1067117 587467 414771 683334 853172 428717 -371817
37550c71817n32029M6985L40483J60866j56239j65057J87017M75245L13782j14335
$$ -371817 -903846 -856861 -516378 -355512 -511751 -676808 -489791 -14546 299236 184901
37540A84901k79969p791L80502O03634O70487N34068J0663p33230j083785p13012
$$ 184901 -95068 -102859 277643 881277 1551764 2085832 2096495 1363265 279480 -433532
37530d33532p3059J71127o8238l73829m23022k06094J42271M32416M91021L65458
$$ -433532 -506591 -335464 -403702 -777531 -1200553 -1406647 -1264376 -831960 -340939 24519
37520B4519L06937M03546M48557L10379J45483N9850j24171n10355q24381p61094
$$ 24519 331456 735002 1183559 1493938 1639421 1699271 1575100 1064745 240364 -520730
37510e20730m20812j34530l7104l4514j2936J00944K97375L86089K04077K081
$$ -520730 -941542 -1076072 -1113176 -1147690 -1160626 -1059682 -762307 -376218 -172141 -170060
37500a70060K29289P71882Q78059J46199q39511j230124q96693l18478J31574
$$ -170060 59229 831111 1709170 1855369 1015858 -214266 -1110959 -1429437 -1297863
37491a297863L46548K72256L2891J8222L77991O61776M14024j22342l81015l04188
$$ -1297863 -951315 -679059 -646168 -627946 -249955 411821 825845 703503 322488 18300
37481A8300k59980l29644k60266j5630J82490K90003L97682L47887m4066m51200
$$ 18300 -241680 -571324 -831590 -847220 -664730 -374727 22955 370842 326776 -124424
37471a24424l31009K18912N10699K62572n6068m2668O9019m9129k15407q0110
$$ -124424 -455433 -236521 274178 536750 480682 438014 507033 457904 242497 162387
37461A62387K57002L72099R8828l15368n44361m66526j79576J10844K34427J58599
$$ 162387 419389 791488 890316 574948 30587 -435939 -615515 -504671 -270244 -111645
37451a11645m0563k54710l49235k25983K68M5557j51646k68403n8315K37616K62482
$$ -111645 -152208 -406918 -756153 -982136 -981868 -936311 -1087957 -1356360 -1414675 -1177059 -914577
37440i14577J23585J76082L57579K38728k62388o95064o98228m02668r6625J45999
$$ -914577 -790992 -614910 -257331 -18603 -280991 -976055 -1674283 -2076951 -2173576 -2027577
37430b027577L61451N22200O05347O14521M86512K09427Q181R9065K82007J51744
$$ -2027577 -1666126 -1143926 -538579 75942 562454 771881 780062 879127 1161134 1312878
37420A312878k75532n64066n34435m69272n14075l68960J49204O48563O24995
$$ 1312878 1037346 473280 -61155 -530427 -1044502 -1413462 -1264258 -615695 9300
37411I300J22969l82405n70968m66922k03534J18555L98654N60617N99053N30237
$$ 9300 132269 -250136 -821104 -1288026 -1491560 -1373005 -974351 -413734 185319 715556
37401G15556L64182J51463m5625k20266l31056k19070J57692M68323L00045k71800
$$ 715556 1079738 1231201 1185576 965310 634254 415184 572876 1041199 1341244 1069444
37391A069444p02187o16228j63790K82961M84666L67386L9079j73904m3150J65949
$$ 1069444 367257 -248971 -412761 -129800 354866 722252 761331 587427 544277 710226
37381G10226j1948m98582o57512j57737N67977R06922P20061K36230k95917o22460
$$ 710226 698278 199696 -457816 -615553 -47576 859346 1579407 1815637 1519720 897260
37371H97260n35010j68682O0270J015q7004n9833r4049j85548n617M34297N58734
$$ 897260 362250 193568 253838 254853 167849 108016 13967 -171581 -177198 257099 815833
37360H15833J05686l34197k05887J11489j8130l58978j93718M14796O60978K70500
$$ 815833 921519 587322 381435 492924 474794 115816 -77902 336894 997872 1268372
37350A268372j22848l4791J91795P4757k49120l60766k45290k29400m45174o72408
$$ 1268372 1145524 1110733 1302528 1377285 1128165 767399 522109 292709 -152465 -824873
37340h24873o25743k30084L09699O39358N56929K10744r6086k35654k46464j28550
$$ -824873 -1450616 -1680700 -1371001 -731643 -174714 36030 -60056 -295710 -542174 -670724
37330f70724R4745K16596P5986j05031L0740M00970N43470L00110M0418P4678
$$ -670724 -575979 -359383 -283397 -388428 -357688 43282 586752 886862 927280 1001958
37320A001958K29419K18424J04385J07251J83971J04322j68033m21537m73310
$$ 1001958 1231377 1449801 1554186 1661437 1845408 1949730 1781697 1360160 886850
37311H86850l20138o1789J65544K05729j1170l34011m47441j54982L60737O22171
$$ 886850 566712 504923 670467 876196 865026 531015 83574 -71408 289329 911500
37301I11500L37299j84511k97502J67961N79996K67418n52811j004333o83231
$$ 911500 1248799 1064288 766786 934747 1514743 1782161 1229350 225017 -458214
37292d58214j21627J9864j81261j57883K82042P16450O89694K39957k15002l45184
$$ -458214 -579841 -559977 -741238 -899121 -617079 99371 789065 1029022 814020 468836
37282D68836j76254K8012O9360j2267n4518j1077o730j58297m12290n81227n01727
$$ 468836 292582 320594 389954 377687 323169 312092 305362 147065 -265225 -846452 -1348179
37271a348179j74318J90268K95701L7233l40482m56149j71510L17111P30358R09007
$$ -1348179 -1522497 -1332229 -1036528 -999295 -1339777 -1795926 -1967436 -1650325 -919967 -10960
37261a0960P79161L31219k42544n42553l08676K26893N00447K21474k67457l64524
$$ -10960 768201 1099420 856876 314323 5647 232540 732987 954461 687004 322480
37251C22480O6194N05500M20441n0437k94811p7174J32690j60421p40150r34868
$$ 322480 388674 894174 1314615 1264178 969367 892193 1024883 864462 124312 -810556
37241h10556n02026Q8257K99742J58467N4942J15142O0397k88824o27001m94482
$$ -810556 -1312582 -1224325 -924583 -766116 -711174 -596032 -535635 -824459 -1451460 -1945942
37231a945942R1436O03612O59333M28312K15412m5588m99843q14084n01081K13774
$$ -1945942 -1854506 -1250894 -591561 -163249 52163 6575 -493268 -1307352 -1808433 -1594659
37221a594659M96867P5356l13677m790O27283P99348M63237J80206J66978J63872
$$ -1594659 -1097792 -1022436 -1336113 -1340903 -713620 85728 548965 729171 896149 1060021
37211A060021Q1911P1559M083m02112q84256p72208o920O21903N28195M7457k15004
$$ 1060021 1141932 1213491 1217574 815462 -68794 -841002 -847922 -226019 302176 349633 134629
37200A34629k02928j53592o867L69189O52930L60654m01291r48160q34975l37564
$$ 134629 -68299 -221891 -228758 140431 793361 1154015 752724 -195436 -1030411 -1367975
37190a367975l0400j04320k30008l3615L89419N47181K07280j98680j10562L24724
$$ -1367975 -1398375 -1502695 -1732703 -1766318 -1376899 -829718 -622438 -821118 -931680 -606956
37180f06956L98987j09294n37549k66046L87816O32084K83623r7920n6978K38735
$$ -606956 -207969 -317263 -854812 -1120858 -733042 -100958 182665 84745 27767 266502
37170B66502L81096K67415J02603M4554J8614j26492l45625l66573k4624M31873
$$ 266502 647598 915013 1017616 1062170 1080784 954292 608667 242094 217470 649343
37160F49343N61869K67541j04220k34980j64116p1330o710K1112o1800k41897
$$ 649343 1211212 1478753 1374533 1139553 975437 904107 897397 918509 856709 614812
37150F14812l60048l36596k46389r6456J74316L88677K20993k34386m19080q9072
$$ 614812 254764 -81832 -328221 -424677 -250361 138316 359309 124923 -294157 -383229
37140c83229L09623L53248K29789J99570J4376n10240q28503l73144L87601M94725
$$ -383229 -73606 279642 509431 709001 723377 213137 -615366 -988510 -600909 -106184
37130a06184n1271l24603K9371L08572k748m20289l25530R8988L20804K64618
$$ -106184 -157455 -482058 -452687 -144115 -146863 -567152 -892682 -793694 -472890 -208272
37120b08272J52713J9720j16393k6220L01672M08923M5575k98667j00370L25965
$$ -208272 -55559 -35839 -152232 -178452 123220 532143 577718 279051 178681 504646
37110E04646L05610j23359l23717j06509N1908j50112m30165m58275k58624M0714
$$ 504646 810256 686897 363180 256671 308579 158467 -271698 -729973 -988597 -947883
37100i47883L63271M73974J10960n07363p68546m49762J2782K21284L15896N16591
$$ -947883 -584612 -110638 322 -507041 -1275587 -1725349 -1712567 -1491283 -1175387 -658796
37090f58796O29669L96709m307k02118j32406L9897K45397M16277L30130o2840
$$ -658796 -29127 367582 363275 161157 28751 68648 314045 730322 1060452 997612
37080I97612l86665l26464j47899k67452n13862l89562M4906J95799j15098l68454
$$ 997612 610947 284483 136584 -130868 -644730 -1034292 -989386 -793587 -908685 -1277139
37070a277139j91388J01714Q9158j42461k87131k79650j25156K91244Q15295Q67735
$$ -1277139 -1468527 -1366813 -1277655 -1420116 -1707247 -1986897 -2112053 -1820809 -1005514 -137779
37060a37779J93989n69638o54932k18482l823j55166j27161K59739M94611K96839
$$ -137779 56210 -513428 -1168360 -1386842 -1390665 -1545831 -1672992 -1413253 -918642 -621803
37050f21803J00491K47451L53336j981m63292m07066O3976K90888Q0009q0559
$$ -621803 -521312 -273861 79475 77494 -385798 -792864 -728888 -438000 -357991 -438550
37040d38550J49848M78660M90071K19218j8047r9034j64900l45691n67453n92134
$$ -438550 -288702 189958 680029 899247 881200 782166 617266 271575 -295878 -888012
37030h88012k39649L44113P07667N62530J77299O3947K97360M49499K42257q0854
$$ -888012 -1127661 -783548 -75881 486649 663948 727895 1025255 1474754 1717011 1636157
37020A636157j91180j59118k30680l53112k69199N447J32074q5006m16274m75644
$$ 1636157 1444977 1285859 1055179 702067 432868 438315 570389 485383 69109 -406535
37010d06535j45150L14930N04212K45944k03235l65012q0680K43375J17231l75601
$$ -406535 -551685 -236755 267457 513401 310166 -54846 -135526 107849 225080 -150521
37000a50521o60909m03493J45600N83429P84527P39686L57255k36894n19212j72078
$$ -150521 -811430 -1214923 -1069323 -485894 298633 1038319 1395574 1158680 639468 467390
36990D67390L11753J89290m15385n91858K1192O48899N00295j16704l76574j80832
$$ 467390 779143 968433 553048 -38810 -17618 631281 1131576 1014872 638298 457466
36980D57466p2591j52055M8700N55971O77587P7763n63100m71698J34835M63430
$$ 457466 384875 232820 281520 837491 1515078 1592841 1029741 558043 692878 1156308
36970A156308K91743O8740N7017L6296j20256j66732L9843K32021J32997j60757
$$ 1156308 1448051 1516791 1573808 1610104 1489848 1323116 1362959 1594980 1727977 1567220
36960A567220m17214o02566p30687o34685k16259K22107K54741o3500j94777J74024
$$ 1567220 1150006 547440 -183247 -817932 -1034191 -812084 -557343 -620843 -815620 -641596
36950f41596O77104P22999K48000k40313l40146k00423j84694l28480l68889j94927
$$ -641596 35508 758507 1006507 766194 426048 225625 40931 -287549 -656438 -851365
36940h51365J9164J28195J89756K48281J94407k0720k30243k72636k07296j57681
$$ -851365 -832201 -704006 -514250 -265969 -71562 -92282 -322525 -595161 -802457 -960138
36930i60138j09213l5057l7932j44603j35128J45876M51293M25147J30273p4908
$$ -960138 -1069351 -1104408 -1142340 -1286943 -1422071 -1276195 -824902 -399755 -269482 -344390
36920c44390j19832k60811n15978n24585j33750K88877L87227L12710L58097L82264
$$ -344390 -464222 -725033 -1241011 -1765596 -1899346 -1610469 -1223242 -910532 -552435 -170171
36910a70171L7802n50885p92622l81975K86860O07075M50791K12790K75433N83520
$$ -170171 -132369 -683254 -1475876 -1857851 -1570991 -963916 -513125 -300335 -24902 558618
36900E58618P47877M97270j2178l57889l11485p0558R633j61491l45267k86835
$$ 558618 1306495 1803765 1791587 1433698 1122213 1051655 1061288 899797 554530 267695
36890B67695Q934L06319L63851J36088j77960k89629q8916K35413L86316K55393
$$ 267695 276629 582948 946799 1082887 904927 615298 526382 761795 1148111 1403504
36880A403504j1627k03849k19264p7949J27116K69479K68633J70168Q5677L5693
$$ 1403504 1391877 1188028 968764 890815 1017931 1287410 1556043 1726211 1811888 1847581
36870A847581n8169j91529k17983q2688L42j93733n02465m97072q7383K55470
$$ 1847581 1789412 1597883 1379900 1297212 1297554 1103821 601356 104284 16901 272371
36860B72371R8437l34738m74087k27998o9612k43615l56477k8955M30485M42738
$$ 272371 370808 36070 -438017 -666015 -735627 -979242 -1335719 -1364674 -934189 -491451
36850d91451K6309k51144j16504J29600K32931L52203N76517N54858K2192o05453
$$ -491451 -465142 -716286 -832790 -703190 -470259 -118056 458461 1013319 1035511 430058
36840D30058o51293r7921L50246J59195m29856p83555n85194k5578M98744P05474
$$ 430058 -221235 -319156 31090 190285 -239571 -1023126 -1608320 -1633898 -1135154 -429680
36830d29680N68499L00691J59509J91247K07916N2161j95060l26989k57855q8973
$$ -429680 138819 439510 599019 790266 998182 1050343 855283 528294 270439 181466
36820A81466K1544l755j13097j60248j8884K88368N86311O93087N54447K43389
$$ 181466 203010 199255 86158 -74090 -92974 195394 781705 1474792 2029239 2272628
36810B272628j13887l94005n19887m94453l76330k21221p4824P932Q973r985p22
$$ 2272628 2158741 1764736 1244849 750396 374066 152845 78021 85953 94926 84941 84219
36799H4219l3091j75057k97032j92613Q6908K59143K42754K69673M09147L35700
$$ 84219 51128 -123929 -420961 -613574 -526666 -267523 -24769 244904 654051 989751
36789I89751r4608l66388N1331P46521P27193j76801r64175q27428k44962j74554
$$ 989751 895143 528755 580086 1326607 2053800 1876999 912824 85396 -159566 -334120
36779c34120o24536p52572j98872M33585N21384K16462L9237J24467K04102Q6606
$$ -334120 -958656 -1711228 -1910100 -1476515 -955131 -738669 -699432 -574965 -370863 -284257
36769b84257j33916k26236j9857M24449P55976O18113Q4554l63709l82687j02348
$$ -284257 -418173 -644409 -664266 -239817 516159 1134272 1218826 855117 472430 370082
36759C70082J47358K12122J06508j15902l13518k88626n7598Q1248p2980l30320
$$ 370082 517440 729562 836070 720168 406650 118024 60426 141674 68694 -261626
36749b61626l61070r8552K50788M52087L82227J05704q6577N8111L47319L04339
$$ -261626 -622696 -721248 -470460 -18373 363854 469558 382981 441092 788411 1092750
36739A092750j16094l63311j09372J92557j554m48363n00341j16422J67816J68538
$$ 1092750 976656 613345 503973 696530 694976 246613 -253728 -370150 -202334 -33796
36729c3796K42014M86943M68953L45m05214k49624K13877L88607J72727m4592
$$ -33796 208218 695161 1164114 1164459 759245 509621 723498 1112105 1284832 1240240
36719A240240m0008J4195o8614k15112k44497r5470J34473K70189K02005K7216
$$ 1240240 1200232 1214427 1145813 930701 686204 590734 725207 995396 1197401 1224617
36709A224617k1778J19386K13893K6090l17996m36276j52870K76114M42412K21919
$$ 1224617 1202839 1322225 1536118 1562208 1244212 807936 655066 931180 1373592 1595511
36699A595511j20515k43148q9167J06070J35890M2604k0269k4465n2445j18254
$$ 1595511 1474996 1231848 1142681 1248751 1384641 1427245 1406976 1382511 1330066 1211812
36689A211812j34714m8880O9720P2269j41564m61756n58263k20586K69553L72648
$$ 1211812 1077098 1028218 1097938 1170207 1028643 566887 8624 -211962 57591 430239
36679D30239N727k85501o4549M10909O27588N12705L05092L6709l50766n88337
$$ 430239 435966 150465 85916 496825 1124413 1637118 1942210 1978919 1628153 1039816
36669A039816l55292J28378L48252K75741L23390N49682N49412K04755j03245
$$ 1039816 684524 812902 1161154 1436895 1760285 2309967 2859379 3064134 2960889
36660B960889j83867l04075n59298o08688l21097q0714j15128j07845J39869K63957
$$ 2960889 2777022 2472947 1913649 1304961 983864 903150 788022 680177 820046 1084003
36650A084003K8539j21412K08229N79231L58908k43240n08268l08749j22933j07729
$$ 1084003 1112542 991130 1199359 1778590 2137498 1894258 1385990 1077241 954308 846579
36640H46579N6842L93936M54437R4017j98392l0946L02840K91622n4054k60864
$$ 846579 903421 1297357 1751794 1845811 1647419 1616473 1919313 2210935 2156881 1896017
36630A896017m9369L26714M01862M8747l58789l81108n5510J81605J12970k5466
$$ 1896017 1846648 2173362 2575224 2623971 2265182 1884074 1828564 2010169 2123139 2097673
36620B097673l2181p3651k67978l16094L7310M58521M26407O813k61426j53208
$$ 2097673 2065492 1991841 1723863 1407769 1445079 1903600 2330007 2336820 2075394 1922186
36610A922186M9138J03752P9465N2409m3360j85798k22271j13595M5869K18846
$$ 1922186 1971324 2075076 2154541 2206950 2163590 1977792 1755521 1641926 1687795 1906641
36600A906641L46137J86607l56423q17250n74981K62986Q66123P16338K00887
$$ 1906641 2252778 2439385 2082962 1265712 690731 953717 1819840 2536178 2737065
36591B737065l8555N6698R6978o3552j60398J4343K77971K88053j0280k98433
$$ 2737065 2698510 2755208 2852186 2788634 2628236 2642579 2920550 3208603 3198323 2899890
36581B899890k81814n9683O8306Q7015K45832N24869N35430J44461k22240k11509
$$ 2899890 2618076 2558393 2626699 2713714 2959546 3484415 4019845 4164306 3942066 3730557
36571C730557p5674j74891l39345k35909k8009p7151k61549k31707j11643k46012
$$ 3730557 3654883 3479992 3140647 2904738 2876729 2799578 2538029 2306322 2194679 1948667
36561A948667m34360j87864L57250N90568M41629L87365M46162J24986m90259
$$ 1948667 1514307 1326443 1683693 2274261 2715890 3103255 3549417 3674403 3184144
36552C184144o10671l3492M26455K38937o6127J5727P2339k72925m26282J66004
$$ 3184144 2573473 2539981 2966436 3205373 3139246 3154973 3227312 2954387 2528105 2694109
36542B694109P89659M06558o16260r30842j91391N45200M57120o1970l04874k24827
$$ 2694109 3483768 3890326 3274066 2343224 2151833 2697033 3154153 3092183 2787309 2562482
36532B562482j23228p1282o7008k42520n34353n67835j88366K71042N11395O36093
$$ 2562482 2439254 2367972 2300964 2058444 1524091 956256 767890 1038932 1550327 2186420
36522B186420P14892M63803j95079o66448l73327L07077M44647j38956o04377
$$ 2186420 2901312 3365115 3170036 2503588 2130261 2437338 2881985 2743029 2138652
36513B138652k91612L98093O69550M30916K11550K38066J93978j09302l88405
$$ 2138652 1847040 2245133 2914683 3345599 3557149 3795215 3989193 3879891 3491486
36504C491486l95982l16296l76287m23225k23115R9569K76152L23227L94408M08700
$$ 3491486 3095504 2779208 2402921 1979696 1756581 1856150 2132302 2455529 2849937 3258637
36494C258637K27421K5409M6332J30719l7483l32191l63141j76077j77948l61304
$$ 3258637 3486058 3511467 3557799 3688518 3651035 3318844 2955703 2779626 2601678 2240374
36484B240374k60101J92682M23814R9403l41054l67544p3972J48185J98132J46443
$$ 2240374 1980273 2172955 2596769 2696172 2355118 1987574 1913602 2061787 2259919 2406362
36474B406362o7518m07572n31999k02416L41046P02468P61431N65521J61682k05403
$$ 2406362 2338844 1931272 1399273 1196857 1537903 2240371 3001802 3567323 3729005 3523602
36464C523602j37760L52182P08760N67626J97681q5180l99347p78174p72796j79123
$$ 3523602 3385842 3738024 4446784 5014410 5212091 5126911 4727564 3949390 3176594 2997471
36454B997471L57365J79878l41226l64218J54286N42874N31180M47770M21090
$$ 2997471 3354836 3534714 3193488 2829270 2983556 3526430 4057610 4505380 4926470
36445D926470K06494j82403m00627l72848l31755k74994l2055J81428o997l72740
$$ 4926470 5132964 4950561 4549934 4177086 3845331 3570337 3538282 3719710 3712713 3339973
36435C339973l40978J0980N4496k05255n903Q31738J389590R60338N3755m69513
$$ 3339973 2998995 3009975 3064471 2859216 2853313 3685051 5074641 6034979 6088734 5619221
36425E619221n49606n77796n37575k43932K4263j07710m10101l97393j30945k5173
$$ 5619221 5069615 4491819 3954244 3710312 3734575 3626865 3216764 2819371 2688426 2663253
36415B663253p4729M1153K27136O4285l70490m67695j1602M38575L27235j82588
$$ 2663253 2588524 2629677 2856813 2921098 2550608 2082913 2071311 2509886 2837121 2654533
36405B654533n22356m10493J3M02270N46012L61310N4677n4323R9807K75506L00527
$$ 2654533 2132177 1721684 1721697 2123967 2669979 3031289 3085966 3031643 3131450 3406956 3707483
36394C707483K76788K91662J78990j97933n98057o31513k88287L1907N0306o9580
$$ 3707483 3984271 4275933 4454923 4256990 3658933 3027420 2739133 2771040 2821346 2751766
36384B751766l8965J12311J04359j60865m47063m93523l14230r7301P3477K44922
$$ 2751766 2712801 2825112 2929471 2768606 2321543 1828020 1513790 1416489 1489966 1734888
36374A734888L82857L20852J5452k56932j33479L70204P65364N87926n9775o11389
$$ 1734888 2117745 2438597 2454049 2197117 2063638 2433842 3199206 3787132 3727357 3115968
36364C115968o76646m00205j27573N4531K47999M00067L50589J72038J25356K24279
$$ 3115968 2439322 2039117 1911544 1966075 2214074 2614141 2964730 3136768 3262124 3486403
36354C486403J68509j51202l80582j64569L33391O39666N56965K68141o0840m66845
$$ 3486403 3654912 3503710 3123128 2958559 3291950 3931616 4488581 4756722 4695882 4229037
36344D229037r25494j156401q78088j97357L96341M85280J39353j89518j82265
$$ 4229037 3303543 2147142 1269054 1071697 1468038 1953318 2092671 1903153 1720888
36335A720888N8652K78205M23251N37685M87836J27240l25895m43748j62940J31779
$$ 1720888 1779540 2057745 2480996 3018681 3506517 3633757 3307862 2864114 2701174 2832953
36325B832953J67279Q3750O8525M1889j08429k76706l23174k71902j74091j5759
$$ 2832953 3000232 3083982 3152507 3194396 3085967 2809261 2486087 2214185 2040094 2024335
36315B024335J23899J01363m643L5746J51175J25l96255n28184j55258K81528
$$ 2024335 2148234 2249597 2244954 2280700 2431875 2432000 2035745 1507561 1352303 1633831
36305A633831L28979J44556O5562P814k22321l94420j80838K34656L85374J84080
$$ 1633831 1962810 2107366 2172928 2180742 1958421 1564001 1383163 1617819 2003193 2187273
36295B187273o9227j62114p9383J48437L58433K72683o5398j96306O2393K40606
$$ 2187273 2118046 1955932 1876549 2024986 2383419 2656102 2590704 2394398 2456791 2697397
36285B697397k3035k99658k9474N38232P22855M08312n797l40406o07698n34798
$$ 2697397 2674362 2374704 2345230 2883462 3606317 4014629 4008832 3668426 3060728 2525930
36275B525930O8566O47521M59932k55987m96596P9351P17659P06688K54760K675
$$ 2525930 2594496 3242017 3701949 3445962 2949366 3028717 3746376 4453064 4707824 4710499
36265D710499K01550O15291Q78007Q01351N57366N47367R31336J487357K060806
$$ 4710499 4912049 5527340 6405347 7206698 7764064 8311431 9242767 10730124 12790930
36256A2790930K657229K816816J664460p45223k832873l161842k180566j370864
$$ 12790930 15448159 18264975 19929435 19184212 16351339 13189497 11008931 9638067
36248I638067j225848j192966j092065j191981j146767l29883P85638R79109J27641
$$ 9638067 8412219 7219253 6127188 4935207 3788440 3458557 4244195 5223304 5350945
36239E350945o07483n72933k92234j77850N1989L76553K49979k26392k02899M20722
$$ 5350945 4743462 4170529 3878295 3700445 3752434 4128987 4378966 4152574 3949675 4370397
36229D370397O80746J87767k37663r4847j8417m18165o41934k74706q095l50614
$$ 4370397 5051143 5238910 5001247 4906400 4887983 4469818 3827884 3553178 3545083 3194469
36219C194469o53755l29877Q4100J2786j06742J63066K81313j77875m91195J129
$$ 3194469 2540714 2210837 2294937 2307723 2200981 2364047 2645360 2467485 1976290 1977419
36209A977419N99541L81065k25557k74641M0855r2445n28811m57129J14640M22208
$$ 1977419 2576960 2958025 2732468 2457827 2498682 2406237 1877426 1420297 1534937 1957145
36199A957145K47044O1939O4934J0106j75956l84700o72704r55631p56655P3358
$$ 1957145 2204189 2266128 2331062 2341168 2165212 1780512 1107808 152177 -604478 -531120
36189e31120Q56581R69007O85826N15424L55148J3310j68735o775k2106m71636
$$ -531120 325461 1294468 1980294 2495718 2850866 2864176 2695441 2688666 2666560 2194924
36179B194924o65260j65968K40086j50204n94791j12199P66918Q46696K02327
$$ 2194924 1529664 1363696 1603782 1453578 858787 746588 1513506 2360202 2562529
36170B562529j62817o4644j08797l27819k46556O71q3322k94773j28366J24851
$$ 2562529 2399712 2335068 2226271 1898452 1651896 1652567 1569245 1274472 1146106 1270957
36160A270957r7219m19827j35784L92467K84016k76255l89194n0779M090k12296
$$ 1270957 1173738 753911 618127 1010594 1294610 1018355 629161 578382 582472 370176
36150C70176n8625L31419K12085l13095l79088J46016N44958N47472N02552L92227
$$ 370176 311551 642970 855055 541960 162872 308888 853846 1401318 1903870 2296097
36140B296097p3673n16151k81500L53179N36267J93510j11300l20737o78001p99885
$$ 2296097 2222424 1706273 1424773 1777952 2314219 2507729 2396429 2075692 1397691 597806
36130E97806k65870L05591J29687k97769p4618L63610P788p51313o97168Q1138
$$ 597806 331936 637527 767214 469445 394827 758437 766225 14912 -682256 -601118
36120f01118M54774L01106M36800Q22451P11731L10787M11607O82828K48248l97804
$$ -601118 -146344 154762 591562 1414013 2125744 2436531 2848138 3530966 3779214 3381410
36110C381410r6277P16713O08767l07289o51446k89442k63571n15820r8755O03141
$$ 3381410 3285133 4001846 4610613 4303324 3651878 3362436 3098865 2583045 2484290 3087431
36100C087431L64721m10845k75432N02829M43743k39998j28597M13659j05628
$$ 3087431 3452152 3041307 2765875 3268704 3712447 3472449 3343852 3757511 3651883
36091C651883j030367m13138J093855R73551n85069q68237M55384Q58547k10543
$$ 3651883 2621516 2208378 3302233 4275784 3690715 2822478 3277862 4136409 3925866
36082C925866m61379N95356P06542n04391o29370P37057J064575j00369j62598
$$ 3925866 3464487 4059843 4766385 4261994 3632624 4369681 5434256 5333887 5171289
36073E171289J254695J376133m6347J63468K317418K895250J550631K176293M974819
$$ 5171289 6425984 7802117 7755770 7919238 10236656 13131906 14682537 16858830 21833649
36064B1833649N266506K767372L278771P872623J0435034J0205350J4932541K5742421
$$ 21833649 27100155 29867527 33146298 41018921 51453955 61659305 76591846 102334267
36056A02334267L3414133L8898978N9176627R4387576J05731975N5471864l5645896
$$ 102334267 135748400 174647378 233824005 328211581 433943556 489415420 453769524
36049D53769524j00856285j01945656o5712874l8468396l1160900k6216294j6174478
$$ 453769524 352913239 250967583 185254709 146786313 115625413 89409119 73234641
36042G3234641r894292j0214047r214675m449680k367082m805867n803958l133355
$$ 73234641 63340349 53126302 43911627 39461947 37094865 32288998 26485040 23351685
36034B3351685j554518l013400l470293j271097m6743j353136j989802n55162
$$ 23351685 21797167 18783767 15313474 14042377 13995634 12642498 10652696 10097534
36026A0097534R5705j201562j671049j56564O61578n38078j389990m99470K33981
$$ 10097534 10193239 8991677 7320628 7164064 7825642 7287564 5897574 5398104 5632085
36017E632085l43894o12171J81090L02711q56098j360733m29072P5940p08710
$$ 5632085 5288191 4676020 4857110 5159821 4303723 2942990 2513918 2589858 1881148
36008A881148j023725J9967P03345j3710o42977j42957K50108l08675o05272J14752
$$ 1881148 857423 877390 1580735 1567025 924048 781091 1031199 722524 117252 232004
35998B32004O12881R8151l09710R0095K49293l32841m40896M09258P76078q7306
$$ 232004 844885 943036 633326 723421 972714 639873 198977 608235 1384313 1297007
35988A297007p60723j95026N40176M34175K36827N67843N16317l85420r00337
$$ 1297007 536284 341258 881434 1315609 1552436 2120279 2636596 2251176 1350839
35979A350839l18998R9765n22610r36013n7548R22044N76513l23926l06077L65641
$$ 1350839 1031841 1131606 608996 -327017 -384565 537479 1113992 790066 483989 849630
35969H49630N78489L88132L90546K67340l68209p65227k56229L54188J12923m14054
$$ 849630 1428119 1816251 2206797 2474137 2105928 1340701 1084472 1438660 1551583 1137529
35959A137529k74663J07589j58210o85225n18202J59042M51532K49500N0841p0099
$$ 1137529 862866 970455 812245 127020 -391182 -232140 219392 468892 519733 449634
35949D49634k20103j22417K25701J72969l76101m06755N16932J176605N50915
$$ 449634 229531 107114 332815 505784 129683 -277072 239860 1416465 1967380
35940A967380m22796l68112L25854M04589p6406j70236R8707J0720k47730O1088
$$ 1967380 1544584 1176472 1502326 1906915 1830509 1660273 1758980 1769700 1521970 1583058
35930A583058O44601N51343j34833m68491l03241l34958o30992n30403J5579L09433
$$ 1583058 2227659 2779002 2644169 2175678 1872437 1537479 906487 376084 391663 701096
35920G01096J42022k3733j09683m97065r90052q46709k3639O08243N11315J06289
$$ 701096 843118 819385 709702 212637 -777415 -1624124 -1647763 -1039520 -528205 -421916
35910d21916l3124J23063L26304L94594J92428k37571n39422m60544k27892r0134
$$ -421916 -455040 -331977 -5673 388921 581349 343778 -195644 -656188 -884080 -974214
35900i74214J57851O42913Q42533K86848n05570o04420K3323N40299M33903m321
$$ -974214 -816363 -173450 669083 955931 450361 -154059 -130736 409563 843466 839145
35890H39145k85677k15202J12637L42069Q6579m91054o98269k83699J56310J86187
$$ 839145 553468 338266 450903 792972 879551 388497 -309772 -593471 -437161 -250974
35880b50974K34151O69075R66789O31755J97276L16651N42838J26731n69184o68621
$$ -250974 -16823 652252 1619041 2250796 2448072 2764723 3307561 3434292 2865108 2196487
35870B196487l01373k58015n16950m22825m3481k3506k85618j97337J22568R507
$$ 2196487 1895114 1637099 1120149 697324 653843 630337 344719 147382 269950 279457
35860B79457l51604j50464M59099M80357j14100k37658L54671N24788l04201j111587
$$ 279457 -72147 -222611 236488 716845 602745 365087 719758 1244546 940345 -171242
35850a71242r10337j58858K54882L35212M38873L85751O715k18939N5068K97706
$$ -171242 -1081579 -1240437 -985555 -650343 -211470 174281 180996 -37943 17125 314831
35840C14831l9841n28592m44180P6208L68867L10695K62075K65628O3718k66889
$$ 314831 274990 -253602 -697782 -621574 -252707 57988 320063 585691 649409 382520
35830C82520l49959r0070K62014N03488N59492L55023l5213l14995l69719m89454
$$ 382520 32561 -57509 204505 707993 1267485 1622508 1587295 1272300 902581 413127
35820D13127q50466j061665o53683J82928P80203Q03893N05501K27707J6334k20393
$$ 413127 -437339 -1499004 -2152687 -1969759 -1189556 -385663 119838 347545 363879 143486
35810A43486m11283l39503L9702L85553K78612j58304k43786L30711Q45283M05867
$$ 143486 -267797 -607300 -567598 -182045 96567 -61737 -305523 25188 870471 1276338
35800A276338o67815j033628o0935J282986J615828P16053m60443r65749o67569
$$ 1276338 608523 -425105 -486040 796946 2412774 3128827 2668384 1702635 1035066
35791A035066j03279J23072j31979m68931m46180j15908J43050K08127K59642
$$ 1035066 931787 1054859 922880 453949 7769 -108139 34911 243038 502680
35782E02680L20925K19071R821m6795K0828p0550k80204k50322J7156R1207j22347
$$ 502680 823605 1042676 1052497 1005702 1026530 955980 675776 425454 442610 533817 411470
35771D11470j70992J49641M08758K60231l0568j29348j47682k36535k09258P948
$$ 411470 240478 390119 798877 1059108 1028540 899192 751510 514975 305717 313665
35761C13665P6655j37282j68832K76502O33574K17222o71952j054589n33270L21184
$$ 313665 390320 253038 84206 360708 994282 1211504 539552 -515037 -1048307 -727123
35751g27123P61092N75732P8635k38245r1766K88305L69359J4932k98712j95118
$$ -727123 33969 609701 688336 450091 358325 646630 1015989 1030921 732209 537091
35741E37091M6548k234k32381k68064j11565k4915j9825L5825K1878k11187m05607
$$ 537091 583639 581405 349024 80960 -30605 -55520 -75345 -39520 -17642 -228829 -634436
35730f34436k05805K26291M07079K33858J2769r4748j53642j03747J20730J93275
$$ -634436 -840241 -613950 -206871 26987 39756 -54992 -208634 -312381 -191651 1624
35720A624k81292j016035j205179n73192K48793N62453L64017P8998m4488k9851
$$ 1624 -279668 -1295703 -2500882 -3074074 -2825281 -2262828 -1898811 -1819813 -1864301 -1894152
35710a894152K8451K7385p6838j39824J8953K84310L44005J73064R5996K76877
$$ -1894152 -1865701 -1838316 -1915154 -2054978 -2036025 -1751715 -1407710 -1234646 -1138650 -861773
35700h61773M86517N01003L87240K37314k0186l30182l86579q4130K08660J52193
$$ -861773 -375256 125747 512987 750301 730115 399933 13354 -70776 137884 290077
35690B90077n6540m7786Q4232l6565l78165m91650k07858J15407J49785o857j44701
$$ 290077 233537 185751 269983 233418 -144747 -636397 -844255 -728848 -579063 -585920 -730621
35679g30621k54964k96723m1698M91419P70222L86498k44103l54760R3317L94795
$$ -730621 -985585 -1282308 -1324006 -832587 -62365 324133 80030 -274730 -181413 213382
35669B13382J88319r7570q4041l4311j82941j26104M36974Q48050K78515q34490
$$ 213382 401701 304131 220090 185779 2838 -123266 313708 1161758 1440273 605783
35659F05783j128758k00578P81945P06802n3045m12723j46528P1489j29542l52747
$$ 605783 -522975 -723553 58392 765194 712149 299426 152898 224387 94845 -257902
35649b57902j65397K93341N74583M34945o776l88941l64167M7605L89662K69902
$$ -257902 -423299 -129958 444625 879570 872794 483853 119686 167291 556953 826855
35639H26855j32622l21779j71913k1825q5517j64008p5022J567j27794k56509
$$ 826855 694233 372454 200541 178716 93199 -70809 -145831 -144264 -272058 -528567
35629e28567p7085K53595K73105n1441j91320J42755M66832J86762m61540o64538
$$ -528567 -605652 -352057 -78952 -130393 -321713 -178958 287874 474636 13096 -651442
35619f51442j59669M60712O72115O44211O64361N25779p025n71882o59854l90416
$$ -651442 -811111 -350399 321716 965927 1630288 2156067 2149042 1577160 917306 526890
35609E26890k18340j35668J31402L45614J8063o15919p76584l84730j96993m59726
$$ 526890 308550 172882 304284 649898 667961 52042 -724542 -1109272 -1306265 -1765991
35599a765991m08970M01508J178243J003717J76203l47360l13891j78337j62160
$$ -1765991 -2174961 -1773453 -595210 408507 584710 237350 -76541 -254878 -417038
35590d17038j35374j58648l45628l81599M9554N17262L29475l08789m66490J17399
$$ -417038 -552412 -711060 -1056688 -1438287 -1388733 -871471 -541996 -850785 -1317275 -1199876
35580a199876O38726M53623n2249j85980O9124K40728J07053j93215n01449o96119
$$ -1199876 -561150 -107527 -159776 -345756 -276632 -35904 71149 -122066 -623515 -1319634
35570a319634o03233j92490K48952M06916L26923K92268L74809L30375j3458m17425
$$ -1319634 -1922867 -2115357 -1866405 -1459489 -1132566 -840298 -465489 -135114 -148572 -565997
35560e65997m33447K1441M40576K82780k97286n94340l04125P5732M7933j12982
$$ -565997 -999444 -978003 -537427 -254647 -551933 -1146273 -1450398 -1374666 -1326733 -1439715
35550a439715J28069O04203O54498J95788j14086R6139L66027J83813k15013k63001
$$ -1439715 -1311646 -707443 -52945 142843 28757 124896 490923 674736 459723 196722
35540A96722O8471K93119J56669p8935j15830m8864j71372n17421p61712n75953
$$ 196722 265193 558312 714981 636046 520216 471352 299980 -217441 -979153 -1555106
35530a555106p244N50669P40852N31989J45545j70367k53191p5869J94597L04988
$$ -1555106 -1562350 -1011681 -270829 261160 406705 236338 -16853 -92722 101875 406863
35520D06863J98045P4076P6803Q9393j2305r9734j0001J22856J0636l86521q00338
$$ 406863 604908 678984 755787 845180 832875 733141 723140 845996 856632 470111 -330227
35509c30227r31025o51909q3501L91428L97988N3715o0812L30013P40277N91821
$$ -330227 -1261252 -1913161 -1996662 -1605234 -1207246 -1153531 -1214343 -884330 -144053 447768
35499D47768P3796j44199J04954L22120J37373k25089l64352k06565J5149L2349
$$ 447768 521564 377365 482319 804439 941812 716723 352371 145806 160955 193304
35489A93304k32471n20839m27563L7057L01166J750l73155j42854M74425O04888
$$ 193304 -39167 -560006 -987569 -950512 -649346 -647596 -1020751 -1163605 -689180 -84292
35479h4292R359n80795n34330o6773L02154M41247M53473L26288Q6835n2420M910
$$ -84292 -74933 -655728 -1190058 -1256831 -954677 -513430 -59957 266331 353166 300746 305656
35468C05656Q1588O5281Q2356J64217J02809j58191l35169k22878J2770J50972
$$ 305656 387244 452525 534881 699098 801907 643716 308547 85669 98439 249411
35458B49411K12441K58470K04099J4271j87600l32570m48576m46119k23125L9
$$ 249411 461852 720322 924421 938692 751092 418522 -30054 -476173 -699298 -699259
35448f99259q5672k74371m4762N35648P67905M02687N5191J78094L28894j1743
$$ -699259 -784931 -1059302 -1104064 -568416 199489 602176 657367 835461 1164355 1152612
35438A152612n18122n68920k36944m1613o5829K42J81150K21991J09153L0252
$$ 1152612 634490 65570 -171374 -212987 -278816 -278574 -97424 124567 233720 263972
35428B63972l5332j90897k67141p6626J71746J91540J27143K43651L71542K32933
$$ 263972 228640 37743 -229398 -306024 -134278 57262 184405 428056 799598 1032531
35418A032531O1373K29548M65902J98214m21269o39920k92830o5563l82425p67937
$$ 1032531 1093904 1323452 1789354 1987568 1566299 926379 633549 567986 185561 -582376
35408e82376o34899j05121L25785M69089M24018K55431M1156l1423R7557K32588
$$ -582376 -1217275 -1322396 -996611 -527522 -103504 151927 193083 161660 259217 491805
35398D91805K15502J20386K6452j29494l32735m05515k95739j84018j64576r6497
$$ 491805 707307 827693 854145 724651 391916 -13599 -309338 -493356 -657932 -754429
35388g54429Q9142K24599K02398J52724J70770J59837R9511J42569K59561J54973
$$ -754429 -665287 -440688 -238290 -85566 85204 245041 344552 487121 746682 901655
35378I01655j98414l24034O8914M78341K05924n99375j046689o64969N5682M38016
$$ 901655 703241 379207 448121 926462 1132386 533011 -513678 -1178647 -1122965 -684949
35368f84949M66213N31181O60523N01258J8590k84761o5455K90258J63905l95155
$$ -684949 -218736 312445 972968 1474226 1492816 1208055 1142600 1432858 1596763 1201608
35358A201608p08438m13137Q6014K71677J89312J55919J54836l4592l23890m13066
$$ 1201608 493170 80033 166047 437724 627036 782955 937791 903199 579309 166243
35348A66243l00398k41242k52601j15242J45254K53203J89389K13868L11003J46596
$$ 166243 -134155 -375397 -627998 -743240 -597986 -344783 -155394 58474 369477 516073
35338E16073k60298l84250n062L45486J56026k74258l04011J02835M11521L09761
$$ 516073 255775 -128475 -133537 211949 367975 93717 -210294 -107459 304062 613823
35328F13823j0257k51191k75367o2590K23514K38383j07223l67205j39232K54131
$$ 613823 603566 352375 77008 14418 237932 476315 369092 1887 -137345 116786
35318A16786K11163j44625j00739M49098P11993K03363m47358m14024J33298L87499
$$ 116786 327949 183324 82585 531683 1243676 1447039 999681 585657 718955 1106454
35308A106454J06610k36853l39329l90078m92397m20567j38749j1788k15996l77548
$$ 1106454 1213064 976211 636882 246804 -245593 -666160 -804909 -816697 -1032693 -1410241
35298a410241j32963K91135M26276K38674O9485O1657M7946m4585n7851P2130
$$ -1410241 -1543204 -1252069 -825793 -587119 -517634 -455977 -408031 -452616 -510467 -438337
35288d38337J45916k0628l13837m19009j32625M31669Q88563Q82909M33123q5396
$$ -438337 -292421 -313049 -626886 -1045895 -1178520 -746851 141712 1024621 1457744 1372348
35278A372348l60163m16195l95199k90686j01401j5812j36374j96979Q3490M98216
$$ 1372348 1012185 595990 200791 -89895 -191296 -207108 -343482 -540461 -456971 41245
35268D1245O06979L97389K33186J88067l5285m52277o15641k93457J50432L12464
$$ 41245 648224 1045613 1278799 1466866 1431581 979304 363663 70206 220638 533102
35258E33102K64185K33416J75023q624j65408j58199j36495k21125k21795j0253
$$ 533102 797287 1030703 1205726 1197102 1031694 873495 737000 515875 294080 283827
35248B83827J37333l3600k66590j63775J83715L81796L62194L61524M00935K50755
$$ 283827 421160 387560 120970 -42805 140910 522706 884900 1246424 1647359 1898114
35238A898114j25684m73311n68395l71136K8729L66252L12607p4936k94772j31658
$$ 1898114 1772430 1299119 730724 359588 388317 754569 1067176 992240 697468 565810
35228E65810n2627l84639n61825M6778R05529Q81396n8600p58593o03511k79633
$$ 565810 513183 128544 -433281 -386503 519026 1400422 1341822 583229 -20282 -299915
35218b99915m41639o36993k24342M28311N04658J8788k93786j17896J50739J72141
$$ -299915 -741554 -1378547 -1602889 -1174578 -669920 -651132 -944918 -1062814 -912075 -739934
35208g39934P4887N0503M0026l7251p9272K4253J89887K13426M85k69725k44473
$$ -739934 -665047 -614544 -574518 -611769 -691041 -666788 -476901 -263475 -262990 -532715 -777188
35197g77188J93407O51023O27109J99238n5215Q9236J90169r6069m07345k48535
$$ -777188 -583781 67242 694351 893589 838374 927610 1117779 1021710 614365 365830
35187C65830J94209L23520N292l33178l84788k79589k31312k60368l07527l20935
$$ 365830 560039 883559 888851 555673 170885 -108704 -340016 -600384 -907911 -1228846
35177a228846k05071P0845L24381L44020J80522M4310K922J7611J49756M17689
$$ -1228846 -1433917 -1363072 -1038691 -694671 -514149 -469839 -466917 -449306 -299550 118139
35167A18139N58358L07869j30443k96723j46912p8415k21560j95424K06771N32575
$$ 118139 676497 984366 853923 557200 410288 331873 110313 -85111 121660 654235
35157F54235K56457m23118p97469n37874J9967M42117O42838O73715M45357p1135
$$ 654235 910692 487574 -309895 -847769 -827802 -385685 257153 930868 1376225 1305090
35147A305090n75624o84305l87613j4939K17724L46362L53321R9872k87800l52337
$$ 1305090 729466 45161 -342452 -357391 -139667 206695 560016 659888 372088 19751
35137A9751N2905L69356M0112n93337o78214q7741L82465K12406j14383J9497
$$ 19751 72656 442012 482124 -111213 -789427 -877168 -494703 -282297 -396680 -377183
35127c77183L40576J68132m05833n69476n720O23850O24204J75876n8366R7041
$$ -377183 -36607 131525 -274308 -843784 -849504 -225654 398550 574426 516060 613101
35117F13101J92628j12525n76424p31643m58127j7203L41669N70562O47581M88350
$$ 613101 805729 693204 116780 -614863 -1072990 -1090193 -748524 -177962 469619 957969
35107I57969J66037J084J90980M72735M27131N5838k50724l12855l73431o07041
$$ 957969 1124006 1125090 1316070 1788805 2215936 2271774 2021050 1708195 1334764 727723
35097G27723p57781m94098R0617N59372N95648K43344j90279l66890k00922R752
$$ 727723 -30058 -524156 -433539 125833 721481 964825 774546 407656 206734 216486
35087B16486q2602l68387l86577k3789K68634J72024J6318K22032N54085M53773
$$ 216486 133884 -234503 -621080 -644869 -376235 -204211 -187893 34139 588224 1041997
35077A041997l8487k54333J62985P64655R05497M94480o6696m27510n21528m12477
$$ 1041997 1003510 749177 912162 1676817 2582314 3076794 3010098 2582588 2061060 1648583
35067A648583j86020m053o2753l66441o11544m60902J4098L24122J46968k16744
$$ 1648583 1462563 1458510 1395757 1029316 417772 -43130 -29032 295090 442058 225314
35057B25314k34825Q8789K11059j23572m61239k81665K53429N34992L21535j7329
$$ 225314 -9511 79278 290337 166765 -294474 -576139 -322710 212282 533817 516488
35047E16488l5327K64787M79202K67315k42091n23925k50088K34640K80391k07769
$$ 516488 481161 745948 1225150 1492465 1250374 726449 476361 711001 991392 783623
35037G83623o15371m48707L0836K31026n378l33689l95229j26337K56686M11630
$$ 783623 168252 -280455 -249619 -18593 -23971 -357660 -752889 -879226 -622540 -210910
35027b10910J95118p2209N2205M49601N16867P7996k97875j73687J05344N8536
$$ -210910 -15792 -88001 -35796 413805 930672 1008668 710793 537106 642450 700986
35017G00986j52626j34187j153r0153k75030j96956R4383L11814M46065N25802
$$ 700986 548360 414173 413020 322867 47837 -149119 -54736 257078 703143 1228945
35007A228945K38031n02787r78466n21835L24435M58247j36634m33345l1469L12350
$$ 1228945 1466976 964189 -14277 -536112 -211677 246570 109936 -323409 -354878 -42528
34997d2528J6714m95620o54312n21712l03869J07007O49831Q73010O43036M26120
$$ -42528 -25814 -521434 -1175746 -1697458 -2001327 -1894320 -1244489 -371479 271557 697677
34987F97677M69657L85142l7315l18063r8681K09038J34870j16894k07567l05888
$$ 697677 1167334 1552476 1515161 1197098 1098417 1307455 1442325 1325431 1117864 811976
34977H11976n74733o36518k41222J08628n4466k96992k7258L99422K52252k86452
$$ 811976 237243 -399275 -640497 -531869 -586335 -883327 -910585 -511163 -258911 -545363
34967e45363m11206l3303J90886O6421P7501L64483M55778J80313l1779L2657
$$ -545363 -956569 -989872 -798986 -732565 -655064 -290581 165197 345510 313731 346388
34957C46388O9523q071J31011M25294K80014l50618o01839l291O39771M23226
$$ 346388 415911 407840 538851 964145 1244159 893541 291702 288411 928182 1351408
34947A351408k50463l49792J64559M23461J47484k0165K20392K50947l56132r66942
$$ 1351408 1100945 751153 915712 1339173 1486657 1466492 1686884 1937831 1581699 614757
34937F14757p48857J12347P09575O22645K05228j57904m36263n99986m82403j57566
$$ 614757 -134100 -21753 687822 1310467 1515695 1357791 921528 321542 -160861 -318427
34927c18427J3179q8530j53966J0847J61739Q8483P918J43732K80419J55638k6124
$$ -318427 -305248 -393778 -547744 -536897 -375158 -286675 -278757 -135025 145394 301032 274908
34916B74908L3600J19548j38883m89618l23134L17669O89556M18761l6038j87273
$$ 274908 308508 428056 289173 -200445 -523579 -205910 483646 902407 866369 679096
34906F79096j58584k28823l10999k66504k53296l49712k58019J80273N55843M52874
$$ 679096 520512 291689 -19310 -285814 -539110 -888822 -1146841 -966568 -410725 42149
34896D2149J18195O8356K80701K97362k4837l65443m55117l10199k9838K44839
$$ 42149 160344 228700 509401 806763 781926 416483 -38634 -348833 -378671 -133832
34886a33832K54348r1707m16537k75191J89587M13294K28774O8336K54329N19437
$$ -133832 120516 28809 -387728 -662919 -473332 -60038 168736 237072 491401 1010838
34876A010838M50317Q2304k36524l82846n38138p51146p11705j53762O20079Q94694
$$ 1010838 1461155 1543459 1306935 924089 385951 -365195 -1076900 -1230662 -610583 284111
34866B84111L43164n33028r71385p74532k83586K59937Q31709J186779R37394
$$ 284111 627275 94247 -877138 -1651670 -1935256 -1675319 -843610 343169 1280563
34857A280563K23106k71013k21162o2590j89652l22798r4259K57938L14620J76020
$$ 1280563 1503669 1232656 1011494 948904 759252 436454 342195 600133 914753 1090773
34847A090773J78247K58001J67808K2367N8363J21494l8142k31964j81692j10769
$$ 1090773 1269020 1527021 1694829 1717196 1775559 1897053 1858911 1626947 1445255 1334486
34837A334486l38117n71799l54357L1133n1853m51156m06851J30915L46335r7881
$$ 1334486 996369 424570 70213 101346 49493 -401663 -808514 -677599 -331264 -429145
34827d29145n06959l03235J11275J31599j01148r3706J64608L19531K61723J46536
$$ -429145 -936104 -1239339 -1128064 -996465 -1097613 -1191319 -1026711 -707180 -445457 -298921
34817b98921M6289n9061j50703k65350m64527n49924j82320N03615Q30611M41019
$$ -298921 -252632 -311693 -462396 -727746 -1192273 -1742197 -1924517 -1420902 -590291 -149272
34807a49272j53752k59102Q4698K82005N3225k98761m01982k40998m8042K4633
$$ -149272 -303024 -562126 -477428 -195423 -142198 -440959 -842941 -1083939 -1131981 -1107348
34797a107348N7357J95460L22581Q1914n46475r04536l73901O31429R91088L21006
$$ -1107348 -1049991 -854531 -531950 -450036 -996511 -1901047 -2274948 -1643519 -652431 -331425
34787c31425n08359n62606P197M02633K96506P057j49196j68271j39238r9076
$$ -331425 -839784 -1402390 -1395193 -992560 -696054 -688997 -838193 -1006464 -1145702 -1244778
34777a244778o2716K8086K79019N97392O50136K66616k71039n13521k95669J77593
$$ -1244778 -1307494 -1279408 -1000389 -402997 247139 513755 242716 -270805 -566474 -388881
34767c88881N15168L85635j50780n38017k96619K83114M59667R1807j97096n4609
$$ -388881 126287 511922 361142 -176875 -473494 -190380 269287 361094 163998 109389
34757A09389O7481k37754n87050m34232N5254L37219L14710K50033J64456p5189
$$ 109389 176870 -60884 -647934 -1082166 -1026912 -689693 -374983 -124950 39506 -35683
34747c5683k93763k09581M6749J24864K3649j6110l3441k46644n33633n21338
$$ -35683 -329446 -539027 -492278 -367414 -343765 -359875 -393316 -639960 -1173593 -1694931
34737a694931j60855K19168L89291L60801J43702k13672m14212j73075L28566
$$ -1694931 -1855786 -1636618 -1247327 -886526 -742824 -956496 -1370708 -1543783 -1215217
34728a215217O15679N03783J89037j30192l56260l51285j07407N5351j13082l17408
$$ -1215217 -599538 -95755 93282 -36910 -393170 -744455 -851862 -796511 -909593 -1227001
34718a227001j06490L65861M92690R6320l56175m41759k08927J07579L31461K78878
$$ -1227001 -1333491 -967630 -474940 -378620 -734795 -1176554 -1385481 -1277902 -946441 -667563
34708f67563q4465m00341l07431n3231j50500m27392j43666P69968J353919R03434
$$ -667563 -752028 -1152369 -1459800 -1513031 -1663531 -2090923 -2234589 -1464621 -110702 792732
34698G92732m5225n42683m92434m41046n17737l68619P568J47940m7784n6463
$$ 792732 747507 204824 -287610 -728656 -1246393 -1615012 -1607444 -1459504 -1507288 -1563751
34688a563751M09265Q06865M81854l23372p03529k79989L30936L92841k178j88592
$$ -1563751 -1154486 -347621 134233 -189139 -892668 -1172657 -841721 -448880 -451058 -639650
34678f39650J01471M54524M40685J54693m0514l910J32916J83763J5275l61450
$$ -639650 -538179 -83655 357030 511723 471209 467299 600215 783978 799253 437803
34668D37803o66665n45850m2622L62985L55107J48535O1475M3455q8592k46574
$$ 437803 -228862 -774712 -817334 -454349 -99242 49293 110768 154223 65631 -180943
34658a80943k48415j45780l4312J92534N21655N52230L4142n66839n91572j18776
$$ -180943 -429358 -575138 -609450 -416916 104739 656969 691111 124272 -467300 -586076
34648e86076J90416Q3088l6647J52997M58684N60710L84875K5800l16925l45010
$$ -586076 -395660 -312572 -349219 -196222 262462 823172 1208047 1233847 916922 571912
34638E71912q871K25120p6571n89743o09635r2373L11084K67549J18093J18757
$$ 571912 563041 788161 711590 121847 -487788 -580161 -269077 -1528 116565 235322
34628B35322M6652j94323k47658O6238L57988K79523M8706O105P9963M4714p5363
$$ 235322 281974 87651 -160007 -93769 264219 543742 592448 598553 678516 723230 647867
34617F47867j91660l79318o12105o12418k55269J88585M35228M79722L53319K1552
$$ 647867 456207 76889 -535216 -1147634 -1402903 -1214318 -779090 -299368 53951 75503
34607G5503l06397k75236j607k4962l84039m09438J70297O24688L01220l32241
$$ 75503 -230894 -506130 -507737 -532699 -916738 -1326176 -1155879 -531191 -229971 -562212
34597e62212m43454j02064L3261j01813j2049L37081M27853J14153j48407r9408
$$ -562212 -1005666 -1107730 -1074469 -1176282 -1188331 -851250 -423397 -309244 -457651 -557059
34587e57059k9661j67916k62499m413M95001Q11492N83248j89056r85370j079140
$$ -557059 -586720 -754636 -1017135 -1021548 -526547 284945 868193 679137 -306233 -1385373
34577a385373l48263M26803M88337Q2594j7074K79511L76473J13378N1704M65764
$$ -1385373 -1733636 -1306833 -818496 -735902 -752976 -473465 -96992 16386 68090 533854
34567E33854Q04936N20354j53987o38108p53754o38240l23160J42068M31986K77628
$$ 533854 1338790 1859144 1705157 1067049 313295 -324945 -648105 -506037 -74051 203577
34557B03577q8263k12595o2840k7778k94925n59108m52325m6250K35325J35736
$$ 203577 115314 -97281 -160121 -187899 -482824 -1041932 -1494257 -1540507 -1305182 -1169446
34547a169446j40229j89570J14503N20087P38734P16021N10936J25238l68276
$$ -1169446 -1309675 -1499245 -1384742 -864655 -125921 590100 1101036 1226274 857998
34538H57998o90969o00744k14976J05058J55518K6614r0929q2715L4349J12772
$$ 857998 167029 -433715 -648691 -543633 -388115 -361501 -452430 -535145 -500796 -388024
34528c88024L7369l8419J48445M53234L33573l28007q09224m55817L02244M93340
$$ -388024 -350655 -389074 -240629 212605 546178 218171 -591053 -1046870 -744626 -251286
34518b51286N855l05746L6582M69372L69105K4973J03024N55326O65168P1033
$$ -251286 -245431 -551177 -514595 -45223 323882 348855 451879 1007205 1672373 1743406
34508A743406p26248r61758m65286J89230L29480q7536m72890l53001P4572L13029
$$ 1743406 1017158 55400 -409886 -220656 108824 21288 -451602 -804603 -730031 -417002
34498d17002K67649K09197J82842l8637l82190l83842J19832O28884N93200J04477
$$ -417002 -149353 59844 242686 204049 -178141 -561983 -442151 186733 779933 884410
34488H84410k77575j81743K77392O60050N29755j46903q17942q32338k21562L09481
$$ 884410 606835 425092 702484 1362534 1892289 1745386 927444 95106 -126456 183025
34478A83025K88368n584j11068m1024m0800o4212P0465K37739J61118j09581k57241
$$ 183025 471393 465809 354741 313717 272917 208705 279170 516909 678027 568446 311205
34467C11205j57303M1043K10995L20763K91183R0583q3228j4859J70573J48864
$$ 311205 153902 194945 405940 726703 1017886 1108469 1025241 1010382 1180955 1329819
34457A329819j24048l56759l49350k01249n9243Q2192K50027L68720L61021K38104
$$ 1329819 1205771 849012 499662 298413 239170 321362 571389 940109 1301130 1539234
34447A539234M5374j53171k26849p9039J66553K44689Q4393p7160j4923J66652
$$ 1539234 1584608 1431437 1204588 1125549 1292102 1536791 1621184 1544024 1529101 1695753
34437A695753J79201l4274j94951o0654K18026K67655p474k89510k88652j19406
$$ 1695753 1874954 1840680 1645729 1585075 1803101 2070756 2063282 1773772 1485120 1365714
34427A365714n5635q7185o317J66010J92702N1419j8834L0527n4486l40690m92187
$$ 1365714 1310079 1222894 1216577 1382587 1575289 1626708 1607874 1638401 1583915 1243225 751038
34416G51038k93686m7541j18427l49612l15999J1856K44604J35376j76588m41726
$$ 751038 457352 409811 291384 -58228 -374227 -362371 -117767 17609 -158979 -600705
34406f00705n13986l16699J05736M84516N30779K79818L5147k6373J0279M0395
$$ -600705 -1114691 -1431390 -1325654 -841138 -310359 -30541 4606 -21767 -11488 28907
34396B8907P7769J12577M1935j72753m04224m70461k85935O9845L63062L70865
$$ 28907 106676 219253 261188 88435 -315789 -786250 -1072185 -1002340 -639278 -268413
34386b68413J47990J9875J66150L45351K37551o3114j61015R8396M54153N67029
$$ -268413 -120423 -100548 65602 410953 648504 585390 424375 522771 976924 1543953
34376A543953L05378k47016q08798r74528n66204Q2362M51663M24899K71576J12767
$$ 1543953 1849331 1602315 793517 -181011 -747215 -664853 -213190 211709 483285 596052
34366E96052j83510n42103n98036k71423K187q2742j86522J45955O91681P66925
$$ 596052 412542 -129561 -727597 -999020 -996833 -1079575 -1266097 -1120142 -428461 338464
34356C38464J75769m98900o38570k91300K9864K6820j17314p8420J80485L83394
$$ 338464 514233 15333 -623237 -914537 -884673 -857853 -975167 -1053587 -873102 -489708
34346d89708K97184K9608j01970K5062J95458J71100J4943k9650J01113K14200
$$ -489708 -192524 -162916 -264886 -239824 -44366 126734 141677 112027 213140 427340
34336D27340J23269j48414m27448n28873l41348P4797M44265M88764K53138P3396
$$ 427340 550609 402195 -25253 -554126 -895474 -820677 -376412 112352 365490 438886
34326D38886J29310K03783N2919j62959j10742J37867J38336k48879n91384n03525
$$ 438886 568196 771979 824898 661939 551197 689064 827400 578521 -12863 -516388
34316e16388k03144j31343k70176k55193k9059Q7635j8751m8556K16972N86033
$$ -516388 -719532 -850875 -1121051 -1376244 -1405303 -1317668 -1336419 -1384975 -1168003 -581970
34306e81970P65669O75827L17238l22158j020914j300940r16889j63492M78590
$$ -581970 183699 859526 1176764 854606 -166308 -1467248 -2384137 -2547629 -2069039
34297b069039P66082O52770K06247k20310j50399L61613O35375K91764j58172
$$ -2069039 -1302957 -650187 -443940 -664250 -814649 -453036 182339 474103 315931
34288C15931j25554J19025r260l05811q1943N82329Q15276K67796l95852n40355
$$ 315931 190377 309402 300142 -5669 -87612 494717 1309993 1577789 1181937 641582
34278F41582l28026j53480l6441L1133k00108o85910q23676k86179L52607L96671
$$ 641582 313556 160076 123635 154768 -45340 -731250 -1554926 -1841105 -1488498 -1091827
34268a091827K8196q1472J71941L31298K38387J97992L17975L05886J7896k73543
$$ -1091827 -1063631 -1145103 -973162 -641864 -403477 -205485 112490 418376 436272 162729
34258A62729k93351r0534J45434L05205L31627K18228P8154K4618M856p6988j77285
$$ 162729 -130622 -221156 -75722 229483 561110 779338 857492 882110 886966 809978 632693
34247F32693k55677m23569o64307o10896j5080O94682Q00633K15818m32481o44521
$$ 632693 377016 -46553 -710860 -1321756 -1336836 -642154 158479 374297 -58184 -702705
34237g02705n13956l09639q9777J11467J54162O6341R2592K71679L04345N0474
$$ -702705 -1216661 -1526300 -1616077 -1504610 -1350448 -1284107 -1191515 -919836 -615491 -565017
34227e65017j70274k3787L56815N68296M00311o6592n70648p17863k34763O00239
$$ -565017 -735291 -759078 -402263 166033 566344 499752 -70896 -788759 -1023522 -423283
34217d23283J064968P77953J13781l67347n54635n82311m16359q9660J4492l12993
$$ -423283 641685 1419638 1533419 1166072 611437 29126 -387233 -476893 -462401 -775394
34207g75394n54158r7929O98699Q25030O5296o06523l70607L38568N45490Q4824
$$ -775394 -1329552 -1427481 -728782 96248 161544 -444979 -815586 -477018 68472 153296
34197A53296l42496k38326J43374L12124J47514j34225l08790k70229j5031L25515
$$ 153296 -189200 -427526 -284152 27972 175486 41261 -267529 -537758 -552789 -227274
34187b27274N05081L46751o7011m24181m37423j02693K95068M71145M21508L44558
$$ -227274 277807 624558 557547 133366 -304057 -406750 -111682 359463 780971 1125529
34177A125529L13136J84921j07232l59111l50743j81775j46969l20897m75738
$$ 1125529 1438665 1623586 1516354 1157243 806500 624725 477756 156859 -318879
34168c18879m21152k14478K3291K72668M58976L58066p2132m06980j78459M05698
$$ -318879 -740031 -954509 -931218 -658550 -199574 158492 86360 -320620 -499079 -93381
34158i3381N87435Q9416l96191j44216N05319N89136o1457n80226l94086k5188
$$ -93381 494054 583470 187279 43063 548382 1137518 1076061 495835 101749 76561
34148G6561j10999l05200Q1042P77010Q42030J48262l93923k61721n8120m09234
$$ 76561 -34438 -339638 -258596 518414 1360444 1508706 1114783 853062 794942 385708
34138C85708r12412q14903j79910L27027M50075M50801M50315L49178K61818L60913
$$ 385708 -526704 -1341607 -1521517 -1194490 -744415 -293614 156701 505879 767697 1128610
34128A128610L61224j50026q44805q39537N3762R06151Q27253L5444n84456n78287
$$ 1128610 1489834 1339808 495003 -344534 -290772 615379 1442632 1478076 893620 315333
34118C15333j88738J63085K65154J55558O4593J84126L48978J98347k03837k92206
$$ 315333 126595 289680 554834 710392 774985 959111 1308089 1506436 1302599 1010393
34108A010393J78231O26818L92313l17546p36115o14952m22604m87703n02749
$$ 1010393 1188624 1815442 2207755 1890209 1154094 539142 116538 -371165 -873914
34099h73914p4020O11152R37852N54927k26109o94548m31481K05885M28113l7692
$$ -873914 -947934 -336782 601070 1155997 929888 235340 -196141 9744 437857 400165
34089D00165n69088m63126J26385M78293L47909J67898K26510K63905Q1186k2933
$$ 400165 -168923 -632049 -505664 -27371 320538 488436 714946 978851 1060037 1037104
34079A037104J84128L01819j72486r55222j184776n47751K73386M73030J05135
$$ 1037104 1221232 1523051 1350565 395343 -789433 -1337184 -1063798 -590768 -485633
34070d85633j22806J29322M27971K76891j20211j56433K61321N52697L26914l3701
$$ -485633 -608439 -479117 -51146 225745 105534 -50899 210422 763119 1090033 1056332
34060A056332L2529M19930N54322K55276j18755l48928o23145r81175j007646
$$ 1056332 1088861 1508791 2063113 2318389 2199634 1850706 1227561 246386 -761260
34051g61260m15535L92666P27618M29905j5048r9457K07665N42835N42246J58226
$$ -761260 -1176795 -784129 -56511 373394 358346 258889 466554 1009389 1551635 1709861
34041A709861l08715n03105l67919j35155K0789J44187K74435K89510J11351j05826
$$ 1709861 1401146 898041 530122 394967 415756 559943 834378 1123888 1235239 1129413
34031A129413j54322k5978J31280J86885O1618k50617n72674o26850l80450j46522
$$ 1129413 975091 949113 1080393 1267278 1328896 1078279 505605 -121245 -501695 -648217
34021f48217j68222k65214j09166K75593N30019M17359M6980l21828m99868m05886
$$ -648217 -816439 -1081653 -1190819 -915226 -385207 32152 79132 -242696 -742564 -1148450
34011a148450q0699K86520M68074L96296K21013J62745L02425M69480L67670p5849
$$ -1148450 -1229149 -942629 -474555 -78259 142754 305499 607924 1077404 1445074 1369225
34001A369225n15169n19500j10185K55636K73775R8279k2627r7302k03889k63770
$$ 1369225 854056 334556 224371 480007 753782 852061 829434 732132 528243 264473
33991B64473k47065l22789n15607m86488j6358N21648N92304K37920n4072j01004
$$ 264473 17408 -305381 -820988 -1307476 -1323834 -802186 -209882 28038 -26034 -127038
33981a27038j41720k35972r5042L50994O82962N31075O1910k95913l60380k32493
$$ -127038 -268758 -504730 -599772 -248778 434184 965259 1027169 731256 370876 138383
33971A38383n1420P3790N1049q5209j56996o1657R8942J90101K07123J88548J26975
$$ 138383 86963 160753 211802 126593 -30403 -92060 6882 196983 404106 592654 719629
33960G19629O1541R6615K17847K47381J04261n0993q0379j16465l33164n70194
$$ 719629 781170 877785 1095632 1343013 1447274 1396281 1315902 1199437 866273 296079
33950B96079m56402N5881N05035M24291o7755l77618j70534J98858J68266k38284
$$ 296079 -160323 -104442 400593 824884 757129 379511 208977 407835 576101 337817
33940C37817m09690N901N86275O92006K87920j14909j93962j23285j66894l09366
$$ 337817 -71873 -65972 520303 1212309 1500229 1385320 1191358 1068073 901179 591813
33930E91813l82595l22299j92263q9020o5766o3367L3300J74372J32539j14059
$$ 591813 209218 -113081 -305344 -394364 -460130 -523497 -490197 -315825 -183286 -297345
33920b97345k05627Q8647L99366K30534k47991m16198j53412L4143j10362k44635
$$ -297345 -502972 -414325 -14959 215575 -32416 -448614 -602026 -567883 -678245 -922880
33910i22880j43749r8651k56564k00341L09694P14881M13960k48579m42849n7794
$$ -922880 -1066629 -1165280 -1421844 -1622185 -1312491 -597610 -183650 -432229 -875078 -932872
33900i32872K75179K56847K71000N60575P19294K99332n08560j093684j061412
$$ -932872 -657693 -400846 -129846 430729 1150023 1449355 940795 -152889 -1214301
33891a214301m81762K34155N65747K65031l26990n76003k99517L8693K8303j02718
$$ -1214301 -1696063 -1461908 -896161 -631130 -958120 -1534123 -1833640 -1794947 -1766644 -1869362
33881a869362J08202N90244P66939L37892k90336m78603q2435M42023N90665L29142
$$ -1869362 -1761160 -1170916 -403977 -66085 -356421 -835024 -917459 -475436 115229 444371
33871D44371K1813o0357j7589o3524j33478N1246N22608Q77625P00142P5336m91211
$$ 444371 466184 405827 388238 324714 191236 242482 765090 1642715 2342857 2418193 1926982
33860A926982o53175n43393m58987m22626k53530L0020J68182O4338n0432j3387
$$ 1926982 1273807 730414 271427 -151199 -404729 -374709 -206527 -142189 -192621 -206008
33850b06008k8583k97553n53080l49985K35821O04366L99484o8465k90268j34642
$$ -206008 -234591 -532144 -1085224 -1435209 -1199388 -595022 -195538 -264003 -554271 -688913
33840f88913J98022M96002N91254L43687j63884n61767n45394k03569J25703J93738
$$ -688913 -490891 5111 596365 940052 776168 214401 -330993 -534562 -408859 -215121
33830b15121l4372l70144m23717O9837P88430J012376N00183j59092l44078j81142
$$ -215121 -249493 -619637 -1043354 -973517 -185087 827289 1327472 1168380 824302 643160
33820F43160j43244k34337j10761K20230M12028L78982L22929K20390j35356n68720
$$ 643160 499916 265579 154818 375048 787076 1166058 1488987 1709377 1574021 1005301
33810A005301n97029j88125J15245R990j56281l4839J65920J16089o1566p0247
$$ 1005301 408272 220147 335392 345382 189101 154262 320182 436271 374705 304458
33800C04458P402j20792l95841m34275q5493L58694N53532M84731L87083L90242
$$ 304458 311860 191068 -204773 -639048 -724541 -365847 187685 672416 1059499 1449741
33790A449741L43306L8296m16371o17023l92842j21954k37064n56518n10127J830
$$ 1449741 1793047 1831343 1414972 797949 405107 283153 46089 -510429 -1020556 -1018726
33780a018726M28681L34585q0209l64725l26176L254M91506P97940N72210J7533
$$ -1018726 -590045 -255460 -335669 -700394 -1026570 -1023316 -531810 266130 838340 855873
33770H55873j88818J45377L25843k20870r85488j034136l31793K74402K63304
$$ 855873 667055 812432 1138275 917405 -68083 -1102219 -1434012 -1159610 -896306
33761h96306n3434k45805l21692l82418k74407J03203M98948O07687M41885J95481
$$ -896306 -949740 -1195545 -1517237 -1899655 -2174062 -2070859 -1571911 -964224 -522339 -326858
33751c26858n3695k97075m10550k35818J90259N97908O77149L36031j55868l51363
$$ -326858 -380553 -677628 -1088178 -1323996 -1133737 -535829 141320 477351 321483 -29880
33741b9880j00255K30879K02220j23867l17621k27906j31182j93835j83270R6105
$$ -29880 -130135 100744 302964 179097 -138524 -366430 -497612 -691447 -874717 -778612
33731g78612M05020L86468P6943j72645j60002K8836K44344L87112L42204M8846
$$ -778612 -373592 12876 89819 -82826 -242828 -213992 30352 417464 759668 808514
33721H08514l28795m84557k91043O8593L18541L39228J80319n0361k38411k84841
$$ 808514 479719 -4838 -295881 -227288 91253 430481 610800 560439 322028 37187
33711C7187j70823J4126J58150K24739K31898J76815N3143p8370j33040j27005
$$ 37187 -133636 -119510 38640 263379 495277 672092 725235 646865 513825 386820
33701C86820j51584j88080q9046J56085K85430Q3180k63122l60417j24958J55557
$$ 386820 235236 47156 -41890 114195 399625 482805 219683 -140734 -265692 -110135
33691a10135K61353K39264J24107j73327n44321o07093k23077K00501K38667L0290
$$ -110135 151218 390482 514589 341262 -203059 -810152 -1033229 -832728 -594061 -563771
33681e63771k5779P4055L7575j13608n4960K24290L23861O6636k17735k29043
$$ -563771 -589550 -515495 -477920 -591528 -646488 -422198 -98337 -31701 -249436 -478479
33671d78479j28885j95647l59802l55492j13983K35915N71623P58124O10006J26384
$$ -478479 -607364 -803011 -1162813 -1518305 -1632288 -1396373 -824750 -66626 543380 669764
33661F69764l56486m78371k46386N2572K16286K25105J06433o4056j01506J06093
$$ 669764 313278 -165093 -411479 -358907 -142621 82484 188917 124861 23355 129448
33651A29448L72892L87842J28274r2623m2593J36392J59222J2733k4012K01773
$$ 129448 502340 890182 1018456 925833 883240 1019632 1178854 1191587 1167575 1369348
33641A369348M18596K24817l23537o57902m01148P8086J31519k62920m93205k38826
$$ 1369348 1787944 2012761 1689224 1031322 630174 708260 839779 576859 83654 -155172
33631a55172Q9505M5688j86276j98962n4643p2405j74694k5305K80280K66955
$$ -155172 -65667 -19979 -206255 -405217 -459860 -532265 -706959 -732264 -451984 -185029
33621a85029j24173l66605j52681J57749J71445O7002J70643L22366J78434j09912
$$ -185029 -309202 -675807 -828488 -670739 -499294 -432292 -261649 60717 239151 129239
33611A29239j04053J35736R2626l01781m32414K9452M62816J25282o90182r75431
$$ 129239 25186 160922 253548 -48233 -480647 -451195 11621 136903 -553279 -1528710
33601a528710m04347K59536L16963O6606J62000N13189M81557j5451l11891k3909
$$ -1528710 -1933057 -1673521 -1356558 -1289952 -1127952 -614763 -133206 -148657 -460548 -484457
33591d84457L55212K29051k08929l37964o8215J28878N0993L8580K95805M55846
$$ -484457 -129245 99806 -109123 -447087 -515302 -386424 -335431 -296851 -1046 454800
33581D54800J49473l32251l69207J19270N43261M20734m1884l01007j75532L5825
$$ 454800 604273 272022 -97185 22085 565346 986080 944196 643189 467657 503482
33571E03482K9866j58730l05345k77084q4042J81640L33676J73829k21958m17762
$$ 503482 533348 374618 69273 -207811 -291853 -110213 223463 397292 175334 -242428
33561b42428q9256M52674N31282k2982n95996n85193j73184K2336j36505j93582
$$ -242428 -331684 120990 652272 629290 33294 -551899 -725083 -702747 -839252 -1032834
33551a032834J18563M40783L22271j27740m01355k39932J43783M19409M67444
$$ -1032834 -914271 -473488 -151217 -278957 -680312 -920244 -776461 -357052 110392
33542A10392L38192R4121j88241l54302k48271J12412M90969O09972L80965n4605
$$ 110392 448584 542705 354464 162 -248109 -135697 355272 965244 1346209 1291604
33532A291604m71009o74791n24918k5743N16499O22437J44973m38408m88974K7022
$$ 1291604 820595 145804 -379114 -404857 111642 734079 879052 440644 -48330 -21308
33522b1308M57811K15454n69546j214159j160010m33359M19472P94125N56728
$$ -21308 436503 651957 82411 -1131748 -2291758 -2725117 -2305645 -1511520 -954792
33513i54792J46531L3019J39456O3338j98630j97545J86847M31144J57364k32602
$$ -954792 -808261 -775242 -635786 -572448 -771078 -968623 -781776 -350632 -193268 -425870
33503d25870j98727N3654j7134k58252j8548O33355P61928n7053r51200q63720
$$ -425870 -624597 -570943 -588077 -846329 -864877 -231522 530406 473353 -477847 -1341567
33493a341567O2186P82395O94508J15248l66083m55343j63204K70193M67949K88954
$$ -1341567 -1279381 -496986 197522 312770 -53313 -508656 -671860 -401667 66282 355236
33483C55236N0311P1314J63044k4132l31164l06966K144Q8300j76237l60975k51010
$$ 355236 405547 476861 639905 615773 284609 -22357 -20213 68087 -108150 -469125 -720135
33472g20135j54851k23580j14653L10001N51487K18959k84427l53320n6976J32712
$$ -720135 -874986 -1098566 -1213219 -903218 -351731 -132772 -417199 -770519 -827495 -694783
33462f94783J47091K50903M19277L96689K13080Q0730n2240k86172l32297M3918
$$ -694783 -547692 -296789 122488 519177 732257 812987 760747 474575 142278 186196
33452A86196L56765N47n94531l88865N71296R44816P971j183677j227966k31087
$$ 186196 542961 543508 -51023 -439888 131408 1076224 1084195 -99482 -1327448 -1558535
33442a558535N77067N68758K02498N5492J79095L63274M19548J97789k28904m71409
$$ -1558535 -981468 -412710 -210212 -154720 24375 387649 807197 1004986 776082 304673
33432C04673l05808o9522j49812l26827j68247J60960J52262j29418j29586K16273
$$ 304673 -1135 -70657 -220469 -547296 -715543 -554583 -402321 -531739 -661325 -445052
33422d45052L64220J26087l2331J08535R4708l37654o66522l82742J69489L43945
$$ -445052 -80832 45255 12924 121459 216167 -121487 -788009 -1170751 -1001262 -657317
33412f57317J57174P9982J86352J71116L4018Q8282L22123L43712L3705k44456
$$ -657317 -500143 -420161 -233809 -62693 -28675 59607 381730 725442 759147 514691
33402E14691k06276l021J18701J44815J17114m3898l28550n02063m07801k31589
$$ 514691 308415 305394 424095 568910 686024 642126 313576 -188487 -596288 -827877
33392h27877k36828l42804j96920L31861Q96791R94164N04538j54618m63263l46072
$$ -827877 -1064705 -1407509 -1604429 -1272568 -375777 618387 1122925 968307 505044 158972
33382A58972j66486j72712j72958Q1865M08730M02328M8130k42138k48187k22944
$$ 158972 -7514 -180226 -353184 -271319 137411 539739 587869 345731 97544 -125400
33372a25400l91318n00600j76256M63794Q85158P69887K96846j82995m70401m94674
$$ -125400 -516718 -1017318 -1193574 -729780 155378 925265 1222111 1039116 568715 74041
33362G4041k70406p982j5095k88145l94154j5091N15258N33314r6406p45123p47406
$$ 74041 -196365 -204347 -219442 -507587 -901741 -916832 -401574 131740 35334 -709789 -1457195
33351a457195j38010M82978O44737L92560J02747R6444L84102O51410N34486R979
$$ -1457195 -1595205 -1112227 -467490 -74930 27817 124261 508363 1159773 1694259 1704238
33341A704238n35055o86074l68131J96821O96969P95211K77097n92185j082711
$$ 1704238 1169183 483109 114978 311799 1008768 1803979 2081076 1488891 406180
33332D06180p35708M1920M77061L95649K58149L26947L46824J13420j85773l69972
$$ 406180 -329528 -287608 189453 585102 843251 1170198 1517022 1630442 1444669 1074697
33322A074697n12693n88356l72967M0692J47999j96206m29839j56431J56197m4034
$$ 1074697 562004 -26352 -399319 -358627 -210628 -406834 -836673 -993104 -836907 -880941
33312h80941l77506r3194O28849Q38216K64033k62800m3156N69591Q15967N17942
$$ -880941 -1258447 -1351641 -722792 115424 379457 116657 73501 643092 1459059 1977001
33302A977001M1194k86966l51162j76916o385j58006n52164o86071l34125P4183
$$ 1977001 2018195 1731229 1380067 1203151 1196766 1038760 486596 -199475 -533600 -459417
33292d59417Q3489j33058j46150L074n9660l44189m47215j90688J26818K00862
$$ -459417 -375928 -508986 -655136 -652062 -711722 -1055911 -1503126 -1693814 -1566996 -1366134
33282a366134J08757R9060K27671L44915L20289J75428L3697k4628m1558o8900
$$ -1366134 -1257377 -1158317 -930646 -585731 -265442 -90014 -56317 -80945 -122503 -191403
33272a91403k5273J66857L19082J38930k55368l26669J44335O42605N88578J51243
$$ -191403 -216676 -49819 269263 408193 152825 -173844 -29509 613096 1201674 1352917
33262A352917n8358Q5636J51577m2126j39292R1261L29586K21431q3220k46394
$$ 1352917 1294559 1380195 1531772 1489646 1350354 1441615 1771201 1992632 1909412 1663018
33252A663018k85535m10653n27282l42838Q3297L07788J08594j94254j81898J23138
$$ 1663018 1377483 966830 439548 96710 180007 487795 596389 402135 220237 343375
33242C43375L56004L05559Q9071j10698k51484l39600l34185k45461j74911j39649
$$ 343375 699379 1004938 1094009 983311 731827 392227 58042 -187419 -362330 -501979
33232e01979j6742J76505J43246k55687n69652k06305O61168J112580O09414l08101
$$ -501979 -518721 -342216 -198970 -454657 -1024309 -1230614 -569446 543134 1152548 844447
33222H44447p46319n13039p1901K24630L56511K99420J7361k73843l26354k93823
$$ 844447 98128 -414911 -486812 -262182 94329 393749 411110 137267 -189087 -482910
33212d82910m50929n52479j01420O93720R42411L10227m27970m74368o1575R8530
$$ -482910 -933839 -1486318 -1587738 -894018 48393 358620 -69350 -543718 -605293 -506763
33202e06763q4495j78892q1454n3012p2148J44856N00108N33579J63033j70843
$$ -506763 -591258 -770150 -851604 -904616 -976764 -831908 -331800 201779 364812 193969
33192A93969k28750k98640n89580p91265n41485K2947M74744N97144M55979K22155
$$ 193969 -34781 -333421 -923001 -1714266 -2255751 -2232804 -1758060 -1160916 -704937 -482782
33182d82782J11916K51037M39909L40003K6501l3811K46269L08572j87528p26367
$$ -482782 -370866 -119829 320080 660083 686584 652773 899042 1207614 1020086 293719
33172B93719o98676l80057m27719o81741l67062N15403R54801M13158k86748j36321
$$ 293719 -404957 -785014 -1212733 -1894474 -2261536 -1746133 -791332 -378174 -664922 -801243
33162h01243O02137Q45888K65161l66787l51394Q1899K76584L1243k89378k83937
$$ -801243 -199106 646782 911943 545156 193762 275661 552245 583488 294110 10173
33152A0173O0700L89985L53713P346k24911j03528O3764j33586n36128n71303
$$ 10173 70873 460858 814571 821917 597006 493478 557242 423656 -112472 -683775
33142f83775p1368M83233O39482M86428L06402J06882j85705l75890k47419R393
$$ -683775 -755143 -271910 367572 854000 1160402 1267284 1081579 705689 458270 467663
33132D67663J8506k11415l13967j43464M6001N4392J4154P4860J10741m3400k70599
$$ 467663 486169 274754 -39213 -182677 -136676 -82284 -68130 6730 117471 74071 -196528
33121a96528l18719j53325L6997J12686Q3893J229p2032j4583K29740M71532M13824
$$ -196528 -515247 -668572 -631575 -518889 -434996 -433767 -505799 -520382 -290642 180890 594714
$$ [...]
##END NTUPLES=NMR SPECTRUM
##END=
