##TITLE=31Pdec_38-2021
 CDCl3, 24 sc
 29.04.2021
##JCAMPDX= 6.0         $$ Bruker NMR JCAMP-DX V2.0
##DATA TYPE= NMR SPECTRUM
##DATA CLASS= NTUPLES
##ORIGIN= UXNMR, Bruker Analytische Messtechnik GmbH
##OWNER= root
$$ XWIN-NMR		Version 3.5
$$ Thu Apr 29 14:29:17 2021 Russian Standard Time (UT+4h)  she@DPX200
##.OBSERVE FREQUENCY= 81.013821
##.OBSERVE NUCLEUS= ^31P
##.ACQUISITION MODE= SIMULTANEOUS
##.ACQUISITION SCHEME= undefined
##.AVERAGES= 24
##.DIGITISER RES= 16
##SPECTROMETER/DATA SYSTEM= spect
##.PULSE SEQUENCE= zgpg30
##.SOLVENT NAME= CDCl3
##.SHIFT REFERENCE= (INTERNAL, CDCl3, 0, 248.564)
##AUDIT TRAIL= $$ (NUMBER, WHEN, WHO, WHERE, WHAT)
$$ ##TITLE= Audit trail, XWIN-NMR		Version 3.5
$$ ##JCAMPDX= 5.01
$$ ##ORIGIN= Bruker BioSpin GmbH
$$ ##OWNER= she
$$ F:/spectra/data/she/nmr/P31/1/pdata/1/auditp.txt
$$ ##AUDIT TRAIL=  $$ (NUMBER, WHEN, WHO, WHERE, WHAT)
(   1,<2021-04-29 14:27:02.75 +0400>,<she>,<DPX200>,
      <created by zg, POWCHK disabled, PULCHK disabled
       configuration hash MD5:
       00 E9 B6 7A A2 85 ED C7 34 08 36 98 17 FE 4E 26
       data hash MD5: 32K
       5B 3C 52 26 6B AB E2 D1 D5 CB EA 98 FB 57 9F C8>)
(   2,<2021-04-29 14:27:05.25 +0400>,<she>,<DPX200>,
      <Start of raw data processing
       efp BC_mod = 2 LB = 1 FT_mod = 6 PKNL = 1 PHC0 = -6464.321 PHC1 = 573.0009 SI = 64K 
       data hash MD5: 64K
       BC 5B BC BA 18 82 0E D0 D7 3E 44 87 52 A1 1E F7>)
(   3,<2021-04-29 14:27:41.20 +0400>,<she>,<DPX200>,
      <pk PHC0 = 240.312 PHC1 = -463.0001 
       data hash MD5: 64K
       AC 76 C5 AA A3 07 2C D4 4F 76 17 29 B9 22 D1 7E>)
(   4,<2021-04-29 14:27:46.70 +0400>,<she>,<DPX200>,
      <abs ABSG = 5 
       data hash MD5: 64K
       CA 49 B2 68 C5 A3 EA CB 75 89 B7 79 4F 95 7E DC>)
$$ ##END=
$$ 
$$ hash MD5
$$ 65 A1 3D D9 C4 D9 4C B4 86 8B 4F 88 0F 30 11 75
##$RELAX= 
##$RELAX= 
##$RELAX= 
##$RELAX= 
##$RELAX= 
##$RELAX= 
##$RELAX= 
##$RELAX= 
$$ Bruker specific parameters
$$ --------------------------
##$DU= <F:/spectra>
##$EXPNO= 1
##$NAME= <P31>
##$PROCNO= 1
##$TYPE= <nmr>
##$USER= <she>
##$AMP= (0..31)
100 100 100 100 100 100 100 100 100 100 100 100 100 100 100 100 100 100 
100 100 100 100 100 100 100 100 100 100 100 100 100 100 
##$AQSEQ= 0
##$AQ_mod= 1
##$AUNM= <au_zg>
##$AUTOPOS= <>
##$BF1= 81.014009
##$BF2= 200.13
##$BF3= 200.13
##$BF4= 200.13
##$BF5= 200.13
##$BF6= 200.13
##$BF7= 200.13
##$BF8= 200.13
##$BYTORDA= 1
##$CFDGTYP= 0
##$CFRGTYP= 5
##$CHEMSTR= <none>
##$CNST= (0..31)
1 1 145 1 1 1 1 1 1 1 1 1 1 1 1 1 1 1 1 1 1 1 1 1 1 1 1 1 1 1 1 1 
##$CPDPRG= <waltz16>
##$CPDPRG1= <>
##$CPDPRG2= <waltz16>
##$CPDPRG3= <>
##$CPDPRG4= <mlev>
##$CPDPRG5= <mlev>
##$CPDPRG6= <mlev>
##$CPDPRG7= <mlev>
##$CPDPRG8= <mlev>
##$CPDPRGB= <>
##$CPDPRGT= <>
##$D= (0..31)
0 1 0 0 0 0 0 0 0 0 0 0.03 2e-05 3e-06 0 0 0 0 0 0 0 0 0 0 0 0 0 0 0 0 
0 0 
##$DATE= 1619692022
##$DBL= (0..7)
120 120 120 11 120 120 24 19 
##$DBP= (0..7)
150 150 150 150 150 150 150 150 
##$DBP07= 0
##$DBPNAM0= <>
##$DBPNAM1= <>
##$DBPNAM2= <>
$$ [...]
##$SUBNAM3= <"">
##$SUBNAM4= <"">
##$SUBNAM5= <"">
##$SUBNAM6= <"">
##$SUBNAM7= <"">
##$SUBNAM8= <"">
##$SUBNAM9= <"">
##$SW= 501.771253377433
##$SWIBOX= (0..15)
0 1 3 0 0 0 0 0 0 0 0 0 0 0 0 0 
##$SW_h= 40650.406504065
##$TD= 32768
##$TD0= 1
##$TE= 0
##$TE2= 300
##$TE3= 300
##$TEG= 300
##$TL= (0..7)
0 120 53 12 22 120 120 120 
##$TP= (0..7)
150 150 150 150 150 150 150 150 
##$TP07= 0
##$TPNAME0= <>
##$TPNAME1= <>
##$TPNAME2= <>
##$TPNAME3= <>
##$TPNAME4= <>
##$TPNAME5= <>
##$TPNAME6= <>
##$TPNAME7= <>
##$TPOAL= (0..7)
0.5 0.5 0.5 0.5 0.5 0.5 0.5 0.5 
##$TPOFFS= (0..7)
0 0 0 0 0 0 0 0 
##$TUNHIN= 0
##$TUNHOUT= 0
##$TUNXOUT= 0
##$USERA1= <user>
##$USERA2= <user>
##$USERA3= <user>
##$USERA4= <user>
##$USERA5= <user>
##$V9= 5
##$VALIST= <valist>
##$VCLIST= <CCCCCCCCCCCCCCC>
##$VD= 0
##$VDLIST= <DDDDDDDDDDDDDDD>
##$VPLIST= <PPPPPPPPPPPPPPP>
##$VTLIST= <TTTTTTTTTTTTTTT>
##$WBST= 1024
##$WBSW= 4
##$XGAIN= (0..3)
0 0 0 0 
##$XL= 0
##$YL= 0
##$YMAX_a= 8615
##$YMIN_a= -8876
##$ZGOPTNS= <>
##$ZL1= 120
##$ZL2= 120
##$ZL3= 120
##$ZL4= 120
##$ABSF1= 248.5645
##$ABSF2= -253.2056
##$ABSG= 5
##$ABSL= 3
##$ALPHA= 0
##$AQORDER= 0
##$ASSFAC= 0
##$ASSFACI= 0
##$ASSFACX= 0
##$ASSWID= 0
##$AUNMP= <proc_1d>
##$AZFE= 0.1
##$AZFW= 0.5
##$BCFW= 0
##$BC_mod= 2
##$BYTORDP= 0
##$COROFFS= 0
##$CY= -3
##$DATMOD= 1
##$DC= 0
##$DFILT= <>
##$DTYPP= 0
##$F1P= 0
##$F2P= 0
##$FCOR= 1
##$FTSIZE= 65536
##$FT_mod= 6
##$GAMMA= 0
##$GB= 0
##$INTBC= 1
##$INTSCL= 5.30512e-09
##$ISEN= 30
##$LB= 1
##$LEV0= 0
##$LPBIN= 0
##$MAXI= 10000
##$MC2= 0
##$MEAN= 0
##$ME_mod= 0
##$MI= 50
##$NCOEF= 0
##$NC_proc= -5
##$NLEV= 6
##$NOISF1= 182.463
##$NOISF2= 159.3651
##$NSP= 0
##$NTH_PI= 0
##$NZP= 0
##$OFFSET= 248.5645
##$PC= 4
##$PHC0= -6224.009
##$PHC1= 110.0008
##$PH_mod= 1
##$PKNL= yes
##$PPARMOD= 0
##$PSCAL= 0
##$PSIGN= 0
##$REVERSE= no
##$SF= 81.014009
##$SI= 65536
##$SIGF1= 159.3651
##$SIGF2= -187.1042
##$SINO= 113.3802
##$SIOLD= 16384
##$SREGLST= <1H.CDCl3>
##$SSB= 0
##$STSI= 65536
##$STSR= 0
##$SW_p= 40650.406504065
##$SYMM= 0
##$S_DEV= 0
##$TDeff= 32768
##$TDoff= 0
##$TI= <>
##$TILT= no
##$TM1= 0
##$TM2= 0
##$TOPLEV= 0
##$USERP1= <user>
##$USERP2= <user>
##$USERP3= <user>
##$USERP4= <user>
##$USERP5= <user>
##$WDW= 1
##$XDIM= 65536
##$YMAX_p= 355692788
##$YMIN_p= -158142119
$$ End of Bruker specific parameters
$$ ---------------------------------
##NTUPLES= NMR SPECTRUM
##VAR_NAME=  FREQUENCY,     SPECTRUM/REAL,   SPECTRUM/IMAG
##SYMBOL=    X,             R,               I
##VAR_TYPE=  INDEPENDENT,   DEPENDENT,       DEPENDENT
##VAR_FORM=  AFFN,          ASDF,            ASDF
##VAR_DIM=   65536,         65536,           65536
##UNITS=     HZ,            ARBITRARY UNITS, ARBITRARY UNITS
##FACTOR=    0.620285442955139, 1,           1
##FIRST=     20137.2065510759, 0,            0
##LAST=      -20513.1999529892, 0,           0
##MIN=       -20513.1999529892, -158142119,  0
##MAX=       20137.2065510759, 355692788,    0
$$ Real data points
##PAGE= N=1
##DATA TABLE= (X++(R..R)), XYDATA
$$ [...]
$$ plain form
38068 -658446 662868 1135706 384361 -935510 -1602040 -1188516 -588089 -717250 -1243163
38059 -1243163 -1270655 -745950 -305347 -123431 149164 520856 608463 333935 -57247 -484981
38049 -484981 -851269 -699924 91734 613175 -37901 -1183493 -1189807 272456 1718763
38040 1718763 1848720 1002880 238333 -60740 -70345 155086 527722 629411 263250 -34945
38030 -34945 345495 1100598 1209893 119627 -1599888 -2834570 -3040752 -2745328 -2869752
38021 -2869752 -3520921 -3745815 -2787176 -1252765 -453313 -748998 -1262346 -1221437 -802943
38012 -802943 -457291 -181406 120889 172618 -252770 -807870 -898285 -298445 776813 1863545
38002 1863545 2314288 1644595 164744 -1093586 -1412789 -1062212 -718192 -618424 -612616 -683534
$$ packed form
38068f58446J321314M72838p51345j319871o66530M13524O00427j29161n25913
38059a243163k7492N24705M40603J81916K72595L71692Q7607k74528l91182m27734
38049d84981l66288J51345P91658N21441o51076j145592o314J462263J446307
38040A718763J29957q45840p64547k99073r605K25431L72636J01689l66161k98195
38030c4945L80440P55103J09295j090266j719515j234682k06182K95424j24424
38021b869752o51169k24894R58639J534411P99452k95685n13348M0909M18494
38012h02943L45652K75885L02295N1729m25388n55100r0415N99840J075258J086732
38002A863545M50743o69693j479851j258330l19203L50577L44020R9768N808p0918
$$ plain form
37992 -683534 -997054 -1575026 -2153623 -2303622 -1767080 -933395 -727479 -1459614 -2072833 -1447071
37982 -1447071 -262520 -247365 -1407110 -1600315 377551 2798387 3309060 2023830 847478
37973 847478 672146 948096 1417024 2394509 3451338 3522973 2512659 1395393 604638
37964 604638 -317796 -1331068 -1613128 -1009257 -415119 -309393 -194858 96146 -51684
37955 -51684 -590719 -343726 1148688 2592914 2769525 2241822 2092143 2035730 1246425 300984
37945 300984 639232 2291577 3621074 3491984 2532375 1923962 1881409 1850344 1610605 1535173
37935 1535173 1834758 1991943 1263924 -279938 -1642117 -2118629 -2192901 -2629873 -3174670
37926 -3174670 -3146979 -2952127 -3564913 -4531490 -4210027 -2462443 -1297319 -1881938 -2654816
$$ packed form
37992f83534l13520n77972n78597j49999N36542Q33685K05916p32135o13219O25762
37982a447071J184551J5155j159745j93205J977866K420836N10673j285230j176352
37973H47478j75332K75950M68928R77485J056829P1635j010314j117266p90755
37964F04638r22434j013272k82060O03871N94138J05726J14535K91004j47830
37955e1684n39035K46993J492414J444226J76611n27703j49679n6413p89305r45441
37945C00984L38248J652345J329497j29090r59609o08413m2553l1065k39739p5432
37935A535173K99585J57185p28019j543862j362179m76512p4272m36972n44797
37926c174670K7691J94852o12786r66577L21463J747584J165124n84619p72878
$$ plain form
37917 -2654816 -1838461 -317104 -161167 -1364951 -2100614 -1610368 -831244 -414242 -45145
37908 -45145 273022 47313 -417300 -155001 798457 1346293 1138148 943881 965860 374651
37898 374651 -962228 -1805728 -1350568 -458823 -325060 -963770 -1697910 -2123086 -1925706
37889 -1925706 -793297 731390 1275285 341611 -842642 -980436 -405771 -296226 -919856
37880 -919856 -1586292 -1799395 -1582076 -1034375 -319062 187357 292444 271213 398598 589784
37870 589784 740109 861056 691332 -66727 -909923 -898603 -166433 99781 -353593 -308713
37860 -308713 664800 1003470 -415967 -2045256 -1728420 663 799203 119348 -352610
37851 -352610 212356 578416 -134607 -863776 -418409 675333 1246263 1208679 1127724 1003294
$$ packed form
37917b654816Q16355J521357J55937j203784p35663M90246P79124M17002L69097
37908d5145L18167k25709m64613K62299R53458N47836k08145j94267K1979n91209
37898C74651j336879q43500M55160Q91745J33763o38710p34140m25176J97380
37889a925706J132409J524687N43895r33674j184253j37794N74665J09545o23630
37880i19856o66436k13103K17319N47701P15313N06419J05087k1231J27385J91186
37870E89784J50325J20947j69724p58059q43196J1320P32170K66214m53374M4880
37860c08713R73513L38670j419437j629289L16836J729083P98540o79855m71958
37851c52610N64966L66060p13023p29169M45367J093742N70930l7584q0955j24430
$$ plain form
37841 1003294 611967 380536 822255 1505179 1516818 711244 -243118 -820473 -1002126 -926979
37831 -926979 -766918 -723203 -634168 106533 1674194 3170389 3501332 2661285 1512277
37822 1512277 572094 -195956 -591833 -167814 837944 1403835 900572 -228109 -1187548
37813 -1187548 -1611159 -1381662 -405547 974351 1943622 2127387 2056845 2233677 2264157 1548707
37803 1548707 348807 -571724 -982114 -1079185 -723194 276258 1351783 1702773 1544114
37794 1544114 1739207 2180187 1782946 346129 -901101 -1144929 -1105260 -1523455 -1763357
37785 -1763357 -1053392 -128796 -243084 -1152821 -1502062 -907149 -319515 -404609 -783613 -934098
37775 -934098 -746728 -93103 1104374 2191335 2170725 1070824 73363 -25897 287431
$$ packed form
37841A003294l91327k31431M41719O82924J1639q05574r54362n77355j81653P5147
37831i26979J60061M3715Q9035P40701J567661J496195L30943q40047j149008
37822A512277r40183p68050l95877M24019J005758N65891n03263j128681r59439
37813a187548m23611K29497R76115J379898R69271J83765p0542J76832L0480p15450
37803A548707j199900r20531m10390r7071L55991R99452J075525L50990j58659
37794A544114J95093M40980l97241j436817j247230k43828L9669m18195k39902
37785a763357P09965R24596j14288r09737l49241N94913N87634q5094l79004j50485
37775i34098J87370O53625J197477J086961k0610j099901r97461r9260L13328
$$ plain form
37766 287431 204019 -275993 -581975 -449523 -201831 -385455 -1156334 -1815795 -1298010 389504
37756 389504 1704824 1384931 279174 258580 1579859 2663041 2461050 1631923 1110091
37747 1110091 884444 653084 453070 95394 -884883 -2131447 -2402553 -1240504 259727
37738 259727 907830 669327 1041 -877003 -1427090 -797451 733056 1477561 510869
37729 510869 -929144 -1236801 -598717 -213307 -319817 -300423 2088 301753 540484 453472
37719 453472 -678875 -2594829 -3327561 -1537714 1159097 1994535 701241 -522834 -428955
37710 -428955 1827 -111754 -43432 894866 1851497 1737399 987560 883778 1649614 2141379
37700 2141379 1296855 -639576 -2339650 -2668378 -1734970 -558797 282309 1127697 2151798
$$ packed form
37766B87431q3412m80012l05982J32452K47692j83624p70879o59461N17785J687514
37756C89504J315320l19893j105757k0594J321279J083182k01991q29127n21832
37747A110091k25647k31360k00014l57676r80277j246564k71106J162049J500231
37738B59727O48103k38503o68286q78044n50087O29639J530507P44505r66692
37729E10869j440013l07657O38084L85410j06510J9394L02511K99665K38731q7012
37719D53472j132347j915954p32732J789847K696811Q35438j293294j224075R3879
37710d28955M30782j13581O8322R38298R56631j14098p49839j03782P65836M91765
37700B141379q44524j936431j700074l28728R33408J176173Q41106Q45388J024101
$$ plain form
37691 2151798 2697946 2402139 2113337 2621024 3200453 2730023 1607846 961431 449756
37682 449756 -1161517 -3299397 -3659368 -1551720 818641 1372649 715977 459752 538603
37673 538603 -154246 -1476386 -2163842 -1879399 -1644238 -2226710 -3173293 -3514929 -2718206
37664 -2718206 -1021436 587325 1002495 250533 -275325 397069 1245532 557386 -1429085
37655 -1429085 -2529869 -1498341 383952 1255215 1123698 1309988 2119028 2407744 1448814
37646 1448814 50635 -595017 -352812 110363 396191 547638 573480 479674 541381 955718
37636 955718 1433517 1650223 1741281 1725193 990765 -624572 -1755689 -977089 829652
37627 829652 1315309 79102 -678951 411171 1829851 1783378 977966 971398 1315206 602967
$$ packed form
37691B151798N46148k95807k88802N07687N79429m70430j122177o46415n11675
37682D49756j611273k137880l59971K107648K370361N54008o56672k56225P8851
37673E38603o92849j322140o87456K84443K35161n82472r46583l41636P96723
37664b718206J696770J608761M15170p51962n25858O72394Q48463o88146j986471
37655a429085j100784J031528J882293Q71263j31517J86290Q09040K88716r58930
37646A448814j398179o45652K42205M63175K85828J51447K5842r3806O1707M14337
37636I55718M77799K16706R1058j6088p34428j615337j131117P78600J806741
37627H29652M85657j236207p58053J090122J418680m6473q05412o568L43808p12239
$$ plain form
37617 602967 -669988 -774666 216965 540905 -166975 -289772 903665 2024604 1859717
37608 1859717 948809 84791 -922897 -2002191 -2046623 -670164 614649 336971 -820899
37599 -820899 -1159575 -428744 124557 -327220 -1364324 -2142185 -2179427 -1538112 -843296 -860252
37589 -860252 -1600173 -2217956 -2137960 -1734085 -1534896 -1445882 -1251768 -1192444 -1439668 -1607351
37579 -1607351 -1367208 -983541 -708717 -287582 352856 592921 9958 -783186 -922882
37570 -922882 -473426 -144392 -216197 -378449 -337122 -80769 171996 -21387 -930305 -2006099
37560 -2006099 -2249637 -1520687 -752634 -522261 -289257 434916 1100226 1018005 452045 80514
37550 80514 70089 300264 715776 884301 175504 -984597 -1203825 -243923 342707 -227834
$$ packed form
37617F02967j272955j04678R91631L23940p07880j22797J193437J120939j64887
37608A859717r10908q64018j007688j079294m4432J376459J284813k77678j157870
37599h20899l38676P30831N53301m51777j037104p77861l7242O41315O94816j6956
37589h60252p39921o17783P9996M03875J99189Q9014J94114N9324k47224j67683
37579a607351K40143L83667K74824M21135O40438K40065n82963p93144j39696
37570i22882M49456L29034p1805j62252M1327K56353K52765j93383r08918j075794
37560b006099k43538P28950P68053K30373K33004P24173O65310q2221n65960l71531
37550H0514j0425K30175M15512J68525p08797j160101k19228R59902N86630n70541
$$ plain form
37540 -227834 -362002 1338088 3361787 3297277 1483379 243280 166176 -212254 -1269600
37531 -1269600 -1620824 -911328 -635299 -1369742 -1584538 -328839 1012206 997068 342756
37522 342756 357091 693605 292970 -638842 -1195746 -1371411 -1608048 -1594725 -983829 -538773
37512 -538773 -1050907 -1744420 -1308937 -52038 509941 -114506 -1025303 -1512835 -1543396 -919355
37502 -919355 465172 1619208 1322668 79314 -390424 243571 541457 -123045 -456558
37493 -456558 492218 1698743 1947081 1801550 2403986 3384666 3439026 2287907 769169
37484 769169 -471554 -1262480 -1477612 -1405508 -1854270 -2750232 -2496624 -210048 2224874
37475 2224874 2255999 377193 -386152 1292147 3477421 4051110 3252499 2319307 1482641
$$ packed form
37540b27834j34168J700090K023699o4510j813898j240099p7104l78430j057346
37531a269600l51224P09496K76029p34443k14796J255699J341045j5138o54312
37522C42756J4335L36514m00635r31812n56904j75665k36637J3323O10896M45056
37512e38773n12134o93513M35483J256899N61979o24447r10797m87532l0561O24041
37502i19355J384527J154036k96540j243354m69738O33995K97886o64502l33513
37493d56558R48776J206525K48338j45531O02436R80680N4360j151119j518738
37484G69169j240723p90926k15132P2104m48762q95962K53608K286576K434922
37475B224874L1125j878806p63345J678299K185274N73689p98611r33192q36666
$$ plain form
37466 1482641 519767 -172579 -354185 -682315 -1529076 -2072243 -1657762 -1054211 -1178073
37457 -1178073 -1521527 -1128681 -325047 -134481 -587908 -868653 -617672 33409 1119836
37448 1119836 2375809 2782692 1867048 817062 935250 1584068 1183287 -248635 -1191533
37439 -1191533 -966776 -357211 -13066 231629 495639 681806 1040891 1600793 1400902
37430 1400902 -190579 -1838948 -1720925 -306711 299249 -460707 -1237902 -1421741 -1683178
37421 -1683178 -1806648 -694385 1019375 1188480 -202842 -508130 1294065 2728516 1885392
37412 1885392 464222 587967 1239383 547313 -625580 -406114 530502 306038 -562397
37403 -562397 -186135 946433 585352 -1280501 -2254161 -1407307 -334905 -61309 221871
$$ packed form
37466A482641r62874o92346j81606l28130q46761n43167M14481O03551j23862
37457a178073l43454L92846Q03634J90566m53427k80745K50981O51081J086427
37448A119836J255973M06883r15644j049986J18188O48818m00781j431922r42898
37439a191533K24757O09565L44145K44695K64010J86167L59085N59902j99891
37430A400902j591481j648369J18023J414214O05960p59956p77195j83839k61437
37421a683178j23470J112263J713760J69105j391322l05288J802195J434451q43124
37412A885392j421170J23745O51416o92070j172893K19466R36616k24464q68435
37403e62397L76262J132568l61081j865853r73660Q46854J072402K73596K83180
$$ plain form
37394 221871 786229 535951 -541653 -651028 866177 2079336 1381753 -18814 -97144
37385 -97144 981058 1518316 970523 378258 549511 1036513 880609 -223207 -1450215
37376 -1450215 -1510408 -209543 916062 411949 -926386 -1032056 346467 1215101 370742
37367 370742 -888952 -954458 -240190 -104855 -606750 -696040 65109 1154476 1993365 2298263
37357 2298263 2003861 1583161 1888992 2953658 3553917 2718074 1040613 -257645 -850712
37348 -850712 -980060 -392240 1109706 2499011 2332352 748361 -527211 -370518 564769
37339 564769 1147977 1260343 1401711 1535885 1147542 234426 -424489 -104776 1083000
37330 1083000 2310990 2686035 1773934 -126342 -1955417 -2463623 -1333068 317444 1028645
$$ packed form
37394B21871N64358k50278j077604j09375J517205J213159o97583j400567p8330
37385i7144J078202N37258n47793n92265J71253M87002j55904j103816j227008
37376a450215o0193J300865J125605n04113j338335j05670J378523Q68634q44359
37367C70742j259694o5506P14268J35335n01895q9290P61149J089367Q38889L04898
37357B298263k94402m20700L05831J064666O00259q35843j677461j298258n93067
37348h50712j29348N87820J501946J389305j66659j583991j275572J56693R35287
37339E64769N83208J12366J41368J34174l88343r13116o58915L19713J187776
37330A083000J227990L75045r12101j900276j829075n08206J130555J650512P11201
$$ plain form
37321 1028645 587032 -13925 -99079 84881 392170 1161505 1969625 1351823 -998371
37312 -998371 -2862913 -2045774 392069 1390582 103235 -1274045 -1064403 -260745 -296017
37303 -296017 -674761 -204127 858217 1397415 1231838 938040 593855 -34090 -567528
37294 -567528 -425931 211681 761827 1083286 1115252 298570 -1567011 -3378869 -3803742
37285 -3803742 -3014976 -2310820 -2253224 -2245625 -1796719 -1147552 -654781 -439756 -603903 -1001140
37275 -1001140 -990194 -294509 170703 -572321 -1819506 -1912518 -752268 -83978 -837354
37266 -837354 -1680522 -1135283 116235 354574 -512944 -908578 -36449 992060 814460
37257 814460 -414020 -1474849 -1640604 -1113171 -309495 522663 1015151 723853 -229031
$$ packed form
37321A028645m41613o00957q5154J83960L07289P69335Q08120o17802k350194
37312i98371j864542Q17139K437843R98513j287347j377280K09642Q03658l5272
37303b96017l78744M70634J062344N39198j65577k93798l44185o27945n33438
37294e67528J41597O37612N50146L21459L1966q16682j865581j811858m24873
37285c803742P88766P04156N7596P599M48906O49167M92771K15025j64147l97237
37275a001140J0946O95685M65212p43024j247185r3012J160250O68290p53376
37266h37354q43168N45239J251518K38339q67518l95634Q72129J028509j77600
37257H14460j228480j060829j65755N27433Q03676Q32158M92488k91298r52884
$$ plain form
37248 -229031 -1016089 -1008407 -516155 -202022 -54704 407177 1015190 857881 -415434 -1889436
37238 -1889436 -2470740 -2162239 -1671741 -1187862 -340383 767835 1342727 941234 113173
37229 113173 -362559 -448860 -601198 -809644 -484644 595777 1705552 1921997 1236039
37220 1236039 447386 19232 -365098 -943280 -1288802 -1119137 -1064307 -1770982 -2639258 -2511452
37210 -2511452 -1465020 -735670 -796468 -865464 -695711 -1332124 -3149784 -4499170 -3752781
37201 -3752781 -1798345 -857214 -1344397 -1666657 -995338 -342177 -459088 -435365 637192
37192 637192 1928617 2055871 1172534 583762 727957 828269 475332 338301 936248
37183 936248 1593055 1251006 -68873 -1162433 -936639 457330 1765881 1816487 641123
$$ packed form
37248b29031p87058P682M92252L14133J47318M61881O08013j57309j273315j474002
37238a889436n81304L08501M90498M83879Q47479J108218N74892m01493q28061
37229A13173m75732q6301j52338k08446L25000J080421J109775K16445o85958
37220A236039p88653m28154l84330n78182l45522J69665N4830p06675q68276J27806
37210b511452J046432P29350o0798o8996J69753o36413j817660j349386P46389
37201c752781J954436R41131m87183l22260O71319O53161j16911K3723J072557
37192F37192J291425J27254q83337n88772J44195J00312l52937j37031N97947
37183I36248O56807l42049j319879j093560K25794J393969J308551N0606j175364
$$ plain form
37174 641123 -544500 -594980 360730 1169877 1041781 283297 -417102 -867732 -1132630 -920129
37164 -920129 48730 1249576 1741230 1410185 1067326 1129296 1044052 418814 -156541 -108230
37154 -108230 39659 -496526 -1356096 -1484001 -671654 353668 1132826 1703989 1822106
37145 1822106 1170910 343434 320776 820027 516654 -767854 -1556432 -977896 -74093
37136 -74093 13894 -252513 -74678 27681 -688986 -1485184 -1231778 -493780 -713088 -1724484
37126 -1724484 -1966650 -1089452 -458964 -766789 -925777 -38624 1037381 1059586 253314
37117 253314 -216298 65072 490793 450404 -59697 -621873 -817990 -662686 -655578 -991395
37107 -991395 -896057 417569 2186807 2645949 1416902 116874 -1979 259755 -306147
$$ packed form
37174F41123j185623n0480R55710Q09147j28096p58484p00399m50630k64898K12501
37164i20129R68859J200846M91654l31045l42859O1970q5244o25238n75355M8311
37154a08230J47889n36185q59570j27905Q12347J025322P79158N71163J18117
37145A822106o51196q27476k2658M99251l03373j284508p88578N78536R03803
37136g4093Q7987k66407J77835J02359p16667p96198K53406P37998k19308j011396
37126a724484k42166Q77198O30488l07825j58988Q87153J076005K2205q06272
37117B53314m69612K81370M25721m0389n10101n62176j96117J55304P108l35817
37107i91395R5338J313626J769238M59142j229047j300028j18853K61734n65902
$$ plain form
37098 -306147 -1155851 -934244 130090 433529 -536408 -1507723 -1493141 -1177330 -1537207 -2120170
37088 -2120170 -1748184 -476991 225215 -619653 -2181975 -2832871 -2031834 -623046 590013
37079 590013 1769773 3194072 4191035 3798979 2267374 933116 440034 -19432 -1245457
37070 -1245457 -2584835 -2660970 -1148270 833730 1907522 1562434 331329 -709320 -817039
37061 -817039 -336442 -335225 -1177232 -1884203 -1424110 -216783 359916 -253421 -1260214 -1693691
37051 -1693691 -1421491 -849134 -245842 326639 753991 843532 555673 248092 566788 1709671
37041 1709671 2756547 2385227 615295 -866579 -751542 193500 326761 -599663 -1511999
37032 -1511999 -1893723 -2183613 -2421764 -2003824 -1034211 -526489 -781213 -828260 -78243 662157
$$ packed form
37098c06147q49704K21607J064334L03439r69937r71315J4582L15811l59877n82963
37088b120170L71986J271193P02206q44868j562322o50896Q01037J408788J213059
37079E90013J179760J424299R96963l92056j531605j334258m93082m59466j226025
37070a245457j339378p6135J512700J982000J073792l45088j231105j040649j07719
37061h17039M80597J217q42007p06971M60093J207327N76699o13337j006793m33477
37051a693691K72200N72357O03292N72481M27352Q9541k87859l07581L18696J142883
37041A709671J046876l71320j769932j481874J15037R45042J33261r26424r12336
37032a511999l81724k89890k38151M17940R69613N07722k54724m7047P50017P40400
$$ plain form
37022 662157 544055 -56496 -434481 -677653 -981412 -834730 48445 837082 720676 141977
37012 141977 -232175 -867988 -2270384 -3352635 -2689561 -936239 -60510 -310666 -30055
37003 -30055 1260605 1826375 673305 -455916 429830 2474695 3135787 1669381 -270017
36994 -270017 -1202851 -1322307 -1227241 -644257 790496 2322979 2637338 1479784 32084
36985 32084 -504375 -208634 73862 185372 780675 1874204 2245894 1072299 -544935
36976 -544935 -809914 331232 1233748 987344 445843 526202 829130 636304 177593 59236
36966 59236 276474 614311 1268526 2208547 2585846 1677212 -65835 -1631912 -2543672
36957 -2543672 -2675760 -1793905 -229377 740925 359010 -337568 82854 1272059 1676116
$$ packed form
37022F62157j18102o00551l77985k43172l03759J46682Q83175P88637j16406n78699
37012A41977l74152o35813j402396j082251O63074J753322Q75729k50156K80611
37003c0055J290660N65770j153070j129221Q85746K044865O61092j466406j939398
36994b70017r32834j19456R5066N82984J434753J532483L14359j157554j447700
36985C2084n36459K95741K82496J11510N95303J093529L71690j173595j617234
36976e44935k64979J141146R02516k46404n41501Q0359L02928j92826m58711j18357
36966E9236K17238L37837O54215R40021L77299r08634j743047j566077r11760
36957b543672j32088Q81855J564528R70302l81915o96578M20422J189205M04057
$$ plain form
36948 1676116 912373 86543 -121560 -138902 -145466 425918 1602007 2395036 2173871 1419234
36938 1419234 627013 -411986 -1640511 -2183273 -1615131 -859355 -889637 -1282699 -1046251
36929 -1046251 -272478 147546 101049 366604 1136164 1477049 645025 -760309 -1440438
36920 -1440438 -855019 358914 1230807 1336984 869706 225687 -228019 -202565 291368
36911 291368 754824 615448 -49693 -578261 -660832 -754542 -1284808 -1941434 -2208833 -2130416
36901 -2130416 -1996846 -1688323 -962081 -69548 536666 802637 816661 418657 -258339 -457619
36891 -457619 73955 270653 -716227 -1740310 -1010000 1071578 2258329 1753790 1187556
36882 1187556 1744830 2279907 1421778 -44567 -396962 479446 1263974 1287359 1100955
$$ packed form
36948A676116p63743q25830k08103j7342o564N71384J176089P93029k21165p54637
36938A419234p92221j038999j228525n42762N68142P55776l0282l93062K36448
36929a046251P73773M20024m6497K65555P69560L40885q32024j405334o80129
36920a440438N85419J213933Q71893J06177m67278o44019m53706K5454M93933
36911B91368M63456j39376o65141n28568q2571r3710n30266o56626k67399P8417
36901b130416J33570L08523P26242Q92533O06214K65971J4024l98004o76996j99280
36891d57619N31574J96698r86880j024083P30310K081578J186751n04539n66234
36882A187556N57274N35077q58129j466345l52395Q76408P84528K3385j86404
$$ plain form
36873 1100955 1278944 1730790 2047512 1809676 851638 -205641 -202019 1106156 2366856
36864 2366856 2129031 529104 -1169446 -2109283 -2168811 -1446533 -384810 101081 -398197
36855 -398197 -1050000 -870095 -66825 597807 1163958 2002334 2498023 1671766 -16326
36846 -16326 -916967 -376670 621906 1220767 1758919 2606254 3161347 2812598 2019752 1596257
36836 1596257 1539103 1385409 1241621 1542707 1988393 1637328 241877 -1194883 -1606422
36827 -1606422 -1218085 -1204419 -2103268 -3127852 -3254354 -2498131 -1629161 -961278 -159823
36818 -159823 776199 1145214 474451 -775511 -1834918 -2500327 -3000910 -3380402 -3406030
36809 -3406030 -2831335 -1535239 242978 1685234 1975995 1327714 784761 729751 389702
$$ packed form
36873A100955J77989M51846L16722k37836r58038j057279L622J308175J260700
36864B366856k37825j599927j698550r39837n9528P22278J061723M85891m99278
36855c98197o51803J79905Q03270O64632N66151Q38376M95689q26257j688092
36846a6326r00641N40297R98576N98861N38152Q47335N55093l48749p92846m23495
36836A596257n7154j53694j43788L01086M45686l51065j395451j436760m11539
36827a606422L88337J3666q98849j024584j26502P56223Q68970O67883Q01455
36818a59823R36022L69015o70763j249962j059407o65409n00583l79492k5628
36809c406030N74695J296096J778217J442256K90761o48281n42953n5010l40049
$$ plain form
36800 389702 -695517 -1603684 -1238650 68116 1072506 1241069 966215 586616 153928
36791 153928 -89923 73290 291242 110597 -176677 49318 647521 888126 618769 413995
36781 413995 555638 657621 398275 -64106 -515501 -906530 -1021118 -489907 631120
36772 631120 1626924 1654973 470736 -1234339 -2186873 -1631682 -238217 598411 516581
36763 516581 496106 1136254 1690855 1495716 1230875 1644550 1969025 1054946 -534343 -1152400
36753 -1152400 -539561 -112904 -735345 -1592703 -1588526 -738814 193909 647799 570986 335833
36743 335833 367177 452612 -191881 -1602842 -2472034 -1745662 -145165 930897 1214494
36734 1214494 1013975 -143265 -2456534 -4188249 -3349702 -824995 517815 -101732 -629622
$$ packed form
36800C89702j085219r08167L65034J306766J004390J68563k74854l79599m32688
36791A53928k43851J63213K17952j80645k87274K25995N98203K40605k69357k04774
36781D13995J41643J01983k59346m62381m51395l91029j14588N31211J121027
36772F31120R95804K8049j184237j705075r52534N55191J393465Q36628q1830
36763E16581k0475O40148N54601j95139k64841M13675L24475r14079j589289o18057
36753a152400O12839M26657o22441q57358M177Q49712R32723M53890p6813k35153
36743C35833L1344Q5435o44493j410961q69192P26372J600497J076062K83597
36734A214494k00519j157240k313269j731715Q38547K524707J342810o19547n27890
$$ plain form
36725 -629622 106935 535213 -764530 -2589357 -3044466 -2225006 -1463940 -1256933 -1352178
36716 -1352178 -1781069 -2454743 -2609617 -1782319 -593634 220305 632235 574210 -349344
36707 -349344 -1609744 -1657341 -123667 1294524 1342601 1138209 2130921 3510492 3451953
36698 3451953 1944674 556154 92056 182605 544638 965692 612474 -904505 -2218853
36689 -2218853 -1698948 71858 1033853 626364 207739 537969 717141 -23897 -1129764
36680 -1129764 -1864990 -2272194 -2392016 -1760409 -442922 379337 -267229 -1722133 -2292767
36671 -2292767 -1182111 544030 1045899 -144388 -1254909 -181125 2677463 4503195
36663 4503195 3480133 997188 -436615 -300209 205103 455061 717361 855731 546311
$$ packed form
36725f29622P36557M28278j299743j824827m55109Q19460P61066K07007r5245
36716a352178m28891o73674j54874Q27298J188685Q13939M11930n8025r23554
36707c49344j260400m7597J533674J418191M8077k04392R92712J379571n8539
36698C451953j507279j388520m64098R0549L62033M21054l53218j516979j314348
36689b218853N19905J770806R61995m07489m18625L30230J79172p41038j105867
36680a129764p35226m07204j19822O31607J317487Q22259o46566j454904n70634
36671b292767J110656J726141N01869j190287j110521J073784K858588J825732
36663D503195j023062k482945j433803J36406N05312K49958K62300J38370l09420
$$ plain form
36654 546311 395595 1064277 1611702 623158 -1231889 -1877052 -1077037 -724089 -1530600
36645 -1530600 -1864213 -740770 389306 253373 96975 1539318 3579186 3796559 1698285
36636 1698285 -969657 -2705772 -3373055 -3185059 -2221103 -1020763 -382031 -362219 -364456
36627 -364456 -244422 -493297 -1290051 -2131664 -2476618 -2168031 -1274310 -119680 594800
36618 594800 357552 -396294 -603041 268260 1704959 2741767 2731671 1660780 94583
36609 94583 -1219612 -1944127 -2253211 -2267735 -1793671 -886570 -180642 -169589 -530525 -666629
36599 -666629 -585610 -724013 -1235118 -1984045 -2867752 -3525883 -3175066 -1574339 138387
36590 138387 536836 -262663 -820323 -423062 144416 98890 -186504 -112344 -7486 -485647
$$ packed form
36654E46311j50716O68682N47425r88544j855047o45163Q00015L52948q06511
36645a530600l33613J123443J130076j35933j56398J442343K039868K17373k098274
36636A698285k667942j736115o67283J87996R63956J200340O38732J9812k237
36627c64456J20034k48875p96754q41613l44954L08587Q93721J154630P14480
36618E94800k37248p53846k06747Q71301J436699J036808j0096j070891j566197
36609I4583j314195p24515l09084j4524M74064R07101P05928J1053l60936j36104
36599f66629Q1019j38403n11105p48927q83707o58131L50817J600727J712726
36590A38387L98449p99499n57660L97261N67478m5526k85394P4160J04858m78161
$$ plain form
36580 -485647 -1224880 -1324786 -639629 86004 363996 479160 733169 859968 540569 19775
36570 19775 -242748 -278311 -497922 -937420 -1053123 -421428 634601 1339278 1258551 615283
36560 615283 -91120 -541257 -662313 -474656 -33406 537072 1060132 1385616 1466909 1391926
36550 1391926 1302221 1213861 964011 443216 -158854 -500820 -505948 -476155 -711845 -1122824
36540 -1122824 -1311756 -999459 -296550 435939 925275 1105535 910625 186593 -916604
36531 -916604 -1630428 -1190531 96998 991355 851065 424443 564375 840120 412400
36522 412400 -193309 407243 2130853 3078720 2080591 316919 -466627 -270644 -212879
36513 -212879 -446832 -183461 573044 812131 150785 -568725 -648551 -496559 -782115 -1405702
$$ packed form
36580d85647p39233r9906O85157P25633K77992J15164K54009J26799l19399n20794
36570A9775k62523l5563k19611m39498j15703O31695J056029P04677q0727o43268
36560F15283p06403m50137j21056J87657M41250N70478N23060L25484Q1293p4983
36550A391926q9705q8360k49850n20795o02070l41966n128K9793k35690m10979
36540a122824j88932L12297P02909P32489M89336J80260j94910p24032j103197
36531i16604p13824M39897J287529Q94357j40290m26622J39932K75745m27720
36522D12400o05709O00552J723610R47867r98129j763672p83546J95983N7765
36513b12879k33953K63371P56505K39087o61346p19510p9826J51992k85556o23587
$$ plain form
36503 -1405702 -1744161 -1359813 -215874 1216995 1932032 1262759 45539 -11294 1404699
36494 1404699 2515637 1775839 37437 -662066 95186 785411 307750 -564701 -465291
36485 -465291 682045 1605883 1150064 -523774 -1994707 -1787519 169319 2258321 2696434
36476 2696434 1386015 -105860 -422119 186716 479440 -184818 -1180279 -1387875 -451468
36467 -451468 758551 1056421 386552 -8641 768061 1868388 1660572 -87931 -1850036
36458 -1850036 -2222791 -1293256 103429 1530345 2788783 3405817 3089878 2277114 1557194
36449 1557194 907677 93800 -585653 -674672 -369166 -188304 -74448 358705 830751 590177
36439 590177 -286583 -672065 192039 1685577 2559507 2205396 937928 -452789 -1130441
$$ packed form
36503a405702l38459L84348J143939J432869P15037o69273j217220n6833J415993
36494A404699J110938p39798j738402o99503P57252O90225m77661q72451R9410
36485d65291J147336R23838m55819j673838j470933K07188J956838K089002M38113
36476B696434j310419j491875l16259O08835K92724o64258r95461k07596R36407
36467d51468J210019K97870o69869l95193P76702J100327k07816j748503j762105
36458a850036l72755R29535J396685J426916J258438O17034l15939q12764p19920
36449A557194o49517q13877o79453q9019L05506J80862J13856M33153M72046k40574
36439E90177q76760l85482Q64104J493538Q73930l54111j267468j390717o77652
$$ plain form
36430 -1130441 -713883 252379 709748 293590 -268967 -285551 -106791 -457079 -1144768 -1176395
36420 -1176395 -110567 1313871 2035590 1753487 1022459 565851 624186 819189 629774
36411 629774 110580 -30528 628929 1393196 1113224 -252285 -1368061 -1170714 -258136
36402 -258136 -28593 -752352 -1299765 -819724 134434 575491 547467 886920 1751600 2205563
36392 2205563 1527526 378499 119903 1068715 1953892 1431594 -116128 -910774 -96021
36383 -96021 977430 544712 -994790 -1586749 -613551 163103 -537682 -1417649 -868579
36374 -868579 100680 -530282 -2086947 -1878917 404856 1923386 1144622 215616 1246594
36365 1246594 2809903 2548959 1292343 1609459 3422468 4163197 2915460 1457241 1040256
$$ packed form
36430a130441M16558R66262M57369m16158n62557j6584J78760l50288o87689l1627
36420a176395J065828J424438P21719k82103p31028m56608N8335J95003j89415
36411F29774n19194j41108O59457P64267k79972j365509j115776J97347R12578
36402b58136K29543p23759n47413M80041R54158M41057k8024L39453Q64680M53963
36392B205563o78037j149027k58596R48812Q85177n22298j547722p94646Q14753
36383i6021J073451m32718j539502n91959R73198P76654p00785q79967N49070
36374h68579R69259o30962j556665K08030K283773J518530p78764r29006J030978
36365A246594J563309k60944j256616L17116J813009P40729j247737j458219m16985
$$ plain form
36356 1040256 866959 300796 58479 312818 -142502 -1689361 -2756887 -2135488 -798211
36347 -798211 -206370 -300947 -411521 -706929 -1356530 -1523624 -628021 484282 955642 1316478
36337 1316478 2055236 2110558 620052 -940690 -528996 1252319 1961998 1007601 254907
36328 254907 903282 1940287 2124848 1539135 546208 -980812 -2547263 -2772448 -1306226
36319 -1306226 235933 286199 -767697 -1623969 -1946624 -2083019 -1817365 -751821 552242
36310 552242 1055345 682493 299253 363222 468136 207555 -242934 -464410 -208405 481370
36300 481370 1164643 1238982 719137 438614 886816 1253387 500663 -862014 -1187400 -9534
36290 -9534 1144512 791198 -517108 -1011360 -13480 1407836 1934200 1423538 720774
$$ packed form
36356A040256j73297n66163k42317K54339m55320j546859j067526O21399J337277
36347g98211N91841r4577j10574k95408o49601j67094Q95603J112303M71360L60836
36337A316478P38758N5322j490506j560742M11694J781315P09679r54397p52694
36328B54907O48375J037005J84561n85713r92927j527020j566451k25185J466222
36319a306226J542159N0266j053896q56272l22655j36395K65654J065544J304063
36310E52242N03103l72852l83240O3969J04914k60581m50489k21476K56005O89775
36300D81370O83273P4339n19845k80523M48202L66571p52724j362677l25386J177866
36290i534J154046l53314j308306m94252R97880J421316N26364n10662p02764
$$ plain form
36281 720774 546731 855812 1119098 1007718 684264 416864 150786 -203249 -239871 500554
36271 500554 1433607 1132013 -780627 -2671163 -2768916 -1497085 -755773 -1124317 -1250498
36262 -1250498 -288356 604472 123709 -1003366 -1004465 390017 1712981 1888714 1402809
36253 1402809 1208352 1415788 1433178 851746 -101938 -745718 -580739 20659 26372 -988057
36243 -988057 -2168291 -2500853 -2120777 -1738979 -1270118 -164548 1118209 1290931 92149
36234 92149 -1204635 -1518721 -1196354 -1071514 -1234332 -1326775 -1310574 -1318310 -1289195 -1245887 -1438597
36223 -1438597 -1834990 -1991725 -1758456 -1551744 -1654253 -1863923 -2065671 -2377376 -2443192 -1521277
36213 -1521277 224619 1463905 1415990 958886 1188033 1647599 1033311 -833514 -2743149
$$ packed form
36281G20774j74043L09081K63286j11380l23454k67400k66078l54035l6622P40425
36271E00554R33053l01594j912640j890536r7753J271831P41312l68544j26181
36262a250498R62142Q92828m80763j127075j099J394482J322964J75733m85905
36253A402809j94457K07436J7390n81432r53684o43780J64979O01398N713j014429
36243i88057j180234l32562L80076L81798M68861J105570J282757J72722j198782
36234I2149j296784l14086L22367J24840j62818r2443J6201p736K9115M3308j92710
36223a438597l96393j56735K33269K06712j02509k09670k01748l11705o5816R21915
36213a521277J745896J239286m7915m57104K29147M59566o14288j866825j909635
$$ plain form
36204 -2743149 -3540445 -2988970 -1446386 452662 1824750 1957890 883431 -685958 -1870198
36195 -1870198 -2039137 -1241583 -434753 -642890 -1570952 -1812538 -854316 53942 -288540
36186 -288540 -1292483 -1609587 -1095484 -568611 -189006 633078 1971379 3180284 3820851
36177 3820851 3801183 2831889 869348 -1014353 -1441556 -603269 -244954 -1411335 -3086188
36168 -3086188 -3556047 -2470237 -1000866 -326297 -479352 -686403 -517817 -344075 -482360
36159 -482360 -348779 739745 2055995 1975670 420592 -507047 702873 2658267 2882192
36150 2882192 1197954 -256806 -69194 951036 1369401 867111 78807 -283948 152944
36141 152944 1112149 1636438 1101674 234118 279291 1187699 1598909 755596 -538746 -1171425
$$ packed form
36204b743149p97296N51475J542584J899048J372088J33140j074459j569389j184240
36195a870198j68939P97554Q06830k08137r28062k41586R58222R08258l42482
36186b88540j003943l17104N14103N26873L79605Q22084J338301J208905O40567
36177C820851j9668r69294j962541j883701m27203Q38287L58315j166381j674853
36168c086188m69859J085810J469371O74569j53055k07051J68586J73742j38285
36159d82360J33581J088524J316250q0325j555078r27639J209920J955394K23925
36150B882192j684238j454760J87612J020230M18365n02290p88304l62755M36892
36141A52944R59205N24289n34764q67556M5173R08408M11210q43313j294342o32679
$$ plain form
36131 -1171425 -1076519 -905620 -976328 -1039251 -796625 -350057 -192479 -690839 -1477592 -1684710
36121 -1684710 -1020283 -138926 401791 905338 1703815 2273790 1968761 1026579 48371
36112 48371 -850852 -1513972 -1243485 -12890 686763 -297624 -1801137 -1934126 -1071707
36103 -1071707 -1243779 -2817688 -3986519 -3689952 -2826865 -2088779 -829026 963167 1635967
36094 1635967 287976 -1326464 -948936 1091717 2474956 2010743 792132 414180 1120722
36085 1120722 1853480 1566091 327071 -789441 -946294 -417725 119725 634056 1222096
36076 1222096 1078298 -606085 -2811655 -3337130 -1608511 565431 1447216 1148021 468305
36067 468305 -410293 -1171071 -806086 893557 2370949 2153829 906735 400791 1045646
$$ packed form
36131a171425R4906J70899p0708o2923K42626M46568J57578m98360p86753k07118
36121a684710O64427Q81357N40717N03547P98477N69975l05029r42182r78208
36112D8371q99223o63120K70487J230595O99653r84387j503513j32989Q62419
36103a071707j72072j573909j168831K96567Q63087P38086J259753J792193O72800
36094A635967j347991j614440L77528K040653J383239m64213j218611l77952P06542
36085A120722P32758k87389j239020j116512j56853N28569N37450N14331N88040
36076A222096j43798j684383k205570n25475J728619K173942Q81785k99195o79716
36067D68305q78598p60778L64985J699643J477392k17120j247094n05944O44855
$$ plain form
36058 1045646 1683988 1471389 797057 422948 610359 1145625 1625301 1671396 1218917 592608
36048 592608 230241 503167 1629723 3230611 4148676 3539871 2110754 1327808 1393669
36039 1393669 1167897 251261 -229193 566794 1876045 2554820 2527396 2279428 1939348
36030 1939348 1626930 1723864 2019059 1568518 202343 -846323 -678679 -47376 33269
36021 33269 -82520 382703 1011934 902581 325897 320363 1059643 1810867 2129194 2025780
36011 2025780 1406260 444806 43163 710802 1370619 557047 -1431892 -2859649 -2911883
36002 -2911883 -2424412 -2185821 -1850303 -967532 2207 370615 231238 159706 316864 383571
35992 383571 167276 -168920 -408247 -447716 -128625 719692 1778760 2089328 1015238
$$ packed form
36058A045646O38342k12599o74332l74109J87411N35266M79676M6095m52479o26309
36048E92608l62367K72926J126556J600888R18065o08805j429117p82946O5861
36039A393669k25772r16636m80454P95987J309251O78775k7424k47968l40080
36030A939348l12418R6934K95195m50541j366175j048666J67644O31303Q0645
36021C3269j15789M65223O29231j09353n76684n534P39280P51224L18327j03414
36011B025780o19520r61454m01643O67639O59817q13572j988939j427757n2234
36002b911883M87471K38591L35518Q82771R69739L68408j39377p1532J57158O6707
35992C83571k16295l36196k39327l9469L19091Q48317J059068L10568j074090
$$ plain form
35983 1015238 -671645 -1461133 -1080080 -829500 -1442727 -1827437 -994464 -4508 -348446
35974 -348446 -1381443 -1447440 -831136 -1081121 -1763657 -871913 1260279 1673092 -560374
35965 -560374 -2503064 -1819946 -154306 134696 -101926 1014396 2437166 1770165 -492894
35956 -492894 -1627193 -957886 -406509 -958112 -1431197 -951638 -159974 408347 1006364
35947 1006364 1404787 896747 -107473 -319565 312720 503766 -114084 -456329 -42667
35938 -42667 238893 -97201 -337895 -105276 -20250 -215790 158620 1189740 1565654 649109
35928 649109 -273762 23171 703480 212147 -1203421 -1753585 -629366 901416 1097155
35919 1097155 -228307 -1621817 -1778259 -1066972 -869438 -1488934 -1640137 -522950 670901
$$ packed form
35983A015238j686883p89488L81053K50580o13227l84710Q32973R89956l43938
35974c48446j032997o5997O16304k49985o82536Q91744K132192M12813k233466
35965e60374j942690O83118J665640K89002k36622J116322J422770o67001k263059
35956d92894j134299O69307N51377n51603m73085M79559P91664N68321N98017
35947A006364L98423n08040j004220k12092O32285J91046o17850l42245M13662
35938d2667K81560l36094k40694K32619Q5026j95540L74410J031120L75914r16545
35928F49109r22871K96933O80309m91333j415568n50164J124219J530782J95739
35919A097155j325462j393510j56442P11287J97534o19496j51203J117187J193851
$$ plain form
35910 670901 495882 -319677 200731 2284791 4077042 4344623 3822583 3498266 3129182
35901 3129182 2135464 727842 -541561 -1386305 -1462441 -448938 1079353 1878988 1627565
35892 1627565 1279181 1365747 1081136 -256881 -1894731 -2667177 -2506407 -2055509 -1463989
35883 -1463989 -495264 589203 1074862 574369 -656071 -1909537 -2328848 -1541703 -278480
35874 -278480 227218 -256351 -718814 -468982 -66631 -129114 -96015 854473 2187878 2405500
35864 2405500 1006761 -781742 -1411177 -594180 706162 1456055 1423600 1060063 852271
35855 852271 908359 990969 706938 -237237 -1597957 -2456196 -2072114 -966968 -430178 -698016
35845 -698016 -566889 604609 1599011 1127614 -30512 -207810 433712 217412 -1105986
$$ packed form
35910F70901j75019q15559N20408K084060J792251K67581n22040l24317l69084
35901C129182r93718j407622j269403q44744p6136J013503J528291P99635k51423
35892A627565l48384Q6566k84611j338017j637850p72446J60770M50898N91520
35883a463989R68725J084467M85659n00493j230440j253466m19311P87145J263223
35874b78480N05698m83569m62463K49832M02351o2483L3099R50488J333405K17622
35864B405500j398739j788503o29435Q16997J300342P49893l2455l63537k07792
35855H52271N6088Q2610k84031r44175j360720q58239L84082J105146N36790k67838
35845f98016J31127J171498R94402m71397j158126j77298O41522k16300j323398
$$ plain form
35836 -1105986 -1708109 -521725 996223 961489 -315426 -998914 -293198 783811 912892
35827 912892 -43385 -1007163 -734201 968026 2911302 3688837 3169654 2365101 1893060
35818 1893060 1389761 609735 166562 628497 1550581 2030728 1810345 1323324 999325
35809 999325 957662 1132038 1361734 1544253 1816035 2263849 2441157 1732401 367646 -548689
35799 -548689 -366534 294235 476702 154345 37392 442316 929250 943979 332009 -759465
35789 -759465 -2000942 -2721263 -2052796 223811 2946971 4222532 3248854 1240222 41965
35780 41965 75494 350861 274483 306225 656692 653649 77051 -80604 791053 1570138 908205
35769 908205 -676804 -1602673 -1545738 -1431957 -1452050 -793192 537489 1215223 431060 -986032
$$ packed form
35836a105986o02123J186384J517948l4734j276915o83488P05716J077009J29081
35827I12892r56277r63778K72962J702227J943276P77535n19183q04553m72041
35818A893060n03299p80026m43173M61935R22084M80147k20383m87021l23999
35809I99325m1663J74376K29696J82519K71782M47814J77308p08756j364755r16335
35799e48689J82155O60769J82467l22357j16953M04924M86934J4729o11970j091474
35789g59465j241477p20321O68467K276607K723160J275561r73678k008632j198257
35780D1965L3529K75367p6378L1742L50467l043n76598j57655Q71657P79085o61933
35769I08205j585009r25869N6935J13781k0093O58858J330681O77734p84163j417092
$$ plain form
35759 -986032 -1850127 -2058843 -2152567 -2178816 -1676938 -500622 736226 1014826 -140299
35750 -140299 -1849273 -2414926 -1164386 656912 1403970 918675 169158 -344859 -750235
35741 -750235 -848239 -265102 641951 1170340 1398258 1848166 2287390 2066354 1415140 1085396
35731 1085396 884001 31298 -1060262 -985227 386906 1360175 689680 -807250 -1499662
35722 -1499662 -825420 548805 1591198 1556594 544403 -344681 -94454 956814 1663025
35713 1663025 1669468 1478671 1187396 451300 -335549 -184447 958781 1961061 1951786 1105707
35703 1105707 100139 -246252 771408 2618120 3275053 1727362 -13847 537213 2410024
35694 2410024 2492495 539862 -350944 1181380 2537074 1373906 -953705 -2076117 -2131313
$$ packed form
35759i86032q64095k08716r3724k6249N01878J176316J236848K78600j155125
35750a40299j708974n65653J250540J821298P47058m85295p49517n14017m05376
35741g50235r8004N83137R07053N28389K27918M49908M39224k21036o51214l29744
35731A085396k01395q52703j091560P5035J372133R73269o70495j496930o92412
35722a499662O74242J374225J042393l4604j012191q89084K50227J051268P06211
35713A663025O443j90797k91275p36096p86849J51102J143228J002280r275q46079
35703A105707j005568l46391J017660J846712O56933j547691j741209N51060J872811
35694B410024Q2471j952633q90806J532324J355694j163168k327611j122412n5196
$$ plain form
35685 -2131313 -2347157 -2290005 -1110748 67540 -358755 -1658972 -1866803 -882248 -183772
35676 -183772 -107819 256109 837607 568088 -422596 -725068 -31497 317509 -345875 -863612
35666 -863612 -187865 904363 1011768 119648 -587453 -471234 -115100 -295860 -910197
35657 -910197 -1191024 -713589 197363 1055833 1731831 2113305 1810375 857906 293885 1082375
35647 1082375 2588528 3133376 2142926 789941 340884 785196 1303365 1214171 276580
35638 276580 -1082552 -1731938 -949040 390370 764560 115138 -246750 144150 310427
35629 310427 -265120 -740397 -497976 -159925 -323558 -631574 -809420 -1299024 -2099516 -2288150
35619 -2288150 -1532124 -842260 -982828 -1334128 -1159352 -767836 -556871 -157798 523788
$$ packed form
35685b131313k15844N7152J179257J178288m26295j300217k07831R84555O98476
35676a83772P5953L63928N81498k69519r90684l02472O93571L49006o63384n17737
35666h63612O75747J092228J07405q92120p07101J16219L56134j80760o14337
35657i10197k80827M77435R10952Q58470O75998L81474l02930r52469n64021P88490
35647A082375J506153N44848r90450j352985m49057M44312N18169q9194r37591
35638B76580j359132o49386P82898J339410L74190o49422l61888L90900J66277
35629C10427n75547m75277K42421L38051j63633l08016j77846m89604q00492j88634
35619b288150P56026O89864j40568l51300J74776L91516K10965L99073O81586
$$ plain form
35610 523788 656504 -134196 -928047 -1037848 -1116701 -1670011 -1801693 -785647 297007
35601 297007 24141 -1134960 -1544766 -724788 405766 1076707 1202748 788233 -36749
35592 -36749 -628377 -411256 317063 786822 690163 297498 39307 221705 639498 460191
35582 460191 -701913 -1730514 -1232933 257266 857608 191324 -200792 367735 669967
35573 669967 7843 -469946 -6499 295327 -353360 -717927 366590 1883671 2311873
35564 2311873 1904918 1618646 1214152 196876 -664179 -545610 -155889 -447577 -876328
35555 -876328 -538942 146177 494719 1012296 2110742 2707375 1960676 1119960 1658569
35546 1658569 2770035 2827944 2208820 2364057 2973862 2420477 574912 -1075533 -1711470
$$ packed form
35610E23788J32716p90700p93851j09801p8853n53310j31682J016046J082654
35601B97007k72866j159101m09806Q19978J130554O70941J26041m14515q24982
35592c6749n91628K17121P28319M69759r6659l92665k58191J82398M17793j79307
35582D60191j162104j028601M97581J490199O00342o66284l92116N68527L02232
35573F69967o62124m77789M63447L01826o48687l64567J084517J517081M28202
35564B311873m06955k86272m04494j017276q61055J18569L89721k91688m28751
35555h76328L37386O85119L48542N17577J098446N96633p46699q40716N38609
35546A658569J111466N7909o19124J55237O09805n53385j845565j650445o35937
$$ plain form
35537 -1711470 -1668194 -1098745 -22013 774070 701730 718318 1893455 3263840 3083558
35528 3083558 1643541 753699 846590 764793 183683 18050 352378 69148 -1085566
35519 -1085566 -1805844 -1054069 720553 2422652 3244881 2776508 1325776 69041 -164536
35510 -164536 -31584 -584030 -1487874 -1549256 -614363 373493 942265 1428796 1889414 1848391
35500 1848391 1172465 391913 181909 903239 2220356 2953445 2196194 839327 713566
35491 713566 1868811 2412472 1667204 1352339 2446700 3134741 1680979 -643928 -1638986
35482 -1638986 -1467935 -1586273 -1848689 -1160660 61820 476159 86704 -152325 -237813
35473 -237813 -707421 -1145154 -884197 -334470 -28547 515223 1422600 1431643 -2969 -1190815
$$ packed form
35537a711470M3276N69449J076732P96083p2340J6588J175137J370385j80282
35528C083558j440017q89842R2891q1797n81110j65633L34328k83230j154714
35519a085566p20278P51775J774622J702099Q22229m68373j450732j256735k33577
35510a64536J32952n52446r03844o1382R34893R87856N68772M86531M60618m1023
35500A848391o75926p80552k10004P21330J317117P33089p57251j356867j25761
35491G13566J155245N43661p45268l14865J094361O88041j453762k324907r95058
35482a638986J71051j18338k62416O88029J222480M14339l89455k39029q5488
35473b37813m69608m37733K60957N49727L05923N43770R07377R043j434612j187846
$$ plain form
35463 -1190815 -746408 61271 -376936 -1184376 -884479 -262907 -687516 -1342713 -955532
35454 -955532 -502052 -1160938 -1374825 638291 3061787 2877560 787317 -82150 674033
35445 674033 863800 233087 802192 2886985 4541060 4956889 5047122 4811699 3469483
35436 3469483 1991691 2143776 3194523 2888736 1437178 1149752 2329363 2981577 2457673
35427 2457673 1964719 1630538 538727 -506989 155338 1565940 1209511 -511126 -671146
35418 -671146 1220643 2525370 2020632 1325326 1340857 1013843 241117 434302 1556276
35409 1556276 1951772 1572598 2005109 3015856 2647932 1090873 753202 2003380 2536172
35400 2536172 1544800 845574 1209633 1207757 406911 189763 724442 554221 -259213 -37804
$$ packed form
35463a190815M44407Q07679m38207q07440K99897O21572m24609o55197L87181
35454i55532M53480o58886k13887K013116K423496j84227k090243q69467P56183
35445F74033J89767o30713N69105K084793J654075M15829R0233k35423j342216
35436C469483j477792J52085J050747l05787j451558k87426J179611O52214n23904
35427B457673m92954l34181j091811j045716O62327J410602l56429j720637j60020
35418f71146J891789J304727n04738o95306J5531l27014p72726J93185J121974
35409A556276L95496l79174M32511J010747l67924j557059l37671J250178N32792
35400B536172r91372o99226L64059j876q00846k17148N34679j70221q13434K21409
$$ plain form
35390 -37804 1069644 1099705 63308 62821 1317829 1815461 1169256 959185 1067757 -199208
35380 -199208 -2117531 -2002633 -28221 797645 -152627 -485285 240283 -242473 -1975638
35371 -1975638 -2050276 109186 1500248 768628 70570 536605 426535 -950777 -1813807
35362 -1813807 -1485519 -1265903 -1109791 295574 1928768 1543473 291721 1150577 3068913
35353 3068913 2459306 202447 633552 3518969 4100045 1599417 324334 1522700 1825928
35344 1825928 854634 2258810 5668774 6006516 2784623 1531799 3699879 4080260 998765
35335 998765 -219487 2593422 4167387 1712354 -74587 1672115 2788427 887512
35327 887512 209013 2699048 3462252 365901 -1114769 1883097 3997204 1909272 520525
$$ packed form
35390c7804J107448L0061j036397m87J255008M97632o46205k10071J08572j266965
35380a99208j918323J14898J974412Q25866r50272l32658P25568m82756j733165
35371a975638p4638K159462J391062p31620o98058M66035j10070j377312q63030
35362a813807L28288K19616J56112J405365J633194l85295j251752Q58856J918336
35353C068913o09607k256859M31105K885417N81076k500628j275083J198366L03228
35344A825928r71294J404176L409964L37742l221893j252824K168080L80381l081495
35335I98765j218252K812909J573965k455033j786941J746702J116312j900915
35327H87512o78499K490035P63204l096351j480670K997866K114107k087932j388747
$$ plain form
35318 520525 2951485 4383034 2083118 1235864 4317720 5458476 2071932 652336
35310 652336 4035485 5302942 1833145 1815714 8414031 12214005 8873245 8247041 15309851
35301 15309851 19683001 16461563 17877653 29826231 38823793 39555536 49757217 75752591
35293 75752591 94082130 99468674 136636551 234317536 334247921 352236444 301013667
35286 301013667 278587210 323353067 355692788 297549525 184820924 108402444 90912764
35279 90912764 83880174 59151290 37946347 35827971 36013169 25878554 17446359 19399177
35271 19399177 20724846 13842829 8319824 10879258 13110458 8710801 4628527 6274386
35263 6274386 7692076 4473939 2166880 4387271 5453042 1854286 -589638 2324500
$$ packed form
35318E20525K430960J431549k299916q47254L081856J140756l386544j419596
35310F52336L383149J267457l469797j7431O598317L799974l340760o26204P062810
35301A5309851M373150l221438J416090J1948578Q997562P31743J0201681K5995374
35293G5752591J8329539N386544L7167877R7680985R9930385J7988523n1222777
35286C01013667k2426457M4765857L2339721n8143263j12728601p6418480j7489680
35279I0912764p032590k4728884k1204943k118376J85198j0134615q432195J952818
35271A9399177J325669o882017n523005K559434K231200m399657m082274J645859
35263F274386J417690l218137k307059K220391J065771l598756k443924K914138
$$ plain form
35255 2324500 5561610 4402931 2196068 2763901 3611170 2121327 876335 1900267
35247 1900267 2500414 1046983 381862 1829786 2155889 -181952 -1854259 -764568 508330
35238 508330 38145 -392071 94811 -493336 -2207389 -2073118 183457 1030419 -418963
35229 -418963 -740031 1134683 1662347 -669471 -2397002 -1252845 367785 613078 1330614
35220 1330614 3403002 4243680 2691082 1442271 2020994 2177822 762832 209813 1552832
35211 1552832 1966566 157806 -688124 1431964 3353937 1985327 -552215 -694120 1133004
35202 1133004 2369422 2594877 2648441 2095963 559103 -671088 -754679 -779274 -1222955
35193 -1222955 -618298 1322386 2128971 304278 -2047310 -2481402 -1561572 -884405 -293145
$$ packed form
35255B324500L237110j158679k206863N67833Q47269j489843j244992J023932
35247A900267O00147j453431o65121J447924L26103k337841j672307J089691J272898
35238E08330m70185m30216M86882n88147j714053J34271K256575Q46962j449382
35229d18963l21068J874714N27664k331818j727531J144157J620630K45293P17536
35220A330614K072388Q40678j552598j248811N78723J56828j414990n53019J343019
35211A552832M13734j808760q45930K120088J921973j368610k537542j41905J827124
35202A133004J236418K25455N3564n52478j536860j230191q3591k4595m43681
35193a222955O04657J940684Q06585j824693k351588m34092R19830O77167N91260
$$ plain form
35184 -293145 783174 1503425 1202579 801396 909799 530439 -875232 -2106976 -2284620
35175 -2284620 -2038473 -1671042 -617120 382560 -486096 -2577525 -2686705 22318 2228083
35166 2228083 1416377 -546628 -931876 -168708 142647 476089 1826349 3071586 2617232
35157 2617232 1049107 -132835 -870957 -1630849 -1764024 -802375 73165 -313101 -1347143
35148 -1347143 -1958937 -2191968 -2121594 -1060631 683714 1223362 -73063 -1074194 -11610
35139 -11610 1736504 1923026 809236 242546 786883 1715188 2606507 3137069 2463879
35130 2463879 555343 -936182 -706773 357514 782454 725366 1078634 1556225 1339793
35121 1339793 704321 448989 455639 152324 -271261 -236629 310900 1209972 2435471 3405512
$$ packed form
35184b93145J076319P20251l00846m01183J08403l79360j405671j231744j77644
35175b284620K46147L67431J053922R99680q68656k091429j09180K709023K205765
35166B228083q11706j963005l85248P63168L11355L33442J350260J245237m54354
35157B617232j568125j181942p38122p59892j33175R61649Q75540l86266j034042
35148a347143o11794k33031P0374J060963J744345N39648j296425j001131J062584
35139a1610J748114J86522j113790n66690N44337R28305Q91319N30562o73190
35130B463879j908536j491525K29409J064287M24940n7088L53268M77591k16432
35121A339793o35472k55332O650l03315m23585L4632N47529Q99072J225499R70041
$$ plain form
35111 3405512 3049418 1441568 247634 602856 1593161 1742646 968583 155366 -244821
35102 -244821 -308362 -138947 73168 203633 672174 1836536 2883544 2615152 1373176
35093 1373176 651442 732727 485443 -327034 -539691 198782 701218 292659 -296847 -573239
35083 -573239 -893703 -1064846 -417041 373061 -152096 -1458703 -1374979 306153 1427175
35074 1427175 1315097 1799814 3306348 3418014 1096293 -1004806 -685323 401426 27857
35065 27857 -813852 -317816 480170 -297550 -1734096 -1772569 -904412 -987036 -1718185 -1501486
35055 -1501486 -755422 -1139958 -2236732 -2147141 -940852 -473822 -970549 -732898 608559
35046 608559 1299511 403890 -803277 -1040607 -695678 -610519 -733370 -644071 -324236 18354
$$ packed form
35111C405512l56094j607850j193934L55222R90305J49485p74063q13217m00187
35102b44821o3541J69415K12115J30465M68541J164362J047008k68392j241976
35093A373176p21734Q1285k47284q12477k12657P38473N02436m08559n89506k76392
35083e73239l20464j71143O47805P90102n25157j306607Q3724J681132J121022
35074A427175j12078M84717J506534J11666k321721k101099L19483J086749l73569
35065B7857q41709M96036P97986p77720j436546l8473Q68157q2624p31149K16699
35055a501486P46064l84536j096774Q9591J206289M67030m96727K37651J341457
35046F08559O90952q95621j207167k37330L44929Q5159j22851Q9299L19835L42590
$$ plain form
35036 18354 117414 -352178 -1164106 -1249804 10504 1567550 1843167 777904 -306874
35027 -306874 -571421 -324553 -87428 16386 100911 495023 1567436 2941037 3391041
35018 3391041 2218310 206997 -1370151 -2041609 -1912117 -1063433 95218 735501 586095
35009 586095 194039 -272596 -1360988 -2913328 -3662206 -3023732 -1952901 -1236163 -441122
35000 -441122 571554 831293 93126 -289641 330516 542775 -616664 -1692303 -1216205
34991 -1216205 -268323 -461327 -1064426 -615075 107776 -449231 -1306731 -209248 2355858
34982 2355858 3473436 2173524 707068 1014276 2311940 2901513 2451033 1670646 1123526
34973 1123526 1036724 1340001 1549567 1299592 893098 662329 275165 -471725 -861516 -310676
$$ packed form
35036A8354R9060m69592q11928q5698J260308J557046K75617j065263j084778
35027c06874k64547K46868K37125J03814Q4525L94112J072413J373601M50004
35018C391041j172731k011313j577148o71458J29492Q48684J158651O40283j49406
35009E86095l92056m66635j088392j552340p48878O38474J070831P16738P95041
35000d41122J012676K59739p38167l82767O20157K12259j159439j075639M76098
34991a216205R47882j93004o03099M49351P22851n57007q57500J097483K565106
34982B355858J117578j299912j466456L07208J297664N89573m50480p80387n47120
34973A123526q6802L03277K09566k49975m06494k30769l87164p46890l89791N50840
$$ plain form
34963 -310676 523729 819171 929829 1409359 1631075 823546 -409578 -1098949 -1500174
34954 -1500174 -2116754 -2214011 -1129344 -24935 -301083 -1192002 -1095544 -408424 -673548
34945 -673548 -1647316 -1762811 -1019662 -827742 -1276507 -1144354 -462693 -474036 -1067092 -858530
34935 -858530 70132 121249 -918545 -1510806 -1187101 -1114578 -1461200 -931449 462304 913131
34925 913131 -78716 -818468 -567843 -778640 -1945031 -2095371 -177959 1655672 1278892
34916 1278892 -101838 -170877 815217 1039786 398267 220267 638928 630000 154153 126593
34906 126593 546023 556694 218935 480505 1391197 1918752 1702350 1633256 2376271 3351483
34896 3351483 3537252 2622278 1205051 302460 535967 1364479 1485104 556704 -22461
$$ packed form
34963c10676Q34405K95442J10658M79530K21716q07529j233124o89371m01225
34954a500174o16580r7257J084667J104409k76148q90919R6458O87120k65124
34945f73548r73768j15495P43149J91920m48765J32153O81661j1343n93056K08562
34935h58530R28662N1117j039794n92261L23705P2523l46622N29751J393753M50827
34925I13131r91847p39752K50625k10797j166391j50340J917412J833631l76780
34916A278892j380730o9039R86094K24569o41519j78000M18661q928m75847k7560
34906A26593M19430J0671l37759K61570R10692N27555k16402o9094P43015R75212
34896C351483J85769r14974j417227r02591K33507Q28512J20625r28400n79165
$$ plain form
34887 -22461 1059652 2890646 3230248 1481768 -457662 -633011 744516 2094644 2599710
34878 2599710 2610173 2423827 1839280 1049032 928925 1815463 2684718 2380351 1246798
34869 1246798 597544 813169 1118728 1228953 1819039 2949993 3450891 2692213 1692223
34860 1692223 1383381 984911 -496473 -2154240 -2279591 -970419 80711 97958 -119744
34851 -119744 89037 445210 639698 641687 148429 -890062 -1354530 -138364 1812077
34842 1812077 2343326 1098895 -67409 56757 598998 525057 222547 361552 707013
34833 707013 945429 1378557 1975458 1969128 1174548 514189 511592 503649 67120 -138855 180891
34822 180891 86296 -922320 -1674123 -1076266 20784 120000 -633421 -891648 -200660 693015
$$ packed form
34887b2461J082113J830994L39602j748480j939430j75349J377527J350128N05066
34878B599710J0463j86346n84547p90248j20107Q86538Q69255l04367j133553
34869A246798o49254K15625L05559J10225N90086J130954N00898p58678r99990
34860A692223l08842l98470j481384j657767j25351J309172J051130J7247k17702
34851a19744K08781L56173J94488J989m93258j038491m64468J216166J950441
34842A812077N31249j244431j166304J24166N42241p3941l02510J39005L45461
34833G07013K38416M33128N96901o330p94580o60359k597p943m36529k05975L19746
34822A80891r4595j008616p51803N97857J097050R9216p53421k58227O90988Q93675
$$ plain form
34812 693015 1190970 1315382 1203290 1139295 1655520 2648005 2958167 1912916 703582
34803 703582 929208 2147012 2313291 621868 -1481139 -2386193 -2208481 -2021283 -2110662
34794 -2110662 -1825888 -838081 180732 318367 -436278 -1150699 -1099650 -576128 -203418
34785 -203418 137135 905309 1632498 1180048 -461592 -1729704 -1452470 -330370 297097
34776 297097 317824 497805 894742 783106 -43971 -893963 -1113035 -682761 99579 893308
34766 893308 1272060 994305 375683 -38516 -151684 -264785 -419004 -262968 351576 994197
34756 994197 1021537 199587 -1041295 -1916106 -1945606 -1338006 -580486 234073 1291117 2308297
34746 2308297 2494285 1501583 -30761 -1175279 -1601358 -1549414 -1339652 -1187476 -1141198
$$ packed form
34812F93015M97955J24412j12092o3995N16225R92485L10162j045251j209334
34803G03582K25626J217804J66279j691423k103007r05054J77712J87198q9379
34794b110662K84774R87807J018813J37635p54645p14421N1049N23522L72710
34785b03418L40553P68174P27189m52450j641640j268112K77234J122100O27467
34776B97097K0727J79981L96937j11636q27077q49992k19072M30274P82340P93729
34766H93308L78752k77755o18622m14199j13168j13101j54219J56036O14544O42621
34756I94197K7340q21950j240882q74811k9500O07600P57520Q14559J057044J017180
34746B308297J85988r92702j532344j144518m26079N1944K09762J52176M6278
$$ plain form
34737 -1141198 -933543 -225493 805360 1515991 1632625 1571261 1676359 1643212 1055900 69151
34727 69151 -825023 -1359079 -1517024 -1397444 -1347476 -1773817 -2447066 -2469279 -1433119 -227174
34717 -227174 -93424 -1072566 -1922319 -1538058 -57621 1443100 2045956 1716780 1100072
34708 1100072 710219 453616 39752 -377267 -351838 113226 380030 -176511 -1533073
34699 -1533073 -2977800 -3562481 -2885584 -1716835 -1443348 -2451238 -3516805 -3361581 -2226053
34690 -2226053 -1142937 -378368 267534 316275 -658539 -1607763 -1173887 -113967 -434291
34681 -434291 -1920789 -1948568 435257 2658526 2316069 584405 -4396 559166 521446
34672 521446 -161988 202494 1943222 3342032 3274562 2504523 1914328 1235467 238674
$$ packed form
34737a141198K07655P08050J030853P10631J16634o1364J05098l3147n87312r86749
34727F9151q94174n34056j57945J19580M9968m26341o73249k2213J036160J205945
34717b27174J33750r79142q49753L84261J480437J500721O02856l29176o16708
34708A100072l89853k56603m13864m17019K5429M65064K66804n56541j356562
34699a533073j444727n84681O76897J168749K73487j007890j065567J55224J135528
34690b226053J083116P64569O45902M8741r74814r49224M33876J059920l20324
34681d34291j486498k7779K383825K223269l42457j731664n88801N63562l7720
34672E21446o83434L64482J740728J398810o7470p70039n90195o78861r96793
$$ plain form
34663 238674 -282659 345771 1493789 1998249 1535741 678272 88833 100917 672559 1385169
34653 1385169 1756743 1705942 1420681 840209 -173869 -1114192 -1000576 328253 1595369
34644 1595369 1324927 -427967 -2046511 -2147085 -1063968 -238221 -340995 -630058 -335570
34635 -335570 121201 3819 -319165 15214 709858 702402 143132 285533 1081054 775443
34625 775443 -1229653 -2975246 -2777289 -1781394 -1884928 -2539545 -1883398 -95508 908449
34616 908449 703898 686839 1124349 490743 -1616313 -3271576 -3001637 -1784254 -1053936
34607 -1053936 -512817 581911 1480740 1075333 -62002 -540601 -389217 -762417 -1829233
34598 -1829233 -2548119 -2361262 -1665718 -714545 490246 1208166 456371 -1128341 -1406721
$$ packed form
34663B38674n21333O28430J148018N04460m62508q57469n89439J2084N71642P12610
34653A385169L71574n0801k85261n80472j014078r40323J13616J328829J267116
34644A595369k70442j752894j618544j00574J083117Q25747j02774k89063K94488
34635c35570M56771j17382l22984L34379O94644p456n59270J42401P95521l05611
34625G75443k005096j745593J97957R95895j03534o54617O56147J787890J003957
34616I08449k04551j7059M37510o33606k107056j655263K69939J217383P30318
34607a053936N41119J094728Q98829m05407j137335m78599J51384l73200j066816
34598a829233p18886J86857O95544R51173J204791P17920p51795j584712k78380
$$ plain form
34589 -1406721 565186 3137256 4164368 3455032 2209105 1042199 -126568 -905147
34581 -905147 -710989 -81518 -237692 -1130044 -1257927 84256 1605536 1819508 1009106
34572 1009106 408170 260885 -62983 -524882 -391337 295914 513115 -201490 -1060637
34563 -1060637 -1305027 -1250608 -1501496 -1862475 -1724085 -1070568 -476194 -346151 -594450 -842315
34553 -842315 -634085 218901 1201395 1379133 498655 -541240 -710477 793 873822
34544 873822 1504914 1918309 1881056 952517 -584066 -1539951 -1128661 -133214 -84368 -1228081
34534 -1228081 -2043868 -1274819 203157 530789 -400192 -744111 477190 1871135 1913663
34525 1913663 1286503 1485366 2171586 1827487 448049 -505323 -620365 -843169 -1205595
$$ packed form
34589a406721J971907K572070J027112p09336j245927j166906j168767p78579
34581i05147J94158O29471j56174q92352j27883J342183J521280K13972q10402
34572A009106o00936j47285l23868m61899J33545O87251K17201p14605q59147
34563a060637k44390N4419k50888l60979J38390O53517N94374J30043k48299k47865
34553h42315K08230Q52986R82494J77738q80478j039895j69237P11270Q73029
34544H73822O31092M13395l7253r28539j536583r55885M11290R95447M8846j143713
34534a228081q15787P69049J477976L27632r30981l43919J221301J393945M2528
34525A913663o27160J98863O86220l44099j379438r53372j15042k22804l62426
$$ plain form
34516 -1205595 -566135 884849 1231247 -80441 -982218 43717 1582186 1740599 1135289
34507 1135289 1392578 2163885 1944693 889584 497556 1029091 1358320 1090187 877947
34498 877947 820986 371521 -264861 -338724 -68298 -304021 -833252 -726321 -230079 -450935
34488 -450935 -1153780 -884993 453983 1203100 654061 157050 662707 1039674 64418
34479 64418 -1455538 -1982478 -1567294 -1433061 -1968964 -2487815 -2619084 -2792556 -3345463 -3865331
34469 -3865331 -3528496 -1918673 302935 1605003 1024469 -579933 -1399801 -837542 18184
34460 18184 116875 -365160 -756330 -732719 -107411 1115497 2066140 1577706 9478 -723834
34450 -723834 254625 1348850 704993 -1167958 -2285411 -1969995 -1342204 -1354845 -1653768
$$ packed form
34516a205595O39460J450984L46398j311688r01777J025935J538469J58413o05310
34507A135289K57289P71307k19192j055109l92028N31535L29229k68133k12240
34498H77947n6961m49465o36382p3863K70426k35723n29231J06931M96242k20856
34488d50935p02845K68787J338976P49117n49039m97011N05657L76967r75256
34479F4418j519956n26940M15184J34233n35903n18851j31269j73472n52907n19868
34469c865331L36835J609823K221608J302068n80534j604402q19868N62259Q55726
34460A8184R8691m82035l91170K3611O25308J222908R50643m88434j568228p33312
34450g23834R78459J094225o43857j872951j117453L15416O27791j2641k98923
$$ plain form
34441 -1653768 -1481278 -780795 -183011 -354134 -1328554 -2214562 -1902363 -417783 897448
34432 897448 971069 194031 -447372 -695016 -764228 -531806 16491 110733 -875123 -2183366
34422 -2183366 -2537497 -2006830 -1751506 -1985914 -1587361 -15833 1680359 2362673 2224270
34413 2224270 1975526 1543670 578077 -348162 -170511 1140559 2358220 2375945 1184779
34404 1184779 -499631 -1867263 -2164113 -1029307 846029 1972705 1575700 508510
34396 508510 114633 553337 983959 1108911 1492977 2263859 2582145 1896589 862700
34387 862700 376207 403673 458142 541180 771873 708484 62847 -387649 249385 1421613
34377 1421613 1745383 1046424 505018 702335 841419 238642 -618809 -1006918 -949085 -781913
$$ packed form
34441a653768J72490P00483N97784j71123r74420q86008L12199J484580J315231
34432H97448P3621p77038o41403k47644o9212K32422N48297R4242r85856j308243
34422b183366l54131N30667K55324k34408L98553J571528J696192O82314j38403
34413B224270k48744m31856r65593r26239J77651J311070J217661J7725j191166
34404A184779j684410j367632k96850J134806J875336J126676l97005j067190
34396E08510l93877M38704M30622J24952L84066P70882L18286o85556j033889
34387H62700m86493K7466N4469Q3038K30693o3389o45637m50496O37034J172228
34377A421613L23770o98959n41406J97317J39084o02777q57451l88109N7833J67172
$$ plain form
34367 -781913 -656847 -885590 -1783791 -2723079 -2462721 -1044342 -163632 -776450 -1507838
34358 -1507838 -676434 1036652 1463500 14302 -1647719 -1927800 -983207 88577 646398
34349 646398 707586 513542 314792 222555 116854 -58986 -50099 303403 655497 643277
34339 643277 536213 793283 1175030 1000258 214406 -513916 -821267 -1101492 -1728712 -2360504
34329 -2360504 -2313053 -1359201 19399 1035242 1251295 960957 795963 877160 697665
34320 697665 28818 -612075 -844917 -1176026 -2108234 -2972881 -2665510 -1385257 -583078
34311 -583078 -1054180 -2023200 -2381663 -1965839 -1224491 -415351 314045 635926 420817 29638
34301 29638 -219196 -490245 -913791 -1064122 -519998 362701 838600 741744 486271 259842
$$ packed form
34367g81913J25066k28743q98201r39288K60358J418379Q80710o12818p31388
34358a507838Q31404J713086M26848j449198j662021k80081R44593J071784N57821
34349F46398O1188j94044j98750r2237j05701j75840Q887L53502L52094j2220
34339F43277j07064K57070L81747j74772p85852p28322l07351k80225o27220o31792
34329b360504M7451R53852J378600J015843K16053k90338j64994Q1197j79495
34320F97665o68847o40893k32842l31109r32208q64647L07371J280253Q02179
34311e83078m71102r69020l58463M15824P41348Q09140P29396L21881k15109l91179
34301B9638k48834k71049m23546j50331N44124Q82699M75899r6856k55473k26429
$$ plain form
34291 259842 -96083 -400216 -84573 882255 1660882 1596660 1130458 1076497 1349834 1152424
34281 1152424 276426 -624355 -1158718 -1686653 -2303913 -2259456 -1149968 45994 187311
34272 187311 -252280 110622 1278190 1753291 948941 188576 561222 1163064 689043
34263 689043 -277114 -147066 1039705 1599890 854594 144057 630750 1460383 1144266
34254 1144266 -68996 -445809 788389 2309905 2327263 756751 -722059 -633055 695652
34245 695652 1664897 1280745 71276 -919515 -1501272 -2177198 -2898107 -2787332 -1380851
34236 -1380851 439543 1305537 958471 475146 868254 1897167 2499761 2113644 1200521
34227 1200521 557800 532114 999901 1671947 2083100 1639139 234317 -1270589 -1741773
$$ packed form
34291B59842l55925l04133L15643R66828P78627o4222m66202n3961K73337j97410
34281A152424q75998r00781n34363n27935o17260M4457J109488J195962J41317
34272A87311m39591L62902J167568M75101q04350p60365L72646O01842m74021
34263F89043r66157J30048J186771N60185p45296p10537M86693Q29633l16117
34254A144266j213262l76813J234198J521516J7358j570512j478810Q9004J328707
34245F95652R69245l84152j209469r90791n81757o75926p20909J10775J406481
34236a380851J820394Q65994l47066m83325L93108J028913O02594l86117r13123
34227A200521o42721k5686M67787O72046M11153m43961j404822j504906m71184
$$ plain form
34218 -1741773 -1024035 -40683 432585 550800 736535 802550 245258 -836012 -1565790
34209 -1565790 -1033650 899468 3313643 4647540 3828150 1370031 -851255 -1253387 83568
34200 83568 1774144 2564997 2262248 1594040 1472551 2195707 3161033 3521637 3141945 2569622
34190 2569622 2119921 1610269 1083772 963448 1131868 734206 -474490 -1380881 -938845
34181 -938845 307742 1049661 985846 721075 390624 -320954 -999154 -725137 359608
34172 359608 958483 464662 -160313 171087 1273519 2280487 2819079 2937043 2510879
34163 2510879 1490889 386205 -149598 -75237 118873 99535 -26787 9391 319218 719474
34153 719474 844854 569668 288610 468371 954691 1136646 792575 292419 -44683 -201354
$$ packed form
34218a741773P17738R83352M73268J18215J85735O6015n57292j081270p29778
34209a565790N32140J933118K414175J333897q19390k458119k221286m02132J336955
34200H3568J690576P90853l02749o68208j21489P23156R65326L60604l79692n72323
34190B569622m49701n09652n26497j20324J68420l97662j208696r06391M42036
34181i38845J246587P41919o3815k64771l30451p11578o78200K74017J084745
34172C59608N98875m93821o24975L31400J102432J006968N38592J17964m26164
34163B510879j019990j104684n35803P4361J94110j9338j26322L6178L09827M00256
34153G19474J25380k75186k81058J79761M86320J81955l44071n00156l37102j56671
$$ plain form
34143 -201354 4388 922719 2324404 3303079 3338054 2931363 2791663 2911397 2901406 2703928
34133 2703928 2397368 1754871 690742 -169882 -128271 504184 706124 186220 -185408
34124 -185408 335604 1230742 1399756 719015 278621 881354 1796599 1578402 27565
34115 27565 -1360733 -1230358 -37746 734061 578233 271053 354415 421247 176058 159735
34105 159735 761744 1269359 749951 -517303 -1308084 -1026797 -339580 -188999 -687259
34096 -687259 -1181221 -1172061 -944657 -1166505 -1851510 -2069719 -1123436 251769 618252 -248454
34086 -248454 -1067092 -870667 -128196 391426 814019 1430754 1718564 1167577 416781 405427
34076 405427 873092 896311 535858 630911 1146012 1139534 459385 79377 429237 706822
$$ packed form
34143b01354K05742R18331J401685R78675L4975m06691j39700J19734r991j97478
34133B703928l06560o42497j064129q60624M1611O32455K01940n19904l71628
34124a85408N21012Q95138J69014o80741m40394O02733R15245k18197j550837
34115B7565j388298J30375J192612P71807j55828l07180Q3362O6832k45189j6323
34105A59735O02009N07615n19408j267254p90781K81287O87217J50581m98260
34096f87259m93962R160K27404k21848o85005k18209R46283J375205L66483q66706
34086b48454q18638J96425P42471N19622M22593O16735K87810n50987p50796j1354
34076D05427M67665K3219l60453R5053N15101o478o80149l80008L49860K77585
$$ plain form
34066 706822 388798 219154 915839 1845110 1878620 940254 -97674 -597791 -551653 -160420
34056 -160420 372324 839402 1144621 1134972 308806 -1559051 -3345907 -3247929 -1154859 682872
34046 682872 306865 -1497640 -2510395 -2058930 -1313738 -1122510 -1148602 -1104429 -1314880 -1753213
34036 -1753213 -1782211 -1258953 -806837 -596710 27261 1164633 1698570 833350 -550761
34027 -550761 -1003008 -397762 168910 7061 -519047 -853501 -1019367 -1380277 -1987340 -2304182
34017 -2304182 -1658171 -207113 735624 48630 -1483462 -1781490 -197076 1439692 1288136
34008 1288136 247 -468936 175978 390614 -586460 -1533169 -1078628 486538 1849680
33999 1849680 2247055 1794321 961466 352476 476390 1125488 1361601 644189 -387761
$$ packed form
34066G06822l18024j69644O96685R29271L3510r38366j037928n00117M6138L91233
34056a60420N32744M67078L05219r649q26166j867857j786856R7978K093070J837731
34046F82872l76007j804505j012755M51465P45192J91228k6092M4173k10451m38333
34036a753213k8998N23258M52116K10127O23971J137372N33937q65220j384111
34027e50761m52247O05246N66672j61849n26108l34454j65866l60910o07063l16842
34017b304182O46011J451058R42737o86994j532092k98028J584414J636768j51556
34008A288136j287889m69183O44914K14636r77074r46709M54541J565166J363142
33999A849680L97375m52734q32855o08990J23914O49098K36113p17412j031950
$$ plain form
33990 -387761 -792241 -642434 -810529 -1590894 -2257818 -2132272 -1481160 -963120 -568247 285281
33980 285281 1609411 2437782 1986211 840300 336944 867177 1527200 1547782 1193886
33971 1193886 821119 -51722 -1842375 -3659065 -4031355 -2741472 -1064410 -266024 -607947
33962 -607947 -1660410 -2716328 -2964271 -2148365 -1084523 -744823 -970355 -999609 -976242
33953 -976242 -1600860 -2378782 -1885415 -144873 957656 401993 -428197 -1477 1046004
33944 1046004 1247134 703568 471748 476524 -82543 -747314 -175245 1497431 2397652 1371514
33934 1371514 -649154 -2102178 -2440875 -1928388 -878553 310361 1098066 1273147 1066589
33925 1066589 712332 423208 644880 1491978 2034724 1208290 -489099 -1355982 -788194
$$ packed form
33990c87761m04480J49807j68095p80365o66924J25546O51112N18040L94873Q53528
33980B85281J324130Q28371m51571j145911n03356N30233O60023K0582l53896
33971A193886l72767q72841j790653j816690l72290J289883J677062P98386l41923
33962f07947j052463j055918k47943Q15906J063842L39700k25532k9254K3367
33953i76242o24618p77922M93367J740542J102529n55663q30190M26720J047481
33944A046004K01130n43566k31820M776n59067o64771N72069J672676R00221j026138
33934A371514k020668j453024l38697N12487J049835J188914P87705J75081k06558
33925A066589l54257k89124K21672Q47098N42746q26434j697389q66883N67788
$$ plain form
33916 -788194 8569 65270 88368 964032 1955766 1699880 398110 -338024 262642 1173263
33906 1173263 1088554 56175 -846458 -968550 -685621 -609767 -615050 5061 1399285 2593741
33896 2593741 2487980 1242182 137549 42940 559121 817260 595152 356181 547764
33887 547764 1126886 1565756 1261293 210660 -812836 -1209253 -1502731 -2580729 -4023740
33878 -4023740 -4255208 -2724879 -887408 -283097 -534810 -233520 850305 1648051 1604544
33869 1604544 1376181 1580922 1869847 1656160 1089612 830790 1189535 1789579 1919051
33860 1919051 1163982 -67878 -735473 -267700 598083 611096 -351846 -1094801 -740954
33851 -740954 145737 519425 289455 84109 7022 -449496 -1323437 -1939325 -1965761 -1877371
$$ packed form
33916g88194P96763N6701K3098Q75664R91734k55886j301770p36134O00666R10621
33906A173263q4709j032379r02633j22092K82929P5854n283O20111J394224J194456
33896B593741j05761j245798j104633r4609N16181K58139k22108k38971J91583
33887E47764N79122M38870l04463j050633j023496l96417k93478j077998j443011
33878d023740k31468J530329J837471O04311k51713L01290J083825P97746m3507
33869A604544k28363K04741K88925k13687n66548k58822L58745O00044J29472
33860A919051p55069j231860o67595M67773Q65783J3013r62942p42955L53847
33851g40954Q86691L73688k29970k05346p7087m56518q73941o15888k6436Q8390
$$ plain form
33841 -1877371 -1931922 -1500108 -176931 1056635 846555 -574797 -1528713 -1049595 162353
33832 162353 1171264 1980257 2660480 2503379 1193987 32014 571764 2351794 3340196
33823 3340196 2619495 1308734 603527 250639 -402474 -978704 -678791 327830 1096062
33814 1096062 1223372 1190872 1488632 2048424 2566824 2849776 2671591 1697496 -78271
33805 -78271 -1863497 -2423063 -1294502 417543 1001783 92154 -956112 -1041119 -842060
33796 -842060 -1467146 -2324978 -1851811 -148595 824470 47077 -1175472 -1365116 -943200
33787 -943200 -1044609 -1445771 -1053470 268397 1663811 2587887 2986525 2636131 1505760
33778 1505760 455896 420654 1133537 1712504 2115374 2766225 3136380 2293589 774715
$$ packed form
33841a877371n4551M31814J323177J233566k10080j421352r53916M79118J211948
33832A62353J008911Q08993O80223j57101j309392j161973N39750J780030R88402
33823C340196p20701j310761p05207l52888o53113n76230K99913J006621P68232
33814A096062J27310l2500K97760N59792N18400K82952j78185r74095j775767
33805g8271j785226n59566J128561J712045N84240r09629j048266q5007J99059
33796h42060o25086q57832M73167J703216R73065p77393j222549j89644M21916
33787i43200j01409m01162L92301J321867J395414R24076L98638l50394j130371
33778A505760j049864l5242P12883N78967M02870O50851L70155q42791j518874
$$ plain form
33769 774715 159808 509221 42811 -1915564 -3422847 -2576282 -315757 982846 804085
33760 804085 665495 1394537 1988235 1444720 348225 -35321 541163 1123627 695509
33751 695509 -865101 -2707253 -3694649 -3398427 -2473660 -1848227 -1685799 -1559391 -1449678
33742 -1449678 -1830236 -2656512 -3043309 -2354514 -1053925 -44878 329992 173486 -505276
33733 -505276 -1514078 -2097807 -1718089 -1020475 -1101625 -1835401 -1942695 -972613 -172816 -760115
33723 -760115 -2150218 -2796745 -2302457 -1721977 -1910372 -2494686 -2678146 -2373947 -2134017
33714 -2134017 -2277510 -2480502 -2256089 -1685285 -1441827 -1885579 -2338387 -1799828 -374649
33705 -374649 755916 1015884 1190631 1950586 2582545 2194256 1426844 1640233 2773092
$$ packed form
33769G74715o14907L49413m66410j958375j507283Q46565K260525J298603j78761
33760H04085j38590P29042N93698n43515j096495l83546N76484N82464m28118
33751F95509j560610j842152r87396K96222R24767O25433J62428J26408J09713
33742a449678l80558q26276l86797O88795J300589J009047L74870j56506o78762
33733e05276j008802n83729L79718O97614q1150p33776j07294R70082P99797n87299
33723g60115j390103o46527M94288N80480j88395n84314j83460L04199K39930
33714b134017j43493k02992K24413N70804K43458m43752m52808N38559J425179
33705c74649J130565K59968J74747P59955O31959l88289p67412K13389J132859
$$ plain form
33696 2773092 3391567 2747891 1451605 132861 -1082262 -1607162 -577798 1374625 2073089
33687 2073089 525251 -1482410 -1614301 158382 2059828 2992907 3188819 2956873 2233532
33678 2233532 1283434 679675 468931 182904 -277494 -483463 -226618 199148 491553
33669 491553 599337 487896 72543 -615391 -1427309 -2086685 -2070053 -1008694 511493
33660 511493 1221861 731467 98074 187617 280048 -685726 -2157661 -2581359 -1667737 -700520
33650 -700520 -545767 -606887 -79371 792136 1235498 1062362 763144 808030 1095775 964683
33640 964683 -120530 -1676355 -2397398 -1694496 -525552 -23616 109830 835064 1883797
33631 1883797 1993473 971882 192531 748064 2176038 3303408 3386570 2200323 96319
$$ packed form
33696B773092O18475o43676j296286j318744j215123n24900J029364J952423O98464
33687B073089j547838k007661j31891J772683J901446R33079J95912k31946p23341
33678B233532r50098o03759k10744k86027m60398k05969K56845M25766K92405
33669D91553J07784j11441m15353o87934q11918o59376J6632J061359J520187
33660E11493P10368m90394o33393Q9543R2431r65774j471935m23698R13622R67217
33650g00520J54753o1120N27516Q71507M43362j73136k99218M4886K87745j31092
33640I64683j085213j555825p21043P02902J168944N01936J33446P25234J048733
33631A883797J09676j021591p79351N55533J427974J127370Q3162j186247k104004
$$ plain form
33622 96319 -1632960 -1531126 263524 1870568 1836882 673705 -295476 -725529 -1080455
33613 -1080455 -1369490 -1080920 -185482 599395 655143 167781 -122218 231271 822306 857826
33603 857826 301754 95062 746885 1278543 533337 -874266 -1262885 -464072 -136333
33594 -136333 -1150851 -2270795 -2223924 -1595335 -1468984 -1428939 -446097 1041576 1575997
33585 1575997 872343 57500 -235158 -615024 -1540994 -2381394 -2387456 -1796696 -1411717 -1533195
33575 -1533195 -1715969 -1348596 -300833 817146 1078288 218449 -903291 -1210754 -669053
33566 -669053 -151960 -133325 -171480 134663 342022 -180300 -1166048 -1661013 -1318041 -945326
33556 -945326 -1485483 -2774350 -3715674 -3534944 -2391077 -815722 766623 1742639 1337151
$$ packed form
33622I6319j729279J01834J794650J607044l3686j163177r69181m30053l54926
33613a080455k89035K88570Q95438P84877N5748m87362k89999L53489N91035L5520
33603H57826n56072k06692O51823N31658p45206j407603l88619P98813L27739
33594a36333j014518j119944M6871O28589J26351M0045R82842J487673N34421
33585A575997p03654q14843k92658l79866r25970q40400o062N90760L84979j21478
33575a533195j82774L67373J047763J117979K61142q59839j121740l07463N41701
33566f69053N17093J8635l8155L06143K07359n22322r85748m94965L42972L72715
33556i45326n40157j288867r41324J80730J143867J575355J582345R76016m05488
$$ plain form
33547 1337151 -390187 -2109142 -2577035 -2067308 -1643569 -1467240 -966827 -427757 -965282
33538 -965282 -2678795 -4151954 -4276996 -3451228 -2464610 -1380113 -211567 418765 217382
33529 217382 -82235 150172 434715 179802 -159230 96693 643582 840432 830830 953871
33519 953871 778203 -93644 -951803 -991848 -759489 -1208857 -1940898 -1937500 -1517646 -1772345
33509 -1772345 -2362049 -1859393 -340423 371332 -512966 -1543251 -1273228 -104839 863413
33500 863413 1366808 1504475 1054308 182330 -248191 122744 652811 986672 1600322 2422686
33490 2422686 2424556 1523323 1301409 2509733 3367860 2027592 -535447 -1962840 -1780690
33481 -1780690 -1188283 -518718 680553 1547913 517193 -1895990 -3373006 -3197561 -2972843
$$ packed form
33547A337151j727338j718955m67893N09727M23739J76329N00413N39070n37525
33538i65282j713513j473159j25042Q25768R86618J084497J168546O30332k01383
33529B17382k99617K32407K84543k54913l39032K55923N46889J96850r602J23041
33519I53871j75668q71847q58159m0045K32359m49368p32041L398M19854k54699
33509a772345n89704N02656J518970P11755q84298j030285K70023J168389R68252
33500H63413N03395J37667m50167q71978m30521L70935N30067L33861O13650Q22364
33490B422686J870r01233k21914J208324Q58127j340268k563039j427393J82150
33481a780690N92407O69565J199271Q67360j030720k413183j477016J75445K24718
$$ plain form
33472 -2972843 -3402452 -2977125 -984611 731606 751085 558350 1816841 3054084 1871506
33463 1871506 -755985 -1553320 44090 1123863 -42357 -1590881 -1505899 -793083 -1250890
33454 -1250890 -2046324 -1030278 1480011 2728881 1271388 -1332081 -2896108 -2990788 -2351247
33445 -2351247 -1381361 -240054 527313 509859 127043 -5346 -39229 -475724 -1092366 -1118601
33435 -1118601 -394297 410571 774490 812654 662728 138186 -634731 -877477 -60538 1195976
33425 1195976 1710664 1096105 65479 -505357 -378704 109174 456328 318323 -203999
33416 -203999 -589034 -508638 -288587 -349338 -427546 -48353 363860 -170068 -1527979 -2230073
33406 -2230073 -1400430 -44351 425740 102015 -14663 156740 -144106 -912248 -1196799
$$ packed form
33472b972843m29609M25327J992514J716217J9479j92735J258491J237243j182578
33463A871506k627491p97335J597410J079773j166220j548524Q4982P12816m57807
33454a250890p95434J016046K510289J248870j457493k603469j564027r4680O39541
33445b351247R69886J141307P67367j7454l82816j32389l3883m36495o16642k6235
33435a118601P24304Q04868L63919L8164j49926n24542p72917k42746Q16939J256514
33425A195976N14688o14559j030626n70836J26653M87878L47154j38005n22322
33416b03999l85035Q0396K20051o0751p8208L79193M12213n33928j357911p02094
33406b230073Q29643J356079M70091l23725j16678J71403l00846p68142k84551
$$ plain form
33397 -1196799 -595314 205335 549070 495361 271667 24567 196888 1067387 1806245 1233059
33387 1233059 -265353 -1001007 -594329 -699136 -2301336 -3960159 -4055856 -3292070 -3178830
33378 -3178830 -3177852 -1586888 1207474 2676342 1633271 -141397 -451802 582027 1209286
33369 1209286 490284 -815725 -1322154 -398314 1298273 2484396 2634192 2509110 2925840
33360 2925840 3442059 3035885 1723858 514063 -34416 -143170 133879 979668 1909932
33351 1909932 2039881 1446149 1087806 1161525 816904 -110957 -432660 618821 2041490
33342 2041490 2324012 1252101 -237848 -1278606 -1508302 -976706 -254856 -102766 -564620
33333 -564620 -913845 -740026 -384155 -110567 247304 583452 510756 342484 874231 1799916
$$ packed form
33397a196799O01485Q00649L43735n3709k23694k47100J72321Q70499P38858n73186
33387A233059j498412p35654M06678j04807j602200j658823r5697P63786J13240
33378c178830R78J590964K794362J468868j043071j774668l10405J033829O27259
33369A209286p19002j306009n06429R23840J696587J186123J49796j25082M16730
33360B925840N16219m06174j312027j209795n48479j08754K77049Q45789R30264
33351A909932J29949n93732l58343P3719l44621r27861l21703J051481J422669
33342B041490K82522j071911j489949j040758k29696N31596P21850J52090m61854
33333e64620l49225J73819L55871K73588L57871L36148p2696j68272N31747R25685
$$ plain form
33323 1799916 1750479 521119 -279631 293451 998169 617604 126003 912509 2114355
33314 2114355 1823280 203334 -761624 -354508 101440 -338515 -890412 -518618 718871
33305 718871 2258140 3714953 4529306 4031803 2403966 767013 -70784 -296305 -383086
33296 -383086 -486163 -693386 -1064086 -1219054 -671547 232652 490438 -177507 -846023 -617060
33286 -617060 255084 779577 328610 -853611 -1832537 -1627425 -148082 1473384 1934853
33277 1934853 1120443 -13797 -684798 -775070 -304536 679714 1596007 1569530 525966
33268 525966 -529704 -636975 120183 939609 1280900 1333814 1686081 2555642 3304690 2993067
33258 2993067 1586061 187305 -230952 148081 550810 566590 124654 -665094 -1066121
$$ packed form
33323A799916m9437j229360q00750N73082P04718l80565m91601P86506J201846
33314B114355k91075j619946r64958M07116M55948m39955n51897L71794J237489
33305G18871J539269J456813Q14353m97503j627837j636953q37797k25521q6781
33296c83086j03077k07223l70700j54968N47507R04199K57786o67945o68516K28963
33286f17060Q72144N24493m50967j182221r78926K05112J479343J621466M61469
33277A934853q14410j134240o71001r0272M70534R84250R16293k6477j043564
33268E25966j055670j07271P57158Q19426L41291N2914L52267Q69561P49048l11623
33258B993067j407006j398756m18257L79033M02729J5780m41936p89748m01027
$$ plain form
33249 -1066121 -111481 1690878 2191050 426038 -1489772 -1055926 913150 1454278 -141067
33240 -141067 -1556536 -1196573 -186524 81893 77520 570816 865736 150640 -752432 -568778
33230 -568778 416918 932652 628272 177931 14514 94608 538129 1488424 2538689 3059577
33220 3059577 2960821 2680576 2682683 3190343 3925767 3984919 2715023 846580 -223673 -425368
33210 -425368 -987200 -2101960 -2304870 -995240 212127 10229 -392983 571348 1894623
33201 1894623 1556137 127219 132890 1983594 3192292 2145867 303250 -320357 130172
33192 130172 417424 385187 543743 615145 99137 -371355 218961 1431242 1674614 409979
33182 409979 -1082553 -1413487 -702294 -104975 -304438 -879040 -922423 -89291 878332 787850
$$ packed form
33249a066121R54640J802359N00172j765012j915810M33846J969076N41128j595345
33240a41067j415469L59963J010049K68417m373M93296K94920p15096r03072J83654
33230e68778R85696N15734l04380m50341j63417Q0094M43521R50295J050265N20888
33220C059577r8756k80245K107N07660P35424N9152j269896j868443j070253k01695
33210d25368n61832j114760k02910J309630J207367k01898m03212R64331J323275
33201A894623l38486j428918N671J850704J208698j046425j842617o23607M50529
33192A30172K87252l2237J58556P1402n16008m70492N90316J212281K43372j264635
33182D09979j492532l30934P11193N97319j99463n74602m3383Q33132R67623r0482
$$ plain form
33172 787850 -594486 -2037852 -2214226 -1267943 -314496 307906 1120917 1831221 1147178
33163 1147178 -966626 -2326932 -1254302 795664 1138618 -244259 -890516 160845
33155 160845 1018179 260551 -752311 -351414 606335 377685 -546850 -255741 1342040
33146 1342040 2373334 1974823 1349333 1598503 2255461 2420906 1922350 922454 -341397
33137 -341397 -1077253 -496381 753640 1013083 -46310 -793521 8859 1439083 1820456
33128 1820456 897537 -259064 -772126 -579112 -66520 295824 333779 463541 1116046
33119 1116046 1842815 1793174 1092105 688488 740311 441935 -263173 -283542 697360 1377981
33109 1377981 830951 -12506 -15149 206824 -633465 -2258404 -3099491 -2425362 -1045668
$$ packed form
33172G87850j382336j443366j76374R46283R53447O22402Q13011P10304o84043
33163A147178k113804j360306J072630K049966L42954j382877o46257J051361
33155A60845Q57334p57628j012862M00897R57749k28650r24535K91109J597781
33146A342040J031294l98511o25490K49170O56958J65445m98556r99896j263851
33137c41397p35856N80872J250021K59443j059393p47211Q02380J430224L81373
33128A820456r22919j156601n13062J93014N12592L62344L7955J29762O52505
33119A116046P26769m9641p01069m03617N1823k98376p05108k0369R80902O80621
33109A377981n47030q43457k643K21973q40289j624939q41087O74129J379694
$$ plain form
33100 -1045668 -101220 -15837 -456286 -699698 -271446 410412 458817 -195049 -661254 -482376
33090 -482376 -202138 -179748 32547 598443 896834 764901 937498 1457034 1093141 -570963
33080 -570963 -1910923 -1487438 -230372 90770 -595583 -1264174 -1812934 -2651221 -3168840
33071 -3168840 -2559108 -1540321 -1374487 -1680509 -1088500 346282 1254096 1160743 754893
33062 754893 231188 -746150 -1614137 -1381223 -484003 -281935 -690729 -264440 1231665
33053 1231665 2312863 2148995 1531115 1057992 265111 -870470 -1404198 -1122716 -1049390
33044 -1049390 -1480934 -1225449 242556 1462312 1011391 -404866 -1064736 -460153 606355
33035 606355 1317417 1331536 687834 -55155 -220918 -13221 -350225 -1395037 -2221074 -2249845
$$ packed form
33100a045668R44448Q5383m40449k43412M28252O81858M8405o53866m66205J78878
33090d82376K80238K2390K12295N65896K98391j31933J72597N19536l63893j664104
33080e70963j339960M23485J257066L21142o86353o68591n48760q38287n17619
33071c168840O09732J018787J65834l06022N92009J434782R07814r3353m05850
33062G54893n23705r77338q67987K32914Q97220K02068m08794M26289J496105
33053A231665J081198j63868o17880m73123p92881j135581n33728K81482P3326
33044a049390m31544K55485J468005J219756m50921j416257o59870O04583J066508
33035F06355P11062J4119o43702p42989j65763K07697l37004j044812q26037k8771
$$ plain form
33025 -2249845 -1906353 -1512284 -803059 26041 187572 -230355 -118432 698380 953109
33016 953109 190097 -221319 527555 1027639 -93135 -1799229 -2307404 -1803724 -1549513
33007 -1549513 -1396565 -409622 795767 723883 -264526 -203890 1338379 2503213 1994514
32998 1994514 816044 436483 808783 1110495 1183637 1240851 1041957 312832 -587076 -1159108
32988 -1159108 -1502184 -1987263 -2562896 -2857835 -2704596 -2246761 -1774744 -1597640 -1739046
32979 -1739046 -1707690 -1039655 -106601 239880 -51641 -86845 496948 746310 -202960 -1555831
32969 -1555831 -1673995 -264236 1212507 1449186 738994 102597 -263775 -853328 -1537515
32960 -1537515 -1433090 -286917 877070 1059043 617525 556280 902618 775729 -2007
$$ packed form
33025b249845L43492L94069P09225Q29100J61531m17927J11923Q16812K54729
33016I53109p63012m11416P48874N00084j120774j706094n08175N03680K54211
33007a549513J52948R86943J205389p1884r88409O0636J542269J164834n08699
32998A994514j178470l79561L72300L01712P3142N7214j98894p29125q99908n72032
32988a159108l43076m85079n75633k94939J53239M57835M72017J77104j41406
32979a739046L1356O68035R33054L46481k91521l5204N83793K49362r49270j352871
32969a555831j18164J409759J476743K36679p10192o36397l66372n89553o84187
32960a537515J04425J146173J163987J81973m41518o1245L46338j26889p77736
$$ plain form
32951 -2007 -415427 274440 1401687 1767118 1051819 -164721 -1305635 -2157166 -2708231
32942 -2708231 -3157259 -3761375 -4241466 -3787516 -2234644 -764696 -635688 -1517035 -2006985
32933 -2006985 -1690450 -1653697 -2734279 -4201897 -4721323 -3996396 -2837933 -1986777 -1532239
32924 -1532239 -1394725 -1765976 -2794506 -4061293 -4686942 -4121105 -2791048 -1771359 -1695628
32915 -1695628 -2161128 -2352989 -1987891 -1319022 -495602 475226 1183137 954323 -196564
32906 -196564 -1338089 -1727545 -1630057 -1560870 -1264554 -250396 965195 1181202 216631
32897 216631 -638485 -319044 624438 978315 640538 597067 1365677 2320377 2642307 2274140
32887 2274140 1736743 1483219 1602252 1773846 1443681 452385 -510561 -629675 -175192
$$ packed form
32951b007m13420O89867J127247L65431p15299j216540j140914q51531n51065
32942b708231m49028o04116m80091M53950J552872J469948J29008q81347m89950
32933b006985L16535L6753j080582j467618n19426P24927J158463Q51156M54538
32924a532239J37514l71251j028530j266787o25649N65837J330057J019689P5731
32915a695628m65500j91861L65098O68869Q23420R70828P07911k28814j150887
32906a96564j141525l89456R7488O9187K96316J014158J215591K16007r64571
32897B16631q55116L19441R43482L53877l37777m3471P68610R54700L21930l68167
32887B274140n37397k53524J19033J71594l30165r91296r62946j19114M54483
$$ plain form
32878 -175192 -285340 -1333565 -2297905 -2201101 -1443641 -1055414 -1238899 -1475349 -1635001 -2014432
32868 -2014432 -2417353 -2149633 -1088674 -36569 260497 -30509 -161711 333670 1204925
32859 1204925 1648576 979976 -517002 -1563408 -1202497 -37058 455194 -175125 -852219
32850 -852219 -565049 293146 644411 210516 -385363 -697365 -887788 -1047656 -773010 201256
32840 201256 1344996 1808941 1402820 607034 -285550 -1317696 -2011063 -1336590 705317
32831 705317 2269618 1667911 -176726 -699699 870961 2582512 2633933 1579142 825982
32822 825982 457029 -133631 -603641 -259781 430489 492926 145166 343310 995039 1162536
32812 1162536 808216 734846 892574 476178 -173627 350505 1993688 2611561 913019
$$ packed form
32878a75192j10148j048225r64340R6804P57460L88227j83485k36450j59652l79431
32868b014432m02921K67720J060959J052105K97066k91006j31202M95381Q71255
32859A204925M43651o68600j496978j046406L60911J165439M92252o30319o77094
32850h52219K87170Q58195L51265m33895n95879l12002j90423j59868K74646R74266
32840B01256J143740M63945m06121p95786q92584j032146o93367O74473K041907
32831G05317J564301o01707j844637n22973J570660J711551N1421j054791p53160
32822H25982l68953n90660m70010L43860O90270O2437l47760J98144O51729J67497
32812A162536l54320p3370J57728m16396o49805N24132J643183O17873j698542
$$ plain form
32803 913019 -1422447 -1874102 -321402 1180132 1204010 206216 -715251 -1074983 -939820
32794 -939820 -536403 -177484 -46564 90319 567338 1171592 1241636 559245 -219671 -317236
32784 -317236 155319 300193 -387684 -1285700 -1394993 -611124 217485 415061 81517 -469650
32774 -469650 -1153887 -1721433 -1646040 -884126 -140933 105537 215926 497936 446517 -368961
32764 -368961 -1311475 -1453847 -851512 -210941 183370 341604 -39650 -1010125 -1663469 -1116623
32754 -1116623 125260 796336 532212 -48418 -472249 -566026 43464 1405880 2581297
32745 2581297 2590223 1628848 388375 -1055488 -2461720 -2576732 -831236 985875 855014
32736 855014 -305886 56209 2062721 3263898 2582435 1677612 1894772 2457879 2520602
$$ packed form
32803I13019k335466m51655J552700J501534K3878r97794r21467l59732J35163
32794i39820M03417L58919J30920J36883M77019O04254P0044o82391p78916r7565
32784c17236M72555J44874o87877q98016j09293P83869Q28609J97576l33544n51167
32774d69650o84237n67546P5393P61914P43193K46470J10389K82010n1419q15478
32764c68961r42514j42372O02335O40571L94311J58234l81254r70475o53344N46846
32754a116623J241883O71076k64124n80630m23831r3777O09490J362416J175417
32745B581297Q926r61375j240473j443863j406232j15012J745496J817111j30861
32736H55014j160900L62095K006512J201177o81463r04823K17160N63107O2723
$$ plain form
32727 2520602 2603465 2930808 2522676 1136853 168905 423775 809449 428912 170420
32718 170420 921284 1892373 2110649 2057694 2415973 2542383 1573732 -95330 -1598891
32709 -1598891 -2712387 -3217358 -2500426 -812077 429186 572203 562538 983197 988102 216165
32699 216165 -152345 441765 695445 -78301 -268367 1294988 2836963 2220992 485917
32690 485917 264873 1793752 3016173 2882179 2129312 1315773 369812 -188098 358818
32681 358818 1414045 1654487 952266 280516 69352 -27359 -260533 -874809 -2225145
32672 -2225145 -3591190 -3134301 -623778 1219894 148541 -2196202 -2691710 -1331947
32664 -1331947 -586843 -1086286 -1199189 -633098 -1072173 -2747309 -3428081 -1852005 308855
$$ packed form
32727B520602Q2863L27343m08132j385823r67948K54870L85674l80537k58492
32718A70420P50864R71089K18276n2955L58279J26410r68651j669062j503561
32709a598891j113496n04971P16932J688349J241263J43017r665M20659M905p71937
32699B16165l68510N94110K53680p73746j90066J563355J541975o15971j735075
32690D85917k21044J528879J222421j33994p52867q13539r45961n57910N46916
32681C58818J055227K40442p02221o71750k11164r6711k33174o14276j350336
32672b225145j366045M56889K510523J843672j071353k344743m95508J359763
32664a331947P45104m99443j12903N66091m39075j675136o80772J576076K160860
$$ plain form
32655 308855 1027102 443894 -222713 -487966 -255287 791831 2366004 3304319 2978194
32646 2978194 2047648 1308061 788605 365229 196632 195806 71634 101375 802151 1724890
32636 1724890 1760133 805347 -52394 -169034 14230 68016 92809 10885 -447896 -930467
32626 -930467 -806625 -349822 -325888 -485183 61086 963778 842049 -338335 -826102 334166
32616 334166 1812063 1953720 1026528 546743 1180870 2178959 2484218 1873348 1141576
32607 1141576 1170243 1654199 1291245 -272561 -1567353 -1333646 -457749 -458972 -985336 -703623
32597 -703623 38870 -254691 -1337781 -1353888 -36168 706933 -29930 -757846 -273062
32588 -273062 474718 359288 -51049 36896 41293 -594179 -895550 28854 1018702 361485
$$ packed form
32655C08855P18247n83208o66607k65253K32679J047118J574173R38315l26125
32646B978194r30546p39587n19456m23376j68597q26j24172K9741P00776R22739
32636A724890L5243r54786q57741j16640J83264N3786K4793q1924m58781m82571
32626i30467J23842M56803K3934j59295N46269R02692j21729j180384m87767J160268
32616C34166J477897J41657r27192m79785O34127R98089L05259o10870p31772
32607A141576K8667M83956l62954j563806j294792K33707Q75897j223n26364K81713
32597g03623P42493k93561j083090j6107J317720P43101p36863p27916M84784
32588b73062P47780j15430m10337Q7945M397o35472l01371R24404R89848o57217
$$ plain form
32578 361485 -1379533 -1815509 103857 2785296 4014560 3259086 1660545 461584 -52052
32569 -52052 -249008 -291503 7650 493348 452418 -467593 -1594452 -2060930 -1899487 -1727028
32559 -1727028 -1811149 -2102773 -2635101 -3128235 -2836573 -1673206 -775194 -940918 -1316725
32550 -1316725 -833093 -29423 59540 -56267 744227 1878385 1743830 392048 -493261
32541 -493261 -117957 837492 1919755 3137833 3671031 2573461 830294 495323 1600586
32532 1600586 2139990 1352321 671541 991860 1390429 1239087 1260002 1642374 1345008 252679
32522 252679 -85771 1068135 2402454 2806057 2866902 3052601 2481234 861039 -267128
32513 -267128 229942 1205744 1072190 46929 -814479 -1384525 -1846010 -1672091 -687086
$$ packed form
32578C61485j741018m35976J919366K681439J229264p55474j598541j198961n13636
32569e2052j96956m2495K99153M85698m0930r20011j126859m66478J61443J72459
32559a727028q4121k91624n32328m93134K91662J163367Q98012j65724l75807
32550a316725M83632Q03670Q8963j15807Q00494J134158j34555j351782q85309
32541d93261L75304R55449J082263J218078N33198j097570j743167l34971J105263
32532A600586N39404p87669o80780L20319L98569j51342K0915L82372k97366j092329
32522B52679l38450J153906J334319M03603O0845J85699n71367j620195j128167
32513b67128M97070R75802j33554j025261q61408n70046m61485J73919R85005
$$ plain form
32504 -687086 33227 -319784 -967679 -945572 -610700 -510104 -43881 1264520 2297251
$$ packed form
32504f87086P20313l53011o47895K2107L34872J00596M66223J308401J032731
$$ [...]
##END NTUPLES=NMR SPECTRUM
##END=
