##TITLE=31Pdec_39-2023
 CDCl3, 3000 sc
 14.7.2023
##JCAMPDX= 6.0         $$ Bruker NMR JCAMP-DX V2.0
##DATA TYPE= NMR SPECTRUM
##DATA CLASS= NTUPLES
##ORIGIN= UXNMR, Bruker Analytische Messtechnik GmbH
##OWNER= root
$$ XWIN-NMR		Version 3.5
$$ Fri Jul 14 13:38:00 2023 Russian Standard Time (UT+4h)  she@DPX200
##.OBSERVE FREQUENCY= 81.013821
##.OBSERVE NUCLEUS= ^31P
##.ACQUISITION MODE= SIMULTANEOUS
##.ACQUISITION SCHEME= undefined
##.AVERAGES= 38024
##.DIGITISER RES= 16
##SPECTROMETER/DATA SYSTEM= spect
##.PULSE SEQUENCE= zgpg30
##.SOLVENT NAME= CDCl3
##.SHIFT REFERENCE= (INTERNAL, CDCl3, 0, 248.564)
##AUDIT TRAIL= $$ (NUMBER, WHEN, WHO, WHERE, WHAT)
$$ ##TITLE= Audit trail, XWIN-NMR		Version 3.5
$$ ##JCAMPDX= 5.01
$$ ##ORIGIN= Bruker BioSpin GmbH
$$ ##OWNER= she
$$ F:/spectra/data/she/nmr/P31/1/pdata/1/auditp.txt
$$ ##AUDIT TRAIL=  $$ (NUMBER, WHEN, WHO, WHERE, WHAT)
(   1,<2023-07-14 06:37:17.09 +0400>,<she>,<DPX200>,
      <continue with go, POWCHK disabled, PULCHK disabled
       configuration hash MD5:
       00 E9 B6 7A A2 85 ED C7 34 08 36 98 17 FE 4E 26
       data hash MD5: 32K
       66 52 0E 4F 8A 0E 0A 52 8B 4C 53 72 BB 90 1D A6>)
(   2,<2023-07-14 13:36:09.68 +0400>,<she>,<DPX200>,
      <Start of raw data processing
       efp BC_mod = 2 LB = 5 FT_mod = 6 PKNL = 1 PHC0 = -10697.74 PHC1 = 40.28482 SI = 64K 
       data hash MD5: 64K
       DF 26 E5 24 F9 AE DB 7C 55 7D 5E 82 D1 FE 38 17>)
(   3,<2023-07-14 13:36:12.68 +0400>,<she>,<DPX200>,
      <abs ABSG = 5 
       data hash MD5: 64K
       BE 24 E3 DB 00 47 75 BE 77 D7 09 B5 9B A6 21 E5>)
(   4,<2023-07-14 13:36:42.65 +0400>,<she>,<DPX200>,
      <pk PHC0 = -11.95956 PHC1 = 0 
       data hash MD5: 64K
       D2 51 B2 92 80 50 32 EF 27 E1 87 E0 17 FE 52 1C>)
(   5,<2023-07-14 13:36:48.23 +0400>,<she>,<DPX200>,
      <abs ABSG = 5 
       data hash MD5: 64K
       48 3F DD A7 2D 98 19 AB 91 5A EF 07 DF F1 BE C1>)
$$ ##END=
$$ 
$$ hash MD5
$$ A3 C5 1A 53 ED CF 33 BB F5 39 0C CD 26 68 2A 15
##$RELAX= 
##$RELAX= 
##$RELAX= 
##$RELAX= 
##$RELAX= 
##$RELAX= 
##$RELAX= 
##$RELAX= 
##$RELAX= 
$$ Bruker specific parameters
$$ --------------------------
##$DU= <F:/spectra>
##$EXPNO= 1
##$NAME= <P31>
##$PROCNO= 1
##$TYPE= <nmr>
##$USER= <she>
##$AMP= (0..31)
100 100 100 100 100 100 100 100 100 100 100 100 100 100 100 100 100 100 
100 100 100 100 100 100 100 100 100 100 100 100 100 100 
##$AQSEQ= 0
##$AQ_mod= 1
##$AUNM= <au_zg>
##$AUTOPOS= <>
##$BF1= 81.014009
##$BF2= 200.13
##$BF3= 200.13
##$BF4= 200.13
##$BF5= 200.13
##$BF6= 200.13
##$BF7= 200.13
##$BF8= 200.13
##$BYTORDA= 1
##$CFDGTYP= 0
##$CFRGTYP= 5
##$CHEMSTR= <none>
##$CNST= (0..31)
1 1 145 1 1 1 1 1 1 1 1 1 1 1 1 1 1 1 1 1 1 1 1 1 1 1 1 1 1 1 1 1 
##$CPDPRG= <waltz16>
##$CPDPRG1= <>
##$CPDPRG2= <waltz16>
##$CPDPRG3= <>
##$CPDPRG4= <mlev>
##$CPDPRG5= <mlev>
##$CPDPRG6= <mlev>
##$CPDPRG7= <mlev>
##$CPDPRG8= <mlev>
##$CPDPRGB= <>
##$CPDPRGT= <>
##$D= (0..31)
0 1 0 0 0 0 0 0 0 0 0 0.03 2e-05 3e-06 0 0 0 0 0 0 0 0 0 0 0 0 0 0 0 0 
0 0 
$$ [...]
##$SUBNAM3= <"">
##$SUBNAM4= <"">
##$SUBNAM5= <"">
##$SUBNAM6= <"">
##$SUBNAM7= <"">
##$SUBNAM8= <"">
##$SUBNAM9= <"">
##$SW= 501.771253377433
##$SWIBOX= (0..15)
0 1 3 0 0 0 0 0 0 0 0 0 0 0 0 0 
##$SW_h= 40650.406504065
##$TD= 32768
##$TD0= 1
##$TE= 0
##$TE2= 300
##$TE3= 300
##$TEG= 300
##$TL= (0..7)
0 120 53 12 22 120 120 120 
##$TP= (0..7)
150 150 150 150 150 150 150 150 
##$TP07= 0
##$TPNAME0= <>
##$TPNAME1= <>
##$TPNAME2= <>
##$TPNAME3= <>
##$TPNAME4= <>
##$TPNAME5= <>
##$TPNAME6= <>
##$TPNAME7= <>
##$TPOAL= (0..7)
0.5 0.5 0.5 0.5 0.5 0.5 0.5 0.5 
##$TPOFFS= (0..7)
0 0 0 0 0 0 0 0 
##$TUNHIN= 0
##$TUNHOUT= 0
##$TUNXOUT= 0
##$USERA1= <user>
##$USERA2= <user>
##$USERA3= <user>
##$USERA4= <user>
##$USERA5= <user>
##$V9= 5
##$VALIST= <valist>
##$VCLIST= <CCCCCCCCCCCCCCC>
##$VD= 0
##$VDLIST= <DDDDDDDDDDDDDDD>
##$VPLIST= <PPPPPPPPPPPPPPP>
##$VTLIST= <TTTTTTTTTTTTTTT>
##$WBST= 1024
##$WBSW= 4
##$XGAIN= (0..3)
0 0 0 0 
##$XL= 0
##$YL= 0
##$YMAX_a= 371158
##$YMIN_a= -1125847
##$ZGOPTNS= <>
##$ZL1= 120
##$ZL2= 120
##$ZL3= 120
##$ZL4= 120
##$ABSF1= 248.5645
##$ABSF2= -253.2056
##$ABSG= 5
##$ABSL= 3
##$ALPHA= 0
##$AQORDER= 0
##$ASSFAC= 0
##$ASSFACI= 0
##$ASSFACX= 0
##$ASSWID= 0
##$AUNMP= <proc_1d>
##$AZFE= 0.1
##$AZFW= 0.5
##$BCFW= 0
##$BC_mod= 2
##$BYTORDP= 0
##$COROFFS= 0
##$CY= -3
##$DATMOD= 1
##$DC= 0
##$DFILT= <>
##$DTYPP= 0
##$F1P= 0
##$F2P= 0
##$FCOR= 1
##$FTSIZE= 65536
##$FT_mod= 6
##$GAMMA= 0
##$GB= 0
##$INTBC= 1
##$INTSCL= 6.047779e-11
##$ISEN= 30
##$LB= 5
##$LEV0= 0
##$LPBIN= 0
##$MAXI= 10000
##$MC2= 0
##$MEAN= 0
##$ME_mod= 0
##$MI= 50
##$NCOEF= 0
##$NC_proc= -5
##$NLEV= 6
##$NOISF1= 182.463
##$NOISF2= 159.3651
##$NSP= 0
##$NTH_PI= 0
##$NZP= 0
##$OFFSET= 248.5645
##$PC= 4
##$PHC0= -10709.7
##$PHC1= 40.28482
##$PH_mod= 1
##$PKNL= yes
##$PPARMOD= 0
##$PSCAL= 0
##$PSIGN= 0
##$REVERSE= no
##$SF= 81.0140089999694
##$SI= 65536
##$SIGF1= 159.3651
##$SIGF2= -187.1042
##$SINO= 113.3802
##$SIOLD= 16384
##$SREGLST= <1H.CDCl3>
##$SSB= 0
##$STSI= 65536
##$STSR= 0
##$SW_p= 40650.406504065
##$SYMM= 0
##$S_DEV= 0
##$TDeff= 32768
##$TDoff= 0
##$TI= <>
##$TILT= no
##$TM1= 0
##$TM2= 0
##$TOPLEV= 0
##$USERP1= <user>
##$USERP2= <user>
##$USERP3= <user>
##$USERP4= <user>
##$USERP5= <user>
##$WDW= 1
##$XDIM= 65536
##$YMAX_p= 390489485
##$YMIN_p= -55171852
$$ End of Bruker specific parameters
$$ ---------------------------------
##NTUPLES= NMR SPECTRUM
##VAR_NAME=  FREQUENCY,     SPECTRUM/REAL,   SPECTRUM/IMAG
##SYMBOL=    X,             R,               I
##VAR_TYPE=  INDEPENDENT,   DEPENDENT,       DEPENDENT
##VAR_FORM=  AFFN,          ASDF,            ASDF
##VAR_DIM=   65536,         65536,           65536
##UNITS=     HZ,            ARBITRARY UNITS, ARBITRARY UNITS
##FACTOR=    0.620285442955139, 1,           1
##FIRST=     20137.2065510682, 0,            0
##LAST=      -20513.1999529968, 0,           0
##MIN=       -20513.1999529968, -55171852,   0
##MAX=       20137.2065510682, 390489485,    0
$$ Real data points
##PAGE= N=1
##DATA TABLE= (X++(R..R)), XYDATA
$$ [...]
36094A3719345q07773j431501k146620k573192k638768k349044j653361p58917
36086f39831j91647j39336J6939J012409K590107L545970K976445J155982q76444
36077I450594k226762k523330j834174o04619M87626R76619R42053P59846O05709
36068F033562M02257J81737K07463O30716J208507J523978J437174J206401J175831
36059A4007626J437171J816465K086184K081924J664072P63086m32851j488649
36051B1935028k135074k627176l441375m547623n221567m764868l265554j434136
36043e502345K01415J649480L024192M127274M676761M729274M556587M147563
36035B1610201L141715J361906p98098k662563l800037m113067l582472k230415
$$ y = [13719345, 12911572, 11480071, 9333451, 6760259, 4121491, 1772447, 119086, -639831, -831478, -970814, -953875, 58534, 2648641, 6194611, 9171056, 10327038, 9450594, 7223832, 4700502, 2866328, 2261709, 2749335, 3725954, 4668007, 5427853, 6033562, 6435819, 6617556, 6825019, 7455735, 8664242, 10188220, 11625394, 12831795, 14007626, 15444797, 17261262, 19347446, 21429370, 23093442, 23856528, 23423677, 21935028, 19799954, 17172778, 13731403, 9183780, 3962213, -802655, -4068209, -5502345, -5300930, -3651450, -627258, 3500016, 8176777, 12906051, 17462638, 21610201, 24751916, 26113822, 25315724, 22653161, 18853124, 14740057, 11157585, 8927170]
36027H927170l50125J487031K770112L265672K885791J613985k41263j917823
36019A8440550k661188k367770j594061q85726k52384O18973J759479K670273
36011A5728146K681953J518300m52893k417674l535954l349469k080997o37576
36003G453836m0733n12185j180361j006646J2221R22908J108735R88641J186698
35994H933114J542099J470853R57379N05647K13198l99631j491722k404208k343267
35985F983462j213362L93077J665514J901910Q77080p46901j733569j418234l64088
35976F344889M04574N49646M33413K59295k47664j298803k613960l665392m126351
35967c960353m041861l737859l539951l404395k901836j778703m26771M97479
$$ y = [8927170, 8577045, 10064076, 12834188, 16099860, 18985651, 20599636, 20358373, 18440550, 15779362, 13411592, 11817531, 10931805, 10679421, 11298394, 13057873, 15728146, 18410099, 19928399, 19475506, 17057832, 13521878, 10172409, 8091412, 7453836, 7413103, 6900918, 5720557, 4713911, 4726132, 5649040, 6757775, 7746416, 8933114, 10475213, 11946066, 12903445, 13409092, 13622290, 13222659, 11730937, 9326729, 6983462, 5770100, 6163177, 7828691, 9730601, 10607681, 9860780, 8127211, 6708977, 6344889, 6749463, 7299109, 7732522, 7991817, 7744153, 6445350, 3831390, 165998, -3960353, -8002214, -11740073, -15280024, -18684419, -21586255, -23364958, -23791729, -23294250]
35959b3294250Q59461J127115J671864K330005K730453K745059K480709K079332
35951g270252J692456J478650J467707J508940J406913J013640K31695q44744
35943F85005j769399j994858j408526m30731N02226J326653K115669K721386K877686
35934D625111K504655J721152P09487k16099n53761M5264J311503K397858K482427
35925A5027597J360402m36636j993557k580709k077954r29001K97549J246065
35917I913756J743588J706674J251099P22747L90785J84627q9191l84943n14953
35908A4924189n23009o43483q66621q72490n52722l56580q84920k219702l793518
35899D211144m846790m924707m079356k794746j662018r11874k21992Q70890K319134
$$ y = [-23294250, -22434789, -21307674, -19635810, -17305805, -14575352, -11830293, -9349584, -7270252, -5577796, -4099146, -2631439, -1122499, 284414, 1298054, 1529749, 685005, -1084394, -3079252, -4487778, -4918509, -4416283, -3089630, -973961, 1747425, 4625111, 7129766, 8850918, 9560405, 9344306, 8790545, 8835809, 10147312, 12545170, 15027597, 16387999, 15951363, 13957806, 11377097, 9299143, 8370142, 8667691, 9913756, 11657344, 13364018, 14615117, 15337864, 15728649, 15913276, 15824085, 15439142, 14924189, 14401180, 13757697, 12891076, 12018586, 11465864, 11109284, 10224364, 8004662, 4211144, -635646, -5560353, -9639709, -12434455, -14096473, -15008347, -15230339, -14359449, -12040315]
35890a2040315L447614L569755K653600J324537K87146j90298l19620m73030q04397
35881b545008j058111p44575L53927J799341K766136K822322K352227K053480
35873G799739K085632J929057J103680j89938j252952j554795j101684l12484
35865H506255K52340J29771p65940j966828k698496k466875j428627j98806O35677
35856a529Q43041N88369K90261L31932P20202J007570O87515k55962j243845j599073
35846A368481j139147k88250L19538L07505k76191j095955j765183k029491j865067
35837f463760j482555j197305j187753j318300j236920p11909J28443R23425J413688
35828a1132946J578415J477136J119572N95480K27681L96182J133083J964637
$$ y = [-12040315, -8592701, -5022946, -2369346, -1044809, -757663, -947961, -1267581, -1740611, -2545008, -3603119, -4347694, -3993767, -2194426, 571710, 3394032, 5746259, 7799739, 9885371, 11814428, 12918108, 12728170, 11475218, 9920423, 8818739, 8506255, 8758595, 8888366, 8122426, 6155598, 3457102, 990227, -438400, -637206, -1529, 841512, 1429881, 1720142, 2052074, 2772276, 3779846, 4467361, 4211399, 2967554, 1368481, 229334, -58916, 260622, 568127, 291936, -804019, -2569202, -4598693, -6463760, -7946315, -9143620, -10331373, -11649673, -12886593, -13598502, -13470059, -12546634, -11132946, -9554531, -8077395, -6957823, -6362343, -6134662, -5738480, -4605397, -2640760]
35820b640760K238986J643955M41836p48386j398152j376324r00390k44764M58764
35811b525235J143852J647792J753197J389574P02028q0088p27512r42147l91413
35802A970048R73901K629053L680815L524735K344618R58800J82951L11123J073845
35793A7649889J910874K251339J752572N39699p79318j567786j746600j791392
35785A8219277k069578k381114k315360j846116j295314q66010n76246n69493
35777F300046j014716j600155j595966p10303M31062R70472P51161K68474o4510
35768C735565k03228j84904l9756j0657m38433j289159k089328k452389k415102
35759e387391k156734j693032j046225m59536j58309j9536K79371Q49439J515856
$$ y = [-2640760, -401774, 1242181, 1684017, 935631, -462521, -1838845, -2739235, -2983999, -2525235, -1381383, 266409, 2019606, 3409180, 4111208, 4031120, 3303608, 2361461, 1970048, 2943949, 5573002, 9253817, 12778552, 15123170, 16081970, 16264921, 16576044, 17649889, 19560763, 21812102, 23564674, 24104373, 23325055, 21757269, 20010669, 18219277, 16149699, 13768585, 11453225, 9607109, 8311795, 7445785, 6869539, 6300046, 5285330, 3685175, 2089209, 1378906, 1809968, 2780440, 3531601, 3800075, 3735565, 3532337, 3347433, 3307677, 3297020, 2858587, 1569428, -519900, -2972289, -5387391, -7544125, -9237157, -10283382, -10742918, -10901227, -10920763, -10641392, -9791953, -8276097]
35750h276097K059878K293978J950043Q25930p98374k091726k272437j307206
35742g616011P8807J078476J409960J299190J061747Q44123O88979O49700P65004
35733B59975J012174J345785J711259J962019J843401J177731Q8574j002567j646298
35724F752053j697374j441280j346379j576816j760927j376027l84967O33204
35716b198513R98009M41850q38170k358254l496936l766765l171014k173246j230882
35707a7793921n65098m10377j025520k158921k927555k723575j989122j587975
35699c1182064j621683j444367o93284L84198J600289L045358M453403N107926
35691b0350224M788854M204177L968002L637543K386104L39718j396648j978651
$$ y = [-8276097, -6216219, -3922241, -1972198, -1146268, -1944642, -4036368, -6308805, -7616011, -7537204, -6458728, -5048768, -3749578, -2687831, -1843708, -1154729, -505029, 259975, 1272149, 2617934, 4329193, 6291212, 8134613, 9312344, 9400918, 8398351, 6752053, 5054679, 3613399, 2267020, 690204, -1070723, -2446750, -2831717, -2198513, -1200504, -758654, -1596824, -3955078, -7452014, -11218779, -14389793, -16563039, -17793921, -18359019, -18769396, -19794916, -21953837, -24881392, -27604967, -29594089, -31182064, -32803747, -34248114, -34941398, -34557200, -32956911, -29911553, -25458150, -20350224, -15561370, -11357193, -7389191, -3751648, -1365544, -1025826, -2422474, -4401125]
35683d401125j603408j075281r95766j397938j850016j855644j331374o55790
35675a5166342j36191L56815R89842J485739J475146J163408J115477J357926
35667g358180J198251J07803j593095l126289m015161m221218l792586k731709
35659b5532184j196765L89832J547611K072088K172672K221331K314493K207353
35651a3803569J816803J607922K141246L247010M008356L703298K506436J123073
35643F350575J0721q03175j374038j685898j807000j880373j876959j583542r65874
35634e615563l86118k78237o52600j075421j152012r10471o75768o90040r31356
35625a2367586j180395j134565n78730L28924R89014Q80389K54342O6955J022683
$$ y = [-4401125, -6004533, -7079814, -8075580, -9473518, -11323534, -13179178, -14510552, -15166342, -15302533, -14945718, -13955876, -12470137, -10994991, -9831583, -8716106, -7358180, -6159929, -6052126, -7645221, -10771510, -14786671, -19007889, -22800475, -25532184, -26728949, -26339117, -24791506, -22719418, -20546746, -18325415, -16010922, -13803569, -11986766, -10378844, -8237598, -4990588, -982232, 2721066, 5227502, 6350575, 6361296, 5558121, 4184083, 2498185, 691185, -1189188, -3066147, -4649689, -5615563, -6001681, -6279918, -6932518, -8007939, -9159951, -10070422, -10746190, -11436230, -12367586, -13547981, -14682546, -15261276, -14932352, -13943338, -13062949, -12808607, -12741652, -11718969]
35616a1718969K803444M374766M904897M246344K754787R93293m18573j031112
35608F908877q57833l73151j31736l86248j006895j645446j973856j870792j421333
35599b758413p36359J38415J051599J589508J284706L9182j709006l235400l944672
35590h280440l681827k801247j926240j527064j662381k057780k325682k152034
35582b6414695j514547q28032o52549j053459j384057r05000M49140K046428L182860
35573b7073911L607084L573066L520215L558376L173260J713555o30063k645249
35565a1203667l238060k527970j473171o96945j75200J55740J81405N0247K27574
35556a8700047R02805J752234K417141K801244K784834K151357J074096K75020
$$ y = [-11718969, -8915525, -4540759, 364138, 4610482, 7365269, 8358562, 7939989, 6908877, 6051044, 5677893, 5546157, 5159909, 4153014, 2507568, 533712, -1337080, -2758413, -3494772, -3356357, -2304758, -715250, 569456, 608638, -1100368, -4335768, -8280440, -11962267, -14763514, -16689754, -18216818, -19879199, -21936979, -24262661, -26414695, -27929242, -28757274, -29409823, -30463282, -31847339, -32752339, -32303199, -30256771, -27073911, -23466827, -19893761, -16373546, -12815170, -9641910, -7928355, -8558418, -11203667, -14441727, -16969697, -18442868, -19139813, -19315013, -19159273, -18977868, -18927621, -18700047, -17797242, -16045008, -13627867, -10826623, -8041789, -5890432, -4816336, -4541316]
35548d541316L54571J187520K202025L006291L532927L833019L987059M042221
35540A7604317L855707L187486K078520Q86395k07923j447370l049768m769330
35532A8138034o131726o893977p087451o846379o385680n890520n224590m025368
35524c0347657k304624o28403N85310J606984K845711M046621M520404M036373
35516a5639281L055235K167034J707970J851709K592923L523819L949328L385034
35508F593771J861249j64894j997519k956905k808864j968492j060972l32467
35500b835093K90774P15676O46349L9520p39210j275186j378856j016991k85726
35491e838743M87444R01118Q60717O24585M15749J59844l57963j226250k272769
$$ y = [-4541316, -4186745, -2999225, -797200, 2209091, 5742018, 9575037, 13562096, 17604317, 21460024, 24647510, 26726030, 27612425, 27404502, 25957132, 22907364, 18138034, 12006308, 5112331, -1975120, -8821499, -15207179, -21097699, -26322289, -30347657, -32652281, -33280684, -32695374, -31088390, -28242679, -24196058, -19675654, -15639281, -12584046, -10417012, -8709042, -6857333, -4264410, -740591, 3208737, 6593771, 8455020, 8290126, 6292607, 3335702, 526838, -1441654, -2502626, -2835093, -2544319, -1828643, -1182294, -1142774, -1881984, -3157170, -4536026, -5553017, -5838743, -5351299, -4450181, -3589464, -2964879, -2549130, -2389286, -2747249, -3973499, -6246268]
35482f246268l014868k815818j390291P78686K729426L785355L922606L490275
35474A239103K847401K257366J828812J458587J006540N42729K54515J75576K45992
35465A1856621N42659J094134J499174J166019N3315j182188j922649k161492
35457A0945593k209290k180004j993646j610367j023181k38760N31869R15737
35449C137951Q78619R77149J778785L091299M023938L820933K509069P85977n98417
35440B0405303j409690k005843k827659l791371m306576l941061k913066j852666
35432b642629j235345j128190j309534j511175j662723j945872k436575k703123
35424a6575166k105693o49140P92464J355507J035437M19556j04287m85721o23510
$$ y = [-6246268, -9261136, -12076954, -13467245, -12688559, -9959133, -6173778, -2251172, 1239103, 4086504, 6343870, 8172682, 9631269, 10637809, 11180538, 11435053, 11610629, 11856621, 12399280, 13493414, 14992588, 16158607, 16211922, 15029734, 13107085, 10945593, 8736303, 6556299, 4562653, 2952286, 1929105, 1690345, 2222214, 3137951, 4016570, 4993719, 6772504, 9863803, 13887741, 17708674, 20217743, 21003720, 20405303, 18995613, 16989770, 14162111, 10370740, 6064164, 2123103, -789963, -2642629, -3877974, -5006164, -6315698, -7826873, -9489596, -11435468, -13872043, -16575166, -18680859, -19329999, -18537535, -17182028, -16146591, -15727035, -15831322, -16317043, -16940553]
35415a6940553l93138m6117q0622n50799q48102l88613O66736J557084J715891
35406a5308233J348481J266220K117305L664830M851754M717077L241779J212147
35398G111360n97262j846438k364104j958318p52792N68550J234828J114243P51371
35389C261438O54797P40044N67687l8422q15525j448904j876112k111208k017296
35380c083501j520039r15482o11716n50116k43236M85807J158703J295905J128931
35371b854744J283152J880609K343323K106265J243656L50703K7750M82734J362391
35362H225839J875357J327074k41191j975526k876533k574947j487979l03089
35354A969005O35358J427804K153512K462984J860161L85900j261448k392111
$$ y = [-16940553, -17333691, -17379808, -17460430, -18011229, -18859331, -19247944, -18581208, -17024124, -15308233, -13959752, -12693532, -10576227, -6911397, -2059643, 2657434, 5899213, 7111360, 6514098, 4667660, 2303556, 345238, -407554, 160996, 1395824, 2510067, 3261438, 3916235, 4656279, 5223966, 5185544, 4370019, 2921115, 1045003, -1066205, -3083501, -4603540, -5519022, -6130738, -6680854, -6924090, -6438283, -5279580, -3983675, -2854744, -1571592, 309017, 2652340, 4758605, 6002261, 6352964, 6380714, 6863448, 8225839, 10101196, 11428270, 11187079, 9211553, 6335020, 3760073, 2272094, 1969005, 2604363, 4032167, 6185679, 8648663, 10508824, 10894724, 9633276, 7241165]
35346G241165k821236k560312j457472M06254K252693L153549L027364K585798
35338A1827803K272244J799720Q67203k34187j042104j522179j893238k185918
35330I889344k342518k489756k722665k801488k432040j709102r43347k05002
35322e756574N60373J076627Q94097P4870o97227q69892n87574l14732j42372
35313e762404K61350J088377J996469K354682J884081J052833P26191J276373
35305D877952K109023K294811J644159Q40039M10989l7950j194081k820498l679793
35296D444651k850660q27321R50588J520285J090373M13207j41471p17234j471579
35287B410839k292459k935342l118907k486358q63088J245432K716145K722846
$$ y = [7241165, 4419929, 1859617, 402145, 808399, 3061092, 6214641, 9242005, 11827803, 14100047, 15899767, 16766970, 16532783, 15490679, 13968500, 12075262, 9889344, 7546826, 5057070, 2334405, -467083, -2899123, -4608225, -5551572, -5756574, -5196201, -4119574, -3225477, -3150607, -3847834, -4717726, -5305300, -5620032, -5762404, -5501054, -4412677, -2416208, -61526, 1822555, 2875388, 3601579, 4877952, 6986975, 9281786, 10925945, 11765984, 12176973, 12139023, 10944942, 8124444, 4444651, 1593991, 766670, 1717258, 3237543, 4327916, 4741123, 4599652, 3882418, 2410839, 118380, -2816962, -5935869, -8422227, -9285315, -8039883, -5323738, -2600892]
35279b600892J520383Q9095q94659j457171j809431j883880j556032j009684n96741
35270a0199012m57122m92987o29526q72627j125152j169877r26516n99564m51780
35261a6924163m61412k93869L56726J428189K514352L201255L335040K987772
35253c856110K298705J459046P71664N29312P56991J159438J381081J271231Q90757
35244F662115L72695j47567n35453o88562n77587k61046R3954K36158J8786l67508
35234D805985m59698O9453J093820K135553K677659K374467J214379l03117j316645
35225A2291856j267097m60449K31052K34861l60473j264118k417087l781018n004823
35216a797296n640519n569872m926966l704148j820066L73091K051297K678330
$$ y = [-2600892, -1080509, -991414, -1886073, -3343244, -5152675, -7036555, -8592587, -9602271, -10199012, -10656134, -11149121, -11778647, -12651274, -13776426, -14946303, -15872819, -16472383, -16924163, -17385575, -17679444, -17322718, -15894529, -13380177, -10178922, -6843882, -3856110, -1557405, -98359, 673305, 1202617, 1959608, 3119046, 4500127, 5771358, 6662115, 7034810, 6887243, 6351790, 5663228, 5085641, 4824595, 4918549, 5154707, 5173493, 4805985, 4346287, 4415740, 5509560, 7645113, 10322772, 12697239, 13911618, 13608501, 12291856, 11024759, 10564310, 10795362, 11030223, 10669750, 9405632, 6988545, 3207527, -1797296, -7437815, -13007687, -17934653, -21638801, -23458867, -23085776, -21034479, -18356149]
35208a8356149K643956K861883L729286M665114M725646L570037J769445K37838
35200E847056n68062q98544j250811j765524k127705j979900j289129l08916O40854
35191c700681J265762J354834R89877O78217J041427K218268L600823M218199
35183A1666726L423133J328838j257826l316609m198369l906213k889790j659599
35175h09709o52863k73248o86586j463231j732736j005513K40366J043304J016078
35166d324138P08177Q98686J739411K663501K940634K195911N65657j404914l024145
35157B958780l830140l848865l453585k911006k089837o90284J215013K950333
35149i699591L683253L164952J958250Q58337J54230m29784j137178j749806j841582
$$ y = [-18356149, -15712193, -12850310, -9121024, -4455910, 269736, 3839773, 5609218, 5847056, 5278994, 4380450, 3129639, 1364115, -763590, -2743490, -4032619, -4341535, -3700681, -2434919, -1080085, -90208, 588009, 1629436, 3847704, 7448527, 11666726, 15089859, 16418697, 15160871, 11844262, 7645893, 3739680, 849890, -809709, -1462572, -1735820, -2422406, -3885637, -5618373, -6623886, -6383520, -5340216, -4324138, -3615961, -2717275, -977864, 1685637, 4626271, 6822182, 7387839, 5982925, 2958780, -871360, -4720225, -8173810, -11084816, -13174653, -13864937, -12649924, -9699591, -6016338, -2851386, -893136, -34799, 119431, -310353, -1447531, -3197337, -5038919]
35140e038919j310680n10844J01021L37524L22721K65879K32751J29369p9718
35131e550896j69614K03519J073471J965202K270826J825615J017105L49341M2754
35122C027323P8442M24407J016002J577373J716774J338251Q37593O92954Q61517
35113A1570636P79686O0952r82752j719573j987565k201773k634372k913234k465723
35104b493718j279248L9832Q85025J102860R06294O18834N22889O95878Q91301
35095A889947P50745J98015n35022j269597j974690k401529j989834m83659J519606
35086d296018K969355L253619K435608P54495j616467m187386n978646o155208
35078a2820648m790782k797439j130972j75225K26617L92185N01157N35564M41010
$$ y = [-5038919, -6349599, -6860443, -6759422, -6421898, -6099177, -5833298, -5600547, -5471178, -5550896, -5720510, -5516991, -4443520, -2478318, -207492, 1618123, 2635228, 2984569, 3027323, 3105765, 3530172, 4546174, 6123547, 7840321, 9178572, 10016165, 10709119, 11570636, 12350322, 12411274, 11428522, 9708949, 7721384, 5519611, 2885239, -27995, -2493718, -3772966, -3733134, -2848109, -1745249, -838955, -220121, 302768, 998646, 1889947, 2640692, 2838707, 2303685, 1034088, -940602, -3342131, -5331965, -5815624, -4296018, -1326663, 1926956, 4362564, 5117059, 3500592, -686794, -6665440, -12820648, -17611430, -20408869, -21539841, -21715066, -21488449, -21096264, -20595107, -20059543, -19618533]
35069a9618533L39112M86433R26450J285451J116830M58025j28583j26187M57468
35060a4803534J230307J873002K328219K650815K872963L048713L297666L689322
35052F187473M066833M033139L210013J619027j89803j508420k060999k190892
35044A3166371k419237k875432l198923k906858j801590j71230J251356J669098
35036B713555Q57042n45994j596840j934729j892226j720875j117364J80449J600268
35027c456714K018127Q92257j164945k993308l805187l455947k168708l30047
35019a4464472J526558K859649L427004L436387L319797L301821L167513K500582
35011I074839J200300k93561j372198j791497j728797j420932r87200n79669l87503
$$ y = [-19618533, -19279421, -18792988, -17866538, -16581087, -15464257, -15006232, -15134815, -15261002, -14803534, -13573227, -11700225, -9372006, -6721191, -3848228, -799515, 2498151, 6187473, 10254306, 14287445, 17497458, 19116485, 18926682, 17418262, 15357263, 13166371, 10747134, 7871702, 4672779, 1765921, -35669, -206899, 1044457, 2713555, 3570597, 3024603, 1427763, -506966, -2399192, -4120067, -5237431, -5056982, -3456714, -1438587, -546330, -1711275, -4704583, -8509770, -11965717, -14134425, -14464472, -12937914, -10078265, -6651261, -3214874, 104923, 3406744, 6574257, 9074839, 10275139, 9981578, 8609380, 6817883, 5089086, 3668154, 2680954, 2101285, 1713782]
35002A713782l73456k74293l2033K8778l16535p72411r06610p80623p97479r87991
34992c498871r03778l25357L23136N10071L04525L10774J038871K501980M245682
34983D507033N538330N692279M565919K837628J570220J344995J831453K193695
34975C0081552J828530P05099q48753k480732l866305m600267m360205l343926
34967A3114993k324565j928175j889558j390188k15995Q24278Q89111J67032m52716
34958F794217n55659n51306q88839j444174j860260k087410k271013k314165j867638
34949g046247p31066Q86989K463548L428476L452618K641252J455252L92700k51355
34940F692167m03553k12110p8765m47128j356019k286009k571675j907449m51107
$$ y = [1713782, 1340326, 1066033, 1034000, 1062778, 746243, -26168, -932778, -1713401, -2510880, -3498871, -4402649, -4728006, -4404870, -3894799, -3590274, -3279500, -2240629, 261351, 4507033, 10045363, 15737642, 20303561, 23141189, 24711409, 26056404, 27887857, 30081552, 31910082, 32615181, 31766428, 29285696, 25419391, 20819124, 16458919, 13114993, 10790428, 8862253, 6972695, 5582507, 5366512, 6190790, 7079901, 7246933, 6794217, 6238558, 5687252, 4798413, 3354239, 1493979, -593431, -2864444, -5178609, -7046247, -7777313, -6890324, -4426776, -998300, 2454318, 5095570, 6550822, 6943522, 6692167, 6288614, 6076504, 5997739, 5550611, 4194592, 1908583, -663092, -2570541, -3021648]
34931c021648J322128K738059L196498K661072J766370J157785Q11444K75076
34923A0906784n37511j168126j226174q25079l55653j50792m29002j178098j926510
34914C109839k009470j363000p95136j140987k298249l374043l642702l083245
34906a4596993k133996j298024r54027j167528j558009j564621r34602J57052
34898b4050748J392398K465813L006619K716199J726040N84643k29426n76849
34890a2965311l97431M47013J805754K992307L306451K766632K055264J771468
34882A782147J983783K466407L019712L427435L378989K706031J630368N80466
34874B0975338k46445r92868j754825k209686j811994m32348J297189K415126
$$ y = [-3021648, -1699520, 1038539, 4235037, 6896109, 8662479, 9820264, 10631708, 10906784, 10369273, 9201147, 7974973, 7149894, 6794241, 6643449, 6214447, 5036349, 3109839, 1100369, -262631, -1057767, -2198754, -4497003, -7871046, -11513748, -14596993, -16730989, -18029013, -18983040, -20150568, -21708577, -23273198, -24207800, -24050748, -22658350, -20192537, -17185918, -14469719, -12743679, -12159036, -12388462, -12965311, -13362742, -12915729, -11109975, -8117668, -4811217, -2044585, 10679, 1782147, 3765930, 6232337, 9252049, 12679484, 16058473, 18764504, 20394872, 20975338, 20728893, 19736025, 17981200, 15771514, 13959520, 13527172, 14824361, 17239487]
34866A7239487K411854J499674J87235j154444k231654k664492k242592j283930
34858A1761138m28383j8578J01164J52560P6412k49911p02909j065999j360911
34849H264583j766901k233637k397380j941765r22511K81782J213259J516665
34841B014095J068351Q5459r34482j521090j557672j317462j169244j207969j134382
34832e674396n40250N91670J677987J974759J341293M97452L87666J276294K527047
34823D059522L214687K822848J404006o34414k672286l958011l918732k589458
34815b271838o61939J008939J968349K277356K215115J969036J548482Q70046
34807H923546r3145j179109k043951k372777k131670j585364j019397m31263M70786
$$ y = [17239487, 19651341, 21151015, 21338250, 20183806, 17952152, 15287660, 13045068, 11761138, 11332755, 11314177, 11415341, 11567901, 11644313, 11394402, 10691493, 9625494, 8264583, 6497682, 4264045, 1866665, -75100, -997611, -715829, 497430, 2014095, 3082446, 3167905, 2233423, 712333, -845339, -2162801, -3332045, -4540014, -5674396, -6214646, -5622976, -3944989, -1970230, -628937, -131485, 256181, 1532475, 4059522, 7274209, 10097057, 11501063, 10866649, 8194363, 4236352, 317620, -2271838, -2933777, -1924838, 43511, 2320867, 4535982, 6505018, 8053500, 8923546, 8830401, 7651292, 5607341, 3234564, 1102894, -482470, -1501867, -1933130, -1462344]
34798a462344J894843L549641M661729M532891L131407J092329q41037k268833
34790A4290626l085686l282803l003493k602484k322736j929381r65178N44783
34782b356352J893396K350326J860035R61520K05474j60047j14605J86751L94125
34773E220623J91209l22808o36302l29184N02913J363150J755969J416402L34828
34764I496800j226200k765965l756371l870756l013786j290285Q67455K652703
34756b906405L315625K804898J815746J072287P11713M92950L62805M84503P99274
34747H953396R63111Q39716P66365J139660J918667K697474L083213K813493J713708
34738B4888803j19382k127850l581453m115602l828005k930652j631597l77934
$$ y = [-1462344, 432499, 3982140, 8643869, 13176760, 16308167, 17400496, 16559459, 14290626, 11204940, 7922137, 4918644, 2316160, -6576, -1935957, -2901135, -2356352, -462956, 1887370, 3747405, 4708925, 4914399, 4754352, 4639747, 4826498, 5220623, 5411832, 5089024, 4452722, 4123538, 4626451, 5989601, 7745570, 9161972, 9496800, 8270600, 5504635, 1748264, -2122492, -5136278, -6426563, -5559108, -2906405, 409220, 3214118, 5029864, 6102151, 6813864, 7306814, 7669619, 8154122, 8953396, 9916507, 10756223, 11522588, 12662248, 14580915, 17278389, 20361602, 23175095, 24888803, 24769421, 22641571, 19060118, 14944516, 11116511, 8185859, 6554262, 6176328]
34730F176328K09540p3084p13443j074604j174654j586011k585755l689941m128939
34721h640563l615995k539171j500325p87571k80613K31172P38751J068453J175676
34712a4150186J211895J234057J027753M26491k68625m55084J00621R38058J381830
34703h553190J244392R13386P91953Q11897N52257k46189j360279k249881k470037
34694a0565691j909262p25491P98141K285937L297335L520969L012093K169513
34686A883544J416806R20639O24391M73606M98450O49813O48352J43376q93237
34677F365740j983816k482524k148029j324898n40344k2330L24705N96860P11684
34668e02952N26694K505p39908j391516j507267q00719N02826J740689K371023
$$ y = [6176328, 6385868, 6312784, 5599341, 4524737, 3350083, 1764072, -821683, -4511624, -8640563, -12256558, -14795729, -16296054, -17083625, -17364238, -17133066, -16394315, -15325862, -14150186, -12938291, -11704234, -10676481, -10249990, -10518615, -10973699, -10873078, -9935020, -8553190, -7308798, -6395412, -5603459, -4791562, -4239305, -4485494, -5845773, -8095654, -10565691, -12474953, -13200444, -12402303, -10116366, -6819031, -3298062, -285969, 1883544, 3300350, 4220989, 4845380, 5318986, 5817436, 6467249, 7115601, 7258977, 6365740, 4381924, 1899400, -248629, -1573527, -2113871, -2136201, -1811496, -1214636, -502952, 23742, 26247, -713661, -2105177, -3612444, -4413163, -3910337, -2169648, 201375]
34659B01375K391582K132190J775595J267135O09443k6703n49604j075991j656761
34650E068261k043419j976718j649465j569518j833736j800842q09423Q20297
34642e794563J842137J328525k99931j685995j897265j183708m35482j72147j91621
34633h490050j0776N91821J445873K209191K647886K778799K785584K772451K621639
34624I352418K163619J471512Q66294N72933M61180K13881l10931r92805j675957
34615A2122144k321798k895606l249746l232304k822132k039495q34900O99776
34607d574061K022853K371267J539745K82669l68447k16155p3961p06720j785279
34598a508089k128870r60664J261749L303847M290958M305426L989154L767921
$$ y = [201375, 2592957, 4725147, 6500742, 7767877, 8377320, 8350617, 7801013, 6725022, 5068261, 3024842, 1048124, -601341, -2170859, -4004595, -5805437, -6614860, -5794563, -3952426, -2623901, -2923832, -4609827, -6507092, -7690800, -8126282, -8298429, -8490050, -8500826, -7909005, -6463132, -4253941, -1606055, 1172744, 3958328, 6730779, 9352418, 11516037, 12987549, 13853843, 14426776, 14887956, 15101837, 14790906, 13798101, 12122144, 9800346, 6904740, 3654994, 422690, -2399442, -4438937, -5273837, -4574061, -2551208, -179941, 1359804, 1642473, 1274026, 1057871, 983910, 277190, -1508089, -3636959, -4597623, -3335874, -32027, 4258931, 8564357, 12553511, 16321432]
34590A6321432L525712K898351J717786J62992j378701k500408k926646k679899
34582A5140619k176854k034981k601618l604313m311236m093218k860331j009787
34574g551719R40521K596520L657057L859994L138972J832536N99407O453J53749
34565I233490O47917Q54520K02898j519519l910831n986944o725623n804074l802517
34556a6810683j592211M57754K578547M931813P001437P810857O801125M471021
34548A5649660K097042P47557M88153N09362M0220q59037j428480j108918k05381
34539A5930178M35242L15653l47520j148584k049280l124953l958371l797818
34531B254547k482093q28399K22399O18705R95136J631628K126199K143879J946920
$$ y = [16321432, 19847144, 22745495, 24463281, 24626273, 23247572, 20747164, 17820518, 15140619, 12963765, 10928784, 8327166, 4722853, 411617, -3681601, -6541932, -7551719, -6611198, -4014678, -357621, 3502373, 6641345, 8473881, 9073288, 9079741, 9233490, 9881407, 10735927, 10938825, 9419306, 5508475, -478469, -7204092, -13008166, -16810683, -18402894, -17945140, -15366593, -10434780, -3433343, 4377514, 11178639, 15649660, 17746702, 18494259, 18982412, 19491774, 19531994, 18672957, 17244477, 16135559, 15930178, 16365420, 16681073, 16333553, 15184969, 13135689, 10010736, 6052365, 2254547, -227546, -1055945, -833546, -214841, 780295, 2411923, 4538122, 6682001, 8628921]
34522H628921J883810J771381J251823N29162J92578L12287K45698m57736j369926
34513A2987998j706064j252653m29824L82347J162778J909083K346581K109761
34505A7510007J039100p13853k640659l934166l976483l010118k086254k056921
34497A30653k722351l180055k858689j937268r10605j63158M6371l35197q87366
34488a2817665r01477j38903Q40146J409468J714367K373775L462258M273773
34480B15742M190564L375294K392383J482811N45892l58534q91047q34641l38059
34471I780405L11550R46590J454018J639663J338081O09414k88402j095464j633886
34462A3061969j754403j372503o43308n188J19226k49711n76058k94121N53259
$$ y = [8628921, 10512731, 12284112, 13535935, 14065097, 14257675, 14569962, 14815660, 14357924, 12987998, 11281934, 10029281, 9599457, 9981804, 11144582, 13053665, 15400246, 17510007, 18549107, 17835254, 15194595, 11260429, 7283946, 4273828, 2187574, 130653, -2591698, -5771753, -8630442, -10567710, -11478315, -11641473, -11595102, -11930299, -12817665, -13719142, -13858045, -13017899, -11608431, -9894064, -7520289, -4058031, 215742, 4406306, 7781600, 10173983, 11656794, 12202686, 11844152, 10953105, 10118464, 9780405, 10091955, 11038545, 12492563, 14132226, 15470307, 16079721, 15791319, 14695855, 13061969, 11307566, 9935063, 9291755, 9286567, 9405793, 9156082, 8580024, 8285903, 8839162]
34453H839162J206635Q21776p52433k846676m575194n455481n444687m614689
34445a2821587l067028j163962M28139J160258J091758Q86761J262662K368141
34437i854858L620616M170169L640301K472690J498805J181188J370978J762362
34429I862251K314464L063241L720938L757779K884601J299270m88289j895878
34421B4518377k438940k011942j114549n45409o70753j095982j187855q37555
34413A4615392n94780j088135k364284l747175m347175l819502k652820j630629
34405e629108j047612n96085P3127R81038J994898K955655L473961L023468J597668
34396F827010J1968q39601q86373p16867p00402p00229n67425m35788m52153n97763
$$ y = [8839162, 10045797, 10867573, 10115140, 7268464, 2693270, -2762211, -8206898, -12821587, -15888615, -17052577, -16624438, -15464180, -14372422, -13485661, -12222999, -9854858, -6234242, -2064073, 1576228, 4048918, 5547723, 6728911, 8099889, 9862251, 12176715, 15239956, 18960894, 22718673, 25603274, 26902544, 26414255, 24518377, 22079437, 20067495, 18952946, 18407537, 17736784, 16640802, 15452947, 14615392, 14020612, 12932477, 10568193, 6821018, 2473843, -1345659, -3998479, -5629108, -6676720, -7272805, -7199678, -6218640, -4223742, -1268087, 2205874, 5229342, 6827010, 6838978, 5999377, 5113004, 4396137, 3695735, 2995506, 2428081, 1992293, 1540140, 942377]
34386I42377q87596j430531k179894k884906l339075l372157k580433n46516K408898
34377a3869833N052644O177513N568160L856972J745902k50685j550731j630045
34369E099897o16328N64344R27224K98145o32358j061576p88024j85923L88166
34360C993567R44240J527511J789202J279290J99410n29537k18069P62357J343206
34351A1091177Q41387n15042k002093l051265l488775l386048k852542k003379
34343e366580j107808o36522r21970j705386k237697j980619j073747k7562Q20293
34334a4237598J393617J679379J702200J544960J187870N09206l55054r32088
34326g507508j018226j092453j675062k474736k718790k233393j581871j096167
$$ y = [942377, 54781, -1375750, -3555644, -6440550, -9779625, -13151782, -15732215, -16278731, -13869833, -8817189, -2639676, 2928484, 6785456, 8531358, 8280673, 6729942, 5099897, 4483569, 5047913, 5975137, 6273282, 5640924, 4579348, 3791324, 3605401, 3993567, 4937807, 6465318, 8254520, 9533810, 9733220, 9203683, 8985614, 9747971, 11091177, 11932564, 11417522, 9415429, 6364164, 2875389, -510659, -3363201, -5366580, -6474388, -7110910, -8032880, -9738266, -11975963, -13956582, -15030329, -15057891, -14237598, -12843981, -11164602, -9462402, -7917442, -6729572, -6220366, -6575420, -7507508, -8525734, -9618187, -11293249, -13767985, -16486775, -18720168, -20302039, -21398206]
34318b1398206m26236P25402K001259K865945L225760L201217K708749J754361
34310e341749Q58597O65037J216266J987986K518744K661049K385136J785638
34302H736704J205209Q96880N78865k14610j299810j864068j505064q05495n71172
34293E157439q37738j012224p90861n15042o34589j134424j556299j397921m71734
34284c193393R24077K105365K431077J797955P24370r5476l36468j91717p1855
34275D093935k13527n57321r05160j058790p68927K54734K003267L828569M746388
34266A1423168M280162K845634J130991o74174k692869m554170n320121m450345
34258A988276k513817o47636M97898R98935J054359O19651k53515j058620j106274
$$ y = [-21398206, -21824442, -21099040, -19097781, -16231836, -13006076, -9804859, -7096110, -5341749, -4483152, -3818115, -2601849, -613863, 1904881, 4565930, 6951066, 8736704, 9941913, 10838793, 11417658, 11203048, 9903238, 8039170, 6534106, 5728611, 5157439, 4319701, 3307477, 2516616, 2001574, 1366985, 232561, -1323738, -2721659, -3193393, -2269316, -163951, 2267126, 4065081, 4789451, 4693975, 4357507, 4165790, 4093935, 3880408, 3323087, 2417927, 1359137, 590210, 844944, 2848211, 6676780, 11423168, 15703330, 18548964, 19679955, 19005781, 16312912, 11758742, 6438621, 1988276, -525541, -1173177, -675279, 323656, 1378015, 1997666, 1744151, 685531, -420743]
34249d20743j44225J353663K470215K460449J307780j89646r90594o30793M81193
34240E697299J543974K021245J832503J153136K70770m40177o82741n03397k94609
34231A0598003m21265q43734j153923j012421n58618l41071p48774j502028j832924
34222B183245j256323p1797R93181J519748J592848J336595N81104p93310k305672
34213C779619k971761k141174k03330J690584K677594K858863K843124K789836
34205A1323355K234837R13626o09877j440255j308158p08925j51600L82523J169791
34196A1805317K238674L301839M001477M056769L316699J878060J28958j454751
34188B9273042k571772l136342l152550k657066j768345p17012K00962P35131
$$ y = [-420743, -564968, 788695, 3258910, 5719359, 7027139, 6837493, 5846899, 5216106, 5697299, 7241273, 9262518, 11095021, 12248157, 12518927, 12078750, 11396009, 10892612, 10598003, 10176738, 9333004, 8179081, 7166660, 6608042, 6266971, 5518197, 4016169, 2183245, 926922, 855125, 1848306, 3368054, 4960902, 6297497, 6878601, 6085291, 3779619, 807858, -1333316, -1536646, 153938, 2831532, 5690395, 8533519, 11323355, 13558192, 14471818, 13861941, 12421686, 11113528, 10404603, 10253003, 10635526, 11805317, 14043991, 17345830, 21347307, 25404076, 28720775, 30598835, 30727793, 29273042, 26701270, 23564928, 20412378, 17755312, 15986967, 15269955, 15470917, 16206048]
34180A6206048Q16060N85009K21579k30823p44492j046072p27476K34694J237733
34171A6552260J549824J020934J69642l82730m19318j27069J93078L45225L14237
34162A9216083K50752L48364O46442R26464Q36974J85625q37725j760057k256897
34153A7556025k515247l034224l953791m683613m389219k867554q14216Q03979
34145c897860J527993J546270J256345Q85299N12040K51658K49159M87603P04370
34136C522877N94123J30511l40231l88439O7516O35707Q28870N95993L92681O33495
34126F673103J146517J338031Q96009J30632m51405o89966p38833p24723p25335
34117F854030r31529j444320j925241j844785j175195m69910j00180J97462P41188
$$ y = [16206048, 17022108, 17607117, 17828696, 17597873, 16853381, 15807309, 15079833, 15314527, 16552260, 18102084, 19123018, 19292660, 18909930, 18490612, 18363543, 18556621, 18901846, 19216083, 19466835, 19815199, 20461641, 21388105, 22225079, 22410704, 21572979, 19812922, 17556025, 15040778, 12006554, 8052763, 3369150, -1020069, -3887623, -4701839, -3897860, -2369867, -823597, 432748, 1318047, 1830087, 2081745, 2330904, 2818507, 3522877, 4117000, 4247511, 3907280, 3518841, 3586357, 4222064, 5050934, 5646927, 6039608, 6673103, 7819620, 9157651, 10053660, 10184292, 9732887, 9042921, 8304088, 7579365, 6854030, 5922501, 4478181, 2552940, 708155, -467040, -936950, -1037130, -839668, -98480]
34108i8480J257169J278630R69678R83616J490902J876973J599455R30020N41438
34099A0829401O47224R30236J179617J546119K043901K137574J184008o91983
34091A9806097k406072k818652j845222n39319k7293m79446j192872j486047j262200
34082G748974p81500k46310K28286M82139M38212L33419O05717J455580K560687
34073A2825204L244612K933680J550825l95217k089940k910347k784256k118769
34065A0255792j388330p93204k80857J92613N08146M83566M2710p57612j782926
34056F479898k785546l361441l161859k288946j369471j033425j285418j507700
34048a0313908j131621k33277N70330P43506K91217l53330p93109r47490q96627
$$ y = [-98480, 1158689, 2437319, 3406997, 4390613, 5881515, 7758488, 9357943, 10287963, 10829401, 11476625, 12406861, 13586478, 15132597, 17176498, 19314072, 20498080, 19806097, 17400025, 14581373, 12736151, 12196832, 12169539, 11690093, 10497221, 9011174, 7748974, 6967474, 6721164, 6949450, 7431589, 7869801, 8203220, 8808937, 10264517, 12825204, 16069816, 19003496, 20554321, 20159104, 18069164, 15158817, 12374561, 10255792, 8867462, 8074258, 7793401, 7986014, 8494160, 8977726, 9020436, 8262824, 6479898, 3694352, 332911, -2828948, -5117894, -6487365, -7520790, -8806208, -10313908, -11445529, -11678806, -11108476, -10364970, -10073753, -10427083, -11220192, -12167682, -13064309]
34039a3064309o02066L4283Q34426J290837J020565J89900o52313j090927j056983
34030a3096587o41999L6252P68231J296880J535149J597969J556547J323421Q70874
34021d753263M09026K20200M09954Q95156J499861J965955K045848J777964J567308
34012F038009J787076K343863K807251K908801K705380K297506J685356R99319
34004B3572561O00627P06865J023534R90301M07544l58456q44920j006137j133436
33995B3958483j367671j497372j277905p67249j90520M27005J246901K170935
33987B2702607K616347J978859L50321j361022k132673j671490n86465J95229
33979B2091713J29149p29484j945091k914422k964039j660528O62393K845938
$$ y = [-13064309, -13666375, -13632092, -12797666, -11506829, -10486264, -10296364, -10948677, -12039604, -13096587, -13738586, -13702334, -12934103, -11637223, -10102074, -8504105, -6947558, -5624137, -4753263, -4344237, -4124037, -3714083, -2818927, -1319066, 646889, 2692737, 4470701, 6038009, 7825085, 10168948, 12976199, 15885000, 18590380, 20887886, 22573242, 23572561, 24173188, 24880053, 25903587, 26893888, 27301432, 26942976, 26098056, 25091919, 23958483, 22590812, 21093440, 19815535, 19048286, 18857766, 19284771, 20531672, 22702607, 25318954, 27297813, 27648134, 26287112, 24154439, 22482949, 21896484, 22091713, 22220862, 21491378, 19546287, 16631865, 13667826, 12007298, 12669691, 15515629]
33971A5515629L760205L297235K292400J455675P22983k08566j123103j489581
33963B4222877j266432j064444j447091k345155l217441l548404l131559k123710
33955F078641r69297j13258L40358N98887P97869Q39402O69430M59424L28191
33946I029647P9485n32699j377419k020992k167618j795459r09977N08839K189663
33937C003470L450782L654635K765142J343036K4575r06999j505643j906888k162482
33928G759628k235757k063458j642254j114094p30088o25917o23572l79382J99630
33919a455264P94071J034104R11863O55241K89866l60842j182183j608269j196240
33910b117653j59901R37750J866893K754919L492825L575477K741117J468865
$$ y = [15515629, 19275834, 22573069, 24865469, 26321144, 27044127, 26835561, 25712458, 24222877, 22956445, 21892001, 20444910, 18099755, 14882314, 11333910, 8202351, 6078641, 5109344, 4996086, 5336444, 5935331, 6733200, 7572602, 8242032, 8701456, 9029647, 9109132, 8576433, 7199014, 5178022, 3010404, 1214945, 304968, 813807, 3003470, 6454252, 10108887, 12874029, 14217065, 14241640, 13334641, 11828998, 9922110, 7759628, 5523871, 3460413, 1818159, 704065, -26023, -651940, -1275512, -1654894, -1455264, -661193, 372911, 1284774, 1940015, 2229881, 1869039, 686856, -921413, -2117653, -2277554, -1339804, 527089, 3282008, 6774833, 10350310, 13091427, 14560292]
33902A4560292N26529J31070j73330q25947j684908k218054k072140j321428k63288
33893F658796Q41204J800810K434094K625943K416906J911152J088909j40098
33885A9637716j623257k858465l376021l178466k664673k187852j870198j780563
33877I8221j981811k292961k249236j507309k03963J198213K309866K965193L141884
33868A478097K919303K436843J750432Q20613k29573j003601j209611j046364
33860E916139r40937r53764p50974j91802L72026N03758J42111m77433j130946
33851B488178j672697k013251k245691k601477k997100k761184j210049J407260
33843a1606011L803894M675496L743976J744643m25155k346246l960805n108606
$$ y = [14560292, 15086821, 15217891, 15044561, 14218614, 12533706, 10315652, 8243512, 6922084, 6658796, 7500000, 9300810, 11734904, 14360847, 16777753, 18688905, 19777814, 19637716, 18014459, 15155994, 11779973, 8601507, 5936834, 3748982, 1878784, 98221, -1883590, -4176551, -6425787, -7933096, -8137059, -6938846, -4628980, -1663787, 1478097, 4397400, 6834243, 8584675, 9405288, 9175715, 8172114, 6962503, 5916139, 4975202, 4021438, 3270464, 3078662, 3450688, 3954446, 4096557, 3619124, 2488178, 815481, -1197770, -3443461, -6044938, -9042038, -11803222, -13013271, -11606011, -7802117, -3126621, 617355, 2361998, 1936843, -409403, -4370208, -9478814]
33835i478814n373644m379411k163470P15158L355348M849844M709364L229469
33827d536156J446202M90801P86278J842718K818815L204481L002116K487626
33819A1542881J960459J591429J297776P84944j31041j236856k064469k292691
33811A1452432j894945r70525L23981J620311K350379K115214J015416m40080
33803A5572183j673554k271520k099753j402967p11567m25951m70815n02412m31218
33794E582426n24011r38315j386728j428447r61693k74320K72189M33011Q3637
33785H57749o96675j562049k158112k449177k564706k363068j521339j62480J007435
33776a1612422J456105J413435J400845J478140J367910J054566O92919O8790
$$ y = [-9478814, -14852458, -19231869, -21395339, -20680181, -17324833, -12474989, -7765625, -4536156, -3089954, -2599153, -1812875, 29843, 2848658, 6053139, 9055255, 11542881, 13503340, 15094769, 16392545, 17177489, 17046448, 15809592, 13745123, 11452432, 9557487, 8586962, 8910943, 10531254, 12881633, 14996847, 16012263, 15572183, 13898629, 11627109, 9527356, 8124389, 7412822, 6986871, 6516056, 6013644, 5582426, 5058415, 4120100, 2733372, 1304925, 343232, 68912, 341101, 774112, 857749, 161074, -1400975, -3559087, -6008264, -8572970, -10936038, -12457377, -12619857, -11612422, -10156317, -8742882, -7342037, -5863897, -4495987, -3441421, -2748502, -2679712]
33768b679712j136504k424593k517910p41065K015584M053803M296757K767080
33760C633440J82139k381343l763304l397619j828626j89227Q62113J440734J837628
33751c604065K053618J905455J212475j09110j760100k903795k782793j604483
33743g592798m00228J34054K64897N51830J019366J312550J327022J289392J386527
33734g07388J633496J985225K304806K314662J829434J016603L05337J17304P12888
33725A1512367K012672L366574L785885K778657Q72953r49991k227383l152446
33717A7999288l901656m246628l877550k782029j198432N63878K156689L261203
33709G974763L771642L804316L448845K630452J320412j80385j270972j430521
$$ y = [-2679712, -3816216, -6240809, -8758719, -9499784, -7484200, -3430397, 866360, 3633440, 3815579, 1434236, -2329068, -5726687, -7555313, -7744540, -6882427, -5441693, -3604065, -1550447, 355008, 1567483, 1458373, -301727, -3205522, -5988315, -7592798, -7993026, -7858972, -7594075, -7042245, -6022879, -4710329, -3383307, -2093915, -707388, 926108, 2911333, 5216139, 7530801, 9360235, 10376838, 10682175, 10799479, 11512367, 13525039, 16891613, 20677498, 23456155, 24329108, 23379117, 21151734, 17999288, 14097632, 9851004, 5973454, 3191425, 1992993, 2556871, 4713560, 7974763, 11746405, 15550721, 18999566, 21630018, 22950430, 22770045, 21499073, 20068552]
33701B0068552o55836M41269J086715J021205O82367O35285R22492J101747Q17641
33692B6121437J56888m95821p76288n69156j03772J96360Q9818l19867q94587
33683B3405012j724711k819912l739212l968942l630623l340107l267023k808331
33675a893849j455435L86484J789959K277409K074801J610782J191322J106799
33667G088272J587727K444921K998007K616865J323717k17420j255297j440331
33659A5146461q83402M6834Q99954J297407J182016R59287J160668J807309K262683
33650B3879217J906082Q25722l73714j307077k015443k496862k466812j748253
33642A6202860n95269N74742J561069K327642K792680K887614K677259K226621
$$ y = [20068552, 19412716, 19853985, 20940700, 21961905, 22644272, 23279557, 24202049, 25303796, 26121437, 26278325, 25782504, 25006216, 24437060, 24333288, 24529648, 24619466, 24299599, 23405012, 21680301, 18860389, 15121177, 11152235, 7521612, 4181505, 914482, -1893849, -3349284, -2962800, -1172841, 1104568, 3179369, 4790151, 5981473, 7088272, 8675999, 11120920, 14118927, 16735792, 18059509, 17842089, 16586792, 15146461, 14263059, 14309893, 15209847, 16507254, 17689270, 18648557, 19809225, 21616534, 23879217, 25785299, 26611021, 26237307, 24930230, 22914787, 20417925, 17951113, 16202860, 15607591, 16182333, 17743402, 20071044, 22863724, 25751338, 28428597, 30655218]
33634C0655218J466233L56519r31513k157381l217391m062159m536725m477569
33626A3095232l890428k919166j753779o53673J38993O60980J193644J776394
33618G648197J982400J441975L90296o12972j336963j900395k280411k227022
33610C105105j650612p15413M70587J892973L308750M258732M546126M451763
33602A9668011M391802M595703N116997N798756O156986N729820M776301M284302
33594F0518678M986111O600380Q300996R671220J0872493J2134093J3579407J5510214
33586A42173592J8328383K1943463K5616888K8759386L1643310L4606972L6125880
33579C39197874L2216914J9074697k714099k6794444m4833051n2315281n0759850
$$ y = [30655218, 32121451, 32477970, 31546457, 29389076, 26171685, 22109526, 17572801, 13095232, 9204804, 6285638, 4531859, 3878186, 4017179, 4678159, 5871803, 7648197, 9630597, 11072572, 11462868, 10849896, 9512933, 7612538, 5332127, 3105105, 1454493, 739080, 1209667, 3102640, 6411390, 10670122, 15216248, 19668011, 24059813, 28655516, 33772513, 39571269, 45728255, 51458075, 56234376, 60518678, 65504789, 72105169, 80406165, 90077385, 100949878, 113083971, 126663378, 142173592, 160501975, 182445438, 208062326, 236821712, 268465022, 303071994, 339197874, 371414788, 390489485, 387775386, 360980942, 316147891, 263832610, 213072760]
33572B13072760m4739230l7645882l0464775k3342406j6899813j1943829q770936
33565C9265889p088375o203884n180922l331089q94213J037048J562789Q49483
33557B0016726j48193o64153p01995q27356j553002k830697m020528m407792l793535
33548A069475k518938r83487O21366K083784L019181L195723K849262K432766
33540A1769132K130012J809275J363116Q35337K23228n64532j434678k001662
33532A4129228j952907j436274q95245n47850k32354J90325N10826M30304J6682
33523A0212735l26884l20906l7187L12251N75302O21349L76685J0196j73240j89090
33513A1061211m79271j346801k501843l408940l847930l819494l157165j737225
$$ y = [213072760, 168333530, 130687648, 100222873, 76880467, 59980654, 48036825, 39265889, 32177514, 25973630, 20792708, 17461619, 16567406, 17604454, 19167243, 20016726, 19868533, 19204380, 18502385, 17675029, 16122027, 13291330, 9270802, 4863010, 1069475, -1449463, -2432950, -1811584, 272200, 3291381, 6487104, 9336366, 11769132, 13899144, 15708419, 17071535, 17906872, 18130100, 17565568, 16130890, 14129228, 12176321, 10740047, 9844802, 9296952, 9064598, 9254923, 9765749, 10196053, 10212735, 9885851, 9564945, 9527758, 9840009, 10415311, 11036660, 11413345, 11423541, 11250301, 11061211, 10581940, 9235139, 6733296, 3324356, -523574, -4343068, -7500233, -9237458]
33505i237458K798J279765J800473J996331K354942K914564L495823L953303L994359
33496A2554900L229130J764727M00075j77807j64238k49057o93249j206779j573264
33487A3884438j916381k364165k852056l293339l616429l627009l183450k542993
33479i511384k157071k022372j617439o80131K98998O65051M48827K79068N48191
33470a3748262J005068J193901J012485P30763O54558R07382J405016J867028
33462d972061J909072J321448L15420o31374j251756j709908k254750k780754
33454a0054663k935852k628927k191249j957819j874454j637640j088916l50497
33446b4720017L27960P59823R62865J182168J622342K073816K026700J342492
$$ y = [-9237458, -9234660, -7954895, -6154422, -4158091, -1803149, 1111415, 4607238, 8560541, 12554900, 15784030, 17548757, 17948832, 17771025, 17606787, 17357730, 16664481, 15457702, 13884438, 11968057, 9603892, 6751836, 3458497, -157932, -3784941, -6968391, -9511384, -11668455, -13690827, -15308266, -15988397, -15689399, -15024348, -14575521, -14296453, -13748262, -12743194, -11549293, -10536808, -9806045, -9151487, -8244105, -6839089, -4972061, -3062989, -1741541, -1426121, -2057495, -3309251, -5019159, -7273909, -10054663, -12990515, -15619442, -17810691, -19768510, -21642964, -23280604, -24369520, -24720017, -24392057, -23632234, -22669369, -21487201, -19864859, -17791043, -15764343, -14421851]
33438a4421851O11256N71165J289632K171203K652302K595783K125669J477383
33430i27458J006124R21004Q96392L23171q61532j911268k087278j506249q99384
33421e046478o81760n55766j2208R89497J887584J999969J172296k7588q45319
33412a119773j066407j049792j059942q93803l32340L66613P68126Q64900R85999
33403b536419J151385R17494k1200j355723k437408k843850k541465j671336m15439
33394a1753961R32387J957433K346834K153907J759854J465647J139819M20573
33386D22493o93347j650561j903350j516916j021153p52455n88330l01717R3125
33377g912211M13725N22533L90283J22499r80L02191R66282J498651J363180M20093
$$ y = [-14421851, -13810595, -13239430, -11949798, -9778595, -7126293, -4530510, -2404841, -927458, 78666, 999670, 1896062, 2219233, 1357701, -553567, -2640845, -4147094, -5046478, -5728238, -6284004, -6296212, -5306715, -3419131, -1419162, -246866, -274454, -1119773, -2186180, -3235972, -4295914, -5189717, -5522057, -5155444, -4387318, -3522418, -2536419, -1385034, -467540, -488740, -1844463, -4281871, -7125721, -9667186, -11338522, -11753961, -10821574, -8864141, -6517307, -4363400, -2603546, -1137899, 1920, 422493, -270854, -1921415, -3824765, -5341681, -6362834, -7115289, -7703619, -8005336, -7912211, -7498486, -6975953, -6585670, -6463171, -6464151, -6161960, -5195678, -3697027, -2333847, -1913754]
33367a913754r66932k084159k155677q28988J390335L372951M279177M162742
33359E255695L563390K781815J878468J124726Q45129P40429l9661j782570l539370
33350A0828051m016032k978843j383800k36927K16595K05025q5592m69700o27439
33341A451338m49193l52430q69544j949278k958479l357950l098664k369033j321279
33332a5274512k01592N47653O05039J10124m84600q33866q48280n42445M0351
33323a6882128P29762J207255J189281O75843P2972K5939R20009K407265L566434
33314f087368L719369L034463K205545J679842J413921J229230J029967O81643
33306H906612J03690l55724k9085J254751K698984L266366K803170K112433J940120
$$ y = [-1913754, -2880686, -4964845, -7120522, -7949510, -6559175, -3186224, 1092953, 5255695, 8819085, 11600900, 13479368, 14604094, 15449223, 16189652, 16149991, 14367421, 10828051, 6812019, 3833176, 2449376, 2212449, 2429044, 2634069, 2548477, 2078777, 1451338, 1002145, 649715, -219829, -2169107, -5127586, -8485536, -11584200, -13953233, -15274512, -15476104, -14928451, -14323412, -14213288, -14697888, -15531754, -16380034, -16922479, -16882128, -16152366, -14945111, -13755830, -13079987, -13007015, -12981076, -12061067, -9653802, -6087368, -2367999, 666464, 2872009, 4551851, 5965772, 7195002, 8224969, 8906612, 9010302, 8654578, 8625493, 9880244, 12579228, 15845594, 18648764, 20761197, 22701317]
33297B2701317K223605K384221K001321J002798n26605k371587m042700m872182
33289A8500188m418355k801844o57694J255552K482206K977677K831842K030487
33281B2200059P03136m41848l28159J537874M469721P225251R151400J0461981
33273E4979415J1516465J2292160J2692907J2901040J2946194J2047233Q906206
33266A38281620K993198m503322j1191567j5081475j5799963j4380124j2063700
33259F8254667r466123o789656m394699k765073k013894j815946j893633k253462
33251C6862181k837524l266088l142949k412124j269604K221R15517Q42042l94417
33242B5299255k141504l485521m088779m183196l969036l495731l007413k814796
$$ y = [22701317, 24924922, 27309143, 29310464, 30313262, 29786657, 27415070, 23372370, 18500188, 14081833, 11279989, 10622295, 11877847, 14360053, 17337730, 20169572, 22200059, 22903195, 22461347, 22133188, 23671062, 28140783, 35366034, 44517434, 54979415, 66495880, 78788040, 91480947, 104381987, 117328181, 129375414, 138281620, 141274818, 136771496, 125579929, 110498454, 94698491, 80318367, 68254667, 58788544, 51998888, 47604189, 44839116, 42825222, 41009276, 39115643, 36862181, 34024657, 30758569, 27615620, 25203496, 23933892, 23936113, 24851630, 25693672, 25299255, 23157751, 19672230, 15583451, 11400255, 7431219, 3935488, 928075, -1886721]
33234a886721k745395k249856j239802l67894k33456o85215j154886j317151j136425
33225a3016801o27913J7668L01459j59796j126327j909827j965648j141171M14773
33216a9213583K246165L650672M143589L872711L354715K905913K578714K469074
33208F007970K665895K940692K899893K495851K045905J696184J210334L80013
33200B2342737o67209j661575k382121k570226k047060j148618p06956j240202
33192I918770k311817k993307k880297k403582k206377k483396k955588l272733
33184a1588327l318949l181732k889887k238143r79031P63200K386973L246562
33176a7799334L166123K486762J715196J216736J105112J202623J114297N51016
$$ y = [-1886721, -4632116, -6881972, -8121774, -8489668, -8723124, -9408339, -10563225, -11880376, -13016801, -13644714, -13627046, -13325587, -13485383, -14611710, -16521537, -18487185, -19628356, -19213583, -16967418, -13316746, -9173157, -5300446, -1945731, 960182, 3538896, 6007970, 8673865, 11614557, 14514450, 17010301, 19056206, 20752390, 21962724, 22342737, 21675528, 20013953, 17631832, 15061606, 13014546, 11865928, 11158972, 9918770, 7606953, 4613646, 1733349, -670233, -2876610, -5360006, -8315594, -11588327, -14907276, -18089008, -20978895, -23217038, -24196069, -23432869, -21045896, -17799334, -14633211, -12146449, -10431253, -9214517, -8109405, -6906782, -5792485, -5241469]
33168e241469l22572r61492r40440l32179M26022R13075Q79898J94525j049277
33159f433909k279873k609034j610260P7094J238508J297718Q05304N96272P77385
33150h140795Q57837O21847L44400J40558l48417j334591k306705k463424j588865
33141a4218155j85502J174704K295334L147542L581425L465374K944549K312524
33133D517795J630173O60958p10737k086726k749059k327429j214661k30015J12246
33124b397455q5098m90006j052978j971358l185935m112572m043904k838509j120646
33115b1298461K71825R96204J303277J516223J612912J392621Q93593M92566O40327
33106a2178913J562044L076310M549086N144986M396853K613758O45666p52212
$$ y = [-5241469, -5564041, -6525533, -7465973, -7798152, -7372130, -6459055, -5579157, -5384632, -6433909, -8713782, -11322816, -12933076, -12855982, -11617474, -10319756, -9514452, -8918180, -8140795, -7282958, -6661111, -6316711, -6176153, -6524570, -7859161, -10165866, -12629290, -14218155, -14403657, -13228953, -10933619, -7786077, -4204652, -739278, 2205271, 4517795, 6147968, 6808926, 6098189, 4011463, 1262404, -1065025, -2279686, -2509701, -2397455, -2482553, -2972559, -4025537, -5996895, -9182830, -13295402, -17339306, -20177815, -21298461, -21026636, -20030432, -18727155, -17210932, -15598020, -14205399, -13311806, -12819240, -12178913, -10616869, -7540559, -2991473, 2153513, 6550366, 9164124, 9809790, 9057578]
33098I057578j303465j176196q39180q73479j585042k694557l598102l988572
33090g001015m054728m096914m229125m479396m794036m754060l662448j301864
33082c8373586J540828L629741M286346L616318J960192l59514k680357l942123
33074c0322155l461624j666040K73814J548855K216065K627920K758385K369736
33066b3655044J600135R47696O75390O37569P92814J429046K577646L597057L805406
33057g592285L268463K433017J216291p60080k971827l886720k557004J81576
33049a0668569K589790L730868L835220L378802K531236J456084M98358j36064
33041G215725n45344q79872j216172j705856k479138l261810l404832k543765
$$ y = [9057578, 7754113, 6577917, 5738737, 4865258, 3280216, 585659, -3012443, -7001015, -11055743, -15152657, -19381782, -23861178, -28655214, -33409274, -37071722, -38373586, -36832758, -33203017, -28916671, -25300353, -23340161, -23699675, -26380032, -30322155, -33783779, -35449819, -35176005, -33627150, -31411085, -28783165, -26024780, -23655044, -22054909, -21107213, -20431823, -19794254, -19001440, -17572394, -14994748, -11397691, -7592285, -4323822, -1890805, -674514, -1434594, -4406421, -8293141, -10850145, -10668569, -8078779, -4347911, -512691, 2866111, 5397347, 6853431, 7351789, 7215725, 6670381, 5790509, 4574337, 2868481, 389343, -2872467, -6277299, -8821064]
33033h821064j112985m9889r476q51970j770261j911793j032166L71114J559378
33024a3629112K098811J893332R66770m71055j875548k676532k781923k508707
33016a8983964k028825j210627l9700J170904K114239K710603K860626K341971
33008a1064773J216480O5296n02354m31830q4191K93655O70669R77089J134749
32999g725210J298421J681584K077622J923906J048825R8367o4814P10385J769041
32990B818127K422386K548122K396810K123406J765268J516121J645140K052403
32982A9287783K175527J550423L51615q00273j492446j815292k076817k447277
32974A4733243k925584l482337m115219m784085n319055n420432m865007l794127
$$ y = [-8821064, -9934049, -9983938, -9993414, -10845384, -12615645, -14527438, -15559604, -15188490, -13629112, -11530301, -9636969, -8670199, -9141254, -11016802, -13693334, -16475257, -18983964, -21012789, -22223416, -22263116, -21092212, -18977973, -16267370, -13406744, -11064773, -9848293, -9782997, -10285351, -10717181, -10801372, -10507717, -9837048, -8859959, -7725210, -6426789, -4745205, -2667583, -743677, 305148, 403515, 338701, 1049086, 2818127, 5240513, 7788635, 10185445, 12308851, 14074119, 15590240, 17235380, 19287783, 21463310, 23013733, 23365348, 22565075, 21072629, 19257337, 17180520, 14733243, 11807659, 8325322, 4210103, -573982, -5893037, -11313469, -16178476, -19972603]
32966a9972603k681990j878018j269048n38690L68151J267247K111970L023163
32958a9569818L928690M474656M378753L641661K383123P92425o44512j237108
32950a852130p27352L17993J010728R74850N37493K21714K37691L93296L39392
32941A453675n2811m66302l92634K88347J110164J508009J355056R02930M06226
32932F112660N083k33563m56358j075927k354299l954460n157321n497502m977867
32923a7589554l777272k096601k81934J262243K378023L115843L374921K931776
32915a0682555J921629R08410K61049k09126p19230r55698m76335N03058J221014
32906h227784J303586J165597J328786J685084J712081J219116N43193K2531m08875
$$ y = [-19972603, -22654593, -24532611, -25801659, -26340349, -25972198, -24704951, -22592981, -19569818, -15641128, -11166472, -6787719, -3146058, -762935, 29490, -615022, -1852130, -2579482, -2261489, -1250761, -275911, 261582, 483296, 720987, 1114283, 1453675, 1400864, 934562, 541928, 830275, 1940439, 3448448, 4803504, 5706434, 6112660, 6117743, 5884180, 5427822, 4351895, 1997596, -1956864, -7114185, -12611687, -17589554, -21366826, -23463427, -23745361, -22483118, -20105095, -16989252, -13614331, -10682555, -8760926, -7852516, -7591467, -7800593, -8519823, -9475521, -9951856, -9448798, -8227784, -6924198, -5758601, -4429815, -2744731, -1032650, 186466, 729659, 752190, 343315]
32897C43315r19195j232298o98028R39649K985271M252553M141192L092523J909947
32888A4814929Q66291k65050j446272k077018j642325m27280O56825Q99263L01827
32879A1681190o37526j430970j870496j989610j915087j758429j582964j386354
32871h90246j019526j49684J474318L535764N066446N168529L906753K282259
32863A9374613J220631P50831K66697o47719j885990l123720m089281m522287
32855G343775m211721l279533k266091j731608j797710k162590k473871k547576
32847a3126925k290265j636355o77690K49321P62985P65943N30779M38838O64023
32838a4319346J104319J529627J725144J569962J133454P16573O49973R50946
$$ y = [343315, -575880, -1808178, -2506206, -1566557, 1418714, 5671267, 9812459, 12904982, 14814929, 15681220, 15416170, 13969898, 11892880, 10250555, 9823275, 10480100, 11379363, 11681190, 11043664, 9612694, 7742198, 5752588, 3837501, 2079072, 496108, -890246, -1909772, -2059456, -585138, 2950626, 8017072, 13185601, 17092354, 19374613, 20595244, 21346075, 21612772, 20965053, 19079063, 15955343, 11866062, 7343775, 3132054, -147479, -2413570, -4145178, -5942888, -8105478, -10579349, -13126925, -15417190, -17053545, -17731235, -17481914, -16718929, -15952986, -15422207, -14983369, -14319346, -13215027, -11685400, -9960256, -8390294, -7256840, -6540267, -5890294, -4939348]
32830d939348J255234J177381O87796P2811l84049n61980m20084O0298Q05857
32821b246084J626157K314212K748076K907286K830933K527435J886777P67172
32813A5361964p25087k109662k844776k790654k293192j842839j720902j871904
32805h37052j945509j521087n04167O89309J504605J766399J632391J137876J87377
32796B110142r22404j415776q00354N11128J626824K032163J741256Q59664m71067
32787E271576j697433j990529j094820K20857Q87189O11144j5726l93305n70537
32778A228416r50431j621739k235105k452804k270530j852923j247839l84966
32770a1787921P47193K023348L191947L892350L826898L104473K314234K033854
$$ y = [-4939348, -3684114, -2506733, -1818937, -1746126, -2130175, -2692155, -3112239, -3051941, -2246084, -619927, 1694285, 4442361, 7349647, 10180580, 12708015, 14594792, 15361964, 14636877, 12527215, 9682439, 6891785, 4598593, 2755754, 1034852, -837052, -2782561, -4303648, -4807815, -4118506, -2613901, -847502, 784889, 1922765, 2110142, 1187738, -228038, -1028392, -517264, 1109560, 3141723, 4882979, 5742643, 5271576, 3574143, 1583614, 488794, 709651, 1596840, 2207984, 2192258, 1798953, 1228416, 277985, -1343754, -3578859, -6031663, -8302193, -10155116, -11402955, -11787921, -11040728, -9017380, -5825433, -1933083, 1893815, 4998288, 7312522, 9346376]
32762I346376K280364K595782K574390K082756J103145k32264j442316j989294
32754A6318939j953578k040653k674245l420568l607164l181487k545342j787671
32746d891769o10274J014506K557940L395641L290850K442649J359936O60427
32738I219906O26937Q92947Q57562M25204r786l10053q19211j638883k182081
32729G062542j892130j132060q65250j497797k414141k697437k041362r16172
32721f393807p7827J3791n02886j026013j005076m14680K81564O10401M76188
32712h038345J29667j06714n6771K40685N77167P01033M67940o6057o65865j090701
32702g907961j361883j843301k866414m177126m934744m469806k974102j256852
$$ y = [9346376, 11626740, 14222522, 16796912, 18879668, 19982813, 19750549, 18308233, 16318939, 14365361, 12324708, 9650463, 6229895, 2622731, -558756, -3104098, -4891769, -5502043, -4487537, -1929597, 1466044, 4756894, 7199543, 8559479, 9219906, 9846843, 10739790, 11597352, 12022556, 12012770, 11702717, 10883506, 9244623, 7062542, 5170412, 4038352, 3173102, 1675305, -738836, -3436273, -5477635, -6393807, -6471634, -6457843, -6960729, -7986742, -8991818, -9406498, -9124934, -8514533, -8038345, -7908678, -8015392, -8072163, -7831478, -7254311, -6553278, -6085338, -6151395, -6817260, -7907961, -9269844, -11113145, -13979559, -18156685, -23091429, -27561235, -30535337, -31792189]
32694c1792189J06986J148546K081510K865406L340146L524189L538980L401249
32686a1785177L138423K988442L185801L572371L698479L332295K603139J621708
32678A2355481L29413j101925k083113k163819j557740p58379J60899J368055
32670F548872K482098K618727J498298L5930n93001k30618K86833K32687l47020
32661A2532806r92878j414269j598773j621055j504493j188597o35928p3098M835
32652C508550o41028j480434j566190n55283Q23877J469465R42322k58319j235970
32643A006990j348088n03869Q85781K195467K967530L126514K860872K333150
32635A3524347J528385L73873j015652k279434l112036l614911m133349m633783
$$ y = [-31792189, -31685203, -30536657, -28455147, -25589741, -22249595, -18725406, -15186426, -11785177, -8646754, -5658312, -2472511, 1099860, 4798339, 8130634, 10733773, 12355481, 12684894, 11582969, 9499856, 7336037, 5778297, 5019918, 5180817, 6548872, 9030970, 11649697, 13147995, 13183925, 12590924, 12360306, 12647139, 12879826, 12532806, 11539928, 10125659, 8526886, 6905831, 5401338, 4212741, 3576813, 3503715, 3508550, 2867522, 1387088, -179102, -734385, 89492, 1558957, 2501279, 2242960, 1006990, -341098, -844967, 40814, 2236281, 5203811, 8330325, 11191197, 13524347, 15052732, 15426605, 14410953, 12131519, 9019483, 5404572, 1271223, -3362560]
32627c362560m518510l375657j739063o50647m43570l85951L21768J567980K575877
32618a0010333K830193K474022J975891J690246J664659J669989J447900R94027
32610D736594M66408k05427j325419k901010m430200n466574o085630o448108
32602b1659366o202152m833983k510154r2381J676128K595603K697693K082863
32594b6245749J215424Q43831J247735J821066J712077P49557m34105j021017
32586b0111181n87024P16991K302626L536803M164060M312059M090456L412893
32578A837683K305048J119198K50674j54957o0998N90894J587483K304988K290098
32569A2070111J834984J528409J309238M89343j171965k891012l628374l138042
$$ y = [-3362560, -7881070, -11256727, -12995790, -13646437, -14090007, -14475958, -14154190, -12586210, -10010333, -7180140, -4706118, -2730227, -1039981, 624678, 2294667, 3742567, 4736594, 5203002, 4997575, 3672156, 771146, -3659054, -9125628, -15211258, -21659366, -27861518, -32695501, -35205655, -35298036, -33621908, -31026305, -28328612, -26245749, -25030325, -24186494, -22938759, -21117693, -19405616, -18656059, -19090164, -20111181, -20698205, -19981214, -17678588, -14141785, -9977725, -5665666, -1575210, 1837683, 4142731, 5261929, 5512603, 5357646, 5296648, 5887542, 7475025, 9780013, 12070111, 13905095, 15433504, 16742742, 17232085, 16060120, 13169108, 9540734, 6402692]
32561F402692k006877r22412k19047L0623j29392n34400r48904j163315r68132
32552d59164j57829J209284K585408L218082K752011J439781k11978j779934k887338
32543E708323l168974k551429j440381l74269M57038J132230J528640J304748
32535B595926M64712m04040p57464p79070j088232j804055k256450j751693l81004
32526f161370J085846J932285J983940J583934J323939J653191K432586K877799
32518H712150K229739N75696j180983k232382k559818k666117k891102l200402
32510c213219l448150l523284l260048k494829j321248j28791P21201J183676
32502a5484692J458777J746849K131844K575079K890740K798392K169496J256125
$$ y = [6402692, 4395815, 3473403, 3254356, 3284979, 3155587, 2621187, 1672283, 508968, -459164, -616993, 592291, 3177699, 6395781, 9147792, 10587573, 10375595, 8595661, 5708323, 2539349, -12080, -1452461, -1826730, -1369692, -237462, 1291178, 2595926, 3060638, 2656598, 1899134, 1120064, 31832, -1772223, -4028673, -5780366, -6161370, -5075524, -3143239, -1159299, 424635, 1748574, 3401765, 5834351, 8712150, 10941889, 11517585, 10336602, 8104220, 5544402, 2878285, -12817, -3213219, -6661369, -10184653, -13444701, -15939530, -17260778, -17389569, -16668368, -15484692, -14025915, -12279066, -10147222, -7572143, -4681403, -1883011, 286485, 1542610]
32494A542610N63711M22485P21215J094130J297546J317732J167466P60575Q0683
32485H968153o52208j152479j359524j361976j025841K7258J872006L867619N059485
32476A4242493M979175L866537K178067K10559j693352k926033k985563k054788
32468A5817095r81402o16896j233760k478113l644902l993201l138367j453674
32460a723220j9739J40896j038299k594039l433660l253427k534799j824098j266800
32451a7547185p97372m20757r0137M62573J434372K520759L073949K772661J937599
32442f653538J113201N37270J28567k06340m51463n70856n57457m40528l34691
32433g435835l71933m55381k03930O49016J831729K679752K701736J884066N12488
$$ y = [1542610, 2106321, 2528806, 3250021, 4344151, 5641697, 6959429, 8126895, 8887470, 8968153, 8315945, 7163466, 5803942, 4441966, 3416125, 3443383, 5315389, 9183008, 14242493, 19221668, 23088205, 25266272, 25476831, 23783479, 20857446, 17871883, 15817095, 14835693, 14218797, 12985037, 10506924, 6862022, 2868821, -269546, -1723220, -1742959, -1602063, -2640362, -5234401, -8668061, -11921488, -14456287, -16280385, -17547185, -18344557, -18765314, -18855451, -18392878, -16958506, -14437747, -11363798, -8591137, -6653538, -5540337, -5003067, -4874500, -5080840, -5532303, -6103159, -6660616, -7101144, -7435835, -7807768, -8263149, -8467079, -7818063, -5986334, -3306582, -604846, 1279220, 1791708]
32424A791708j072763k499992l355011l319514k335012o57314J171960K467651
32416g808287K738557K035638R35916J10379j30990L7545J59330j60938r50045
32407c032895j803897k173986j762428o43745R12709K591374L993308M625324
32399B705764M104762K449188J75661j932907l284627l794893l723986l224295
32391f525333k236210r06826J84752N47456L94813L78071P24948J000667P63204
32382e674458Q6592o77159j286720j570600j346629o79998N797L52529M25593
32373a0365053M36514L74404K28068K90971P40731J028826K73893j585275l459744
32364a2036665m168192l544795k306429j133090k18726M34152P08630N17772Q5686
$$ y = [1791708, 718945, -1781047, -5136058, -8455572, -10790584, -11447898, -10275938, -7808287, -5069730, -3034092, -2098176, -1987797, -2118787, -2081242, -1921912, -2082850, -3032895, -4836792, -7010778, -8773206, -9416951, -8504242, -5912868, -1919560, 2705764, 6810526, 9259714, 9435375, 7502468, 4217841, 422948, -3301038, -6525333, -8761543, -9668369, -9483617, -8936161, -8541348, -8163277, -7438329, -6437662, -5674458, -5587866, -6265025, -7551745, -9122345, -10468974, -11148972, -11143175, -10790646, -10365053, -9928539, -9554135, -9326067, -9035096, -8294365, -7265539, -6991646, -8576921, -12036665, -16204857, -19749652, -22056081, -23189171, -23407897, -22973745, -22265115, -21747343, -21661657]
32355b1661657q2292M56703J755092L433278M915065N712726N576910M531942
32347D637767K873233J083733l59489j151501j200542o61182m87J59959m72441
32338D909050j532406k324426k496545k260825j986552j794797j603508j357925
32330a0447934j070481p39751l56765M5547M02565O29657O16788L16952j17285
32321a0720707l88237l20760l8563J40650n3774o35995j236312j220974k03213
32312a4677885J439481K734821K959302K219313J118829N8004r16445j709482
32304f774062j984064j484554l72140R02617J989045K789505L269300L284442
32296A620089K732866J834200J059761O60316L93430j01297p75869j313846j754081
$$ y = [-21661657, -21743949, -21287246, -19532154, -16098876, -11183811, -5471085, 105825, 4637767, 7511000, 8594733, 8235244, 7083743, 5883201, 5222019, 5221532, 5381491, 4909050, 3376644, 1052218, -1444327, -3705152, -5691704, -7486501, -9090009, -10447934, -11518415, -12258166, -12614931, -12569384, -12166819, -11537162, -10920374, -10603422, -10720707, -11108944, -11429704, -11468267, -11327617, -11381391, -12017386, -13253698, -14474672, -14677885, -13238404, -10503583, -7544281, -5324968, -4206139, -4148135, -5064580, -6774062, -8758126, -10242680, -10614820, -9712203, -7723158, -4933653, -1664353, 1620089, 4352955, 6187155, 7246916, 7907232, 8300662, 8199365, 7423496, 6109650, 4355569]
32287D355569k558897l875039n070801n338399m572146l340915k151254j109130
32279b3661012k25305L85673P08241R01176J052146J128662J269625J787118K641441
32270a4012235L176466K725483J424913J76373k09905L08809J148911J756548
32262c504637K099198K573644L420356M246130M280843L182378J412879l06146
32254A7404645j689356k804191l518844l468190k573329j206441K64325J741755
32246D150374L038481L607992L005073J485295j61898j326825j883446j876502
32238A0038544j300790l48615L84274K39773r02369k423048l373621l140651j861983
32229b688486k97001P60467J045435Q58775N99590L49959o0836p10861j444882
$$ y = [4355569, 1796672, -2078367, -7149168, -12487567, -17059713, -20400628, -22551882, -23661012, -23886317, -23500644, -22792403, -21891227, -20839081, -19710419, -18440794, -16653676, -14012235, -10835769, -8110286, -6685373, -6509000, -6718905, -6410096, -5261185, -3504637, -1405439, 1168205, 4588561, 8834691, 13115534, 16297912, 17710791, 17404645, 15715289, 12911098, 9392254, 5924064, 3350735, 2144294, 2408619, 4150374, 7188855, 10796847, 13801920, 15287215, 15125317, 13798492, 11915046, 10038544, 8737754, 8389139, 8773413, 9013186, 8110817, 5687769, 2314148, -826503, -2688486, -2985487, -2225020, -1179585, -320810, 278780, 628739, 567903, -142958, -1587840]
32220a587840k049524k413842k449003j975002q68125O53433K037696K813556
32212e838651K954471K745782K363268J744434Q66071n9786p80775j268941j663988
32203A061885k032273k300730k371470k191989j758588j144906m75470K04943
32195a1008598R44816J675363K118544K064036J625647J047631L97946k98555
32187a433170p62846o59931o8211N88778J049797J257625R39467k26836j793025
32178a108352k513317j672521p0923Q70935P28761K12534r4204l71526q68706
32169d887319j296084j265125q81718n30059l36242j20765L50004J269912K646673
32160e050723L975912M372403L445191J911836R81475J187727K098994L024764
$$ y = [-1587840, -3637364, -6051206, -8500209, -10475211, -11343336, -10689903, -8652207, -5838651, -2884180, -138398, 2224870, 3969304, 4835375, 4775589, 3994814, 2725873, 1061885, -970388, -3271118, -5642588, -7834577, -9593165, -10738071, -11213541, -11008598, -10063782, -8388419, -6269875, -4205839, -2580192, -1532561, -1134615, -1433170, -2196016, -2855947, -2924158, -2335380, -1285583, -27958, 911509, 684673, -1108352, -3621669, -5294190, -5365113, -4494178, -3765417, -3552883, -3647087, -4018613, -4887319, -6183403, -7448528, -8330246, -8860305, -9196547, -9317312, -8967308, -7697396, -5050723, -1074811, 3297592, 6742783, 8654619, 9636094, 10823821, 12922815, 15947579]
32152A5947579L599375L720325L398503K855178K447870K275088K036438J444541
32144C7724897O06738j57477p15636j152197j524972j810167k039947k288067
32136B8643172k502292k515108k274579j944597j694091j445326r13078R1577
32128A5445678J408826K587509L213551L195477K717128J948199R17475k82013
32120C1151830j314062j818978j795547j593190j494579j469113j399132j357308
32112A8909921j489215j729618j839265j713103j499313j397153j442034j478995
32104F321225j244901n29117N71160J561804J921688J617757J075750N92816J4142
32095A1902324q82477j928590k729381l118936l173360k873842k087669r12731
$$ y = [15947579, 19546954, 23267279, 26665782, 29520960, 31968830, 34243918, 36280356, 37724897, 38331635, 38174158, 37458522, 36306325, 34781353, 32971186, 30931239, 28643172, 26140880, 23625772, 21351193, 19406596, 17712505, 16267179, 15354101, 15445678, 16854504, 19442013, 22655564, 25851041, 28568169, 30516368, 31433843, 31151830, 29837768, 28018790, 26223243, 24630053, 23135474, 21666361, 20267229, 18909921, 17420706, 15691088, 13851823, 12138720, 10639407, 9242254, 7800220, 6321225, 5076324, 4547207, 5118367, 6680171, 8601859, 10219616, 11295366, 11888182, 11902324, 11019847, 9091257, 6361876, 3242940, 69580, -2804262, -4891931, -5804662]
32087e804662K35088R77456J244930J160772Q84007O67514Q42233J523668K400415
32078D131421K955054K873361K205413J260184M47772P4126O7950o6221q10218
32069A3138842k048589l013572k918523j678309l1620J006095Q55169k82694j602353
32060C424446k199678j597583l2542J686411K733316K851403K434620K027830
32052A1328223J815462J632592J329510R54404O30571M17960K70811j6124p54463
32043A7608946k007183l254680l670856k881276j325049J99111J184233J571614
32035G424860J538614J353302J272914J321209J202771O16707l77465j435024
32027A2917888k279219k814342k998526k884502k799333l187769m085377m871107
$$ y = [-5804662, -5569574, -4592118, -3347188, -2186416, -1302409, -634895, 207338, 1731006, 4131421, 7086475, 9959836, 12165249, 13425433, 13873205, 13947331, 14015281, 13949060, 13138842, 11090253, 8076681, 5158158, 3479849, 3448229, 4454324, 5309493, 5026799, 3424446, 1224768, -372815, -405357, 1281054, 4014370, 6865773, 9300393, 11328223, 13143685, 14776277, 16105787, 17060191, 17690762, 18108722, 18379533, 18363409, 17608946, 15601763, 12347083, 8676227, 5794951, 4469902, 4669013, 5853246, 7424860, 8963474, 10316776, 11589690, 12910899, 14113670, 14730377, 14352912, 12917888, 10638669, 7824327, 4825801, 1941299, -858034, -4045803, -8131180, -13002287]
32019a3002287m743911l479601j639097k392J131161J990603K727300L010612
32011a4007612K473511J456910R03864J314636K060043K003116O75834j380321
32003d500019l274681m434975m697076m151566l070615j776599m46917Q41257
31995b5511191J862960K264634J943265J256827P51161P64178J297804K067292
31987a3303070K587223K432200J616863O30930l0600k74053k45315O2900Q07850
31978e715072J953088L146936L983432M267577M036626L477499K864485K438189
31970B0452760K237218K082980J782192J320850Q32397M11868R660m96971j170292
31961B7462662j968934k799374l546824m053605m161097l859749l367815k981609
$$ y = [-13002287, -17746198, -21225799, -22864896, -22867288, -21736127, -19745524, -17018224, -14007612, -11534101, -10077191, -9173327, -7858691, -5798648, -3795532, -3119698, -4500019, -7774700, -12209675, -16906751, -21058317, -24128932, -25905531, -26352448, -25511191, -23648231, -21383597, -19440332, -18183505, -17432344, -16668166, -15370362, -13303070, -10715847, -8283647, -6666784, -6035854, -6066454, -6340507, -6585822, -6522922, -5715072, -3761984, -615048, 3368384, 7635961, 11672587, 15150086, 18014571, 20452760, 22689978, 24772958, 26555150, 27876000, 28708397, 29120265, 29129925, 28632954, 27462662, 25493728, 22694354, 19147530, 15093925, 10932828, 7073079, 3705264, 723655]
31953G23655k847988k917235l049316l060790k720029j864247n68838Q80462K176330
31944a3247996L067927L345201K983125K318344J826101J614845J361860Q85080
31936D154487N46942Q57101J803347K788462L144854K563132J192737l97767j445448
31927A5207847j497573p64944J58387Q65452J270283J349574J108192P56300N20877
31918A8974395K09266o53993k084874l360093l702814l001593j660976n2920J554340
31909F220738K753286L127572K643960J657102N37163m97992j246498j500990
31901A3694341j210973n08146L99859J204646J493487J086731L74157n02J26893
31892A6660493K68100q9487r28973j840952k419107k397125j723324p64820k07858
$$ y = [723655, -2124333, -5041568, -8090884, -11151674, -13871703, -15735950, -16304788, -15424326, -13247996, -10180069, -6834868, -3851743, -1533399, 292702, 1907547, 3269407, 4154487, 4701429, 5558530, 7361877, 10150339, 13295193, 15858325, 17051062, 16653295, 15207847, 13710274, 12945330, 13103717, 13969169, 15239452, 16589026, 17697218, 18453518, 18974395, 19183661, 18529668, 16444794, 13084701, 9381887, 6380294, 4719318, 4666398, 6220738, 8974024, 12101596, 14745556, 16402658, 16939821, 16441829, 15195331, 13694341, 12483368, 11975222, 12375081, 13579727, 15073214, 16159945, 16534102, 16533600, 16660493, 16928593, 16839106, 15910133, 14069181, 11650074, 9252949, 7529625, 6764805, 6556947]
31883F556947m34029j084267j475352j343947r41499n22504p7704M41966R77097
31874B096708J517149K108963K564957K435265J525864K98196n17668o60265m39804
31865A0929365j21889M53871J445700K455282K786197K261509J442367Q86676
31857B2539078M81456k24191j254613k191158k868904l633185m729183n762630
31849B356670o029016n223770l663552j985611p94378l81123n09328n63875j18054
31840a6912037P23973J650967K552176L337107L609906K983264J669248L63797
31832b1599m58117p84787o66196p6251O92859R75307L86792p10088j599105j828377
31822d089562j301777j42626J197404J982916J807931J112319P51494J048118
$$ y = [6556947, 6122918, 5038651, 3563299, 2219352, 1277853, 755349, 677645, 1119611, 2096708, 3613857, 5722820, 8287777, 10723042, 12248906, 12547102, 12029434, 11369169, 10929365, 10807476, 11261347, 12707047, 15162329, 17948526, 20210035, 21652402, 22539078, 23020534, 22796343, 21541730, 19350572, 16481668, 12848483, 8119300, 2356670, -3672346, -8896116, -12559668, -14545279, -15339657, -15720780, -16230108, -16793983, -16912037, -16188064, -14537097, -11984921, -8647814, -5037908, -2054644, -385396, -21599, -479716, -1264503, -1930699, -2006950, -1314091, -338784, 48008, -662080, -2261185, -4089562, -5391339, -5533965, -4336561, -2353645, -545714, 566605, 1318099, 2366217]
31814B366217J507425J455353P48496j31165m99943j4642J024140J898836K109038
31805A0463755J737590J136791M58176k96546r49452j220514j086899p59744l10888
31796I172269L53711J094831J444517J075580J52607r13705j839513k437227k459623
31787E643447j789499p31557J52135N62347O65315P08027N54513k46070j887755
31778C630903l854194n129334m966913l528872j785866p61476p96416j437541
31770a8629709j955595j957360j542956r69882l16925M38908J155717J586736
31762b2191066J729981J875906K179658K376594K095895J310059K84821p70795
31754a1108947j738105k344298k206006j229659J89171J457345K216219K502865
$$ y = [2366217, 3873642, 5328995, 6077491, 5946326, 5446383, 5431741, 6455881, 8354717, 10463755, 12201345, 13338136, 13796312, 13499766, 12550314, 11329800, 10242901, 9483157, 9172269, 9525980, 10620811, 12065328, 13140908, 13293515, 12379810, 10540297, 8103070, 5643447, 3853948, 3122391, 3274526, 3836873, 4502188, 5210215, 5764728, 5518658, 3630903, -223291, -5352625, -10319538, -13848410, -15634276, -16395752, -17192168, -18629709, -20585304, -22542664, -24085620, -25055502, -25372427, -24933519, -23777802, -22191066, -20461085, -18585179, -16405521, -14028927, -11933032, -10622973, -10338152, -11108947, -12847052, -15191350, -17397356, -18627015, -18437844, -16980499, -14764280, -12261415]
31746a2261415K598832K725368K798709K493325J601281K67869j165912k381496
31738c323439l024196k691511j332743M21500J678685K068750J885665J525048
31730b792241J122254P28946M39290K33188L4494K1106M98238J315270J820239
31721C420784J645002J152882P82518L24365o64669j942546k611127k057720m95794
31712d46305J383595K888642L460493K834287J332164k56857j322757j852911
31704H020351k121712k165982j752387p55230O21025J983284K996535L477803
31696A0303687L340589K557704J252494k07368j351818j927060j995894j692665
31688A0279669j061463k56977L33925M77007M86110Q81662J651122K188814K045631
$$ y = [-12261415, -9662583, -6937215, -4138506, -1645181, -43900, 223969, -941943, -3323439, -6347635, -9039146, -10371889, -9950389, -8271704, -6202954, -4317289, -2792241, -1669987, -941041, -501751, -268563, -234069, -212963, 285275, 1600545, 3420784, 5065786, 6218668, 7001186, 7325551, 6660882, 4718336, 2107209, 49489, -446305, 937290, 3825932, 7286425, 10120712, 11452876, 11196019, 9873262, 8020351, 5898639, 3732657, 1980270, 1225040, 1846065, 3829349, 6825884, 10303687, 13644276, 16201980, 17454474, 17247106, 15895288, 13968228, 11972334, 10279669, 9218206, 8961229, 9295154, 9772161, 10258271, 11139933, 12791055, 14979869, 17025500]
31679A7025500J409089O99812J7656p71056j660686k538618l426872m349952n024612
31670A380261n009294m189931k863411j336707K47172J617874K296652K106202
31662e751182J558700J384125J699894J930711J581522Q26702K30792J11206L45046
31653C917516O27707O80600K95620n08846j267570j224174L5037K043014L635369
31644H234273L791175K417550L93407j165563j751369j647228j389226j228420
31636G654599j167824j258305j537524j751437j522745r30785o26885j120631
31628b261537k087744k608191k048466o01632R25362J726944J571929J002645
31620d380690Q74542J463666K103079J962403J128812N75187R86898J923971K302618
$$ y = [17025500, 18434589, 19134401, 19152057, 18381001, 16720315, 14181697, 10754825, 6404873, 1380261, -3629033, -7818964, -10682375, -12019082, -11771910, -10154036, -7857384, -5751182, -4192482, -2808357, -1108463, 822248, 2403770, 3230472, 3461264, 3572470, 3917516, 4545223, 5225823, 5521443, 5012597, 3745027, 2520853, 2555890, 4598904, 8234273, 12025448, 14442998, 14836405, 13670842, 11919473, 10272245, 8883019, 7654599, 6486775, 5228470, 3690946, 1939509, 416764, -514021, -1140906, -2261537, -4349281, -6957472, -9005938, -9607570, -8682208, -6955264, -5383335, -4380690, -3506148, -2042482, 60597, 2023000, 3151812, 3726999, 4713897, 6637868, 8940486]
31611H940486J495998j73791j801802k550857k140915j014462k6546K22636j90067
31602B760680p72026j186812j462913j780996k277777l006076l839969m373106
31594a5938995m114631k906253j077270Q24580K344834L198387L285278K787027
31586a1597043K129028J692491J574654J640495J671412J411901O94141k79162
31578a062083r23426q08167j58134M11818O16049O79311Q14692Q83133P20524
31569A173717M95113M79677O52230P82900P96437P83066P02984L32716m57880
31560E740960j505503k406170k681490k038689o74102P84806J870220K700232
31552A790264L546531M135376L849874K647829J255017K22467p50159k172104
$$ y = [8940486, 10436484, 10262693, 8460891, 5910034, 3769119, 2754657, 2728111, 2950747, 2760680, 1988654, 801842, -661071, -2442067, -4719844, -7725920, -11565889, -15938995, -20053626, -22959879, -24037149, -23212569, -20867735, -17669348, -14384070, -11597043, -9468015, -7775524, -6200870, -4560375, -2888963, -1477062, -782921, -1062083, -1985509, -2793676, -2951810, -2539992, -1923943, -1244632, -429940, 453193, 1173717, 1668830, 2148507, 2800737, 3583637, 4380074, 5163140, 5866124, 6198840, 5740960, 4235457, 1829287, -852203, -2890892, -3564994, -2780188, -909968, 1790264, 5336795, 9472171, 13322045, 15969874, 17224891, 17447358, 16697199, 14525095]
31544A4525095l774575m664023m367380l301920k184958j322342n74862K43005
31536e421960J107406J821007K192895K206615K028584J839496J704935J617242
31528I096220J519533J212208M42158o97610j593459j623521q37210R1068N67875
31519H177262N20005J53806m15631j147287j853891k159396j680991l12970J532716
31510B813623L017279L433209K744658J467881Q6260j168572k008211k016483
31502H369644j164341j47707J23749o60302k055114l361551m044611l795398k574248
31493i309879p31010J116989K475784L193961L306906K859488K001144J111339
31485F024722O21321O86328J118621J622683J990288K087622J836728J319084
$$ y = [14525095, 10750520, 6086497, 1719117, -1582803, -3767761, -5090103, -5664965, -5421960, -4314554, -2493547, -300652, 1905963, 3934547, 5774043, 7478978, 9096220, 10615753, 11827961, 12270119, 11572509, 9979050, 8355529, 7518319, 7609387, 8177262, 8697267, 8851073, 8435442, 7288155, 5434264, 3274868, 1593877, 1280907, 2813623, 5830902, 9264111, 12008769, 13476650, 13562910, 12394338, 10386127, 8369644, 7205303, 7057596, 7181345, 6521043, 4465929, 1104378, -2940233, -6735631, -9309879, -10040889, -8923900, -6448116, -3254155, 52751, 2912239, 4913383, 6024722, 6646043, 7332371, 8450992, 10073675, 12063963, 14151585, 15988313, 17307397]
31477A7307397P78093L63242p5589p86290j740010k625767l191441l372689l096934
31468C560012k303121j293825o78257o00405k96179J054844L076989M309626L709658
31459A0539342J665402n94061k128727k578209j877060l47851J057296J283735
31451G019867J99289j240314k067357k299522k636751l381959m048649m086124
31443a2541520l671156l494199l803996l929314k921444o06652K130409M081403
31435b4756469M616796L932736K686789J557118R98720J133589J731602K328094
31427e771025K452831J877694P81429l18879r34766r79148p00391k39711N62082
31418c269884J798748L104781L846167L677973K781594J624273O71421K85755
$$ y = [17307397, 18085490, 18448732, 18373143, 17586853, 15846843, 13221076, 10029635, 6656946, 3560012, 1256891, -36934, -715191, -1315596, -1611775, -556931, 2520058, 6829684, 10539342, 12204744, 11610683, 9481956, 6903747, 5026687, 4678836, 5736132, 7019867, 7219156, 5978842, 3911485, 1611963, -1024788, -4406747, -8455396, -12541520, -16212676, -19706875, -23510871, -27440185, -30361629, -30968281, -28837872, -24756469, -20139673, -16206937, -13520148, -11963030, -10964310, -9830721, -8099119, -5771025, -3318194, -1440500, -659071, -977950, -1912716, -2891864, -3592255, -3831966, -3269884, -1471136, 1633645, 5479812, 9157785, 11939379, 13563652, 14235073, 14520828]
31410A4520828O23920J471829K292849K594010K271098J576557P78676j15658
31402B6014109j293922k782358m182005m868503m534493l475851k286050j374538
31394A216389q73079q18366j125575j406716j141719j89909J021957J921211K260106
31385H64299K105871J578777P85121j01198q51886j223630r44324J09020J527247
31376C849297K402779K121898J070252K08251m0027r8423m14265q16868r41679
31367G341215q38646p21357m49178J36331M98714k42098k038745l573981l574452
31358c462197k094239j25818J661282L208489M333359M501019L551498K102594
31350A3675987Q63458j09569j110126k017533k318257j834432r98189k89818L04892
$$ y = [14520828, 15144748, 16616577, 18909426, 21503436, 23774534, 25351091, 26129767, 26014109, 24720187, 21937829, 17755824, 12887321, 8352828, 4876977, 2590927, 1216389, 343310, -475056, -1600631, -3007347, -4149066, -4338975, -3317018, -1395807, 864299, 2970170, 4548947, 5334068, 5232870, 4380984, 3157354, 2213030, 2322050, 3849297, 6252076, 8373974, 9444226, 9652477, 9612450, 9514027, 9099762, 8282894, 7341215, 6502569, 5781212, 5332034, 5468365, 5967079, 5724981, 3686236, 112255, -3462197, -5556436, -5682254, -4020972, -812483, 3520876, 8021895, 11573393, 13675987, 14539445, 14429876, 13319750, 11302217, 8983960, 7149528, 6151339, 5861521, 6166413]
31341F166413J129817K340225L672211M586067M560890L449315J716663J90694
31333B7812295o37386j002811j391013j787487j723581j110829o60610j158768
31325A8339810k445493l439991l252258k089515r80268p39048j303911j979872
31317B109454k163852j818468j357466j168410j261544j341052j161136p92318
31309h954792n75777q28858j515560k145380k095618j186755P3587R41004J118645
31300a5169504Q93151O81039O73297Q98590J296855J589721J383918O76362Q7927
31291f988644L33578J546506L284452M988972O152927O261137N082316L097682
31283B3758926J262243J74306l19434o71925j088976j509771j809320j853252
$$ y = [6166413, 7296230, 9636455, 13308666, 17894733, 22455623, 25904938, 27621601, 27812295, 27174909, 26172098, 24781085, 22993598, 21270017, 20159188, 19498578, 18339810, 15894317, 12454326, 9202068, 7112553, 6132285, 5393237, 4089326, 2109454, -54398, -1872866, -3230332, -4398742, -5660286, -7001338, -8162474, -8954792, -9530569, -10359427, -11874987, -14020367, -16115985, -17302740, -17229153, -16288149, -15169504, -14276353, -13595314, -12922017, -12023427, -10726572, -9136851, -7752933, -7076571, -6988644, -6655066, -5108560, -1824108, 3164864, 9317791, 15578928, 20661244, 23758926, 25021169, 25195475, 24876041, 24204116, 23115140, 21605369, 19796049, 17942797]
31275A7942797j606092j343743j490884k037242k362780j914853q90311Q863L38810
31266F644565J64665k77126p90014j140761j166861j065130j286435j990456k784382
31257c691935l120059k802210k020944j084276l02318P520l16140j049323j680422
31248a6060107j851459j651371j404838j237450r77822m77422J60179P85292J471320
31239b1243678K318141L018747K952908J901977M75277m32854n64216m75501q00839
31230a2850038j507635j921115j362346K58629K324950L884586M254385L451672
31222c466912K120861J006926M29958K03521r07k72113m68991n53082p56152j292443
31212c049334j965471k238918j757131o94396M50476J283467J671557J623099
$$ y = [17942797, 16336705, 14992962, 13502078, 11464836, 9102056, 7187203, 6296892, 6305755, 6644565, 6809230, 6532104, 5742090, 4601329, 3434468, 2369338, 1082903, -907553, -3691935, -6811994, -9614204, -11635148, -12719424, -13021742, -13014222, -13330362, -14379685, -16060107, -17911566, -19562937, -20967775, -22205225, -23183047, -23660469, -23500290, -22714998, -21243678, -18925537, -15906790, -12953882, -11051905, -10576628, -11009482, -11573698, -12049199, -12850038, -14357673, -16278788, -17641134, -17382505, -15057555, -11172969, -6918584, -3466912, -1346051, -339125, 90833, 294354, 293447, 21334, -447657, -1000739, -1756891, -3049334, -5014805, -7253723, -9010854, -9705250, -9254774, -7971307, -6299750, -4676651]
31204d676651J211346O22945J36588m6032N9264K87744N48904R39456J547758
31195F31322K130834K131871J183378m27411j915054k608711k346349j395006
31187b615126k16898P04490J060961Q49341K22557p18107j792045k537571k555397
31178g597795k104134j922033k265991k513785j998950r12043l0345J99484l5267
31169a9180859k91422j46156P34684K332193M066222N184390N376573M796773
31161B872398L650957K174700R49615P20123J666169L081920L901384L439109
31153B2456375J722895n73403k493581l397852l327428k690798j743503o53655
31145I299050J32661J52124l99932p68710n76238k08136q9398q3138N3867O7903
$$ y = [-4676651, -3465305, -2842360, -2705772, -2751804, -2692540, -2404796, -1855892, -916436, 631322, 2762156, 4894027, 6077405, 5649994, 3734940, 1126229, -1220120, -2615126, -2832024, -2127534, -1066573, -217232, 5325, -712782, -2504827, -5042398, -7597795, -9701929, -11623962, -13889953, -16403738, -18402688, -19314731, -19345076, -19145592, -19180859, -19472281, -19618437, -18883753, -16551560, -12485338, -7300948, -1924375, 2872398, 6523355, 8698055, 9647670, 10367793, 12033962, 15115882, 19017266, 22456375, 24179270, 23605867, 21112286, 17714434, 14387006, 11696208, 9952705, 9299050, 9431711, 9583835, 9183903, 8415193, 7838955, 7630819, 7541421, 7458283, 7512150, 7580053]
31135G580053m38989j296706j902780j988709j842886j783681j765020j567183
31127e005901j119309n46372n9842J47032K3203k76004n22334o14327n88788m77183
31117i039825k47076J13633N17687Q11085Q99618Q48789P86464O56450K18847
31108d434328n24177j049684p93769R8776Q51236R63124P20334O79751R71974
31099b516763J301173J348230R66727K46418l98259m60394J12350Q54902J460072
31090B914456K149927L065796L712146L554750K922626K685390L073171L369017
31082B7447279K821642J395010m14043j966689k564690j744669P3769J531296
31074B6578905J373905m05266k563203l646277l023860j189691P00408J653881
$$ y = [7580053, 7141064, 5844358, 3941578, 1952869, 109983, -1673698, -3438718, -5005901, -6125210, -6671582, -6731424, -6584392, -6561189, -6837193, -7359527, -7973854, -8562642, -9039825, -9286901, -9173268, -8655581, -7844496, -6944878, -6096089, -5309625, -4653175, -4434328, -4958505, -6008189, -6801958, -6703182, -5851946, -4888822, -4168488, -3488737, -2516763, -1215590, 132640, 1099367, 1345785, 947526, 487132, 599482, 1454384, 2914456, 5064383, 8130179, 11842325, 15397075, 18319701, 21005091, 24078262, 27447279, 30268921, 31663931, 31249888, 29283199, 26718509, 24973840, 25047609, 26578905, 27952810, 27547544, 24984341, 21338064, 18314204, 17124513, 17824921, 19478802]
$$ [...]
##END NTUPLES=NMR SPECTRUM
##END=
