##TITLE=31Pdec_36-2021
 CDCl3, 24 sc
 26.04.2021
##JCAMPDX= 6.0         $$ Bruker NMR JCAMP-DX V2.0
##DATA TYPE= NMR SPECTRUM
##DATA CLASS= NTUPLES
##ORIGIN= UXNMR, Bruker Analytische Messtechnik GmbH
##OWNER= root
$$ XWIN-NMR		Version 3.5
$$ Mon Apr 26 14:06:47 2021 Russian Standard Time (UT+4h)  she@DPX200
##.OBSERVE FREQUENCY= 81.013821
##.OBSERVE NUCLEUS= ^31P
##.ACQUISITION MODE= SIMULTANEOUS
##.ACQUISITION SCHEME= undefined
##.AVERAGES= 24
##.DIGITISER RES= 16
##SPECTROMETER/DATA SYSTEM= spect
##.PULSE SEQUENCE= zgpg30
##.SOLVENT NAME= D2O
##.SHIFT REFERENCE= (INTERNAL, D2O, 0, 248.564)
##AUDIT TRAIL= $$ (NUMBER, WHEN, WHO, WHERE, WHAT)
$$ ##TITLE= Audit trail, XWIN-NMR		Version 3.5
$$ ##JCAMPDX= 5.01
$$ ##ORIGIN= Bruker BioSpin GmbH
$$ ##OWNER= she
$$ F:/spectra/data/she/nmr/P31/1/pdata/1/auditp.txt
$$ ##AUDIT TRAIL=  $$ (NUMBER, WHEN, WHO, WHERE, WHAT)
(   1,<2021-04-26 14:05:35.09 +0400>,<she>,<DPX200>,
      <created by zg, POWCHK disabled, PULCHK disabled
       configuration hash MD5:
       00 E9 B6 7A A2 85 ED C7 34 08 36 98 17 FE 4E 26
       data hash MD5: 32K
       86 1F 6B E1 A1 C7 3A 5A 30 2E 8D E9 AD D7 3D C6>)
(   2,<2021-04-26 14:05:39.62 +0400>,<she>,<DPX200>,
      <Start of raw data processing
       efp BC_mod = 2 LB = 1 FT_mod = 6 PKNL = 1 PHC0 = -5298.318 PHC1 = 409.0017 SI = 64K 
       data hash MD5: 64K
       CC DC DE 6B D7 24 81 78 80 B4 84 08 1C 01 A9 FF>)
(   3,<2021-04-26 14:06:14.10 +0400>,<she>,<DPX200>,
      <pk PHC0 = 128.807 PHC1 = -243.8 
       data hash MD5: 64K
       7D C0 05 F9 1E B2 41 5B 53 58 2C D9 24 30 AC C2>)
(   4,<2021-04-26 14:06:19.64 +0400>,<she>,<DPX200>,
      <abs ABSG = 5 
       data hash MD5: 64K
       67 C5 08 5A C3 85 91 7F 0C C7 25 C1 67 B5 35 C2>)
$$ ##END=
$$ 
$$ hash MD5
$$ B0 A2 0E 78 EE 11 F5 89 BE 5F 96 BD B6 F2 28 6B
##$RELAX= 
##$RELAX= 
##$RELAX= 
##$RELAX= 
##$RELAX= 
##$RELAX= 
##$RELAX= 
##$RELAX= 
$$ Bruker specific parameters
$$ --------------------------
##$DU= <F:/spectra>
##$EXPNO= 1
##$NAME= <P31>
##$PROCNO= 1
##$TYPE= <nmr>
##$USER= <she>
##$AMP= (0..31)
100 100 100 100 100 100 100 100 100 100 100 100 100 100 100 100 100 100 
100 100 100 100 100 100 100 100 100 100 100 100 100 100 
##$AQSEQ= 0
##$AQ_mod= 1
##$AUNM= <au_zg>
##$AUTOPOS= <>
##$BF1= 81.014009
##$BF2= 200.13
##$BF3= 200.13
##$BF4= 200.13
##$BF5= 200.13
##$BF6= 200.13
##$BF7= 200.13
##$BF8= 200.13
##$BYTORDA= 1
##$CFDGTYP= 0
##$CFRGTYP= 5
##$CHEMSTR= <none>
##$CNST= (0..31)
1 1 145 1 1 1 1 1 1 1 1 1 1 1 1 1 1 1 1 1 1 1 1 1 1 1 1 1 1 1 1 1 
##$CPDPRG= <waltz16>
##$CPDPRG1= <>
##$CPDPRG2= <waltz16>
##$CPDPRG3= <>
##$CPDPRG4= <mlev>
##$CPDPRG5= <mlev>
##$CPDPRG6= <mlev>
##$CPDPRG7= <mlev>
##$CPDPRG8= <mlev>
##$CPDPRGB= <>
##$CPDPRGT= <>
##$D= (0..31)
0 1 0 0 0 0 0 0 0 0 0 0.03 2e-05 3e-06 0 0 0 0 0 0 0 0 0 0 0 0 0 0 0 0 
0 0 
##$DATE= 1619431534
##$DBL= (0..7)
120 120 120 11 120 120 24 19 
##$DBP= (0..7)
150 150 150 150 150 150 150 150 
##$DBP07= 0
##$DBPNAM0= <>
##$DBPNAM1= <>
##$DBPNAM2= <>
$$ [...]
##$SUBNAM3= <"">
##$SUBNAM4= <"">
##$SUBNAM5= <"">
##$SUBNAM6= <"">
##$SUBNAM7= <"">
##$SUBNAM8= <"">
##$SUBNAM9= <"">
##$SW= 501.771253377433
##$SWIBOX= (0..15)
0 1 3 0 0 0 0 0 0 0 0 0 0 0 0 0 
##$SW_h= 40650.406504065
##$TD= 32768
##$TD0= 1
##$TE= 0
##$TE2= 300
##$TE3= 300
##$TEG= 300
##$TL= (0..7)
0 120 53 12 22 120 120 120 
##$TP= (0..7)
150 150 150 150 150 150 150 150 
##$TP07= 0
##$TPNAME0= <>
##$TPNAME1= <>
##$TPNAME2= <>
##$TPNAME3= <>
##$TPNAME4= <>
##$TPNAME5= <>
##$TPNAME6= <>
##$TPNAME7= <>
##$TPOAL= (0..7)
0.5 0.5 0.5 0.5 0.5 0.5 0.5 0.5 
##$TPOFFS= (0..7)
0 0 0 0 0 0 0 0 
##$TUNHIN= 0
##$TUNHOUT= 0
##$TUNXOUT= 0
##$USERA1= <user>
##$USERA2= <user>
##$USERA3= <user>
##$USERA4= <user>
##$USERA5= <user>
##$V9= 5
##$VALIST= <valist>
##$VCLIST= <CCCCCCCCCCCCCCC>
##$VD= 0
##$VDLIST= <DDDDDDDDDDDDDDD>
##$VPLIST= <PPPPPPPPPPPPPPP>
##$VTLIST= <TTTTTTTTTTTTTTT>
##$WBST= 1024
##$WBSW= 4
##$XGAIN= (0..3)
0 0 0 0 
##$XL= 0
##$YL= 0
##$YMAX_a= 8245
##$YMIN_a= -8370
##$ZGOPTNS= <>
##$ZL1= 120
##$ZL2= 120
##$ZL3= 120
##$ZL4= 120
##$ABSF1= 248.5645
##$ABSF2= -253.2056
##$ABSG= 5
##$ABSL= 3
##$ALPHA= 0
##$AQORDER= 0
##$ASSFAC= 0
##$ASSFACI= 0
##$ASSFACX= 0
##$ASSWID= 0
##$AUNMP= <proc_1d>
##$AZFE= 0.1
##$AZFW= 0.5
##$BCFW= 0
##$BC_mod= 2
##$BYTORDP= 0
##$COROFFS= 0
##$CY= -3
##$DATMOD= 1
##$DC= 0
##$DFILT= <>
##$DTYPP= 0
##$F1P= 0
##$F2P= 0
##$FCOR= 1
##$FTSIZE= 65536
##$FT_mod= 6
##$GAMMA= 0
##$GB= 0
##$INTBC= 1
##$INTSCL= 5.30512e-09
##$ISEN= 30
##$LB= 1
##$LEV0= 0
##$LPBIN= 0
##$MAXI= 10000
##$MC2= 0
##$MEAN= 0
##$ME_mod= 0
##$MI= 50
##$NCOEF= 0
##$NC_proc= -4
##$NLEV= 6
##$NOISF1= 182.463
##$NOISF2= 159.3651
##$NSP= 0
##$NTH_PI= 0
##$NZP= 0
##$OFFSET= 248.5645
##$PC= 4
##$PHC0= -5169.511
##$PHC1= 165.2017
##$PH_mod= 1
##$PKNL= yes
##$PPARMOD= 0
##$PSCAL= 0
##$PSIGN= 0
##$REVERSE= no
##$SF= 81.014009
##$SI= 65536
##$SIGF1= 159.3651
##$SIGF2= -187.1042
##$SINO= 113.3802
##$SIOLD= 16384
##$SREGLST= <1H.CDCl3>
##$SSB= 0
##$STSI= 65536
##$STSR= 0
##$SW_p= 40650.406504065
##$SYMM= 0
##$S_DEV= 0
##$TDeff= 32768
##$TDoff= 0
##$TI= <>
##$TILT= no
##$TM1= 0
##$TM2= 0
##$TOPLEV= 0
##$USERP1= <user>
##$USERP2= <user>
##$USERP3= <user>
##$USERP4= <user>
##$USERP5= <user>
##$WDW= 1
##$XDIM= 65536
##$YMAX_p= 309151152
##$YMIN_p= -12774808
$$ End of Bruker specific parameters
$$ ---------------------------------
##NTUPLES= NMR SPECTRUM
##VAR_NAME=  FREQUENCY,     SPECTRUM/REAL,   SPECTRUM/IMAG
##SYMBOL=    X,             R,               I
##VAR_TYPE=  INDEPENDENT,   DEPENDENT,       DEPENDENT
##VAR_FORM=  AFFN,          ASDF,            ASDF
##VAR_DIM=   65536,         65536,           65536
##UNITS=     HZ,            ARBITRARY UNITS, ARBITRARY UNITS
##FACTOR=    0.620285442955139, 1,           1
##FIRST=     20137.2065510759, 0,            0
##LAST=      -20513.1999529892, 0,           0
##MIN=       -20513.1999529892, -12774808,   0
##MAX=       20137.2065510759, 309151152,    0
$$ Real data points
##PAGE= N=1
##DATA TABLE= (X++(R..R)), XYDATA
$$ [...]
42440 -688025 -531901 -368942 -86067 434470 937272 994844 503327 -176126 -568013 -544058
42430 -544058 -412473 -462659 -489073 -93048 493227 447705 -404628 -996164 -386563 715605
42420 715605 797984 -270287 -1058161 -717769 -96876 -207257 -707699 -759401 -513901 -680170
42410 -680170 -1157405 -1215344 -776665 -466186 -458948 -282505 141718 206816 -347358 -903855
42400 -903855 -858575 -410709 -54937 176437 495775 798177 821872 626849 470486 347972
42390 347972 35936 -466807 -842135 -806530 -405219 24217 124388 -132411 -330016 -35121
42380 -35121 602386 923353 547441 -166927 -594425 -515520 -157167 152989 169824 -132996
42370 -132996 -364072 24001 946970 1487733 926212 -271459 -985006 -778310 -164506
42361 -164506 325366 659941 826442 517553 -360637 -1296932 -1639573 -1230154 -406566 355841
42351 355841 678310 483100 134185 79362 243171 150142 -243968 -373528 15757 328426
42341 328426 -27147 -702241 -907023 -522612 -92754 73771 136101 163542 8893 -233823
42331 -233823 -245334 -58801 -95217 -482540 -798721 -634899 -14981 818893 1581950 1832972
42321 1832972 1242167 189680 -408530 -145687 453341 794720 947698 1120664 974399
42312 974399 122901 -992211 -1447900 -1012828 -375130 -136861 -118033 133945 566825 721060
42302 721060 452118 207235 462706 1036636 1199947 555242 -399824 -821906 -502113 22931
42292 22931 249292 161098 -91392 -430061 -601348 -240650 503382 904122 602334 136825
42282 136825 65118 64085 -424585 -1062114 -994723 -220653 320671 127550 -206124 6022
42272 6022 557621 778958 468226 -33580 -363892 -335876 148525 982702 1720702 1840732
42262 1840732 1191691 128714 -744450 -1011549 -790276 -609113 -753867 -861861 -490602
42253 -490602 56313 20008 -662358 -1133534 -810953 -220518 -180972 -612322 -752726 -312714
42243 -312714 211016 333485 149837 655 -23893 -68576 -248062 -541075 -805825 -838331
42233 -838331 -545986 -91610 255158 404180 453488 447795 314443 61298 -132759 -92762
42223 -92762 183515 549012 796058 733048 336717 -112668 -190598 256605 909203 1275926
42213 1275926 1176355 860539 674428 696498 740496 645267 457235 313992 250383 199922
42203 199922 123102 19912 -161847 -494092 -893928 -1069608 -729866 126173 1110422 1660068
42193 1660068 1478404 861186 487007 739225 1303525 1581896 1393177 1025819 691862
42184 691862 300583 -165509 -430490 -297178 30598 249382 373929 571865 730669 532481
42174 532481 -39606 -556460 -614388 -302731 -86456 -260601 -598302 -609205 -179084 169906
42164 169906 -137373 -915895 -1285376 -656740 617812 1739403 2296648 2327666 1870331
42155 1870331 967095 42253 -266971 165339 747882 886601 635492 424341 383232 257498
42145 257498 -91452 -428671 -489038 -373597 -400724 -600769 -588352 -91963 540524 680704
42135 680704 287969 56638 464728 1043552 1055777 658234 711526 1391421 1744428 1030307
42125 1030307 -101098 -438072 144756 666711 582056 452504 806787 1149151 763315
42116 763315 -12252 -169756 449566 878820 437840 -334066 -572426 -310918 -194911 -350188
42106 -350188 -273263 235202 715846 757457 512103 304514 185466 109789 147501 241147
42096 241147 124161 -209458 -300705 157232 812697 1145303 1139046 1016276 638822 -199484
42086 -199484 -1087524 -1326479 -926519 -579970 -575672 -483997 -140843 -165977 -1006604 -2051958
42076 -2051958 -2316302 -1651889 -728984 -93087 193688 186487 -47304 -209195 18508 492361
42066 492361 751256 654297 473379 345303 97918 -259552 -320089 175635 850412 1030928
42056 1030928 473263 -426464 -1079348 -1223094 -991480 -570852 28628 708675 985118
42047 985118 429910 -530273 -852194 -235683 346580 2938 -788503 -1020751 -756932 -813598
42037 -813598 -1158102 -925236 -54744 453347 225280 80932 367981 160979 -955112
42028 -955112 -1659856 -795765 574845 618447 -483965 -951307 -220174 493618 440898 308815
42018 308815 572642 588616 34838 -225573 359768 912522 550627 -77036 159926 1046464
42008 1046464 1443771 1055023 628825 644924 790751 659230 190875 -490027 -1072787 -1110778
41998 -1110778 -659969 -528774 -1207907 -1930222 -1630859 -532814 176211 59856 -200963
41989 -200963 -121027 -16157 -116897 -88477 197422 275015 -75782 -335812 -108841 136757
41979 136757 -226370 -972802 -1306909 -925462 -315168 -81399 -310602 -585438 -482457 -55778
41969 -55778 235250 180749 161424 515677 856999 586983 -110256 -505963 -476174 -579179
41959 -579179 -929754 -933273 -408336 -33239 -210406 -359664 46355 532425 446680 68240
41949 68240 59963 341220 375806 188360 215955 421306 400218 175564 72998 -28577 -495588
41938 -495588 -1097617 -1212064 -848827 -634776 -722205 -551867 124314 767554 875895 636604
41928 636604 489676 606482 1009496 1625760 2018614 1692288 915156 592900 1000946 1301590
41918 1301590 752803 -224359 -729559 -607316 -364380 -265963 -191434 -161806 -361206 -685031
41908 -685031 -766405 -458655 36428 442945 543958 223347 -306915 -525455 -203124 219806
41898 219806 236165 13339 62409 368249 415066 -267 -542240 -918460 -1137656 -1140509
41888 -1140509 -745603 -122647 201957 44592 -179263 -142968 -108174 -411024 -839719 -937147
41878 -937147 -664447 -362201 -227564 -197074 -207843 -216058 -63540 318303 654430 640701
41868 640701 444536 469253 619557 302342 -655372 -1535099 -1521317 -693989 134836 403578
41858 403578 257666 133661 281251 691909 1122852 1124708 417361 -616023 -1159771 -903328
41848 -903328 -417749 -320280 -417932 -125181 537219 962367 901766 753033 793955 739153
41838 739153 331908 -148096 -335924 -295142 -167701 252985 1047622 1614741 1280451 338042
41828 338042 -182563 207730 992321 1487594 1544161 1315640 952525 738048 951770 1324083
41818 1324083 1170885 382818 -282815 -298584 -179096 -631904 -1380028 -1531667 -823773 195483
41808 195483 1009001 1450889 1351629 654312 -122521 -310171 -67247 -171679 -693227 -739608
41798 -739608 104080 947643 871921 353516 533367 1445454 1948178 1396297 502496 270194
41788 270194 720660 1086297 861224 235053 -306746 -437251 -124333 365217 572854 213255
41778 213255 -454871 -782508 -412020 267057 514938 83816 -528137 -712715 -408578 29490
41768 29490 367787 587959 597810 259302 -284577 -673014 -773142 -732328 -557507 -60117
41758 -60117 670876 1193252 1306877 1280271 1246728 893278 137306 -408570 -221019 291826
41748 291826 404507 217650 400325 961171 1173292 790531 451944 594223 771051 511167
41738 511167 148932 176655 312412 -28650 -647755 -753300 -172040 383649 393140 207228
41728 207228 340881 631481 591866 272752 189865 465684 604260 261224 -235221 -420031
41718 -420031 -356878 -338823 -224643 307647 934660 850783 -32937 -734505 -478891 245585
41708 245585 510031 349246 525977 1124356 1324009 709089 -24177 -46144 504972 832822
41698 832822 502079 -246127 -922120 -1193227 -1052821 -825054 -828787 -918132 -649120 -36642
41688 -36642 262281 -195077 -959680 -1244844 -896788 -428726 -280838 -432780 -638020 -696334
41678 -696334 -551973 -390879 -561879 -1151652 -1725915 -1748673 -1205434 -592490 -329459 -360776
41668 -360776 -316385 28697 416251 275627 -549109 -1315305 -1073737 68818 926095 725168
41658 725168 29403 -262299 -214096 -438752 -859606 -818140 -243350 226842 343099 577384
41648 577384 1133346 1435165 1010654 251750 -169164 -160197 -45229 34036 63017 -165261
41638 -165261 -777974 -1393736 -1431393 -794826 75811 743779 1060091 1021491 705405 336893
41628 336893 126151 22836 -133256 -237702 12440 603351 1007908 692524 -255453 -1130307
41618 -1130307 -1244043 -545142 354077 729033 345917 -404881 -883494 -708459 -40747
41609 -40747 516462 413185 -269648 -813747 -652081 -92250 47494 -497831 -1131391 -1249347
41599 -1249347 -974943 -772754 -699882 -451776 50262 526803 702029 472434 -145932 -857060
41589 -857060 -1015332 -238057 901254 1332314 795746 197254 411510 1204716 1714542
41580 1714542 1594669 1190620 850054 611750 471525 445685 394687 236386 288727 879524
41570 879524 1613342 1656560 922651 328924 524029 956016 729694 -88106 -675283 -656507
41560 -656507 -391379 -205990 -46453 91511 41919 -113589 -82843 61039 -75162 -420007
41550 -420007 -345162 312589 743821 193912 -928066 -1527924 -1152135 -309846 355535 685081
41540 685081 827485 904689 957442 961693 838569 589917 369764 279221 205553 29464 -148896
41529 -148896 -169504 -38888 183053 521010 891955 1004017 730395 385068 326118 474684
41519 474684 534951 472065 405751 252294 -77176 -296392 -77901 326685 347213 -30207
41509 -30207 -201254 160985 683569 933566 976956 1042921 1076265 975512 945448 1210107
41499 1210107 1559706 1564421 1174222 782171 673280 686120 538363 292631 271940 539296
41489 539296 712476 455097 -20010 -207809 7152 258642 288943 242898 281252 317982
41479 317982 320183 444282 634827 534302 96472 -185020 -36683 120893 -66927 -221282
41469 -221282 33923 226270 -229052 -905766 -983561 -654943 -755584 -1152531 -834372 239398
41459 239398 758171 59864 -712109 -288488 813682 1058510 21130 -1206644 -1497791
41450 -1497791 -799881 160350 688612 595568 206655 -40479 -71468 -127329 -313329 -534618
41440 -534618 -804315 -1112980 -1051486 -247620 780593 1021135 402415 -38056 279921 684108
41430 684108 486103 44485 -79420 -131517 -496916 -789824 -530334 -91210 -30447 -55005
41420 -55005 363014 847879 657880 -17913 -341591 -105806 256785 615516 1044353 1093647
41410 1093647 313338 -697954 -945666 -593683 -623909 -1038725 -819864 165199 672002
41401 672002 -37150 -1085698 -1359914 -903355 -310694 252473 709175 641736 -25557 -617042
41391 -617042 -645631 -490744 -554697 -529895 -211646 -237502 -1109287 -2116777 -2222977 -1566011
41381 -1566011 -1105583 -1113287 -1003664 -488334 48893 312539 427198 477110 403356 383904
41371 383904 679607 1076931 1086226 719350 484167 581945 712233 724462 818215 948241
41361 948241 666895 -162735 -1022143 -1417183 -1455655 -1429834 -1269903 -851533 -502668 -640746
41351 -640746 -1018546 -884566 -16738 828935 792933 7998 -541663 -228232 524609 915801
41341 915801 790599 603323 562235 389593 8626 -128427 247214 628981 362436 -386057
41331 -386057 -819607 -566374 -33887 288231 373518 379816 272223 -18605 -347683 -515398
41321 -515398 -490839 -289941 155601 754554 1057618 673761 -106441 -469131 -61788 440620
41311 440620 116734 -925685 -1510025 -823889 495487 1118834 631409 -164276 -490504
41302 -490504 -472912 -544942 -594815 -245228 356337 637844 426223 171700 289043 652906
41292 652906 860821 725481 386016 112942 94773 296437 473600 397540 66594 -335969
41282 -335969 -604479 -587280 -271764 106346 242669 183740 307636 712307 978270 842634
41272 842634 695737 909285 1064852 587629 -99493 2486 866959 1284969 655707 -40832
41262 -40832 287142 1206360 1485499 926125 450772 595934 936211 1047233 1104180 1259203
41252 1259203 1201847 744472 275654 215968 433249 533510 366177 -20692 -512899 -765078
41242 -765078 -400515 304405 498564 -50340 -462484 -51990 525748 313427 -308209 -189188
41232 -189188 647871 964774 288339 -397067 -314200 15630 -27843 -46745 415645 797337
41222 797337 453631 -119286 -126359 115941 -163555 -652838 -436426 316280 578276 246542
41212 246542 208517 578457 440602 -327954 -568764 201023 848204 520316 78369 471780
41202 471780 925970 243017 -984518 -1144548 -130433 586208 325767 49664 566468
41193 566468 1289242 1364761 979170 823016 965833 949425 574890 45200 -421918 -734272
41183 -734272 -853600 -824493 -728426 -518766 -109088 356535 604762 620809 628077 676117 585325
41172 585325 318010 69205 -27306 19603 211052 448772 395253 -115668 -646769 -654730
41162 -654730 -312314 -226013 -415752 -315351 184296 528668 520451 671442 1162847 1309165
41152 1309165 641644 -201085 -387403 -133507 -228763 -718603 -929240 -645584 -439570 -753180
41142 -753180 -1305671 -1602508 -1580766 -1529236 -1620008 -1683752 -1385400 -641381 127312 371067
41132 371067 117327 -37943 179074 283094 -155473 -708842 -676748 -161177 123503 -33402
41122 -33402 -137647 66691 173006 -122944 -418156 -157106 557407 1079121 960630 312683
41112 312683 -437424 -910557 -975920 -782185 -597724 -545441 -507442 -303973 83113 466589
41102 466589 580793 270267 -382767 -1111446 -1641380 -1774666 -1376679 -488661 524531
41093 524531 1190389 1396218 1418142 1414427 1221648 806908 509516 511852 438013 -85928 -755886
41082 -755886 -966263 -664220 -322920 -212461 -232962 -379395 -792127 -1318708 -1547453 -1350056
41072 -1350056 -947180 -429325 274702 918034 1013213 553763 126022 91224 150575 -47975
41062 -47975 -374488 -585414 -754936 -970819 -998093 -654592 -224122 -108408 -292439 -482527
41052 -482527 -554259 -550361 -439049 -182136 112713 340218 516547 579674 350249 -94871
41042 -94871 -339473 -202178 -61886 -268553 -559899 -488975 -149655 17885 -48231 -20726
41032 -20726 197366 349319 329447 362639 583814 779065 684468 346069 78233 122025
41022 122025 338339 281270 -236645 -711536 -486083 235806 500234 -33045 -535468 -305479
41012 -305479 107819 -129345 -660972 -511496 222521 486933 40015 -153105 434396 1029725
41002 1029725 871875 370600 251444 373210 232822 28063 285311 770818 680711 -147727
40992 -147727 -944190 -1002567 -445375 115560 306449 255065 329732 686088 1044183 1020459
40982 1020459 667804 415101 444687 523627 546487 740590 1108306 1206307 828248 387120
40972 387120 203025 -46816 -639913 -1108312 -905075 -341234 -117072 -261675 -305912 -197426
40962 -197426 -195649 -112237 394980 921136 738819 109687 79743 809342 1232409 741634
40952 741634 111905 163704 513891 446180 183507 330631 640665 372802 -427400 -971159
40942 -971159 -939758 -800831 -891752 -933882 -600827 9071 622889 1061834 1146628 751254
40932 751254 96726 -323197 -233669 199581 624647 754037 448324 -147438 -607308 -657688
40922 -657688 -528878 -576946 -700609 -543118 -166981 -28043 -270495 -541388 -591055 -584112
40912 -584112 -657799 -606359 -245032 217304 379503 32607 -702592 -1370666 -1372692 -574181
40902 -574181 310170 471950 155145 334097 1088257 1210314 -11382 -1459907 -1565128
40893 -1565128 -484597 178987 -349342 -1142056 -1109503 -401138 163860 289000 242818 201655
40883 201655 112068 -52732 -295717 -631654 -855102 -597594 87295 570762 459242 188005
40873 188005 344217 751071 805982 455066 145478 -38317 -417667 -878897 -799119 -70808
40863 -70808 508546 294987 -305843 -495580 -205315 6718 -93793 -176938 -5622 183723
40853 183723 71161 -296963 -585636 -549900 -269603 -58406 -123752 -337001 -464204 -551385
40843 -551385 -780151 -967104 -686944 -39984 249464 -170864 -712912 -729895 -445918 -398370
40833 -398370 -445540 -143178 251341 134783 -237760 14447 870559 1217096 547859 -155687
40823 -155687 163147 1165460 1762525 1588273 1079334 593681 240730 233551 613622 824783
40813 824783 296345 -649431 -1122384 -820969 -252295 130164 360053 524073 548958 544837
40803 544837 785291 1177458 1268372 955631 673221 638714 456062 -145434 -633416 -287478
40793 -287478 723633 1436314 1264764 617968 211185 144726 -33076 -555013 -1119730 -1369016
40783 -1369016 -1335973 -1243804 -1127592 -926976 -754127 -727059 -676699 -414526 -175971 -304391
40773 -304391 -559166 -372594 126583 83210 -788948 -1596916 -1457494 -699227 -269103 -426688
40763 -426688 -696688 -731901 -524888 -69275 485443 604621 14971 -645939 -570752 25177
40753 25177 239249 -150607 -501687 -405316 -85886 294645 824039 1245506 1079044 503955
40743 503955 255027 454790 442071 -13670 -293219 -66868 129181 -56968 -116950 308356
40733 308356 609136 170655 -542265 -688398 -313863 -124010 -375700 -691347 -680489 -203551
40723 -203551 647270 1384577 1385804 751442 368522 668244 981721 679841 178964 60865
40713 60865 -33355 -665105 -1413061 -1524282 -1241434 -1322058 -1625839 -1404279 -748923 -499613
40703 -499613 -807515 -1004490 -888216 -921430 -1081307 -759981 -40017 139441 -529877 -1157406
40693 -1157406 -1007567 -428318 20913 396989 804210 901932 576195 330107 449117 505434
40683 505434 204629 -37571 97980 238818 124514 191444 661924 864229 302555 -336742
40673 -336742 -214842 267389 203118 -195999 44733 910210 1273815 618691 -255291 -539672
40663 -539672 -451705 -501730 -541576 -204761 193956 -81593 -1116089 -2043459 -1968569 -968097
40653 -968097 3456 174606 -257968 -541021 -383255 -195345 -329567 -570743 -599798 -523942
40643 -523942 -589358 -691649 -561807 -216145 115238 307200 315390 92174 -203105 -222768
40633 -222768 47820 158127 -83617 -207534 139744 492592 259969 -290803 -484510 -367714
40623 -367714 -554712 -1089587 -1317671 -930602 -380869 -128287 -116435 -133714 -139644 -129549
40613 -129549 -153275 -446121 -1017953 -1253238 -629405 277167 384570 -283737 -593634 -103558
40603 -103558 232164 -349065 -1168450 -1200588 -585466 -158330 -92318 34455 219749 31953
40593 31953 -558355 -1139808 -1524666 -1749487 -1582955 -808111 75450 224879 -399150 -967435
40583 -967435 -978170 -830359 -1013922 -1393233 -1598342 -1547608 -1221945 -458190 557622 1024425
40573 1024425 358528 -892058 -1516972 -1012907 -49127 471932 397518 187470 129647 54755
40563 54755 -223774 -522530 -531189 -303136 -241677 -551139 -925901 -947800 -633038 -342294
40553 -342294 -223071 -44566 343518 654420 473498 -171803 -732517 -659308 47399 818924
40543 818924 1054896 693922 217222 72560 215805 324390 300289 305280 376805 354472
40533 354472 240975 278842 496248 510996 81067 -404903 -367714 171245 638078 682255
40523 682255 472196 195941 -232012 -749664 -883018 -317895 501551 784273 334625 -284717
40513 -284717 -526637 -449511 -454743 -727884 -1097549 -1276714 -1111762 -692954 -284100 -55075
40503 -55075 104702 354473 522941 235883 -501368 -1135616 -1177980 -790055 -534425 -662014
40493 -662014 -875361 -759423 -262585 275175 491160 382389 292860 442712 568486 285737
40483 285737 -233251 -361757 62492 384480 41661 -580767 -722907 -394461 -283919 -604460
40473 -604460 -755911 -318514 262871 376600 151021 156396 467575 562708 110159 -598797
40463 -598797 -1093172 -1249475 -1206840 -1018237 -661347 -307957 -292241 -704501 -1179199 -1247662
40453 -1247662 -831838 -236695 270502 631765 769150 539198 84932 -94809 245660
40444 245660 637089 442689 -245613 -717111 -667165 -617905 -1092542 -1775123 -1904630 -1338942
40434 -1338942 -780929 -847585 -1227137 -1041587 24049 1253713 1703257 1257851 614605
40425 614605 343478 383414 496388 701377 979884 1003450 608909 232509 346865 669718
40415 669718 508630 -192866 -743069 -661610 -191678 239544 511941 570899 234633 -410579
40405 -410579 -809042 -527018 148909 508891 210548 -417605 -769015 -534569 31969 372234
40395 372234 206811 -210799 -515153 -672315 -755745 -596373 -133125 152683 -181526 -663087
40385 -663087 -403881 495420 908847 272490 -662706 -1062427 -1144384 -1464975 -1782873 -1446204
40375 -1446204 -510273 289419 494633 289116 75089 137621 538846 971632 963468 543317
40365 543317 350436 732983 1186998 1132247 759657 556328 468581 210787 -6065 174997
40355 174997 461394 245239 -430907 -948975 -1016505 -836909 -549223 -177354 19153 -163326
40345 -163326 -373333 -179943 139592 38147 -277180 -135906 398154 581492 260154 106123
40335 106123 433329 712984 524004 137435 -120615 -284323 -269558 176879 737859 606568
40325 606568 -276772 -904544 -610195 5268 129874 -39546 163367 734383 1141085 1150307
40315 1150307 845735 232588 -521443 -815736 -252613 700622 1231900 1111154 633792
40306 633792 16426 -566355 -676739 -37057 880225 1265043 894575 213848 -325164 -544008
40296 -544008 -370023 65796 266244 -191412 -1068053 -1681894 -1646726 -1104677 -412866 56268
40286 56268 16329 -430166 -754475 -614119 -291047 -190668 -228834 -156972 -145734 -459329
40276 -459329 -813542 -712820 -266624 -9322 -3224 193177 665484 935571 730958 367648
40266 367648 200903 203444 246723 322070 311988 1261 -469735 -563893 -8780 787163 1171096
40255 1171096 874462 117412 -636066 -926345 -576668 142466 793067 1214040 1484872
40246 1484872 1560688 1315924 916821 730196 816265 901806 886899 932785 976145 669980
40236 669980 8893 -462623 -362301 -4600 93212 -98036 -271623 -340170 -435625 -539316
40226 -539316 -521807 -472144 -601977 -799744 -622180 119102 968637 1240187 803063 297516
40216 297516 449688 1226830 1861984 1771138 1207120 804007 704838 526364 109984 -158198
40206 -158198 86157 660882 1102014 1202504 1051071 718870 178427 -518197 -1173249 -1561981
40196 -1561981 -1548900 -1159452 -622743 -255196 -177598 -188443 -28121 251047 299597 -92156
40186 -92156 -653990 -866887 -568082 -177653 -162824 -388421 -294288 269840 751591 614970
40176 614970 22278 -491144 -739685 -884861 -904645 -571013 40067 467390 417919 75340
40166 75340 -249933 -463197 -545775 -402540 -98185 -15767 -460062 -1169038 -1508127 -1221537
40156 -1221537 -789174 -868338 -1466677 -1898853 -1611902 -802643 -41054 438434 699363 597679
40146 597679 -58214 -831364 -847923 58075 1003841 1229779 1008090 909796 823510 432525
40136 432525 127528 500578 1220141 1391911 934818 617672 701351 578953 18385 -244405
40126 -244405 310076 989025 768668 -286466 -1117715 -956200 -37494 839926 1128486
40117 1128486 941954 802886 967519 1131050 1007283 903345 1184271 1397839 742422
40108 742422 -584518 -1405382 -1168922 -661073 -708359 -1023859 -940877 -558507 -410474 -520198
40098 -520198 -517520 -304517 34684 577606 1172063 1155526 230965 -770673 -875187 -425048
40088 -425048 -586580 -1524784 -2120662 -1654899 -797229 -536877 -913062 -1302679 -1361856 -1120389
40078 -1120389 -574102 208000 786981 732177 276784 145822 625331 1135492 937800 74825
40068 74825 -678650 -790424 -598060 -766763 -1333562 -1663732 -1349285 -754537 -499344 -707826
40058 -707826 -1007141 -1043741 -746856 -253663 163075 199029 -215280 -787912 -1124796 -1044119
40048 -1044119 -609417 -57525 247089 75243 -309543 -344818 114214 578082 608260 365005
40038 365005 213812 149946 -32503 -294794 -452069 -491361 -476447 -386985 -333317 -581409
40028 -581409 -1008258 -941399 -41794 1004733 1259918 723095 146186 -78986 -142533 -95509
40018 -95509 288085 880800 1151831 909858 512560 196238 -226041 -806952 -1154698 -961836
40008 -961836 -435449 38814 311545 365546 168128 -145561 -245119 9574 352575 413294
39998 413294 72528 -477211 -790735 -378009 761123 1850593 2054320 1503691 1087451
39989 1087451 1136106 964863 41185 -1008377 -1146622 -343042 402389 386241 -30981 -152620
39979 -152620 17468 -103349 -655178 -973256 -538480 87020 -111029 -1091636 -1630577 -982587
39969 -982587 74376 444948 302024 564193 1223348 1338076 654059 92494 327259
39960 327259 836871 836866 371096 -59562 -302445 -408825 -222900 273780 614466 433866
39950 433866 83069 99238 342958 257516 -199313 -498766 -382367 -205873 -334686 -618098
39940 -618098 -668338 -422165 -204573 -278430 -481735 -442829 -161568 -140605 -710596 -1431091
39930 -1431091 -1566511 -1056598 -520107 -312844 -175677 65275 106097 -216114 -507759 -465612
39920 -465612 -439368 -817212 -1245495 -1071454 -337876 253673 288243 43312 -39129 137588
39910 137588 396089 553393 542125 442434 411753 484202 498781 298890 -96416 -538384
39900 -538384 -794886 -585806 124674 868443 1088539 849237 680256 678937 392740 -228930
39890 -228930 -514074 -127825 243738 -101058 -745036 -768339 -124230 368517 206307 -320273
39880 -320273 -722244 -793733 -571077 -288802 -249055 -344643 -15119 840943 1343289 741343
39870 741343 -316655 -541453 157240 607665 184774 -373269 -269038 181807 247535 -39312
39860 -39312 -80845 274318 543896 348611 -91813 -268253 -12908 277345 119723 -370609
39850 -370609 -547394 -132644 336679 310006 49439 95970 296043 140351 -167286 75636
39840 75636 788002 1010510 337395 -418695 -375802 312128 903653 1008938 680093 122730
39830 122730 -275203 -117365 429074 689249 392714 5732 -110866 -220220 -510752 -596677
39820 -596677 -266099 -59879 -420569 -844275 -667592 -218815 -287129 -765539 -797593 -184931
39810 -184931 301674 156487 -132599 97120 736534 1151420 999101 479553 5733 -130010
39800 -130010 101127 469966 665030 519224 79506 -454930 -818970 -848845 -650425 -475366
39790 -475366 -411181 -394206 -479504 -715434 -756605 -172250 709116 947814 340173 -114058
39780 -114058 315324 855369 354127 -867095 -1365821 -596162 493613 928010 771079
39771 771079 500489 227556 -29679 12443 487429 1025501 1174266 851126 197618 -606933
39761 -606933 -1225397 -1325805 -1067486 -969545 -1115009 -1011955 -486979 -127144 -421070 -951055
39751 -951055 -940300 -270733 502273 888534 807327 432730 90821 115586 452881 594886
39741 594886 229445 -264874 -327815 -25816 35017 -506207 -1385857 -2019269 -1935066 -1082790
39731 -1082790 6274 542114 257640 -306180 -562511 -637754 -959983 -1371879 -1263587
39722 -1263587 -530183 202041 413585 258896 122827 47530 -134829 -418725 -676908 -906225
39712 -906225 -1144999 -1239893 -949206 -305766 281174 393328 68433 -180918 85091 681360
39702 681360 961185 606258 66241 35218 624891 1278190 1434895 1064868 559807 290272
39692 290272 302642 349777 218820 44701 155070 530109 665822 215973 -427648 -543480
39682 -543480 1271 576499 547995 -67680 -739248 -970072 -680591 -264080 -287017 -923822
39672 -923822 -1676833 -1872345 -1429070 -879780 -625534 -499886 -200348 152850 155115 -308008
39662 -308008 -853574 -978077 -542974 126681 588876 697977 628455 522449 297484 -99711
39652 -99711 -455827 -533044 -415491 -350965 -329146 -109737 338181 696355 650184 205600
39642 205600 -343617 -606725 -328814 337920 841513 742859 190712 -311236 -505566 -491656
39632 -491656 -370696 -146744 69514 131254 130136 262128 432140 342044 -35908 -418863
39622 -418863 -610180 -577038 -233807 379149 778738 478641 -239653 -592591 -382321 -166495
39612 -166495 -238758 -188902 252592 655084 565495 129915 -335443 -772010 -1004117 -642760
39602 -642760 152850 545163 243958 116302 825052 1592220 1284879 143922 -670729
39593 -670729 -826391 -900678 -981399 -527968 300755 475469 -364911 -1255416 -1268991 -676648
39583 -676648 -247794 -167401 -229682 -465548 -908448 -1152368 -782166 -56253 310341 -34273
39573 -34273 -745250 -1175910 -974475 -409639 -106031 -276669 -379175 89251 674314 491049
39563 491049 -398270 -925792 -491985 286207 600795 470242 299499 123583 -134739 -206201
39553 -206201 101429 416853 312313 -18651 -88458 177536 499366 676154 547118 -67666
39543 -67666 -892014 -1091345 -262209 822422 1109629 616710 195041 197234 178723 -151271
39533 -151271 -481527 -516040 -386335 -273027 -139801 -11533 -73040 -334146 -562293 -655799
39523 -655799 -754518 -922122 -1042434 -1055452 -977438 -711428 -189319 346392 590508 635338
39513 635338 745616 774061 375051 -214090 -284439 282043 708890 399167 -241120 -454451
39503 -454451 -150688 194402 329669 405321 502793 432445 22695 -633016 -1234007 -1486498
39493 -1486498 -1345419 -1089828 -1006296 -996869 -763984 -393841 -351197 -748277 -1052833 -813836
39483 -813836 -320360 -199635 -655102 -1432566 -2216750 -2658070 -2341809 -1287994 -280990
39474 -280990 -105376 -539119 -683233 -225559 294725 515921 749189 1148071 1152616 354052
39464 354052 -634498 -893293 -456361 -109153 -113584 23445 463641 605545 122035 -292638
39454 -292638 153073 1109306 1482330 916797 206423 154322 602329 862797 717036 583987
39444 583987 813985 1165040 1108468 523226 -104425 -246769 43886 292261 298632 318082
39434 318082 473913 451158 69064 -257317 -94185 280255 283407 -40100 -125528 170961
39424 170961 403845 308156 60642 -280326 -858276 -1390715 -1244151 -430792 233652 339342
39414 339342 449064 963600 1284737 860426 290521 414141 876756 711578 -37711 -464079
39404 -464079 -370916 -430648 -722334 -428423 615265 1269654 702394 -275548 -353796 422224
39394 422224 868839 410684 -287749 -408897 37982 505325 658444 538429 239427 -248447
39384 -248447 -849243 -1231114 -1017271 -228139 631057 1070279 1090467 999673 933447 850337
39374 850337 856673 1118829 1463437 1467978 1013247 404344 -94853 -484563 -753875 -801253
39364 -801253 -728122 -804597 -1016650 -1044829 -815611 -634524 -613441 -457074 -65677 160329
39354 160329 -11155 -136851 243974 794777 809388 282704 -31852 344196 1006253 1245904
39344 1245904 915365 502888 494830 862165 1204586 1290114 1287198 1412971 1563881 1517316
39334 1517316 1333203 1220449 1105111 742782 231549 -48665 -45555 -82241 -204717 -59075
39324 -59075 357907 429863 -190569 -915191 -936072 -260327 439309 718876 649878 456461
39314 456461 316773 342398 380296 62602 -582564 -881585 -347573 525628 853619 513215
39304 513215 97798 -84102 -239743 -365124 -76521 624749 1084737 846677 288946 44062
39294 44062 139183 98291 -332689 -922582 -1296090 -1243479 -743541 67347 896149 1395557
39284 1395557 1363406 886591 312394 15056 89470 284863 307469 141397 -12922 -37881
39274 -37881 8683 59690 136347 256083 361474 406701 481443 781303 1364817 1914613 1912648
39263 1912648 1240569 463985 227035 468040 616831 480732 391840 452133 322951 5273
39253 5273 94397 768886 1188712 604092 -425155 -723945 -100809 576585 716247 559384
39243 559384 457416 436318 560732 948355 1274032 1004870 321899 60092 461792 740473
39233 740473 268376 -517369 -892673 -875216 -850351 -714193 -151222 553456 743624 326809
39223 326809 -156477 -356269 -435733 -566020 -643539 -605684 -563185 -486140 -170651 312647
39213 312647 509378 155867 -418350 -718067 -709576 -751708 -1017667 -1254028 -1112527 -537099
39203 -537099 205815 755990 890403 634095 213873 -115849 -231671 -163408 -33121 1660
39193 1660 -153820 -396724 -474930 -295761 -96080 -125473 -262661 -234369 -146542 -358759 -756683
39182 -756683 -697054 18139 650547 527389 73226 126946 569904 553565 -17460 -269077
39172 -269077 200606 687409 608916 418733 668358 984484 782700 348638 308608 492153
39162 492153 255468 -359329 -690014 -502489 -144966 196775 575400 732507 335621 -262973
39152 -262973 -350971 33148 159860 -150645 -249335 169490 501701 221903 -305359 -462617
39142 -462617 -248090 -56941 -35144 -44361 44525 272763 519620 416937 -276981 -1174993
39132 -1174993 -1584338 -1347123 -866619 -369158 212578 680452 694413 493318 637341 955723
39122 955723 713696 -31147 -351276 -24712 30470 -589793 -953736 -403965 220413 -6036
39112 -6036 -531221 -367881 211815 362412 309370 838256 1633810 1638736 829655 204537
39102 204537 110958 -22085 -311008 -218705 108928 -250887 -1331978 -1822010 -900855 526769
39092 526769 1125670 781233 252758 -78107 -330698 -491536 -387817 -72694 223372 338831
39082 338831 152440 -357896 -828129 -688206 125618 987218 1271287 871307 2369 -970643
39072 -970643 -1422259 -839805 441762 1429060 1591496 1234440 680384 -96740 -777939
39063 -777939 -625253 326038 877028 229576 -788877 -934511 -356255 -171576 -660652
39054 -660652 -1018503 -776315 -377384 -217001 -68775 235677 349487 49777 -258791 -128500
39044 -128500 263161 456648 413883 446864 620315 649127 380350 43329 -83136 -35559
39034 -35559 -40874 -150398 -201741 -120293 -28649 5019 67683 104255 -158627 -678436 -806575
39023 -806575 -57494 1017135 1363476 799523 171323 78855 226282 268927 457425 943394
39013 943394 1193211 779870 196275 140622 420052 324063 -228805 -665361 -640993 -251561
39003 -251561 388023 1052363 1158774 444930 -303679 -119534 664815 805295 26260 -597281
38993 -597281 -360304 111621 111269 -7802 308563 678739 445370 -110975 -190898 226583
38983 226583 433334 187546 -8211 153874 330746 166873 -217698 -573939 -865511 -1058256
38973 -1058256 -990155 -683865 -453316 -478958 -571838 -577287 -702363 -1113330 -1430061 -1066575
38963 -1066575 -83593 693231 603590 -44924 -387137 -105305 220630 -56946 -787433 -1229094
38953 -1229094 -945814 -217071 373474 497177 254234 24495 137978 509235 685219
38944 685219 484174 399378 937933 1682439 1639900 636675 -288684 -219918 475132 799588
38934 799588 494872 145392 177220 385126 401656 122910 -341259 -731658 -675528 -62072
38924 -62072 622936 731077 238254 -262231 -344521 -135803 79092 180029 61923 -357256
38914 -357256 -796890 -730196 -118006 348100 76814 -635612 -1023311 -843233 -517720 -372068
38904 -372068 -209970 201446 591410 480708 -83105 -455296 -208032 254440 219196 -320260
38894 -320260 -623548 -253468 327307 488061 293738 177658 141594 -89004 -361743 -287176
38884 -287176 -41529 -188106 -641625 -652295 -55015 323827 -49614 -523745 -299446 294844
38874 294844 366845 -151621 -540782 -470851 -305743 -311434 -327563 -255533 -201230 -73551 332921
38863 332921 788751 801719 453774 411333 896764 1300880 1139629 786518 795273 982692
38853 982692 742170 -23764 -813089 -1212538 -1225918 -997642 -612201 -184128 139474 309616
38843 309616 359369 307757 218539 250736 466777 660076 544001 78717 -489556 -840554
38833 -840554 -764672 -286334 272975 492337 257064 -126486 -304493 -218866 -2116 247393
38823 247393 427173 387141 158871 73273 388166 871063 988609 516468 -185810 -531303
38813 -531303 -297811 117106 88732 -481837 -948233 -714955 -83940 174152 7957 140469
38803 140469 793484 1184997 764520 173190 236348 632792 517036 39387 135581 933608
38793 933608 1491054 1254940 763608 593013 518070 159664 -299068 -529010 -560270 -437881
38783 -437881 7515 596443 642630 -108486 -956334 -1208566 -1093793 -1117431 -1128553 -799181
38773 -799181 -490292 -715304 -1116587 -959990 -416503 -322506 -739894 -812914 -182955 455807
38763 455807 501455 247719 143081 38650 -315486 -653833 -620426 -355427 -189776 -136182
38753 -136182 -82194 -121804 -319509 -478378 -460001 -390073 -296044 11226 411300 369732 -241061
38742 -241061 -757497 -647050 -279862 -205821 -198497 257347 968825 1337501 1319553 1238551
38732 1238551 948516 165043 -554509 -284597 746558 1220144 592239 -151651 -60518
38723 -60518 443915 449976 -44030 -424650 -564497 -764258 -962981 -840697 -529525 -483934
38713 -483934 -709897 -762175 -495805 -247806 -235230 -284578 -240201 -190636 -165979 9014 393031
38702 393031 726461 709653 341158 -90819 -269335 -128610 52083 -57496 -381659 -493180
38692 -493180 -237643 27246 45333 116242 538748 976322 928466 549387 356892 335757
38682 335757 75074 -294762 -141814 589902 1158694 1117533 853047 713935 410505 -208358
38672 -208358 -542951 -139977 371690 91620 -759471 -1123229 -604501 160614 608435 870304
38662 870304 1116928 1042898 390261 -528676 -1219380 -1563799 -1674271 -1509219 -993610 -334524
38652 -334524 92264 91518 -269251 -767836 -1065355 -844204 -151827 499598 588899 109124
38642 109124 -461372 -620260 -210730 494962 948996 725283 -66981 -858367 -1196928 -1109453
38632 -1109453 -842088 -527870 -277662 -278146 -492649 -528417 -175439 149242 -55898 -570281
38622 -570281 -729133 -418808 -174614 -250618 -275178 -47595 289 -445945 -926715 -823932
38612 -823932 -225687 339821 666990 822645 695588 248520 -71088 92739 234732 -370573
38602 -370573 -1373490 -1653575 -991957 -409439 -525984 -626373 31194 887996 928963 215685
38592 215685 -364186 -480176 -554294 -776162 -815427 -507203 -94038 242814 487640 478094
38582 478094 123403 -131365 233974 896541 984265 352577 -231702 -344367 -476988 -996699
38572 -996699 -1360349 -954901 -105159 403457 381232 226648 224882 421566 868660 1398534
38562 1398534 1429587 656649 -227684 -188656 782434 1590278 1428603 672349 158310 78097
38552 78097 -27290 -450734 -926488 -1054314 -847925 -710184 -896609 -1142267 -980081 -420795
38542 -420795 -76265 -445253 -1255223 -1754900 -1568880 -1008682 -568917 -387240 -279227 -101886
38532 -101886 67955 49108 -242704 -683760 -987137 -891200 -372154 308426 816079 1059014
38522 1059014 1256496 1613534 1995609 2106156 1935874 1730368 1492475 965960 289054
38513 289054 96734 535315 740728 18868 -896005 -729390 396016 1030646 486349
38504 486349 -305765 -393431 -142161 -314005 -737052 -749215 -327194 53336 200775 121243
38494 121243 -360464 -1141287 -1477207 -902097 -112427 -96654 -734869 -1134348 -1031004 -892760
38484 -892760 -848385 -542671 -23659 182751 -35578 -223928 -155637 -42632 29361 128747
38474 128747 30209 -441257 -753840 -318001 314825 32610 -1038556 -1579339 -1136586 -795776
38464 -795776 -1315683 -1903032 -1606852 -801891 -361104 -270590 -53316 151325 -86632 -614527
38454 -614527 -994535 -1176789 -1153556 -580064 436696 868583 112693 -796681 -514048 520850
38444 520850 648171 -525043 -1580550 -1383919 -476014 34853 -51343 -216267 -144869 129650
38434 129650 541299 977900 1218470 1159988 902747 535248 116071 -147126 -83286 93637
38424 93637 44395 -113077 51171 570471 1021660 1158545 1062464 696100 -21163 -633552
38414 -633552 -413055 538386 1152633 726523 -230698 -881987 -1162657 -1435826 -1580372 -1159571
38404 -1159571 -259053 522581 881588 1075963 1342502 1476011 1139874 370420 -360173
38395 -360173 -557877 -218086 97364 -125335 -658578 -757486 -157345 547591 737759 563488
38385 563488 533555 666991 575135 190521 -149614 -306805 -496884 -769955 -820206 -490773
38375 -490773 -60977 209043 475178 941679 1367691 1345165 952944 702864 779532 731909
38365 731909 158421 -571142 -647490 164777 1167969 1485152 956068 158542 -278525 -214278
38355 -214278 22448 4726 -382789 -793556 -777914 -376285 -137379 -358790 -596537 -314815
38345 -314815 201681 164642 -510897 -977253 -664112 -105819 -99307 -505333 -532512 13593
38335 13593 478325 392183 97489 68418 125912 -200484 -801441 -1010976 -502345 265553
38325 265553 650304 571264 422971 450209 517803 439239 217244 -103918 -543387 -988685
38315 -988685 -1130145 -821947 -356797 -122698 -81305 125850 582292 918511 804398 368729
38305 368729 3406 -73635 49663 135545 -14761 -403154 -795647 -967417 -1009287 -1187119
38295 -1187119 -1447090 -1350631 -681955 144289 568672 598437 690567 1019616 1261253 1153946
38285 1153946 890059 747834 631421 290917 -159448 -320013 -117255 22849 -208700
38276 -208700 -493845 -305201 309153 737658 609803 206827 -57014 -176463 -302171 -279756
38266 -279756 120682 680377 909368 722551 495420 398163 130845 -497650 -1109732 -1154366
38256 -1154366 -542880 309619 887771 883596 344750 -300936 -571224 -433859 -289960 -376294
38246 -376294 -501098 -500083 -537699 -698812 -709364 -429665 -207368 -266753 -159478 533266
38236 533266 1264006 1086630 69212 -676200 -467213 207677 616908 695661 662555 408540
38226 408540 -181908 -750508 -857315 -591724 -370955 -361652 -441221 -471302 -298239 210995
38216 210995 820447 983430 606933 323500 553572 802740 527479 202976 637675 1537343
38206 1537343 1803414 1207501 677639 732541 726501 127277 -433245 -135457 688329 1028801
38196 1028801 617510 87875 -84558 -110296 -371036 -880576 -1317125 -1336269 -916436 -530197
38186 -530197 -726553 -1398310 -1861275 -1858887 -1907211 -2253536 -2191201 -1133431 206479 662921
38176 662921 293763 154259 548894 654367 18122 -672617 -719145 -388617 -243592 -247180
38166 -247180 -117197 27112 -29358 -98586 58603 253291 218826 79504 22973 -103584
38156 -103584 -379426 -391399 168316 779170 630528 -239578 -950067 -911926 -442085 -183459
38146 -183459 -338071 -614362 -676005 -508903 -397616 -513147 -581139 -234791 297211 331453
38136 331453 -260128 -742308 -587671 -265194 -370052 -506271 110686 1233112 1724057
38127 1724057 1128970 233318 -140194 -125473 -257772 -534495 -515227 -49528 493461 629101
38117 629101 225260 -341737 -481453 10658 700041 1039625 998603 888854 773341 486170
38107 486170 111210 -69284 -73120 -176815 -383211 -420896 -279230 -228016 -270001 -108280
38097 -108280 272053 531957 579758 684861 864526 738050 189314 -360788 -541135 -379272
38087 -379272 68625 814375 1462679 1332331 404159 -466098 -647403 -442932 -344978 -281881
38077 -281881 -103539 -114864 -473345 -667516 -328117 -15366 -378868 -989300 -915866 -149626
38067 -149626 489160 665646 787385 1012813 981202 650830 509706 701303 722034 308143
38057 308143 -64298 55358 411143 546223 519778 669035 981846 1127830 935812 539676
38047 539676 172459 -9951 -42527 -173325 -569332 -965540 -908072 -416685 -42425 -114879
38037 -114879 -296594 -117367 372047 774141 919404 929721 858436 620184 279111 134372
38027 134372 395651 869677 1091637 822928 367018 243657 523965 721412 488845 144872
38017 144872 194544 554024 702831 510131 400027 628770 854901 614946 -76590 -750927
38007 -750927 -902888 -372527 433194 752672 246804 -501246 -675904 -314293 -129439 -305509
37997 -305509 -250824 265800 572225 150557 -473452 -521051 -86629 219741 319909 581976
37987 581976 953952 983619 634666 366731 350973 218432 -290684 -925829 -1305622 -1304909
37977 -1304909 -985244 -506802 -161788 -142745 -245887 -144772 62913 -11783 -367455 -519033
37967 -519033 -170511 436792 951580 1287901 1459594 1433966 1285443 1136182 859647 265396
37957 265396 -334574 -287164 440892 1007283 776213 184093 44466 369447 473538 56722
37947 56722 -410639 -387370 116335 694591 990572 900406 570291 263427 96862 -71442
37937 -71442 -380608 -696536 -771406 -570383 -267557 -36256 -12839 -292370 -727357 -915927
37927 -915927 -684883 -411215 -508430 -751928 -575250 16229 338629 -63404 -851171 -1412744
37917 -1412744 -1561431 -1476839 -1282614 -1001868 -731099 -550210 -362453 -79392 103683 -124729
37907 -124729 -721407 -1179094 -1003801 -257266 455734 582765 183692 -188568 -172020 20192
37897 20192 32465 -25182 263715 897717 1283457 956665 218834 -188749 58665 540408
37887 540408 601022 53674 -661230 -952006 -634441 1924 566861 826240 642041 3527
37877 3527 -727068 -937011 -439547 215236 432759 313387 285200 289385 -49683 -591694
37867 -591694 -750559 -447802 -272868 -492648 -583237 -73890 744096 1347934 1695816 1967211
37857 1967211 2055883 1824077 1514059 1421688 1420180 1219940 843569 461163 24475 -544546
37847 -544546 -1038764 -1189677 -987890 -542413 45286 453858 288737 -224862 -277342 360372
37837 360372 838837 462094 -245139 -422092 -168845 -76190 -71980 204704 391983 -19636
37827 -19636 -479675 -78294 777506 833180 69023 -248617 232684 351808 -465357 -1106206
37817 -1106206 -601417 335578 608263 388691 355819 313999 -181742 -626583 -295416 388674
37807 388674 455297 -62201 -358798 -298710 -424820 -735111 -643091 -132499 136309 -47493
37797 -47493 -172390 37018 266145 326906 391464 380094 -61055 -773495 -1041031 -584640
37787 -584640 45793 290196 190881 26104 -50564 154927 767459 1390541 1411355 950687
37777 950687 815287 1247143 1475336 942755 276044 412953 1252726 1841182 1642619 1059644
37767 1059644 802437 1158065 1814185 2136651 1738299 950329 515595 654161 771526
37758 771526 358519 -211741 -243738 193004 320012 -230888 -890853 -930666 -383215 114173
37748 114173 201615 144135 260214 367345 115243 -309076 -307900 196514 473350 -19211
37738 -19211 -759597 -804276 -25550 896269 1532205 2020714 2328283 2017183 1059499 223245
37728 223245 191318 734645 1163867 1206941 1017266 680377 228081 -91484 -77459 7859
37718 7859 -233113 -640176 -617721 -23744 521770 458209 77045 101866 593208 746547
37708 746547 -8059 -1070069 -1319399 -601616 55809 -99024 -523295 -337222 247880
37699 247880 301514 -266245 -495190 146159 961141 1088054 664293 434517 710847 1228359
37689 1228359 1648945 1726576 1280454 475137 -92100 2874 478503 725141 502399 -7266
37679 -7266 -538780 -800720 -503868 254134 883683 983257 865675 989952 1185799 1006905
37669 1006905 613510 612624 1069600 1354224 1075518 577445 318979 293287 333012 529347
37659 529347 966371 1345788 1287805 866844 495169 323809 92270 -352625 -679479 -477543
37649 -477543 41799 83249 -792045 -1963903 -2347655 -1688524 -879359 -827843 -1368233 -1621233
37639 -1621233 -1172094 -437991 61359 317722 570777 797645 787163 599344 616466 1013104
37629 1013104 1364114 1040388 17697 -951007 -1127369 -575155 39758 250735 102372
37620 102372 -177168 -416573 -469056 -342492 -348841 -730158 -1185139 -1240301 -1026051 -1059604
37610 -1059604 -1256007 -951176 -93444 478422 364034 311875 940456 1569161 1234929 264388
37600 264388 -204993 110668 509608 609739 697550 794941 434010 -427711 -1123186 -1160466
37590 -1160466 -707253 -49395 703780 1205192 945191 63470 -566211 -398107 174536
37581 174536 500360 379434 -124001 -916221 -1600634 -1594820 -903445 -242204 -76510 -113173
37571 -113173 -47137 -105722 -394893 -419502 115460 631173 513053 115733 154425 493368
37561 493368 395429 -231426 -662574 -397558 301044 908254 1109309 805326 194253 -168177
37551 -168177 113938 723323 1033055 939829 786916 627505 236525 -191812 -97926 561572
37541 561572 1148892 1268107 1255932 1505395 1866600 2032891 2015833 1876301 1428181 615332
37531 615332 -166484 -518833 -527942 -456360 -261903 158444 510190 386486 -98692 -410038
37521 -410038 -296664 -20168 119604 124568 102628 43487 -83883 -211744 -260021 -220883 -117362
37510 -117362 7586 66056 27772 25272 184317 369723 322580 73349 -42682 117842
37500 117842 265276 136482 -42082 121865 522341 620472 220127 -221673 -265824 -132257
37490 -132257 -312559 -754557 -907600 -581039 -293889 -571485 -1226157 -1615605 -1421352 -901832
37480 -901832 -485458 -357003 -404102 -396600 -240334 -124385 -289888 -579637 -468119 251536
37470 251536 1050200 1234211 751356 98219 -382663 -675567 -692870 -262134 415162 782740
37460 782740 588762 164563 -94377 -168396 -196428 -192362 -156752 -130697 19970 507400 1154888
37449 1154888 1463198 1353022 1348184 1715227 1959273 1635938 1157686 1172499 1530826 1585775
37439 1585775 1265366 1083626 1205978 1275389 1166178 1145718 1176916 814147 42630 -456255
37429 -456255 -228018 324377 595606 561314 512577 464020 288035 104561 100410 212988
37419 212988 350258 640167 1095700 1341887 1112183 754941 776196 1090187 1216125 1045620
37409 1045620 872245 759796 479937 118338 150309 697038 1180523 1048681 546445 415051
37399 415051 950943 1664644 1888656 1518161 1021921 780735 621954 190440 -340396 -317205
37389 -317205 492711 1418081 1637823 1174632 716627 592630 445889 -12722 -440261 -360765
37379 -360765 72297 223962 -144785 -504069 -255931 390616 616620 133923 -285942 197349
37369 197349 1250978 1712466 1128007 285619 70938 475008 1039266 1568429 1892514
37360 1892514 1605453 773447 356863 1046882 2063739 2081965 1132044 544603 1029372
37351 1029372 1855748 2117361 1832668 1454411 1142019 947787 1014641 1168652 939166 347224
37341 347224 27676 200205 234856 -270725 -689009 -288830 594699 1031701 769348 386674
37331 386674 436941 958017 1590180 1769226 1131684 111667 -296211 209836 750450 549799
37321 549799 87495 219929 718010 665511 -21288 -536843 -548008 -568836 -860126 -909083
37311 -909083 -331472 435285 723750 435478 -26849 -249342 -64493 353686 595038 510799
37301 510799 492129 858178 1213981 1035657 668419 904212 1637292 1907169 1414226 985669
37291 985669 1190747 1477952 1238959 832190 818653 938648 713850 472986 808149 1406720
37281 1406720 1451613 1005692 965924 1586274 2015755 1591375 786346 442414 666982 976532
37271 976532 1092148 1087706 1036606 996668 1187582 1749427 2391275 2652919 2505490 2374567
37261 2374567 2559462 2942482 3329498 3757681 4292697 4746410 4825915 4485224 3982834 3638060
37251 3638060 3601200 3762319 3799245 3436386 2777637 2276635 2240290 2451883 2430512 1994812
37241 1994812 1432932 1163617 1334246 1707622 1898217 1804377 1780792 2181574 2785816 3056902
37231 3056902 2992828 3170417 3761852 4162968 3983138 3702706 3758362 3705443 3136409 2754011
37221 2754011 3401473 4508632 4791745 4210424 3857540 4061926 4097091 3795634 3861111 4339722
37211 4339722 4374230 3845496 3661322 4000381 4001843 3723421 4460559 6318504 7522178 7241619
37201 7241619 7016292 8013249 9035770 8962838 8997424 10407141 12098015 12805379 13699045
37192 13699045 16163008 18965305 20613683 22544186 26602425 31393099 35036554 39437712
37184 39437712 47114233 55867215 62405250 69521712 82731645 101438808 122810338 153863724
37176 153863724 205728478 269281374 309151152 295569605 237590602 173243744 129718406
37169 129718406 104811135 85369748 68240395 57143253 50667459 43570431 35227052
37162 35227052 28906553 25013229 21075429 16875717 14409756 13545722 12052351 9579790
37154 9579790 7982214 7815596 7633811 6805126 6316466 6561394 6608249 5971723 5276842
37145 5276842 4946121 4758153 4768966 5260016 5763294 5434801 4390799 3541106 3197307
37136 3197307 2891164 2383679 1847161 1280306 684095 510844 1053557 1795342 2181100
37127 2181100 2409508 2580965 1972221 389106 -701570 8560 1461520 1640717 626253
37118 626253 241871 943053 1249177 441947 -304458 -65232 431575 336921 34433 95685
37108 95685 236578 178448 333259 773262 666138 -344993 -1240615 -1064691 -336741 -44776
37098 -44776 -83344 245685 903270 1415175 1960083 3008650 4196346 4619222 4111685 3333970
37088 3333970 2694793 2018192 1247320 709516 579260 635812 627821 483287 216479 -3937
37078 -3937 150446 701710 1100095 891493 451168 522954 1160388 1658507 1470493 715763
37068 715763 -141369 -652723 -539189 403 219215 -385940 -1254693 -1317051 -382145 636531
37058 636531 972391 834309 756039 744749 502235 55571 -310674 -509380 -638778 -676510
37048 -676510 -533688 -321160 -269960 -416139 -555511 -472320 -102096 419428 753007 566481
37038 566481 -72743 -652275 -750075 -488593 -260289 -160021 12087 270497 346497 152455
37028 152455 13628 218511 545742 524640 104496 -228645 -91365 273373 326170 -31828
37018 -31828 -350028 -302022 -155922 -337322 -739185 -837240 -447270 26069 189894 134929
37008 134929 90565 -48368 -483128 -1008845 -1183203 -939614 -627196 -429713 -173647 169457
36998 169457 239174 -152762 -552428 -383140 211798 489910 99709 -438729 -411714 207166
36988 207166 813302 974129 875036 910738 1074483 990011 516954 64666 122405 597849
36978 597849 881318 594145 29675 -275405 -196026 -19729 76099 236145 567557 827424
36968 827424 671805 142934 -291144 -266897 10810 12752 -386084 -658077 -318400 309069
36958 309069 419890 -169587 -713709 -547663 19106 218431 -80447 -332269 -252521 -198805
36948 -198805 -496667 -875205 -858383 -431477 -26180 37485 -117093 -131975 125624 328146
36938 328146 -1736 -865101 -1638756 -1756617 -1358798 -962965 -707586 -409479 -229806 -594957
36928 -594957 -1353009 -1710875 -1314156 -755741 -595742 -498927 55513 745509 882282 581297
36918 581297 567632 920198 932664 359440 -89591 112934 432477 133842 -506085 -588705
36908 -588705 33793 525035 268119 -320445 -455447 -18145 487807 779565 1083910 1536902
36898 1536902 1768720 1421251 818116 647094 988892 1144666 635146 -45526 -72876 564088
36888 564088 1064176 906004 426166 167951 110416 -116704 -529460 -738472 -561757 -306279
36878 -306279 -307750 -462561 -451350 -273450 -250641 -507808 -780500 -875921 -1003744 -1348070
36868 -1348070 -1559008 -1128178 -197824 492785 531469 238112 25798 -129099 -331362 -399537
36858 -399537 -249230 -194299 -382334 -338995 318308 1038641 950783 170474 -291016 33891
36848 33891 477506 294299 -358560 -847072 -950178 -905682 -893008 -854624 -691949 -424929
36838 -424929 -235274 -335250 -591789 -435994 417458 1280574 1149785 79235 -812270 -855273
36828 -855273 -571565 -613220 -811325 -805895 -822573 -1088881 -1136706 -536834 189349 299813
36818 299813 53705 226049 722535 758402 267739 8056 225514 322995 40123 -111795
36808 -111795 99496 186365 -22168 76709 711185 1103030 707517 190523 294991 537493
36798 537493 103504 -577616 -392039 632129 1300019 1025837 496257 393271 478765 298803
36788 298803 -35547 -204068 -195574 -98269 111456 273032 45558 -496395 -761828 -443320
36778 -443320 38061 172490 -17900 -282583 -567700 -800258 -748935 -489429 -507514 -891880
36768 -891880 -946282 -179480 789324 1014278 563956 307548 566850 789780 537276 34784
36758 34784 -363022 -592166 -604498 -279099 164780 186799 -374716 -1026231 -1256049 -1074139
36748 -1074139 -752827 -453886 -325542 -542705 -968762 -1148191 -933161 -773951 -1058136
36739 -1058136 -1472926 -1409776 -789798 -115480 167049 44682 -217759 -339520 -209882 -9590
36729 -9590 -35836 -257253 -243208 259706 902366 1148965 920029 521691 119874 -338465
36719 -338465 -766268 -888100 -609889 -188760 26311 -104509 -431151 -616629 -425039 -32335
36709 -32335 115187 -99836 -256480 -19108 336457 409644 411945 853108 1600182 1877720
36699 1877720 1299730 351766 -329548 -643666 -743249 -577183 -141008 183872 59669 -210862
36689 -210862 -14706 669861 1147255 876511 115142 -473027 -573948 -359678 -74489 193794
36679 193794 365164 306425 54990 -87578 128687 575993 891423 886007 675195 484376
36669 484376 495381 785707 1175576 1222530 708960 115433 188379 942943 1542933 1372691
36659 1372691 768232 361801 155919 -255140 -874831 -1308001 -1417842 -1423397 -1414640 -1292292
36649 -1292292 -1156856 -1235526 -1400091 -1263768 -821191 -502970 -505670 -561708 -500750 -527598
36639 -527598 -736878 -838357 -650091 -455102 -557545 -824514 -969793 -987034 -992786 -897876
36629 -897876 -543671 11243 559105 917427 910754 462929 -145164 -451415 -427339 -529845
36619 -529845 -918095 -1084260 -621687 79034 355668 119120 -306556 -786757 -1212641 -1107672
36609 -1107672 -204796 752947 678747 -314550 -888617 -275513 672889 710358 -144881 -820424
36599 -820424 -686539 -137513 221803 312723 346829 330985 128118 -198948 -393684 -317027
36589 -317027 -76958 138376 217714 131626 -45459 -79074 252687 794337 1022837 669242
36579 669242 177478 195202 681373 963491 731165 451244 551987 712892 442885 -10836
36569 -10836 20943 532130 738415 208397 -470492 -489467 81214 398626 -84244 -1023382
36559 -1023382 -1682998 -1744372 -1457704 -1153531 -877687 -562063 -311937 -296743 -457757 -561988
36549 -561988 -493020 -253144 222365 885370 1259196 818568 -179333 -766412 -446821 165608
36539 165608 250247 -148944 -430699 -390953 -264110 -116116 132614 264077 39342 -169153
36529 -169153 244096 1050997 1225228 279371 -1021399 -1590143 -1215757 -530588 -149212
36520 -149212 -167298 -301457 -264517 -68712 262 -179458 -281232 36925 553398 746454
36510 746454 546120 341166 284494 154939 -49940 6505 366878 592216 427327 140201
36500 140201 -27817 -240350 -636810 -1007032 -1155517 -1129512 -871387 -195167 617700 814927
36490 814927 175229 -542915 -615219 -292636 -227397 -474472 -670341 -783920 -1028189 -1306677
36480 -1306677 -1355367 -1228903 -1137925 -1037716 -841318 -742010 -841356 -807372 -440396 -193147
36470 -193147 -497365 -949483 -894125 -486575 -356798 -478359 -287112 203770 369766 90891
36460 90891 -21332 313539 579019 306003 -318792 -916910 -1339255 -1417637 -948369 -168064
36450 -168064 340835 420139 433269 467538 143042 -565725 -1057009 -986082 -754305 -763907 -838192
36439 -838192 -760747 -728839 -825756 -673589 -110454 359089 295712 -29662 -206836 -337631
36429 -337631 -599809 -748909 -637354 -641683 -926901 -893968 -130258 665693 623362 96596
36419 96596 102812 690993 961738 576616 151799 104852 137518 34263 29936 135267 -29770
36408 -29770 -432448 -489698 -88146 69196 -408718 -882602 -668550 -102590 44347 -264070
36398 -264070 -437639 -227306 65276 171103 87745 -159485 -507195 -689144 -524136 -314599
36388 -314599 -540006 -1152748 -1550723 -1306083 -637115 -101677 -47551 -412290 -880808 -1175664
36378 -1175664 -1277355 -1356917 -1467182 -1431191 -1119856 -662856 -249141 68737 177920 -209089
36368 -209089 -1092374 -1780807 -1460798 -229558 876027 1055106 586642 267253 356205
36359 356205 482273 402387 327102 411336 375349 -73539 -702079 -975651 -703528 -141525
36349 -141525 462561 1030389 1347875 1081952 341638 -171105 50981 627764 779048 324724
36339 324724 -231566 -502365 -607803 -747335 -847283 -771975 -530387 -156848 276447 439725
36329 439725 -45505 -982253 -1569328 -1271729 -420341 298698 609753 592854 244513 -387904
36319 -387904 -823020 -479253 536669 1390924 1413321 759429 89289 -163546 -72943 30114
36309 30114 -88397 -393918 -654907 -687374 -535986 -380859 -295885 -176201 100481 512127
36299 512127 910961 1174579 1322427 1456679 1567690 1473182 1048351 442355 -91435 -507573
36289 -507573 -874130 -1012044 -582087 351591 1153756 1224292 591725 -221825 -704631 -611055
36279 -611055 -16425 661480 927418 701845 349636 110185 -152746 -466392 -491541 -97340
36269 -97340 267317 245636 175634 432190 593560 54381 -810312 -1018011 -440961 58472
36259 58472 39448 32594 388661 577334 193333 -198482 31253 501083 506355 284331 621840
36248 621840 1441833 1777026 1208830 472456 375010 772656 961613 612581 -26093 -535659
36238 -535659 -650656 -403907 -156350 -281014 -672184 -806143 -444670 -10283 -32010 -447843
36228 -447843 -761624 -756982 -704844 -844637 -974230 -740577 -188189 223089 190296 -16246
36218 -16246 120858 673616 1118851 957509 299399 -313145 -510396 -339554 -55198 69644
36208 69644 -174376 -695434 -942586 -361841 844824 1727364 1583225 736436 100594 150508
36198 150508 591840 905876 880005 607073 280505 106663 205045 447462 524531 304884
36188 304884 38830 64933 353098 484427 131527 -525243 -950502 -823994 -374266 -66654
36178 -66654 -26159 29191 220497 154721 -533437 -1412736 -1529547 -627018 359702 429999
36168 429999 -181959 -415890 38709 316104 -276894 -1196547 -1467240 -1045446 -681029 -692142
36158 -692142 -673736 -398830 -194528 -198229 14097 631077 1070751 838583 443226 718017
36148 718017 1487342 1707534 924218 -151049 -675546 -624950 -419009 -185974 130579 314361
36138 314361 64412 -482016 -823038 -674527 -221454 181418 364916 433680 611864 920027
36128 920027 987842 458978 -318226 -438080 372143 1112995 663989 -638563 -1311650 -660860
36118 -660860 344996 454489 -253257 -699780 -359548 197108 245987 -194880 -589528 -642369
36108 -642369 -567846 -701416 -1004117 -1026590 -442914 392372 649144 -46943 -1079863 -1494278
36098 -1494278 -1032406 -215638 460274 948975 1257823 1155700 560507 -118024 -371901
36089 -371901 -179480 66199 96711 2180 10236 231022 560530 703997 419355 -120365
36079 -120365 -389860 -137374 258666 326026 156919 138341 233331 92508 -174690 -4643
36069 -4643 674536 1135707 848266 241307 -9638 -2037 -284749 -820946 -1013372 -697191
36059 -697191 -384271 -394671 -395131 -73501 271998 200695 -202130 -520847 -593617 -523217 -328589
36048 -328589 20063 351055 432951 295333 135432 17934 -65364 -6699 203229 237225
36038 237225 -155898 -601881 -470352 209075 738799 752385 644619 781407 884934 641563
36028 641563 407255 669688 1110184 939350 130564 -386983 37529 925243 1394386 1303063
36018 1303063 1187957 1294121 1237433 727932 180648 252607 913988 1353456 921012 -93136
36008 -93136 -863751 -1059130 -1096804 -1355818 -1575844 -1327727 -771015 -493185 -675401 -844869
35998 -844869 -529046 175747 808486 1049768 893107 550026 348210 528698 960661 1197828
35988 1197828 982989 574274 419489 642544 1032963 1401729 1678653 1714176 1310980 571168
35978 571168 -17174 -43815 368865 755604 883842 891940 833048 432948 -409161 -1121567
35968 -1121567 -966893 -78541 521784 177789 -581483 -840278 -493103 -106035 83145
35959 83145 296871 479840 256709 -246184 -331193 191713 557203 133884 -642887 -975776
35949 -975776 -813309 -607631 -416370 -21743 347907 264806 -37863 102225 641337 759288
35939 759288 126213 -549131 -604346 -362243 -468023 -832227 -868019 -461377 -73867 -6993
35929 -6993 -111106 -205222 -306581 -368644 -191003 245387 615545 583412 134254 -518219
35919 -518219 -1154677 -1522900 -1292875 -383119 642385 861614 -22239 -1141545 -1297063
35910 -1297063 -357650 565235 490003 -315894 -909583 -945096 -812437 -760464 -597181 -277859
35900 -277859 -108516 -173020 -145688 71934 88236 -276121 -568672 -423477 -200762 -366965
35890 -366965 -664953 -558446 -189959 -144172 -406449 -355376 158225 487736 175310 -390171
35880 -390171 -642478 -638954 -774047 -1077485 -1243425 -1128766 -843550 -509358 -242956 -215898
35870 -215898 -415374 -494785 -199663 167999 77494 -473181 -896865 -778437 -376933 -223845
35860 -223845 -456634 -747789 -779273 -598730 -492818 -596703 -704032 -524436 -109164 140966
35850 140966 -4937 -250716 -155243 245353 506520 445696 381706 582805 810612 673355
35840 673355 221844 -105779 -45683 243773 469034 520995 488046 492657 534371 441893 65589
35829 65589 -409824 -521221 -83559 460038 498293 -30420 -630948 -870034 -726629 -419750
35819 -419750 -213137 -322157 -664094 -776434 -388365 27428 -184340 -798867 -913231 -320041
35809 -320041 128464 -147047 -594342 -560359 -379794 -632807 -992009 -819335 -420696 -539605
35799 -539605 -882373 -452932 638554 1059031 269040 -625508 -621956 -239704 -342684 -565572
35789 -565572 -64062 824033 931898 38089 -837604 -920638 -523291 -281678 -362490 -636851
35779 -636851 -966685 -1070575 -666494 7742 308713 55215 -185890 58722 491987 550272
35769 550272 212537 -98422 -186792 -253701 -498116 -878365 -1250815 -1501897 -1526981 -1247543
35759 -1247543 -693711 -18763 538742 703024 327213 -369136 -851913 -744523 -220739
35750 -220739 209292 278668 182112 220942 423303 618172 725182 768916 678116 340115
35740 340115 -91817 -231925 2631 129193 -307565 -1010673 -1180335 -481205 607226
35731 607226 1453673 1892070 2040425 1918420 1540765 1105536 766169 399030 -120706 -577807
35721 -577807 -645992 -351072 -40740 43851 -36659 -79669 70015 412049 766133 976743
35711 976743 1173688 1572765 1972646 1865810 1229552 721356 751999 851839 437170 -247980
35701 -247980 -570798 -510690 -499265 -552637 -392478 -254817 -635704 -1219990 -1057105 -47915
35691 -47915 677800 295421 -621461 -1074099 -965325 -790821 -638274 -319796 -91595 -354642
35681 -354642 -800684 -692715 -22155 369667 11455 -508340 -416612 160501 449157 119664
35671 119664 -343614 -363311 5145 241343 55130 -344684 -659092 -903615 -1231377 -1524898
35661 -1524898 -1452885 -941972 -369221 -210571 -601845 -1220455 -1471176 -908389 244597
35652 244597 1054967 728042 -443074 -1327544 -1265624 -762715 -699335 -1230964 -1794820 -1935699
35642 -1935699 -1724076 -1445392 -1212445 -930821 -483571 76739 485187 497836 191001 -118308
35632 -118308 -266885 -351943 -424325 -373571 -216881 -181592 -332563 -424631 -322414 -246829 -357353
35621 -357353 -413318 -168189 184700 313915 246615 195575 143577 31914 134280 712583
35611 712583 1412651 1553964 1028085 407078 106033 -63392 -378924 -733548 -912546 -954818
35601 -954818 -951025 -772172 -302531 243844 506065 358688 -79802 -673448 -1279365 -1638457
35591 -1638457 -1513083 -953737 -283679 193970 389486 370156 239572 88718 -22968 -85258
35581 -85258 -122048 -158093 -207852 -276298 -355832 -439105 -537184 -655312 -741217 -684985 -393641
35570 -393641 116840 668576 956794 725944 19452 -749085 -1080061 -817124 -272567 116547
35560 116547 239368 361062 714461 1140011 1258912 992181 735287 907844 1444608 1884281
35550 1884281 1893238 1530406 1034301 562937 202068 66368 265256 774889 1345880 1558531
35540 1558531 1139003 354484 -86312 213870 806509 930647 491525 104942 179938 448449
35530 448449 548012 570587 710109 767471 464459 44524 101009 815928 1678394 1999491
35520 1999491 1548127 714609 177708 336359 943867 1370030 1276017 878294 513700 232893
35510 232893 -22335 -150389 -83136 -30788 -226026 -555572 -709487 -588082 -341242 -129075
35500 -129075 -44496 -125846 -254438 -214654 -34277 -17007 -208094 -137533 545420 1430567
35490 1430567 1760607 1340161 662014 277799 405502 980297 1668318 1958626 1653034
35481 1653034 1139742 807517 436874 -306404 -1032069 -1006964 -286906 325756 524479 867249
35471 867249 1643684 2189118 1841177 964717 413103 384419 424622 287426 166589 182319
35461 182319 196782 162232 197991 235608 -27311 -645843 -1169861 -1101605 -506845 32470
35451 32470 85480 -163618 -226298 15135 168431 -86094 -522251 -667874 -400178 -1191
35441 -1191 248532 266685 72377 -209090 -321476 -159102 -5926 -192689 -607244 -876314
35431 -876314 -900950 -797425 -463123 228633 870707 847332 310540 126373 619849 1074647
35421 1074647 842675 280778 81166 248995 344714 278831 225324 117884 -102953 -52599
35411 -52599 569952 1237762 1141674 381997 -153442 -106757 -47554 -383007 -647906 -285205
35401 -285205 443272 818309 584105 82925 -278955 -322956 -50355 335055 473555 235061
35391 235061 -16861 164378 668460 880491 428051 -330626 -676619 -300729 380258 669169
35381 669169 321637 -201764 -258518 248300 800986 942043 823204 924390 1353900 1684522
35371 1684522 1519208 995900 568861 407716 248404 -121676 -448032 -284636 364696
35362 364696 904829 762623 37410 -599061 -633143 -213488 127646 159060 193606 586677
35352 586677 1145530 1287922 821065 276678 241055 553019 540605 10697 -441965 -285291
35342 -285291 173211 218767 -258296 -609375 -316649 310946 528491 88389 -441516 -345858
35332 -345858 343771 765312 148213 -1230438 -2219786 -2033131 -1137213 -682043 -1125735
35323 -1125735 -1737188 -1568926 -647769 102998 44314 -447141 -586925 -220257 123534 99662
35313 99662 -35601 -37038 -199378 -816992 -1426082 -1233233 -287510 423989 290608 -66867
35303 -66867 297848 1271255 1788228 1224733 127119 -565353 -583877 -348026 -207866 -56791
35293 -56791 316226 805295 1098321 1084371 951698 885406 847719 720713 496229 202528
35283 202528 -195711 -639395 -854936 -640045 -193320 93332 111608 49877 28531 68008
35273 68008 326933 885800 1285015 884447 -110319 -604534 -18312 801951 666207 -361549
35263 -361549 -1163330 -1151917 -861755 -922817 -1199604 -1224711 -912542 -471970 -10273 410996
35253 410996 622000 590358 586842 784462 915759 691125 365397 431812 811921 839423
35243 839423 173772 -672606 -952346 -547088 46475 378832 383113 171503 -146394 -409474
35233 -409474 -447014 -271656 -58388 107034 269372 381642 312977 163293 270040 723204
35223 723204 1143542 1164437 869580 489534 -28179 -740017 -1254028 -1115396 -578137 -434681
35213 -434681 -994126 -1702551 -1899454 -1519082 -910582 -410373 -282065 -639756 -1166539 -1288226
35203 -1288226 -901691 -572033 -718210 -980368 -773219 -154906 281078 170345 -344119
35194 -344119 -900895 -1120983 -726154 130071 800663 823129 531094 569248 918927 906787
35184 906787 180484 -824216 -1513465 -1798217 -1898508 -1813673 -1340703 -561744 -38487 -329976
35174 -329976 -1285715 -1984843 -1635444 -521401 275495 187024 -209007 -96225 478216 839497
35164 839497 686959 308209 -21750 -271621 -340508 -89945 236968 133906 -470533 -1023440
35154 -1023440 -1017263 -536569 -14932 248209 191565 -106462 -445511 -585065 -444438 -164606
35144 -164606 24022 -53075 -354471 -499353 -73718 707935 993846 353992 -495401 -604812
35134 -604812 -147218 -114098 -800792 -1469394 -1579775 -1438026 -1348926 -1020335 -305504 225856
35124 225856 87759 -346883 -519056 -593756 -951032 -1212251 -686302 380789 903220 395738
35114 395738 -430814 -735601 -578498 -524322 -677676 -605273 -73641 554630 769162 553867
35104 553867 378356 545773 774067 631830 215857 -901 43050 -109631 -599991 -886526
35094 -886526 -584118 -133747 -75905 -105677 393773 1144964 1200375 381811 -390779 -453770
35084 -453770 -266488 -469240 -784499 -557933 45367 200943 -321837 -802840 -615775 -63888
35074 -63888 118488 -279031 -829026 -1091900 -1010344 -757613 -504505 -364476 -317036 -113729
35064 -113729 492510 1275535 1535982 860735 -251886 -882301 -776902 -536906 -633927 -727797
35054 -727797 -311732 350974 494548 -66236 -665861 -652700 -59450 698753 1327998 1631583
35044 1631583 1410577 757655 187988 119869 393742 590872 602929 532585 269194 -331193
35034 -331193 -950273 -1058370 -718823 -613575 -1102415 -1736749 -1946873 -1769743 -1579178 -1477910
35024 -1477910 -1327905 -1075656 -687243 -71568 550349 569853 -193621 -935090 -785714 -52574
35014 -52574 247546 -34485 -29068 583220 878144 92441 -1101316 -1479100 -887773 -183672
35004 -183672 119448 301359 610051 768664 517047 134855 132152 630186 1211245 1316747
34994 1316747 793896 74287 -312193 -385753 -573806 -894503 -817068 -197045 250295 -60553
34984 -60553 -620466 -538468 142786 625180 620641 591042 784115 876237 684370 484884 445404
34973 445404 395752 337689 549312 990670 1208177 1015106 679368 308519 -257514 -772366
34963 -772366 -619091 144307 591095 250989 -155313 98966 589475 547881 187873 282324
34953 282324 819395 1053081 712220 254356 -41194 -388557 -822611 -978055 -757701 -615607
34943 -615607 -916565 -1461896 -1851389 -1921826 -1662551 -1093600 -440477 -98050 -183186 -356369
34933 -356369 -278487 -39305 54815 -53347 -139779 -70245 -10302 -195921 -564121 -743910
34923 -743910 -506077 -119196 -37105 -254156 -284692 108078 493884 331266 -303180 -834795
34913 -834795 -889400 -606627 -363183 -410629 -700716 -895152 -653797 -48091 457399 545195
34903 545195 363833 202417 127475 104014 168925 270197 222650 18195 -140656 -269210
34893 -269210 -606522 -983848 -796712 -13136 434324 -116158 -995932 -1147398 -649969 -409097
34883 -409097 -676144 -896185 -857239 -911846 -1021651 -651408 146994 524695 109196 -332911
34873 -332911 24839 984810 1759909 1913682 1461441 602165 -197774 -342459 215514 816898
34863 816898 952898 839727 821148 744270 385643 4185 -62772 50930 123653 383914
34853 383914 1061114 1713941 1676908 1020695 455118 357486 468638 525372 622505 843098
34843 843098 994743 893860 612831 318116 87706 -40668 -48017 -25323 -122155 -354425
34833 -354425 -574243 -642714 -558893 -445705 -443799 -531931 -448565 21200 643702 878632 520611
34822 520611 -77753 -532836 -820322 -954734 -725310 -127654 319675 192435 -159478 -89689
34812 -89689 355736 523262 191005 -88605 163481 659609 760774 266459 -450635 -898442
34802 -898442 -875267 -559604 -304445 -268241 -267065 -119184 -31272 -369818 -1075887 -1616137
34792 -1616137 -1581279 -1093229 -576515 -365659 -557875 -960604 -1116756 -680561 124038 699171
34782 699171 821301 851025 1036822 1031720 478223 -239275 -361494 197561 679749 468534
34772 468534 -176512 -594313 -598036 -537182 -665935 -843091 -871048 -803760 -795348 -878106 -1039103
34761 -1039103 -1314055 -1616251 -1656966 -1299150 -869509 -813511 -1098732 -1292563 -1210175 -1076970
34751 -1076970 -972565 -595247 151313 767836 787197 489409 470854 684135 521733 -137352
34741 -137352 -608470 -378076 125399 154261 -304837 -586776 -307484 209532 473607 369221
34731 369221 30947 -456072 -968563 -1198227 -937966 -451828 -240075 -383336 -400560 91726
34721 91726 802026 1082370 711583 111086 -188521 -56259 281967 549171 580631 377191
34711 377191 138695 121159 340191 521860 451431 246352 150300 179115 159324 51211
34701 51211 14238 119732 179950 -16404 -373568 -540052 -346719 -98896 -265406 -855216
34691 -855216 -1318026 -1221800 -819994 -648052 -707495 -490087 192144 900400 1239388 1331056
34681 1331056 1330784 967470 56495 -879831 -1101549 -609891 -76907 85118 36499 -47277
34671 -47277 -218385 -356276 -148146 297963 372741 -176178 -781671 -844855 -575406 -576195 -902969
34660 -902969 -1070355 -819235 -349959 146829 690139 1193751 1383879 1161649 750032 393886
34650 393886 161839 54605 2601 -250260 -876551 -1516288 -1548400 -990934 -658678 -1084978
34640 -1084978 -1697993 -1548488 -568076 462996 1042484 1385877 1692275 1645014 994907
34631 994907 183714 -100371 185920 412517 128273 -376042 -465573 45780 661431 784629
34621 784629 433773 186720 357214 523485 191800 -315237 -208428 540122 1002704 603045
34611 603045 -25668 -2321 501467 632308 226264 -2916 368762 853521 778942 85611
34601 85611 -804646 -1465634 -1624735 -1254129 -693346 -336585 -101360 380251 994663 1176309
34591 1176309 908491 990029 1824692 2564062 2166715 908161 20009 -1411 128015 -227209
34581 -227209 -669662 -499812 166800 560780 307993 -160092 -238404 140424 537886 586814
34571 586814 394859 377052 755139 1286287 1509432 1217480 633019 132552 -133783 -304219
34561 -304219 -522450 -708279 -711585 -609639 -616600 -670278 -428782 134063 470847 171402
34551 171402 -333794 -293929 281418 651713 430896 1933 -253456 -469926 -803369 -1060725
34541 -1060725 -1160227 -1348240 -1551400 -1152979 18168 1052940 1026001 259406 -223217
34532 -223217 -133742 26132 70505 313652 679807 597626 6310 -347608 24523 625006
34522 625006 701448 225982 -246388 -347785 -166681 34142 94538 54382 70488 134234
34512 134234 -33460 -551310 -993740 -861694 -350669 -135183 -389959 -586282 -348588 66244
34502 66244 324941 485721 627484 511723 -14972 -630794 -884445 -696752 -322253 -70467
34492 -70467 -176750 -616402 -960688 -820138 -496261 -671341 -1335967 -1673334 -1278628 -809093
34482 -809093 -972745 -1490569 -1645463 -1353632 -1029500 -769348 -372062 58994 195919 51115
34472 51115 -86651 -165619 -326079 -488712 -494862 -515395 -788265 -1063669 -872047 -299150
34462 -299150 46917 -149884 -612096 -972102 -1103648 -971672 -651153 -494453 -755002 -1018240
34452 -1018240 -581149 488295 1246625 1045139 297960 -169297 -64395 369058 836413
34443 836413 1093483 922121 424383 88912 176851 270181 -154659 -898093 -1270815 -1071422
34433 -1071422 -798479 -816922 -852698 -595093 -344790 -560875 -995507 -902633 -164761 400866
34423 400866 188148 -253745 10706 894341 1374452 959294 317331 227368 590393 887425
34413 887425 1013772 1083682 873117 167570 -585920 -686031 -158368 293414 285066 96471
34403 96471 10339 -61116 -164770 -110436 100846 152032 -57460 -202615 -79774 81212
34393 81212 94280 140016 291885 182312 -402908 -942605 -719767 230430 1180510 1608737
34383 1608737 1584686 1315250 815189 171040 -277760 -320094 -236402 -471918 -979597 -1171041
34373 -1171041 -652542 185957 579141 330123 20868 185849 624680 795452 587426
34364 587426 307975 112882 -69674 -154073 36999 317725 267753 -113599 -386099 -389817
34354 -389817 -426959 -563515 -375136 296474 927385 1075660 1013389 1082973 960878 259440
34344 259440 -539396 -591960 21648 350140 -40866 -481690 -208555 651227 1399288 1605145
34334 1605145 1307670 725055 94550 -379538 -638985 -732249 -625047 -269749 119042 184487
34324 184487 -75525 -258347 -142661 22021 14238 63713 440323 894865 930782 513152
34314 513152 108251 32059 104245 -8055 -407339 -1006973 -1660436 -2087768 -1921911 -1091341
34304 -1091341 -49944 618136 789841 786878 799793 628029 111255 -457378 -620277 -330138
34294 -330138 38844 201744 214359 225277 265474 337011 438484 426921 140098 -242630
34284 -242630 -292170 40797 237717 -66066 -500166 -497590 -175107 -199858 -871474 -1779828
34274 -1779828 -2357724 -2382581 -1945487 -1336887 -1004406 -1216324 -1656510 -1695167 -1165415 -552741
34264 -552741 -328841 -436167 -535885 -419159 -46031 480589 852380 829384 696089 1003245
34254 1003245 1667061 1837624 1007233 -221610 -919126 -955077 -804617 -614521 -184938
34245 -184938 295639 283097 -263399 -701264 -584614 -210032 -55851 -125609 -129483 33068
34235 33068 260697 455264 488065 192703 -371285 -846360 -975505 -872996 -711724 -402815
34225 -402815 131679 596361 613526 285986 112259 341773 718700 907933 903066 914992
34215 914992 1060870 1275455 1394341 1249804 810583 282109 -74710 -282140 -618644 -1134127
34205 -1134127 -1401522 -1016469 -247779 149607 -155395 -648593 -653825 -196169 130283 25425
34195 25425 -189918 -153384 30555 71616 -15069 13008 241556 561789 848518 902886 436190
34184 436190 -484515 -1144309 -876874 -32484 345557 -70644 -453041 -90034 553458 622374
34174 622374 221325 195638 772731 1246828 1094988 683776 596868 825274 985873 926501
34164 926501 722552 368447 -137582 -591125 -799241 -839831 -799773 -455654 371007 1250505
34154 1250505 1429910 769473 -9581 -191439 144031 431351 443432 451967 676179 949963
34144 949963 1016125 873175 665295 417254 96892 -166921 -194933 -80395 -120989 -336954
34134 -336954 -347700 55595 482121 451492 159474 231627 708024 854739 244194 -496166
34124 -496166 -488351 190424 687054 587403 319309 323209 443680 358111 92288 -204104 -574365
34113 -574365 -974917 -1032748 -544574 -779 -132726 -1016160 -2014134 -2525960 -2402119 -1732969
34103 -1732969 -756094 -4422 13306 -511510 -785319 -436517 -9636 -106934 -458047 -352147
34093 -352147 254736 651008 369777 -227568 -503088 -314609 -37561 -24470 -228680 -302347
34083 -302347 11466 584762 1055068 1282984 1477703 1761276 1874798 1582033 1126811 915151
34073 915151 919282 830847 658934 647541 682499 418857 45474 212086 964262 1451892
34063 1451892 1106422 483530 389650 696076 691298 241314 -138665 -189311 -183811 -336510
34053 -336510 -536112 -695052 -861437 -965926 -913485 -909343 -1217717 -1605335 -1524335 -885457
34043 -885457 -179063 200180 273151 124236 -213511 -465762 -309417 7006 -155761 -821873
34033 -821873 -1200077 -801938 -171066 -81095 -515382 -929016 -1114421 -1272907 -1490303 -1630974
34023 -1630974 -1606889 -1397985 -968621 -444789 -152996 -198272 -234451 72829 594826 990268
34013 990268 1113860 938457 442616 -117403 -220756 250113 723553 716415 499089 529921
34003 529921 658012 484611 174872 236556 685748 1048358 1052231 782078 328354 -186290
33993 -186290 -452734 -398882 -490495 -995183 -1289970 -690171 317715 612379 73922 -307915
33983 -307915 33958 609661 898400 1000597 991774 576451 -209779 -757676 -740329 -508537
33973 -508537 -352646 -155847 -40436 -421887 -1043044 -979717 -143455 297584 -275304 -809345
33963 -809345 -265245 598869 435789 -479495 -773034 -260884 -87504 -644595 -958191 -478106
33953 -478106 -56115 -501861 -1269873 -1352861 -680597 118433 710372 1044462 853307 26737
33943 26737 -751130 -583083 373550 920178 351505 -550345 -496994 600804 1461997 1040706
33933 1040706 -193469 -949638 -765078 -366930 -445550 -774737 -832944 -676636 -660071 -698378
33923 -698378 -441859 14343 193262 -51823 -388391 -532912 -481408 -261138 89521 311555
33913 311555 142542 -249412 -456047 -418787 -388146 -354831 -70613 335467 369301 -23919
33903 -23919 -228113 186209 840120 1114227 946517 689332 490907 264343 97565 234377
33893 234377 633994 909530 835476 673508 781018 1021157 875274 219827 -343527 -244530
33883 -244530 220144 305689 -57178 -233885 -43975 -137571 -872382 -1611483 -1704931 -1439796
33873 -1439796 -1301227 -1012866 -251033 329340 -30501 -725237 -519869 457509 867231
33864 867231 312126 -124308 249742 776503 852462 891589 1168106 990121 -32385 -984736
33854 -984736 -952244 -412968 -252247 -221935 399274 1258978 1373542 763459 394906 641594
33844 641594 931678 883664 760528 730573 582145 296545 148894 139309 -22956 -327547
33834 -327547 -459048 -367994 -266862 -141997 125649 286191 32472 -345142 -315393 18595
33824 18595 136492 21952 23688 -46035 -673462 -1531416 -1697098 -1131359 -841974 -1271784
33814 -1271784 -1618685 -1227353 -602740 -384474 -255794 300169 895146 789438 61390
33805 61390 -598589 -903547 -1044924 -1059981 -834389 -526683 -371982 -242408 72674 389698
33795 389698 465966 528342 855993 1077873 577759 -509005 -1361072 -1504921 -1193755 -784892
33785 -784892 -358194 -6711 94442 62149 245800 637064 799278 554331 296365 403301
33775 403301 726292 912467 903200 843170 759206 603382 434373 329603 251217 149052
33765 149052 32746 -177544 -637472 -1232141 -1488496 -1117633 -489501 -263249 -622596 -1166044
33755 -1166044 -1503555 -1621764 -1601845 -1330594 -735335 -105259 131684 -59832 -252584 -92456
33745 -92456 262497 359377 7135 -526778 -840602 -778556 -476471 -169445 -30014 -92989
33735 -92989 -216225 -152225 214051 675954 850279 561185 14916 -445742 -669344 -702894
33725 -702894 -594255 -382216 -240557 -364227 -624246 -599391 -152346 253128 118106 -358543
33715 -358543 -505934 -112288 285715 137795 -476453 -1103482 -1467169 -1536954 -1344673 -1012640
33705 -1012640 -762054 -664270 -558477 -354592 -146208 108854 606520 1148018 1066572 133072
33695 133072 -913081 -1277224 -1133889 -1091193 -1054254 -506188 314838 541613 20394 -429659
33685 -429659 -277128 98999 286390 417117 509868 170010 -530140 -761548 -198463 258588
33675 258588 -166120 -806839 -597340 172849 338230 -227968 -451074 173698 830111 708870
33665 708870 127980 -126286 133006 544875 792028 733356 348931 -123573 -335710 -319678
33655 -319678 -450050 -760746 -801364 -418925 -137568 -365082 -690732 -457739 319255 1100735
33645 1100735 1586163 1803751 1677024 1109210 423550 141640 270607 305477 44394 -64016
33635 -64016 410535 1229708 1753737 1619134 957685 166474 -341617 -364148 -115109 -68272
33625 -68272 -410828 -796992 -816266 -514546 -213567 -11636 198928 354933 278260 78996
33615 78996 70790 226289 159511 -206552 -415705 -186235 87950 -71689 -493030 -682417
33605 -682417 -618749 -668409 -862248 -852913 -578959 -398792 -470272 -511282 -320997 -66241 116566
33594 116566 335463 556110 480375 90866 -134306 104825 451529 482166 395534 633214
33584 633214 1098319 1283543 1028803 667152 490466 487285 550998 561553 316105 -241286
33574 -241286 -758884 -816490 -508325 -336918 -537885 -854380 -974695 -843670 -537117 -194489
33564 -194489 -107932 -493967 -1081643 -1279406 -883000 -311432 -9596 77605 259915 592767
33554 592767 827591 718314 241386 -353252 -650733 -432871 -442 105340 -207441 -452709
33544 -452709 -264742 107987 259366 242616 317772 321491 -139099 -884668 -1181111 -798262
33534 -798262 -495071 -975681 -1769566 -1823237 -1032275 -389088 -492224 -730917 -382748 204392
33524 204392 242869 -186857 -341448 -82359 344 -277353 -358007 56795 494502 518975
33514 518975 332000 216975 59942 -183222 -193868 108124 295850 186937 186688 428434
33504 428434 354502 -245590 -602904 -154679 430116 340960 -18672 128240 435890 105280
33494 105280 -486175 -326186 366573 411047 -274903 -515602 68400 494601 292606 315432
33484 315432 1023932 1474404 906654 38568 -206961 -114515 -275800 -346627 126977 550575
33474 550575 203219 -402583 -331532 214932 422321 418506 932633 1742963 1886311 1307247
33464 1307247 935541 1064872 974100 392555 70451 419556 682820 114372 -841763 -1257246
33454 -1257246 -1015418 -712920 -645352 -545839 -197926 204863 364885 269594 169206 228997
33444 228997 293601 119415 -182499 -218463 74145 269575 146501 89205 404225 706678
33434 706678 551279 244044 313047 532031 326390 -94749 11773 621437 922199 685435
33424 685435 595724 933074 982768 278568 -492527 -513778 -21370 295670 465622 929793
33414 929793 1464139 1349677 552658 -77640 31418 381127 51506 -1141779 -2407873
33405 -2407873 -2855990 -2453033 -1948670 -1821805 -1642061 -859044 80723 170234 -587793 -959610
33395 -959610 -237451 615529 306704 -902620 -1579518 -1094022 -251185 55152 -71979
33386 -71979 -77058 109846 153995 -44045 -251646 -309780 -281156 -196605 71548 532674 806082
33375 806082 413647 -527777 -1182604 -937171 -303639 -316272 -1004448 -1210923 -278442 834534
33365 834534 825894 -113684 -664929 -301960 201461 234146 262781 866128 1668657 1852860
33355 1852860 1254204 410718 -134237 -139664 367265 955412 919084 53212 -910960 -1119100
33345 -1119100 -630797 -132668 158676 616703 1258783 1436948 751571 -283496 -870455
33336 -870455 -861397 -707214 -744335 -903343 -989603 -937954 -816990 -751215 -784285 -741765 -380675
33325 -380675 236319 719909 820566 678322 480204 186615 -180104 -327348 -127054 43810
33315 43810 -161861 -433287 -229693 340793 678007 662164 791077 1228388 1380431 750095
33305 750095 -279062 -893802 -765532 -214199 255874 326076 46478 -124887 248823 937468
33295 937468 1206545 840040 511615 760091 1093600 696474 -320117 -1046643 -984726 -476300
33285 -476300 15562 407374 700599 770995 655851 620696 736930 732305 438483 86194
33275 86194 -31970 45894 74892 -50743 -231575 -353742 -450718 -673104 -1035273 -1182322
33265 -1182322 -647167 488843 1451511 1579800 1054631 499794 130883 -229230 -521277
33256 -521277 -465261 -157642 -43163 -227160 -352016 -223975 -32319 113309 283915 282683
33246 282683 -256572 -1143178 -1662287 -1582916 -1453960 -1585120 -1502465 -923184 -504042 -856893
33236 -856893 -1411996 -1179716 -289445 188407 -176095 -692253 -714569 -461818 -444253 -727826
33226 -727826 -1043678 -1131679 -767589 61381 795422 628671 -484675 -1564655 -1681140
33217 -1681140 -955123 -181343 174548 193839 29729 -265764 -547423 -652773 -650594 -668368
33207 -668368 -537722 -14381 657894 862173 423619 -93561 -131679 156630 247855 17233
33197 17233 -212841 -244184 -216953 -268764 -333598 -341779 -339751 -336800 -271583 -193303 -242103 -392087
33185 -392087 -456894 -399141 -351837 -272259 75847 660864 1072496 1080018 950265 973209 1054453
33174 1054453 1080484 1258491 1649840 1762745 1190333 362540 10333 76884 -126777 -772526
33164 -772526 -1283759 -1301097 -1124820 -1024052 -833717 -522005 -464927 -739039 -736172 -65
33154 -65 993401 1413219 1112736 622268 371973 376892 482328 488223 188975 -326589 -576354
33143 -576354 -265613 188751 126779 -458690 -918258 -829864 -484635 -377714 -516881 -462564
33133 -462564 23427 557032 504040 -207742 -858478 -747298 -68426 397408 361518 267514
33123 267514 422242 530290 346297 157288 165353 -65357 -930249 -1917493 -2093641 -1303368
33113 -1303368 -312383 155908 24392 -388278 -676074 -434095 405001 1227636 1206474 282081
33103 282081 -672158 -821282 -218833 448396 687288 560591 381790 283861 144830 -125539
33093 -125539 -356620 -316366 -87067 -3149 -190996 -458438 -700683 -1027257 -1314438 -1088564
33083 -1088564 -224167 608807 673583 120301 -255061 -57129 361315 520915 352333 104879
33073 104879 54329 319616 734419 935374 752513 397257 118282 -99586 -307008 -378284
33063 -378284 -292373 -261860 -247212 217980 1222768 1932962 1537641 462596 -121525 125989
33053 125989 410277 85638 -517569 -757407 -559784 -323503 -328511 -498910 -568892 -392243
33043 -392243 -173259 -242752 -475708 -302880 395955 906879 710797 366423 608463 1049387
33033 1049387 783498 -35903 -398664 -121513 -76555 -588197 -846556 -306826 454206 791135
33023 791135 875307 952846 707317 68977 -234195 244095 775747 488603 -338296 -860430
33013 -860430 -986833 -1202658 -1505517 -1454371 -1028344 -607130 -281493 80267 279615 37085
33003 37085 -371146 -443519 -282589 -385645 -727738 -810990 -609356 -699371 -1297124 -1794112
32993 -1794112 -1499982 -446208 701821 1239316 903852 60110 -601568 -756199 -678443
32984 -678443 -602500 -263503 491415 1097024 969344 484868 448838 801770 789053 357016
32974 357016 325002 948474 1330763 759856 -192265 -523655 -134047 332724 486001 369046
32964 369046 12755 -508250 -791231 -522146 -71331 -81894 -502121 -611176 -80126 540726
32954 540726 594623 131798 -328695 -507565 -496990 -417894 -336971 -435315 -862637 -1362605
32944 -1362605 -1385793 -754141 38362 423756 466394 656280 1094366 1284311 845194 114965
32934 114965 -195636 180006 774606 867390 187612 -771097 -1113476 -383332 892677 1669022
32924 1669022 1451850 711339 180389 63630 143474 351841 826962 1472190 1810767 1395200
32914 1395200 260035 -1044069 -1843139 -1875181 -1499402 -1264917 -1273407 -1192695 -912595 -807213
32904 -807213 -1155375 -1655949 -1821071 -1575107 -1141153 -592139 95280 718019 977933 855614
32894 855614 554318 195456 -149728 -312986 -254715 -254769 -509033 -729888 -569842 -238815
32884 -238815 -179854 -288225 -82021 380388 440052 -143939 -728507 -639422 -23038 483684
32874 483684 568622 382215 123652 -151976 -418549 -616860 -671580 -479648 6340 610606
32864 610606 985175 914359 494932 19471 -226400 -139719 56690 -45412 -537212 -960646
32854 -960646 -855950 -398042 -138575 -254442 -481861 -677329 -908103 -1017841 -708862 -159650
32844 -159650 26442 -316984 -642938 -500358 -103105 160983 263434 272630 88835 -176210
32834 -176210 -63559 525003 938893 624163 -40310 -332254 -268844 -426645 -882598 -1049587
32824 -1049587 -578473 161041 600527 554924 232639 6989 162412 547599 578637 -37112
32814 -37112 -724550 -678670 14914 477731 270739 -95543 -46224 249857 260975 -170326
32804 -170326 -799551 -1345210 -1591153 -1430335 -1067569 -886750 -903187 -710370 -205216 113381
32794 113381 -34492 -98531 458584 1092286 798923 -303649 -937413 -409507 437142 470981
32784 470981 -205067 -627906 -430926 -162358 -292322 -626368 -808285 -822514 -760875 -525488
32774 -525488 -72244 329699 391141 209689 141176 350877 669487 818501 638982 180307
32764 180307 -313210 -586777 -642166 -705113 -845259 -830881 -530730 -231175 -254338 -426374
32754 -426374 -327095 -20882 -70843 -692912 -1336672 -1418184 -1141702 -1150393 -1524321 -1657149
32744 -1657149 -1196164 -589062 -392669 -433172 -150111 415344 592778 132046 -306068 -43631
32734 -43631 671457 1073541 912039 533365 145792 -346427 -823630 -965856 -918812 -1255291
32724 -1255291 -1976892 -2210813 -1389454 -213663 162877 -426152 -1132350 -1269801 -909756
32715 -909756 -419769 -14868 189753 146933 -4403 -70120 -22055 131762 487296 918825
32705 918825 899781 153154 -757661 -1090546 -978718 -1105364 -1459033 -1311984 -541446 -21164
32695 -21164 -293958 -665761 -232144 756391 1219946 637936 -437430 -1094569 -900319 -169500
32685 -169500 322160 40449 -738084 -1276113 -1318548 -1245942 -1215604 -815912 91949 852256
32675 852256 879138 512737 411468 569707 627213 717918 1160764 1567738 1191877 147990
32665 147990 -566331 -402090 123436 323457 161637 -105662 -476821 -973951 -1302474 -1175593
32655 -1175593 -735479 -341573 -133471 -24245 83012 281211 667485 1163305 1476524
32646 1476524 1405251 1056481 662958 334783 76616 -122667 -312343 -531358 -663938 -518123
32636 -518123 -125545 211570 255615 63062 -170851 -319055 -317523 -139821 138149 381055
32626 381055 536371 613636 577998 467094 529122 931269 1366199 1333111 849556 466799
32616 466799 473054 532749 307775 -37389 -255501 -480091 -830260 -939904 -450561 257514
32606 257514 438674 13356 -354313 -241804 27668 15938 -194464 -257628 -82850 194121
32596 194121 482381 691218 617101 158238 -464450 -897143 -967722 -706658 -253629 112971
32586 112971 110885 -154108 -190416 192056 477154 150035 -423865 -405813 308034 934224
32576 934224 952250 736527 754994 780431 413413 -92572 -183711 74289 88447 -329719
32566 -329719 -724154 -714260 -423484 -95478 241567 576841 777753 800053 714001 454870
32556 454870 -61082 -507259 -338235 388576 880227 608558 -3524 -276459 -230869 -342296
32546 -342296 -654059 -746160 -480660 -203057 -152934 -150207 -5607 130194 33765 -205590
32536 -205590 -277945 -53964 231291 214159 -177211 -576287 -571452 -244328 -108358 -445572
32526 -445572 -965540 -1266753 -1340538 -1367654 -1293951 -965283 -498861 -140929 127844 470835
32516 470835 767359 714938 361483 147845 322568 607002 566677 126622 -373061 -526593
32506 -526593 -252436 98780 102631 -215864 -403373 -215701 65931 144634 141240 173928 -57393
32495 -57393 -696604 -1096490 -533092 586219 1072252 581252 61488 317929 907896 917941
32485 917941 221909 -583593 -1048340 -1102247 -734837 -32095 589649 677831 270432 -180650
32475 -180650 -352909 -254065 6091 314276 454027 219486 -296230 -718112 -773888 -564206
32465 -564206 -410955 -504582 -749216 -943937 -1040786 -1101619 -1018491 -538816 274663 881077
32455 881077 862962 483355 280709 310326 246660 56708 -25814 -118465 -599762 -1346973
32445 -1346973 -1759563 -1683861 -1593302 -1633011 -1286327 -383719 351221 339823 40794 133072
32435 133072 426289 369654 123561 219710 507129 379959 -133591 -424912 -357380 -361804
32425 -361804 -483516 -265803 263620 391232 -178542 -806974 -926424 -874177 -1196668 -1666123
32415 -1666123 -1617499 -972577 -360022 -304675 -697574 -1052708 -1027075 -672499 -296014 -84651
32405 -84651 72452 269634 252995 -254202 -963278 -1215053 -839499 -367972 -227516 -173131
32395 -173131 211171 822545 1173649 963909 275699 -534338 -932721 -538165 355539 899845
32385 899845 656250 125577 -49565 -37318 -404128 -994358 -957787 30901 1218710 1698545
32375 1698545 1399174 819481 195523 -552298 -1231255 -1334248 -741943 -63095 21545 -447385
32365 -447385 -857940 -840822 -595413 -434678 -395022 -414962 -529399 -649448 -478759 14955
32355 14955 324623 37085 -454941 -397581 245689 729892 591912 190397 -9515 -120927
32345 -120927 -434978 -777207 -744573 -348806 16528 135261 127910 113724 40250 -130737
32335 -130737 -299470 -351061 -303285 -309555 -500356 -745933 -666244 -113645 424753 305348
32325 305348 -338744 -627442 -115591 535389 443152 -329339 -952742 -895879 -344851 222749
32315 222749 412764 42804 -624386 -914831 -483443 121384 144979 -269824 -304233 243974
32305 243974 618941 251837 -412963 -612805 -298979 -26342 -118012 -375997 -480758 -329877
32295 -329877 -23062 255849 349866 248038 82844 -12376 22129 193684 409569 481199
32285 481199 392691 479031 1017406 1677197 1776326 1158419 423821 146220 229057 234633 8280
32274 8280 -282156 -464053 -464640 -300990 -167804 -333140 -765724 -1073184 -978826 -643449 -360353
32263 -360353 -179890 -11012 162457 360990 653288 929536 893141 481998 36967 -147774
32253 -147774 -170990 -243099 -379869 -566158 -847046 -1029920 -734510 -40924 375490 122145
32243 122145 -378742 -638208 -804379 -1072040 -1024730 -355896 299144 220771 -128204 186380
32233 186380 877509 766567 -216929 -787999 -380206 -64625 -716119 -1507255 -1242032 -273554
32223 -273554 81634 -495970 -1092169 -1030321 -551372 -62071 412798 886504 1167691 1149010
32213 1149010 939858 658711 408777 376324 590682 694105 332096 -333975 -866300 -1146258
32203 -1146258 -1334005 -1418073 -1276358 -1040104 -901205 -691507 -200154 202194 -99724 -986036
32193 -986036 -1600155 -1460007 -987160 -743726 -713530 -621198 -447043 -249480 107842 619894
32183 619894 837818 384040 -369416 -594756 -13342 735060 855110 293520 -338805 -630142
32173 -630142 -820681 -1237395 -1587137 -1284597 -436510 87767 -195252 -691123 -586444 57108
32163 57108 594106 794361 908389 1012533 995573 1021042 1266613 1323089 656601 -359174
32153 -359174 -729918 -247157 256092 223686 45848 123766 194281 40647 3297 210079
32143 210079 104474 -592638 -1188977 -1026756 -503417 -290541 -203320 212726 575894 275266
32133 275266 -244322 -49210 632500 628536 -256497 -827675 -335806 446664 540836 153935
32123 153935 25553 163282 101177 -68242 176952 789344 1055738 582197 -164853 -476051
32113 -476051 -217041 169381 304434 307467 558293 1130387 1625804 1636755 1204525 674380
32103 674380 277297 81035 149835 399840 449619 53708 -398574 -315860 176707 321679
32093 321679 -149027 -563288 -261229 505033 1003077 951118 591223 153506 -250413 -367918
32083 -367918 43903 777099 1260275 1186454 802003 485645 274378 -22523 -381673 -500152
32073 -500152 -236778 91960 87772 -151695 -167300 113881 192991 -212883 -639110 -560865
32063 -560865 -245842 -315800 -679866 -634221 -18521 458701 242829 -331506 -598361 -352562
32053 -352562 183459 725514 977695 730895 197347 -111422 -64709 -76199 -378359 -604169
32043 -604169 -391523 45058 293578 287313 128234 -207598 -607364 -682078 -318316 5628
32033 5628 -119669 -433217 -491813 -342616 -211157 43195 536172 801354 366405 -341387
32023 -341387 -438922 131465 496406 101333 -560265 -646850 43950 950118 1324296 881890
32013 881890 69050 -381999 -301076 -218749 -466976 -616813 -235076 311529 450561 361522
32003 361522 548712 803703 524791 -108056 -262809 243250 703363 655579 356360 23132
31993 23132 -438815 -749276 -280282 857413 1641926 1485130 943647 674978 541215 266977
31983 266977 129978 329172 417725 93553 -120762 234339 611962 279833 -414027 -531216
31973 -531216 40654 577224 704771 712026 770445 657923 279245 -184061 -614022 -887162
31963 -887162 -628975 302832 1242447 1360926 797989 384475 309161 -41000 -829710 -1330327
31953 -1330327 -1073481 -575729 -429253 -406111 -99098 153561 -212683 -874574 -877086 -15813
31943 -15813 744254 493233 -443822 -932946 -438139 392954 605341 90050 -403488 -282378
31933 -282378 231371 548876 477849 285549 238055 384874 644953 794263 498199 -294453
31923 -294453 -1059925 -1149897 -524021 249678 667338 650304 321607 -154622 -472787 -326612
31913 -326612 207813 699714 859238 763407 564772 279776 -57054 -309207 -410168 -411674
31903 -411674 -336797 -218098 -250289 -574179 -891274 -680300 74699 709933 625323 -30281
31893 -30281 -569085 -471594 215888 995813 1329460 1082656 623618 382761 384190 365550
$$ [...]
##END NTUPLES=NMR SPECTRUM
##END=
