##TITLE=31Pdec_35-2024-Bay
 CDCl3
 24 sc
 7.5.2024
##JCAMPDX= 6.0         $$ Bruker NMR JCAMP-DX V2.0
##DATA TYPE= NMR SPECTRUM
##DATA CLASS= NTUPLES
##ORIGIN= UXNMR, Bruker Analytische Messtechnik GmbH
##OWNER= root
$$ XWIN-NMR		Version 3.5
$$ Tue May  7 13:59:15 2024 Russian Standard Time (UT+4h)  she@DPX200
##.OBSERVE FREQUENCY= 81.013821
##.OBSERVE NUCLEUS= ^31P
##.ACQUISITION MODE= SIMULTANEOUS
##.ACQUISITION SCHEME= undefined
##.AVERAGES= 24
##.DIGITISER RES= 16
##SPECTROMETER/DATA SYSTEM= spect
##.PULSE SEQUENCE= zgpg30
##.SOLVENT NAME= CDCl3
##.SHIFT REFERENCE= (INTERNAL, CDCl3, 0, 248.564)
##AUDIT TRAIL= $$ (NUMBER, WHEN, WHO, WHERE, WHAT)
$$ ##TITLE= Audit trail, XWIN-NMR		Version 3.5
$$ ##JCAMPDX= 5.01
$$ ##ORIGIN= Bruker BioSpin GmbH
$$ ##OWNER= she
$$ F:/spectra/data/she/nmr/P31/1/pdata/1/auditp.txt
$$ ##AUDIT TRAIL=  $$ (NUMBER, WHEN, WHO, WHERE, WHAT)
(   1,<2024-05-07 13:58:01.03 +0400>,<she>,<DPX200>,
      <created by zg, POWCHK disabled, PULCHK disabled
       configuration hash MD5:
       00 E9 B6 7A A2 85 ED C7 34 08 36 98 17 FE 4E 26
       data hash MD5: 32K
       37 F3 59 72 D1 FB CE 3C 8D 9A 10 0A 2B 58 46 52>)
(   2,<2024-05-07 13:58:04.07 +0400>,<she>,<DPX200>,
      <Start of raw data processing
       efp BC_mod = 2 LB = 10 FT_mod = 6 PKNL = 1 PHC0 = -13082.04 PHC1 = -265.1166 SI = 64K 
       data hash MD5: 64K
       C0 F9 17 50 96 E5 89 51 CA 3C 96 EB 08 D4 E1 2A>)
(   3,<2024-05-07 13:58:32.57 +0400>,<she>,<DPX200>,
      <pk PHC0 = -159.8384 PHC1 = 397.2001 
       data hash MD5: 64K
       39 09 F7 A4 AE 9B 70 70 BB F5 B4 10 BE 76 08 CD>)
$$ ##END=
$$ 
$$ hash MD5
$$ 31 48 41 F1 A2 46 B7 C1 47 5E CE F5 BD 96 D8 2D
##$RELAX= 
##$RELAX= 
##$RELAX= 
##$RELAX= 
##$RELAX= 
##$RELAX= 
##$RELAX= 
##$RELAX= 
##$RELAX= 
$$ Bruker specific parameters
$$ --------------------------
##$DU= <F:/spectra>
##$EXPNO= 1
##$NAME= <P31>
##$PROCNO= 1
##$TYPE= <nmr>
##$USER= <she>
##$AMP= (0..31)
100 100 100 100 100 100 100 100 100 100 100 100 100 100 100 100 100 100 
100 100 100 100 100 100 100 100 100 100 100 100 100 100 
##$AQSEQ= 0
##$AQ_mod= 1
##$AUNM= <au_zg>
##$AUTOPOS= <>
##$BF1= 81.014009
##$BF2= 200.13
##$BF3= 200.13
##$BF4= 200.13
##$BF5= 200.13
##$BF6= 200.13
##$BF7= 200.13
##$BF8= 200.13
##$BYTORDA= 1
##$CFDGTYP= 0
##$CFRGTYP= 5
##$CHEMSTR= <none>
##$CNST= (0..31)
1 1 145 1 1 1 1 1 1 1 1 1 1 1 1 1 1 1 1 1 1 1 1 1 1 1 1 1 1 1 1 1 
##$CPDPRG= <waltz16>
##$CPDPRG1= <>
##$CPDPRG2= <waltz16>
##$CPDPRG3= <>
##$CPDPRG4= <mlev>
##$CPDPRG5= <mlev>
##$CPDPRG6= <mlev>
##$CPDPRG7= <mlev>
##$CPDPRG8= <mlev>
##$CPDPRGB= <>
##$CPDPRGT= <>
##$D= (0..31)
0 1 0 0 0 0 0 0 0 0 0 0.03 2e-05 3e-06 0 0 0 0 0 0 0 0 0 0 0 0 0 0 0 0 
0 0 
##$DATE= 1715075880
##$DBL= (0..7)
120 120 120 11 120 120 24 19 
##$DBP= (0..7)
150 150 150 150 150 150 150 150 
##$DBP07= 0
##$DBPNAM0= <>
##$DBPNAM1= <>
##$DBPNAM2= <>
##$DBPNAM3= <>
##$DBPNAM4= <>
##$DBPNAM5= <>
##$DBPNAM6= <>
##$DBPNAM7= <>
##$DBPOAL= (0..7)
0.5 0.5 0.5 0.5 0.5 0.5 0.5 0.5 
$$ [...]
##$SUBNAM2= <"">
##$SUBNAM3= <"">
##$SUBNAM4= <"">
##$SUBNAM5= <"">
##$SUBNAM6= <"">
##$SUBNAM7= <"">
##$SUBNAM8= <"">
##$SUBNAM9= <"">
##$SW= 501.771253377433
##$SWIBOX= (0..15)
0 1 3 0 0 0 0 0 0 0 0 0 0 0 0 0 
##$SW_h= 40650.406504065
##$TD= 32768
##$TD0= 1
##$TE= 0
##$TE2= 300
##$TE3= 300
##$TEG= 300
##$TL= (0..7)
0 120 53 12 22 120 120 120 
##$TP= (0..7)
150 150 150 150 150 150 150 150 
##$TP07= 0
##$TPNAME0= <>
##$TPNAME1= <>
##$TPNAME2= <>
##$TPNAME3= <>
##$TPNAME4= <>
##$TPNAME5= <>
##$TPNAME6= <>
##$TPNAME7= <>
##$TPOAL= (0..7)
0.5 0.5 0.5 0.5 0.5 0.5 0.5 0.5 
##$TPOFFS= (0..7)
0 0 0 0 0 0 0 0 
##$TUNHIN= 0
##$TUNHOUT= 0
##$TUNXOUT= 0
##$USERA1= <user>
##$USERA2= <user>
##$USERA3= <user>
##$USERA4= <user>
##$USERA5= <user>
##$V9= 5
##$VALIST= <valist>
##$VCLIST= <CCCCCCCCCCCCCCC>
##$VD= 0
##$VDLIST= <DDDDDDDDDDDDDDD>
##$VPLIST= <PPPPPPPPPPPPPPP>
##$VTLIST= <TTTTTTTTTTTTTTT>
##$WBST= 1024
##$WBSW= 4
##$XGAIN= (0..3)
0 0 0 0 
##$XL= 0
##$YL= 0
##$YMAX_a= 4565
##$YMIN_a= -4606
##$ZGOPTNS= <>
##$ZL1= 120
##$ZL2= 120
##$ZL3= 120
##$ZL4= 120
##$ABSF1= 0
##$ABSF2= 0
##$ABSG= 0
##$ABSL= 0
##$ALPHA= 0
##$AQORDER= 0
##$ASSFAC= 0
##$ASSFACI= 0
##$ASSFACX= 0
##$ASSWID= 0
##$AUNMP= <proc_1d>
##$AZFE= 0.1
##$AZFW= 0.5
##$BCFW= 0
##$BC_mod= 2
##$BYTORDP= 0
##$COROFFS= 0
##$CY= -3
##$DATMOD= 1
##$DC= 0
##$DFILT= <>
##$DTYPP= 0
##$F1P= 0
##$F2P= 0
##$FCOR= 1
##$FTSIZE= 65536
##$FT_mod= 6
##$GAMMA= 0
##$GB= 0
##$INTBC= 1
##$INTSCL= 6.047779e-11
##$ISEN= 30
##$LB= 10
##$LEV0= 0
##$LPBIN= 0
##$MAXI= 10000
##$MC2= 0
##$MEAN= 0
##$ME_mod= 0
##$MI= 50
##$NCOEF= 0
##$NC_proc= -7
##$NLEV= 6
##$NOISF1= 182.463
##$NOISF2= 159.3651
##$NSP= 0
##$NTH_PI= 0
##$NZP= 0
##$OFFSET= 248.5645
##$PC= 4
##$PHC0= -13241.88
##$PHC1= 132.0835
##$PH_mod= 1
##$PKNL= yes
##$PPARMOD= 0
##$PSCAL= 0
##$PSIGN= 0
##$REVERSE= no
##$SF= 81.0140089999694
##$SI= 65536
##$SIGF1= 159.3651
##$SIGF2= -187.1042
##$SINO= 113.3802
##$SIOLD= 16384
##$SREGLST= <1H.CDCl3>
##$SSB= 0
##$STSI= 65536
##$STSR= 0
##$SW_p= 40650.406504065
##$SYMM= 0
##$S_DEV= 0
##$TDeff= 32768
##$TDoff= 0
##$TI= <>
##$TILT= no
##$TM1= 0
##$TM2= 0
##$TOPLEV= 0
##$USERP1= <user>
##$USERP2= <user>
##$USERP3= <user>
##$USERP4= <user>
##$USERP5= <user>
##$WDW= 1
##$XDIM= 65536
##$YMAX_p= 501194049
##$YMIN_p= -5133220
$$ End of Bruker specific parameters
$$ ---------------------------------
##NTUPLES= NMR SPECTRUM
##VAR_NAME=  FREQUENCY,     SPECTRUM/REAL,   SPECTRUM/IMAG
##SYMBOL=    X,             R,               I
##VAR_TYPE=  INDEPENDENT,   DEPENDENT,       DEPENDENT
##VAR_FORM=  AFFN,          ASDF,            ASDF
##VAR_DIM=   65536,         65536,           65536
##UNITS=     HZ,            ARBITRARY UNITS, ARBITRARY UNITS
##FACTOR=    0.620285442955139, 1,           1
##FIRST=     20137.2065510682, 0,            0
##LAST=      -20513.1999529968, 0,           0
##MIN=       -20513.1999529968, -5133220,    0
##MAX=       20137.2065510682, 501194049,    0
$$ Real data points
##PAGE= N=1
##DATA TABLE= (X++(R..R)), XYDATA
$$ [...]
38756g20653N8710L9186J9276K681q057j1788q515Q14J4449L0095M5320N7795
38744d80687O5372O6377O0128M7319K9887J0519p898k2791l2464l6464l5565l1297
38732c67564k5121j7664q512L023J6669L0518M1477M6344M2806L0076R360j6046
38720b14634m1306o1190p1351o9406n5502l2134l353K6108N1394O8007P2669O4376
38708b66322M4987J8904q072l0519m5193n1869n2522m9616m4967l9770l4954l1049
38696e90962k7906k4897k1498j7629j3630j0166q145q405j1148j5563k0092k3286
38684g93327k4837k5997k8835l4674m3012n1993o0029o7018p4124q2380r1331
38673a377557r8525j00120r2315p3073m3285o695L1453O6303R4591J14600J25263
$$ y = [-720653, -661943, -622757, -603481, -600800, -608857, -620645, -629160, -628346, -613897, -583802, -538482, -480687, -415315, -348938, -288810, -241491, -211604, -201085, -208983, -231774, -264238, -300702, -336267, -367564, -392685, -410349, -418861, -415838, -399169, -368651, -327174, -280830, -238024, -207948, -198588, -214634, -255940, -317130, -388481, -457887, -513389, -545523, -548876, -522768, -471374, -403367, -330698, -266322, -221335, -202431, -210503, -241022, -286215, -338084, -390606, -440222, -485189, -524959, -559913, -590962, -618868, -643765, -665263, -682892, -696522, -706688, -714833, -723238, -734386, -749949, -770041, -793327, -818164, -844161, -872996, -907670, -950682, -1002675, -1062704, -1129722, -1203846, -1286226, -1377557, -1476082, -1576202, -1668517, -1741590, -1784875, -1791570, -1760117, -1693814, -1599223, -1484623, -1359360]
38662a359360J25635J15376R5666O9519M0989J3822r783k9830m8265o7615q9022
38651a142868j10987j29848j41587j43585j35305j18083r4690o8815m4300k4150
38641b154218r893j594J773K041J590K720O722J3347K1258K9085L6224M2962N0282
38628a957701N9792P3391R2275J15604J39925J60102J71234J70477J57956J36748
38618f80197J12142R0172P5688P0628P3478Q0298Q6720Q9640Q7657Q0317O7221
38607B33764M8099K3759l186k8832m9419o2539o7386o4412n5105m1886k7564j4232
38595a08939k301R331K1956L5572M8401N7717O1247N8114M8998L5683K0324M750
38583B90853r951k3131l3882m0732m2314l8387l0125j9326p471M445J5281K3258
$$ y = [-1359360, -1233725, -1118349, -1022683, -953164, -912175, -898353, -908136, -937966, -986231, -1053846, -1142868, -1253855, -1383703, -1525290, -1668875, -1804180, -1922263, -2016953, -2085768, -2130068, -2154218, -2164111, -2165705, -2163932, -2161891, -2160301, -2157581, -2150859, -2137512, -2116254, -2087169, -2050945, -2007983, -1957701, -1897909, -1824518, -1732243, -1616639, -1476714, -1316612, -1145378, -974901, -816945, -680197, -568055, -477883, -402195, -331567, -258089, -177791, -91071, -1431, 86226, 166543, 233764, 281863, 305622, 302436, 273604, 224185, 161646, 94260, 29848, -25257, -67143, -94707, -108939, -111240, -101909, -79953, -44381, 4020, 61737, 122984, 181098, 230096, 265779, 286103, 290853, 280902, 257771, 223889, 183157, 140843, 102456, 72331, 53005, 45534, 49979, 65260, 88518]
38571H8518K6153K2005R724j0582l7382o7506r6335j18831j31229j32253j22934
38560e70652j05143q0266m9126j2972K5577O2435R2748J12037J17341J08042Q5894
38549b14085N4307J7464k0189n4260q0928r7805j04473j02297r3628q0980o6476
38538h43350n1718l7926k6245j7940j4296j6234k3824l5867m9783o1953o8579
38527a247715o6740n5174l4500o907K4340N5391Q2199J01065J09380J06438R3874
38516h38349P5391N5816L9746L0221K7949L1490L8206M5184M9638M9057M1670
38505c53981K7145O857j6583m0083o0636p5693q3570q3747p6882o4536m8811l1806
38493i02326j4927J535J8109L5336N3065P0243Q5008R4912R7520R1529P7952O0392
$$ y = [88518, 114671, 136676, 146400, 135818, 98436, 30930, -65405, -184236, -315465, -447718, -570652, -675795, -756061, -805187, -818159, -792582, -730147, -637399, -525362, -408021, -299979, -214085, -159778, -142314, -162503, -216763, -297691, -395496, -499969, -602266, -695894, -776874, -843350, -895068, -932994, -959239, -977179, -991475, -1007709, -1031533, -1067400, -1117183, -1179136, -1247715, -1314455, -1369629, -1404129, -1411036, -1386696, -1331305, -1249106, -1148041, -1038661, -932223, -838349, -762958, -707142, -667396, -637175, -609226, -577736, -539530, -494346, -444708, -395651, -353981, -326836, -319979, -336562, -376645, -437281, -512974, -596544, -680291, -757173, -821709, -870520, -902326, -917253, -915718, -897609, -862273, -809208, -738965, -653957, -559045, -461525, -369996, -292044, -231652]
38481b31652M3741L1834K5547K2820K0585J6981J2262Q090O384Q629J5558K6802
38469G581M0633N4138O3961O7307O2950N1942L7547K4113J5297J2653J5393K1206
38457D74721K7457L2134L4309L4097L2304K9795K6954K3445J8402J0835j18j5101
38445G29234l4384n7510q2963j08164j29800j44330j48617j40773j21070r2392
38435c30769n9845k9451o377O621R894O422L24m963q052r845j2604j8442k8312
38422d85399m1975n8571p6871r4914j09708j17817j16733j06105q7967o5831m3132
38411a405023k1810j709J8717M0678O3297Q3125R5516R7027Q7458P0261N1253
38400h21210L6378K9563L1568M0151N1119N9663O1466N3724L6025J0722j7565
$$ y = [-231652, -187911, -156077, -130530, -107710, -87125, -70144, -57882, -49792, -43408, -34779, -19221, 7581, 48214, 102352, 166313, 233620, 296570, 348512, 386059, 410172, 425469, 438122, 453515, 474721, 502178, 534312, 568621, 602718, 635022, 664817, 691771, 715216, 733618, 744453, 744335, 729234, 694850, 637340, 554377, 446213, 316413, 172083, 23466, -117307, -238377, -330769, -390614, -420065, -426442, -419821, -409927, -403505, -403181, -408144, -416196, -426041, -438645, -457087, -485399, -527374, -585945, -662816, -757730, -867438, -985255, -1101988, -1208093, -1296060, -1361891, -1405023, -1426833, -1428542, -1409825, -1369147, -1305850, -1222725, -1127209, -1030182, -942724, -872463, -821210, -784832, -755269, -723701, -683550, -632431, -572768, -511302, -457578, -421553, -410831, -428396]
38389d28396m3174o0739o6422n8920m0027j4230J2721L5574N0807N7010N4654
38378e01142M5486L1807J5876l89j5461k8310l8442m5623m9336m8318m0802k5539
38366g00193l088K3519M9453O9871Q1632Q3988P8149O6417N1406L5417J9912N292
38354a38225q831k3146l8201n4122p0434q6095r9819j10459j17054j18595j13934
38343i78915j02221q3742o0690l7228j8561r210j1280k3568m1949o0799p4668
38332a502831p9592p3757n7598l3543n505K1978M5078O2052P3756Q2612R0414
38321a376936R6470R7691R0712P4672N2677L0982J6399J3405K2476M0330O1786
38310g79336Q1858R6930J04716J03822R3695P5027N0096K2749k041j9098k4577
$$ y = [-428396, -471570, -532309, -598731, -657651, -697678, -711908, -699187, -663613, -612806, -555796, -501142, -455656, -423849, -407973, -408362, -423823, -452133, -490575, -536198, -585534, -633852, -674654, -700193, -703281, -679762, -630309, -560438, -478806, -394818, -316669, -250252, -198846, -163429, -143517, -138225, -147056, -170202, -208403, -262525, -332959, -419054, -518873, -629332, -746386, -864981, -978915, -1081136, -1164878, -1225568, -1262796, -1281357, -1290567, -1301847, -1325415, -1367364, -1428163, -1502831, -1582423, -1656180, -1713778, -1747321, -1752826, -1730848, -1685770, -1623718, -1549962, -1467350, -1376936, -1280466, -1182775, -1092063, -1017391, -964714, -933732, -917333, -903928, -881452, -841122, -779336, -697478, -600548, -495832, -392010, -298315, -223288, -173192, -150443, -152484, -171582, -196159]
38299a96159j7568p24K0756M1275N6765O5469O7674O5050N9942N4657N0716M8313
38287C16166M6262M2545L5254K3490P660j0989l1049n1209p0047q6025r8066j06112
38275A7880j10801j12443j10459j04072r3588q0956o9089o0492n6061n4626n3346
38264h88053m8899l8965k3201l191J8483L9249N6977O9687P5101P0813N5238K8792
38252e87969n670m3543p9860j10539j32991j46027j49338j42890j26622j00635
38242a626084o5898k5024J7452N5809Q4822J01592J06520J02894R5486Q8825Q5777
38231i77829Q6836R0463R4245R6299R6011R3826R0393Q5762P9133O9363N5938
38220c9560L9667K2700P843k174n263k77J2706L2137N4901P6578R2282R8169R3037
$$ y = [-196159, -213727, -214451, -193695, -152420, -95655, -30186, 37488, 102538, 162480, 217137, 267853, 316166, 362428, 404973, 440227, 463717, 471377, 460388, 429339, 378130, 308083, 222058, 123992, 17880, -92921, -205364, -315823, -419895, -513483, -594439, -663528, -724020, -780081, -834707, -888053, -936952, -975917, -999118, -1002309, -983826, -944577, -887600, -817913, -742812, -671999, -616761, -587969, -593639, -637182, -717042, -827581, -960572, -1106599, -1255937, -1398827, -1525449, -1626084, -1691982, -1717006, -1699554, -1643745, -1558923, -1457331, -1350811, -1247917, -1152431, -1063606, -977829, -890993, -800530, -706285, -609986, -513975, -420149, -329756, -243994, -164861, -95498, -39560, 107, 22807, 30650, 28476, 23213, 22936, 35642, 67779, 122680, 199258, 291540, 389709, 482746]
38207D82746P9063O0982M3951L1248K2953J6339P658n714k4000m5095o5499q1482
38195E23150r0192r0663q4443p5178o7147o3424o4699o9382p4784p8571p9618
38184c14951p7873p3759o7815o0868n4239m9471m7656m8918n2348n6393n9227
38173i63518n9017n4172m3970k9449j3837j705L030j006j2182k6923m1253n1691
38161a295693n5438n0448l6035j3733J2455L7075N5129O3788O2953N4663M1899
38150a123385K7373J2752j344j4596k6169l4621l8393l6365k7960j3185P085L0790
38138a238018N4830P5683R0293R6857R5398Q7707P6584O4764N4215M6132M1147
38127d54408L9312L9818M0880M0199L5947K7907J7930R286N085O660J2877K0761
$$ y = [482746, 561809, 622791, 666742, 697990, 720943, 737282, 744940, 739226, 715226, 670131, 604632, 523150, 432958, 342295, 257852, 182674, 115527, 52103, -12596, -81978, -156762, -235333, -314951, -392824, -466583, -534398, -595266, -649505, -698976, -746632, -795550, -847898, -904291, -963518, -1022535, -1076707, -1120677, -1150126, -1163963, -1165668, -1162638, -1163644, -1175826, -1202749, -1244002, -1295693, -1351131, -1401579, -1437614, -1451347, -1438892, -1401817, -1346688, -1282900, -1219947, -1165284, -1123385, -1096012, -1083260, -1084604, -1099200, -1125369, -1159990, -1198383, -1234748, -1262708, -1275893, -1268808, -1238018, -1183188, -1107505, -1017212, -920355, -824957, -737250, -660666, -595902, -541687, -495555, -454408, -415096, -375278, -334398, -294199, -258252, -230345, -212415, -203129, -198044, -191384, -178507, -157746]
38115a57746K6997K9376K7500K2514J6345J0988Q155R051J4180K3182L4909M7818
38103A13269O0458P1833Q1561Q9757R6745J02568J06629J07733J04774R7658Q7794
38092A120779P7635O9457O4093O0281N5083M5255K8881O271k0382m8050p3729
38081A385574r4751j09113j16059j16502j12529j06273r9045r1398q3743p6767
38071C79394p1118o6669o1955n4368m1295k1686K897K8576N0757O5984P2970P2410
38059C55897O6114N6216M4647L2734K0903Q835l739j6088k6193l1503l0170k1789
38047D55864p212J2046L4127N6783P7543R4297J05731J10996J08940R7865P6221
38036A223201M3721K016m5311r3318j36669j70821j92907k01934j98447j84070
$$ y = [-157746, -130749, -101373, -73873, -51359, -35014, -24026, -15871, -6820, 7360, 30542, 65451, 113269, 173727, 245560, 327121, 416878, 513623, 616191, 722820, 830553, 935327, 1032985, 1120779, 1198414, 1267871, 1331964, 1392245, 1447328, 1492583, 1521464, 1527735, 1507353, 1459303, 1385574, 1290823, 1181710, 1065651, 949149, 836620, 730347, 631302, 539904, 456161, 379394, 308276, 241607, 179652, 125284, 83989, 62303, 65200, 93776, 144533, 210517, 283487, 355897, 422011, 478227, 522874, 555608, 576511, 585346, 581607, 565519, 539326, 507823, 477653, 455864, 448652, 460698, 494825, 551608, 629151, 723448, 829179, 940175, 1049115, 1146980, 1223201, 1266922, 1268938, 1223627, 1130309, 993640, 822819, 629912, 427978, 229531, 45461]
38026D5461j61050j31680r7772o0652k1616J7709N5478Q9775J18300J37913J44953
38015A36819J36711J13074P7058L3686j1986n6348r7423j34078j65094j88758
38005a56339k03094k06415j98079j79093j52207j21229q9895o1021l6439j7451
37995a421262n050L64m73n548j2073j7229j8697j4693l848J4700M0871P3230J08918
37982a260790J44062J74497J96587K08018K08352J99088J83096J63630J43236
37973C59776J23000J02300P9251N1736J8677j9026n8329r4863j24372j44188j53977
37962A39985j55364j50750j42047j30080j14765r5940p4290n1840l1574j6206
37952h22871o889k760j730j946k820m921r037j5240k2667k9882l5333l7758l6589
$$ y = [45461, -115589, -247269, -345041, -405693, -427309, -409600, -354122, -264347, -146047, -8134, 136819, 273530, 386604, 463662, 497348, 485362, 429014, 331591, 197513, 32419, -156339, -359433, -565848, -763927, -943020, -1095227, -1216456, -1306351, -1367372, -1403811, -1421262, -1426312, -1425948, -1426421, -1431969, -1444042, -1461271, -1479968, -1494661, -1498509, -1483809, -1442938, -1369708, -1260790, -1116728, -942231, -745644, -537626, -329274, -130186, 52910, 216540, 359776, 482776, 585076, 664327, 716063, 734740, 715714, 657385, 562522, 438150, 293962, 139985, -15379, -166129, -308176, -438256, -553021, -648961, -723251, -775091, -806665, -822871, -829760, -832520, -834250, -836196, -839016, -843937, -852974, -868214, -890881, -920763, -956096, -993854, -1030443]
37939a030443l2323k6443k0875j7285j6592j8640k1978k4069k2311j5434m394
37928a250787P875J7513K0860J5356K45k2965n0749p8749j03410j22991j37395
37917a705197j47179j52734j54044j50727j42087j27469j06936q1766n4085k5790
37907b848014K185K9706N6633Q2141J04676J22509J34551J40766J41773J38017
37897a895057J29320J15288R6160P3221M8538K4307K248j6628l1764m2462m7384
37886a544213m4729l3155j3009J2907L9773O2545P8280Q7645R4469J03463J17386
37875a038638J35230J52417J62840J61580J46887J20600Q7246N2359K0618n636
37865d497k6796m4885o1744p7656r1307j00700j04202j01045r1318p5693n5309
$$ y = [-1030443, -1062766, -1089209, -1110084, -1127369, -1143961, -1162601, -1184579, -1208648, -1230959, -1246393, -1250787, -1242912, -1225399, -1204539, -1189183, -1188938, -1211903, -1262652, -1341401, -1444811, -1567802, -1705197, -1852376, -2005110, -2159154, -2309881, -2451968, -2579437, -2686373, -2768139, -2822224, -2848014, -2845829, -2816123, -2759490, -2677349, -2572673, -2450164, -2315613, -2174847, -2033074, -1895057, -1765737, -1650449, -1554289, -1481068, -1432530, -1408223, -1405975, -1422603, -1454367, -1496829, -1544213, -1588942, -1622097, -1635106, -1622199, -1582426, -1519881, -1441601, -1353956, -1259487, -1156024, -1038638, -903408, -750991, -588151, -426571, -279684, -159084, -71838, -19479, 1139, -4497, -31293, -76178, -137922, -215578, -306885, -407585, -511787, -612832, -704150, -779843, -835152]
37854h35152l1763o976J7276L9811O0100P7920R3123J05650J15396J21776J23361
37843a19478J18324J05550Q5614O0966L5207J1867o661j9583k7288l0586l0299
37832A83633k7548k4182k2593k4883l2121m4257o0564p9933j00850j21482j40052
37821d94832j55265j66266j72318j72685j66961j55492j39421j20361r9961p9550
37811a923112n9796m0509k0706R45K5380N2287P9429J02559J16389J16523J01663
37800a448948P4877M3096J4879k701o638R95J4175K5626K9708K4057R403j1695
37788a233166l6035o0369q1659r7407j05940j06543r9428q5701o7284m6514k5469
37777b045515n426J3272L0937M8085O5020Q1538R6962J10532J21929J31409J39281
$$ y = [-835152, -866915, -873891, -856615, -816804, -756704, -678784, -585661, -480011, -364615, -242839, -119478, -1154, 104396, 190010, 250976, 286183, 298050, 291389, 271806, 244518, 213932, 183633, 156085, 131903, 109310, 84427, 52306, 8049, -52515, -132448, -233298, -354780, -494832, -650097, -816363, -988681, -1161366, -1328327, -1483819, -1623240, -1743601, -1843562, -1923112, -1982908, -2023417, -2044123, -2043178, -2017798, -1965511, -1886082, -1783523, -1667134, -1550611, -1448948, -1374071, -1330975, -1316096, -1318797, -1325435, -1324440, -1310265, -1284639, -1254931, -1230874, -1221471, -1233166, -1269201, -1329570, -1411229, -1508636, -1614576, -1721119, -1820547, -1906248, -1973532, -2020046, -2045515, -2050941, -2037669, -2006732, -1958647, -1893627, -1812089, -1715127, -1604595, -1482666, -1351257, -1211976]
37766a211976J45179J47753J45122J35875J20038R9614P8245N9949M7473M1416
37756a91312M0729M3922M9732N6750O2877O5512O2398N2427L6064J5519n357k1806
37744B67455k9636k6908j4956J850J7547K6630K5830J4980l099k3474m0598n0251
37732A65370n1196m5418l6686k8389k2177j7884j4192r353j970Q211J9897L0816
37720b971L8952M3472M4676M3241L9701L4452K7940K0634J2913N195j767o983
37708B99455r856j0865j1603j4014j9394k7874l8579n0102o0780o8719p1913o8806
37696a53050n9146m4571k8311j3905l618K443N798Q034R433Q816M355n482k1331
37683b90535m2478o6473q9342j06748j15352j13493j01084p9501n1768k2335M125
$$ y = [-1211976, -1066797, -919044, -773922, -638047, -518009, -418395, -340150, -280201, -232728, -191312, -150583, -106661, -56929, -179, 62698, 128210, 190608, 243035, 279099, 294618, 289261, 267455, 237819, 210911, 195955, 197805, 215352, 241982, 267812, 282792, 279693, 256219, 215621, 165370, 114174, 68756, 32070, 3681, -18496, -36380, -50572, -59925, -61895, -53684, -33787, -2971, 35981, 79453, 124129, 167370, 207071, 241523, 269463, 290097, 303010, 308205, 306438, 299455, 289599, 278734, 267131, 253117, 233723, 205849, 167270, 117168, 56388, -12331, -84244, -153050, -212196, -256767, -285078, -298983, -302601, -300158, -294360, -286326, -276893, -268077, -263722, -269204, -290535, -333013, -399486, -488828, -595576, -710928, -824421, -925505, -1005006, -1056774, -1079109, -1074984]
37672a074984K4470L8153M6989N3933O1723P1928Q4603R8456J11239J20274J22915
37661b40301J17241J02815Q1287N6351L2690J4241K629l227o007q025r558q575
37649A31561k058J1825L2148N5340P6814R2793J01247J01906R5933Q5510P3052
37638H56071O0132M6920L2769J7466J965j2052k3192l0949l5457l6967l5899l3431
37626H07376l1715l2943l7800m4850n1771n7529o3450p2155q5361j02460j20804
37615A06538j37025j48314j53172j51834j46244j39273j33304j29009j25181j19571
37605a276389j09994r5088p4686m9951k3242K451K4414M1080N2446N9784O4773
37594a384402O8596P1566P3430P3935P3079P1018O8053O4884O2780O3005O5576
$$ y = [-1074984, -1050514, -1012361, -965372, -911439, -849716, -777788, -693185, -594729, -483490, -363216, -240301, -123060, -20245, 61042, 117393, 150083, 164324, 166953, 163726, 157719, 149694, 140136, 131561, 129503, 141328, 173476, 228816, 305630, 398423, 499670, 601576, 697509, 783019, 856071, 916203, 963123, 995892, 1013358, 1015323, 1003271, 980079, 949130, 913673, 876706, 840807, 807376, 775661, 742718, 704918, 660068, 608297, 550768, 487318, 415163, 329802, 227342, 106538, -30487, -178801, -331973, -483807, -630051, -769324, -902628, -1031637, -1156818, -1276389, -1386383, -1481471, -1556157, -1606108, -1629350, -1626899, -1602485, -1561405, -1508959, -1449175, -1384402, -1315806, -1244240, -1170810, -1096875, -1023796, -952778, -884725, -819841, -757061, -694056, -628480]
37583f28480O8366O7581N9587M2748J8054j1499m1856o8519q7175r4712r0418
37572g66323p6441n7118l7478k1612j1603p371p384r650j2367j4145j4199j2591
37560a048282j0177q054o982p243q752j0913j2352j1326o866K97Q064J4378J8400
37547a089808K0572K1684K1836K0093J5043N970o166j8618k7879l1233k7939j9359
37535a115804q034L646J4340K3791L2243L9919M6851N2818N7104N8320N4702M4886
37523f95218K8546O445k0007m9036p8307j04555j23645j31598j26276j08775q3411
37512a485837n6091l2063j4412m010l78k512r136j8545k8567l6909m1857m3022
37500a773339m1633m0009m0329m3373m8047n1970n2656m8424l8580k2966j521
$$ y = [-628480, -560114, -492533, -432946, -390198, -372144, -383643, -425499, -494018, -581193, -675905, -766323, -842764, -899882, -937360, -958972, -970575, -977946, -985330, -994980, -1007347, -1021492, -1035691, -1048282, -1058459, -1066513, -1073495, -1080738, -1089490, -1100403, -1112755, -1124081, -1130947, -1130650, -1122586, -1108208, -1089808, -1069236, -1047552, -1025716, -1005623, -990580, -984610, -990776, -1009394, -1037273, -1068506, -1096445, -1115804, -1123838, -1120192, -1105852, -1082061, -1049818, -1009899, -963048, -910230, -853126, -794806, -740104, -695218, -666672, -660227, -680234, -729270, -807577, -912132, -1035777, -1167375, -1293651, -1402426, -1485837, -1541928, -1573991, -1588403, -1592413, -1592791, -1595303, -1604439, -1622984, -1651551, -1688460, -1730317, -1773339, -1814972, -1854981, -1895310, -1938683, -1986730, -2038700, -2091356, -2139780, -2178360, -2201326, -2202847]
37489b202847K5569N7168R0465J21093J44326J56861J58096J50144J36614J20947
37479a041564J05185Q9840P4620N9321M4019K8565J1914p808l2483o2898r8065
37468h29354j35120j69716j96863k12241k13647k01742j79406j50071j16338p9897
37458b484395m2545p065K2976M4276N4795N4230M4096K7670R566n295j3025j1618
37446b306334r43J7751M2131O8768R3370J11657J20661J19728J10613R6567Q0940
37435a445091O5886N1861L8073K3599Q393o485j9611l0329l9266m7747n6717o6218
37423a523652p5696q4503r1952r7234r9643r9002r5698r0288q3180p4559o4365
37412b479772n2257l7936k1767n011J0806K4686L6247M5231N1239N4050N3988
$$ y = [-2202847, -2177278, -2120110, -2029645, -1908552, -1764226, -1607365, -1449269, -1299125, -1162511, -1041564, -936379, -846539, -771919, -712598, -668579, -640014, -628100, -635908, -668391, -731289, -829354, -964474, -1134190, -1331053, -1543294, -1756941, -1958683, -2138089, -2288160, -2404498, -2484395, -2526940, -2534005, -2511029, -2466753, -2411958, -2357728, -2313632, -2285962, -2276396, -2281691, -2294716, -2306334, -2307277, -2289526, -2247395, -2178627, -2085257, -1973600, -1852939, -1733211, -1622598, -1526031, -1445091, -1379205, -1327344, -1289271, -1265672, -1257279, -1263764, -1283375, -1313704, -1352970, -1400717, -1457434, -1523652, -1599348, -1683851, -1775803, -1873037, -1972680, -2071682, -2167380, -2257668, -2340848, -2415407, -2479772, -2532029, -2569965, -2591732, -2596743, -2585937, -2561251, -2525004, -2479773, -2428534, -2374484, -2320496]
37401b320496N1899M8808M5675M3279M2160M2718M5301N0183N7265O5812P4464
37390a752932Q1362Q4299Q0957O9587M9859K3448o111l4252n6689p0714p6024
37379a607210p4516o9021o1621n2489m0058k2320J593L0587O1823R1337J14601
37368a627294J27023J25029J07593P7373M0424M408k3877m0496m5185m0721l1212
37357a326935k0096q826L179J7492L5194N5691P6370R3308J02811J03029R4711
37346g74072Q0689O4436M8404L3054J7044j346k2319m3396o0015o7550o3576m8943
37334h37590k7238l046J9807L9075N3598O2108O2569N2846L2301L053l0227o1930
37322f34674q7448j04295j11900j10606j00778q2663n6911k5280R222M2921P2537
$$ y = [-2320496, -2268597, -2219789, -2174114, -2130835, -2088675, -2045957, -2000656, -1950473, -1893208, -1827396, -1752932, -1671570, -1587271, -1506314, -1436727, -1386868, -1363420, -1369531, -1403783, -1460472, -1531186, -1607210, -1681726, -1750747, -1812368, -1864857, -1904915, -1927235, -1925642, -1895055, -1833232, -1741895, -1627294, -1500271, -1375242, -1267649, -1190276, -1149852, -1145444, -1169321, -1209817, -1255002, -1295723, -1326935, -1347031, -1355857, -1352678, -1335186, -1299992, -1244301, -1167931, -1074623, -971812, -868783, -774072, -693383, -628947, -580543, -547489, -530445, -531791, -554110, -597506, -657521, -725071, -788647, -837590, -864828, -867874, -848067, -808992, -755394, -693286, -630717, -577871, -545570, -542517, -572744, -634674, -722122, -826417, -938317, -1048923, -1149701, -1232364, -1289275, -1314555, -1305333, -1262412, -1189875]
37311a189875R6053J12920J23613J28884J29188J24647J15492J02668Q8110P4372
37301i3928O3802N7724N6090N7643O0466O2738O3339O2108N9583N6416N2781M8032
37289F06794M0804K9621J3850n481k5597m2865n4252n8565n6924n2396m9024n0516
37277B95449n8958p4004r2905j11419j25251j31416j29078j19387j04538q6597
37267g38104o6863m5852k3492O56K6909N4490Q0804J01816J13686J14602J05645
37256b75703R0284P2943N7473M5996L8470L3122K7513J9850R824j457j2270k1182
37244H4863k7550l1607l4301l6938m0592m5545n1094n5712n7342n3792m3511k6739
37232d19860o275J2933K5407K7114J6898l145k8238n2304o9768p7283p4628o4353
$$ y = [-1189875, -1093822, -980902, -857289, -728405, -599217, -474570, -359078, -256410, -168300, -93928, -30126, 27598, 83688, 141331, 201797, 264535, 327874, 389982, 449565, 505981, 558762, 606794, 647598, 677219, 691069, 685588, 659991, 617126, 562874, 504309, 447385, 394989, 345965, 295449, 236491, 162487, 69582, -41837, -167088, -298504, -427582, -546969, -651507, -738104, -804967, -850819, -874311, -873655, -846746, -792256, -711452, -609636, -495950, -381348, -275703, -185419, -112476, -55003, -9007, 29463, 62585, 90098, 109948, 119772, 118315, 106045, 84863, 57313, 25706, -8595, -45533, -86125, -131670, -182764, -238476, -295818, -349610, -393121, -419860, -426135, -413202, -387795, -360681, -343783, -346928, -375166, -427470, -497238, -574521, -649149, -713502]
37220g13502n0495l7114k7224k2199k1485k2795k2944j9094r797M544K1711L8134
37208h82260M9831N3743M8920L6931K1206N661o829j5237k0244k3251k5437k7480
37196g84446l0049l4493m3060n8155q0894j09825j40849j68418j87292j93785
37186a831266j86394j65952j35526r9965o5157l6980k0005j6117k3659l7722n1611
37175b670354n8795n4651l7537q963K7137O5666J01613J30959J51189J61408J62106
37164b030222J54645J40823J22590J01930Q0762O0974M4453L3008K8133L0677
37154a232227M0366N5347P2144Q6440R4471R4249Q6027P2058N5944M1599L1985
37143e01597K8180K9382L3683L8934M3225M5132M4139M1018L7629L5955L6899
$$ y = [-713502, -763997, -801111, -828335, -850534, -872019, -894814, -917758, -936852, -946649, -942105, -920394, -882260, -832429, -778686, -729766, -692835, -671629, -665968, -672797, -688034, -708278, -731529, -756966, -784446, -814495, -848988, -892048, -950203, -1031097, -1140922, -1281771, -1450189, -1637481, -1831266, -2017660, -2183612, -2319138, -2419103, -2484260, -2521240, -2541245, -2557362, -2581021, -2618743, -2670354, -2729149, -2783800, -2821337, -2830300, -2803163, -2737497, -2635884, -2504925, -2353736, -2192328, -2030222, -1875577, -1734754, -1612164, -1510234, -1429472, -1368498, -1324045, -1291037, -1262904, -1232227, -1191861, -1136514, -1064370, -977930, -883459, -789210, -703183, -631125, -575181, -533582, -501597, -473417, -444035, -410352, -371418, -328193, -283061, -238922, -197904, -160275, -124320, -87421]
37132h7421L9675M2156M1837L6702K5675Q846j2334l5002n5379o9890p6569p5890
37120b17594p0409o3218n6007m8017l6677j9521L995L2036O1391Q8846J11832
37109b13343J28288J36532J35627J25819J08380Q4936N6999K6097n846l6434o3115
37098D83940q3633r6478j01409r9858r4900r0484r0113r5456j05631j17518j26993
37087f18533j30361j25360j11342q8843n8873k2473J9121O3722J07595J45696
37077h19651J72922J85593J82280J63748J32404R1902M6973L109l4268o1102p5706
37066a1796p8899p3144o1274m5566k7606q941Q041J9754K2206J2712q467l7669
37054b90649o8970r6218j14888j23204j22379j16059j08968j04976j05469j08981
$$ y = [-87421, -47746, -5590, 36247, 72949, 98624, 107470, 95136, 60134, 4755, -65135, -141704, -217594, -288003, -351221, -407228, -455245, -491922, -511443, -507448, -475412, -414021, -325175, -213343, -85055, 51477, 187104, 312923, 421303, 506239, 563238, 589335, 583489, 547055, 483940, 400307, 303829, 202420, 102562, 7662, -82822, -172935, -268391, -374022, -491540, -618533, -748894, -874254, -985596, -1074439, -1133312, -1155785, -1136664, -1072942, -965347, -819651, -646729, -461136, -278856, -115108, 17296, 109198, 156171, 159280, 125012, 63910, -11796, -90695, -163839, -225113, -270679, -298285, -307226, -299185, -279431, -257225, -244513, -252980, -290649, -359619, -455837, -570725, -693929, -816308, -932367, -1041335, -1146311, -1251780, -1360761]
37044a360761j12501j13598j11977j09323j07636j07391j06890j03227r3957p8221
37034b405482n6798l1490m588K1289M3203N8196O4073O0231M7963K9904R218j0818
37022b175099k6661l4488l0806j3529J7064N7947J03628J47166J81849K02936
37012a569993K08786K00873J82786J58589J31216J01640O9480L4772l78l1573
37002e13802n3720o3372o0127m6228k4814J717L2191O5899J01447J36055J65771
36991b58983J86530J95448J91609J75936J50597J18422Q2586M6290J2314j7209
36981H83540m0711n7040o5555o6384o0479m9364l4789j8489k073J3002K5506L4731
36969E61895M0898M5384N0476N8604P1425Q9089J09908J30481J46384J53246J47956
$$ y = [-1360761, -1473262, -1586860, -1698837, -1808160, -1915796, -2023187, -2130077, -2233304, -2327261, -2405482, -2462280, -2493770, -2498358, -2477069, -2433866, -2375670, -2311597, -2251366, -2203403, -2173499, -2164281, -2175099, -2201760, -2236248, -2267054, -2280583, -2263519, -2205572, -2101944, -1954778, -1772929, -1569993, -1361207, -1160334, -977548, -818959, -687743, -586103, -516623, -481851, -482229, -513802, -567522, -630894, -691021, -737249, -762063, -760346, -728155, -662256, -560809, -424754, -258983, -72453, 122995, 314604, 490540, 641137, 759559, 842145, 888435, 900749, 883540, 842829, 785789, 720234, 653850, 593371, 544007, 509218, 490729, 488656, 501658, 527164, 561895, 602793, 648177, 698653, 757257, 828682, 917771, 1027679, 1158160, 1304544, 1457790, 1605746]
36958A605746J29357R8146N6073N195n2106j12364j70454k19946k54496k69613
36948H15538k64063k40333k03837j61122j18066p9099m7455k5452j4152j2842
36938c50883j9353l1233m6825o5285q5583j05404j20914j27722j22562j04800
36928a180564p6887m3698j1138J5209L1110L4388K5520P830j3175l1432m2257
36917a285094m3491l5415j9924J81K1458M0009N2000N4558M6751L0211Q916j2003
36905a141843k7971l6321l6612k9980j8210l261J2558K6286L4678L5386K8178
36894a157112J5079q20j7035l2839m9103o7109q7007j06992j23815j34146j35733
36883a896632j27703j10328q4850n3308j8168J8057N2860Q3555J07436J22451
$$ y = [1605746, 1735103, 1833249, 1889322, 1894517, 1842411, 1730047, 1559593, 1339647, 1085151, 815538, 551475, 311142, 107305, -53817, -171883, -250982, -298437, -323889, -338041, -350883, -370236, -401469, -448294, -513579, -599162, -704566, -825480, -953202, -1075764, -1180564, -1257451, -1301149, -1312287, -1297078, -1265968, -1231580, -1206060, -1198230, -1211405, -1242837, -1285094, -1328585, -1364000, -1383924, -1383743, -1362285, -1322276, -1270276, -1215718, -1168967, -1138756, -1129840, -1141843, -1169814, -1206135, -1242747, -1272727, -1290937, -1294198, -1281640, -1255354, -1220676, -1185290, -1157112, -1142033, -1142853, -1159888, -1192727, -1241830, -1308939, -1395946, -1502938, -1626753, -1760899, -1896632, -2024335, -2134663, -2219513, -2272821, -2290989, -2272932, -2220072, -2136517, -2029081, -1906630]
36873a906630J27959J25089J16604J06377R8424R5724R9382J08594J21232J34558
36863g72687J45661J51779J50651J41005J22952R8188O9835M1937J8717L750q27
36852A70961N121J9600L8991N8945P5362Q5026Q5766P6401N6761K7982p168m4415
36840F49333p8851j06160j23656j30733j28888j21429j12791j07270j07553j13816
36830d81814j23972j34765j42960j45954j41938j29833j09293q0876m6377r067
36820a546849K6663N6471P7579Q9648R4529R5059R3722R1798Q9268Q5317P8963
36809f67832O9421N6285L9762K1001K094j4550k7147l5081l8727l8863l6290l1796
36797g01723k6243k0512j5445j1935j0955j3086j7680k2548k4882k2998j7432
$$ y = [-1906630, -1778671, -1653582, -1536978, -1430601, -1332177, -1236453, -1137071, -1028477, -907245, -772687, -627026, -475247, -324596, -183591, -60639, 37549, 107384, 149321, 168038, 171788, 170961, 176082, 195682, 234673, 293618, 368980, 454006, 539772, 616173, 672934, 700916, 693748, 649333, 570482, 464322, 340666, 209933, 81045, -40384, -153175, -260445, -367998, -481814, -605786, -740551, -883511, -1029465, -1171403, -1301236, -1410529, -1491405, -1537782, -1546849, -1520186, -1463715, -1386136, -1296488, -1201959, -1106900, -1013178, -921380, -832112, -746795, -667832, -598411, -542126, -502364, -481363, -479269, -493819, -520966, -556047, -594774, -633637, -669927, -701723, -727966, -748478, -763923, -775858, -786813, -799899, -817579, -840127, -865009, -888007, -905439]
36786i05439j0469m498n45K089N137J0235J8065K8046L8545M7366N2368N2071
36774f67029M6216L6070K4244J4038Q466R316J6524K8007M0063M8424M9904M4067
36762c01690L3806K4125J9659K2505L1621M3690N4608O0896O0798N4759M4891
36751A49668L3749K3296J4678Q545N045L484K142j121p855j8350l1611m5829n8964
36738G6877o9450p6820q1782q5385q7745q7441q2297p1065n4522l5134j5555K722
36726f67597J9605L5526N0366O2946P1298P3307O7415N3449L3391J1513o781j7022
36714b12584j7450r367L874J8344L0712L9004M2949M3681M2667M0477L6311K8632
36702H7250J6338k71j9185l7030m9956n4781m9849l5442j3796J1044L3891M9863
$$ y = [-905439, -915908, -920406, -920951, -918862, -913725, -903490, -885425, -857379, -818834, -771468, -719100, -667029, -620813, -584743, -560499, -546461, -537995, -528679, -512155, -484148, -444085, -395661, -345757, -301690, -267884, -243759, -224100, -201595, -169974, -126284, -71676, -10780, 50018, 104777, 149668, 183417, 206713, 221391, 229936, 234981, 238465, 240607, 239486, 231631, 213281, 181670, 135841, 76877, 7427, -69393, -151175, -236560, -324305, -411746, -494043, -565108, -619630, -654764, -670319, -667597, -647992, -612466, -562100, -499154, -427856, -354549, -287134, -233685, -200294, -188781, -195562, -212584, -230034, -239401, -235527, -217183, -186471, -147467, -104518, -60837, -18170, 22307, 58618, 87250, 103588, 103317, 84132, 47102, -2854, -57635, -107484, -142926, -156722, -145678, -111787, -61924]
36690f1924N6216N3334M4262L3098K3258J6279J1378O009k698j6234l3902n3453
36678G5623p2498q9433j03255j13002j17827j17716j13853j07946j01106r3409
36668i54422q4501p4458o4129n4828m7788m3771m2989m5276n0142n6395o1734
36657a580433o3135n8204m6449k9424r831R572K6751M1088N3705O6720Q1354R6283
36645a412003J07759J11551J05095Q8313O2903L1194m471m1460p6363j04987j23221
36634a255690j28327j19909j00053p2734m2914j5612N117J7128K0677J8137J3125
36623a661055R661J1470K1203L9485O4256R0999J14026J28391J31714J25119J12731
36612h12000R9891R1006Q8156R0740R5968R9874R8796R0858P6735N9348M2813
$$ y = [-61924, -5708, 47626, 91888, 124986, 148244, 164523, 175901, 181910, 179212, 162978, 129076, 75623, 3125, -86308, -189563, -302565, -420392, -538108, -651961, -759907, -861013, -954422, -1038923, -1113381, -1177510, -1232338, -1280126, -1323897, -1366886, -1412162, -1462304, -1518699, -1580433, -1643568, -1701772, -1748221, -1777645, -1787476, -1777904, -1751153, -1710065, -1656360, -1589640, -1508286, -1412003, -1304244, -1192693, -1087598, -999285, -936382, -905188, -909659, -951119, -1027482, -1132469, -1255690, -1384017, -1503926, -1603979, -1676713, -1719627, -1735239, -1730122, -1712994, -1692317, -1674180, -1661055, -1651394, -1639924, -1618721, -1579236, -1514980, -1423981, -1309955, -1181564, -1049850, -924731, -812000, -712109, -621103, -532947, -442207, -346239, -246365, -147569, -56711, 20024, 79372, 122185]
36601A22185L1186K7197L1110M0257M9728N4179M9880L5996J4655j0085l3858
36590D12430n3530o7952p7683q3895q7190q7116q2688p3492o0582m6471l4338
36579c42507k6999k6254l2797m6458o6538r1975j21107j51147j77875j96269k02129
36568a482055j93715j72225j40723j02570o0442j6333K7893O9898J06529J34040
36558a829703J49085J50122J38278J17041R1007O4619M1443K3931J3234R140J0161
36547a021642J3899J7404J7609J2012l49j8210l8249n6236o8476p2879o9233n8730
36535a343080m3170k4354m127J5195L0588L8716L6758K3291r01l2229o4485r0340
36523a458138j03686j01505q4299n5197j8688K0332N7126Q7506J08222J17367
$$ y = [122185, 153371, 180568, 211678, 251935, 301663, 355842, 405722, 441718, 456373, 446288, 412430, 358900, 290948, 213265, 129370, 42180, -44936, -127624, -201116, -261698, -308169, -342507, -369506, -395760, -428557, -475015, -541553, -633528, -754635, -905782, -1083657, -1279926, -1482055, -1675770, -1847995, -1988718, -2091288, -2151730, -2168063, -2140170, -2070272, -1963743, -1829703, -1680618, -1530496, -1392218, -1275177, -1184170, -1119551, -1078108, -1054177, -1040943, -1031803, -1021642, -1007743, -990339, -972730, -960718, -961067, -979277, -1017526, -1073762, -1142238, -1215117, -1284350, -1343080, -1386250, -1410604, -1414731, -1399536, -1368948, -1330232, -1293474, -1270183, -1271084, -1303313, -1367798, -1458138, -1561824, -1663329, -1747628, -1802825, -1821513, -1801181, -1744055, -1656549, -1548327, -1430960]
36513a430960J14713J01763Q1376N7091L2411J0362o627j6710j8837j3157j242
36502a089817J4264L0399M4540N4659N9488N8935N4513M9198M6367M8152N4211
36491e75091O1719O6813O6634O0632N0461L8749K7740J8597J1477O170K797K148
36479a61154N320J2886K4223L7427M9910N9343O4575O6049O5437O4624O4698O5611
36467D18949O6579O6753O5809O4360O3966O6454P2709Q1788R1174R7875R9422
36456A255838R4221Q1591O1852L6405P426k2657n1565p7379r8594j14267j24146
36445A048725j28965j30694j32319j36805j45737j58490j72552j84546j91336
36436c32719j90701j81657j64449j40432j11829q1398n2109k6826p986K917O056
$$ y = [-1430960, -1316247, -1214484, -1133108, -1076017, -1043606, -1033244, -1039871, -1056581, -1075418, -1088575, -1089817, -1075553, -1045154, -1000614, -945955, -886467, -827532, -773019, -723821, -677454, -629302, -575091, -513372, -446559, -379925, -319293, -268832, -230083, -202343, -183746, -172269, -166099, -163302, -161154, -155834, -142948, -118725, -81298, -31388, 27955, 92530, 158579, 224016, 288640, 353338, 418949, 485528, 552281, 618090, 682450, 746416, 812870, 885579, 967367, 1058541, 1156416, 1255838, 1350059, 1431650, 1493502, 1529907, 1537333, 1514676, 1463111, 1385732, 1287138, 1172871, 1048725, 919760, 789066, 656747, 519942, 374205, 215715, 43163, -141383, -332719, -523420, -705077, -869526, -1009958, -1121787, -1203185, -1255294, -1282120, -1290106, -1287189, -1281133]
36425a281133L678m08k184J211J0803K5879M4453O3939Q1942R6907J07960J14136
36413g32817J13689J04544Q5811N9202K9096R63k0765l4160l9881m0213l7818
36402e12349l4843l2684l2183l3800l7539m2811m8547n3441n6009n4455m6914
36391i85575l2324j1496J2731L6747N8047P6185R2049J06337J18842J28947J36245
36380b63265J40230J39344J30793J11717Q1058M0955l021m3076p1528q3416p7915
36369A01876n7917k8326N701L9771P0616R6128J15257J27684J33237J31334J20864
36358H56225J00875P1620L5265m292m2268p4099r6469j08108j10088j05387r7859
36347D25415r0948q6564q4539q2948p9233p1646o0396m7993l8516l5924m2193
$$ y = [-1281133, -1277455, -1277863, -1280047, -1278836, -1268033, -1242154, -1197701, -1133762, -1051820, -954913, -846953, -732817, -619128, -514584, -428773, -369571, -340475, -339512, -360277, -394437, -434318, -474531, -512349, -547192, -579876, -612059, -645859, -683398, -726209, -774756, -828197, -884206, -938661, -985575, -1017899, -1029395, -1016664, -979917, -921870, -845685, -753636, -647299, -528457, -399510, -263265, -123035, 16309, 147102, 258819, 339877, 380832, 377811, 334735, 263207, 179791, 101876, 43959, 15633, 21334, 61105, 131721, 227849, 343106, 470790, 604027, 735361, 856225, 957100, 1028720, 1063985, 1059693, 1017425, 943326, 846857, 738749, 628661, 523274, 425415, 334467, 247903, 163364, 80416, 1183, -70463, -130859, -178852, -217368, -253292, -295485]
36336b95485n6341p4834r2991j06508j12579j10307j00321q4015o2943l8938j4447
36325a149709P452K3600L1586L0653K2345J0273j437j0147j5703j9659k3661k8392
36313a122799l3469l7771l9609l6901k7817j1798R605L2866N3746O9049P7791
36302a067107Q1140Q1311Q0339P9378P8568P7205P4153O8441N9899M9251L7564
36291b99858K5477J2956l28j4458k8985m2999n5468o5848p4699q3643r4276j06696
36279h28825j18909j27719j30431j25996j14846r7880p5642m8387j6848J7013
36269a668470M9817P7397R6127J04477J03863R8091R1644Q7963Q8632R3412J00636
36258f76411J07740J11995J11298J04598R1889P4029N2617K9930Q761q003j8029
$$ y = [-295485, -351826, -426660, -519651, -626159, -738738, -849045, -949366, -1033381, -1096324, -1135262, -1149709, -1142257, -1118657, -1087071, -1056418, -1034073, -1023800, -1025237, -1035384, -1051087, -1070746, -1094407, -1122799, -1156268, -1194039, -1233648, -1270549, -1298366, -1310164, -1300559, -1267693, -1213947, -1144898, -1067107, -985967, -904656, -824317, -744939, -666371, -589166, -515013, -446572, -386673, -337422, -299858, -274381, -261425, -261753, -276211, -305196, -348195, -403663, -469511, -544210, -627853, -722129, -828825, -947734, -1075453, -1205884, -1331880, -1446726, -1544606, -1620248, -1668635, -1685483, -1668470, -1618653, -1541256, -1445129, -1340652, -1236789, -1138698, -1047054, -959091, -870459, -777047, -676411, -568671, -456676, -345378, -240780, -148891, -74862, -22245, 7685, 16446, 8443, -9586]
36247i586k0305j5413n119Q394K2916L6023M4919M6843L9872K3577p64l0282o0857
36234H0218q7703j06317j13536j08363r2161o8140m0498j3696P942K0659K2119
36223d99476J2503m986k4969m1827n1682n3280m7521l6259k1238l669J5535L5197
36211g21672N3539O8417P7911Q0931P7493O8661N6191M1881K7032J2392j489j4105
36199a72818k5389l6023m7011n8688p0131p9571q5444q7359q6430q4836q4890
36188i18590q8005r4100j01566j07626j08831j01787q4238n6335k1340J5068M6896
36177a620454P0299Q4744R2422R6600J00042J03997J07841J09674J07865J02646
36167f44324R6472R2727R3789R9694J08131J15545J18807J16448J08813R7394
$$ y = [-9586, -29891, -45304, -50423, -42029, -19113, 16910, 61829, 108672, 148544, 172121, 171357, 141075, 80218, -7485, -113802, -227338, -335701, -427862, -496002, -536500, -550196, -542254, -521595, -499476, -486973, -491959, -516928, -558755, -610437, -663717, -711238, -747497, -768735, -772404, -756869, -721672, -668133, -599716, -521805, -440874, -363381, -294720, -238529, -196648, -169616, -157224, -158713, -172818, -198207, -234230, -281241, -339929, -410060, -489631, -575075, -662434, -748864, -833700, -918590, -1006595, -1100695, -1202261, -1309887, -1418718, -1520505, -1604743, -1661078, -1682418, -1667350, -1620454, -1550155, -1465411, -1372989, -1276389, -1176347, -1072350, -964509, -854835, -746970, -644324, -547852, -455125, -361336, -261642, -153511, -37966, 80841, 197289, 306102, 403496]
36157D03496Q4121P0968N9426M9614L9745K6921Q988j3893l9023o2330q0152r0628
36145D57253r4148r2688q8625q3789p9183p5128p1508o7944o3930n8746n1222
36134c69658l9739k2921o64K5324N2078P6603R6870J12041J22166J27751J29432
36123C09283J27702J22725J14303J02155Q6395O7999M8856L1213J6822O332p72
36112A033013n897j0879j7308k5838l5846m5718n3430n7019n4949m6618l2888
36101F46623j6201r5J1643J5849J0825k981k2717m3723o0940p0621p1394o4008
36089C32260n0141l1325q931J5112L7896N5974O6430O7893O1138M9034L5800K5739
36077F56879K1870K4922L3005M2223M8096M7204L8230K2064J326k0249l8532n0016
$$ y = [403496, 487617, 558585, 618011, 667625, 707370, 734291, 743279, 729386, 690363, 628033, 547881, 457253, 363105, 270417, 181792, 98003, 18820, -56308, -127816, -195760, -259690, -318436, -369658, -409397, -432318, -432982, -407658, -355580, -278977, -182107, -70066, 52100, 179851, 309283, 436985, 559710, 674013, 776168, 862563, 930562, 979418, 1010631, 1027453, 1033785, 1033013, 1027116, 1016237, 998929, 973091, 937245, 891527, 838097, 781078, 726129, 679511, 646623, 630422, 630327, 641970, 657819, 668644, 665663, 642946, 599223, 538283, 467662, 396268, 332260, 282119, 250794, 241863, 256975, 294871, 350845, 417275, 485168, 546306, 595340, 631140, 656879, 678749, 703671, 736676, 778899, 826995, 874199, 912429, 934493, 935819, 915570, 877038, 827022]
36065H27022n2900m7747l7115k4276j1676j46J0617K0798K9546L5088L5772L1258
36053H16241K3126J4611R548J0993K0025L5149N2552O7180P4438P1650N8623L7164
36041A291300J0215j8843m6501o9350q4402q9542q3994o8504m5104j6533J4199
36030G92941M3906O9161Q6529R3286Q8265P2226M7413J6751j6639m9349p7652
36019A166838r8093j08468j08347r8890q2328o1576l9793j9624k410J1914K3951
36008E83174L3624L9691M0546L5737K6848J6808Q064R32o570j7217l2322n0317
35996F78998o7361p9646q5422q5132p9859o9953n5069l5259j1843J2579L4846
35985A56879N2141O2694O5986O2542N3576M0787K6224J2159P90o257q496o795
$$ y = [827022, 774122, 726375, 689260, 664984, 653308, 653162, 663779, 684577, 714123, 749211, 784983, 816241, 839367, 853978, 863526, 874519, 894544, 929693, 982245, 1049425, 1123863, 1195513, 1254136, 1291300, 1301515, 1282672, 1236171, 1166821, 1082419, 992877, 908883, 840379, 795275, 778742, 792941, 836847, 906008, 992537, 1085823, 1174088, 1246314, 1293727, 1310478, 1293839, 1244490, 1166838, 1068745, 960277, 851930, 753040, 670712, 609136, 569343, 549719, 547309, 559223, 583174, 616798, 656489, 697035, 732772, 759620, 776428, 784492, 785424, 778854, 761637, 729315, 678998, 611637, 531991, 446569, 361437, 281578, 211625, 156556, 121297, 109454, 122033, 156879, 209020, 271714, 337700, 400242, 453818, 494605, 520829, 532988, 533778, 527521, 519025, 512230]
35973E12230k853J707N950R667J3168J7073K1888K7447L2732L6401L7607L6444
35961G49461L3977L1984L2401L6258M2653M8658N0624M6077L4968J9578L356j0517
35949A119478k0222k5894k9624l4622m3587n6990p2487q5970r3684r4042q8121
35938D74235p8675o8381n8495m8776l8549k7833j7620r251l570n62M24K35l15
35925A22867m51N71L352Q317J5703K5303L5865M4869M9431M8089M2120L5217L1594
35912D62847L3670M0824N0031N7923O2655O4352O4301O4068O5078O8359P4290
35901A108398Q2703R3423J06448J21387J36549J48794J54448J50848J37707J17484
35891B358189R4551P3755N9277N4045N9203P3574R3731J15164J33996J48315J58550
$$ y = [512230, 509377, 511084, 517034, 526701, 539869, 556942, 578830, 606277, 639009, 675410, 713017, 749461, 783438, 815422, 847823, 884081, 926734, 975392, 1026016, 1072093, 1107061, 1126639, 1129995, 1119478, 1099256, 1073362, 1043738, 1009116, 965529, 908539, 836052, 750082, 656398, 562356, 474235, 395560, 327179, 268684, 219908, 181359, 153526, 135906, 126655, 123085, 122523, 122947, 123182, 122867, 122416, 122987, 126339, 134656, 150359, 175662, 211527, 256396, 305827, 353916, 396036, 431253, 462847, 496517, 537341, 587372, 645295, 707950, 772302, 836603, 900671, 965749, 1034108, 1108398, 1191101, 1284524, 1390972, 1512359, 1648908, 1797702, 1952150, 2102998, 2240705, 2358189, 2452740, 2526495, 2585772, 2639817, 2699020, 2772594, 2866325, 2981489, 3115485, 3263800, 3422350]
35880C422350J66744J74931J83385J89998J91309J84430J68462J44608J15108
35871D941325Q1744M5086N317l5943p4584j05010j22684j26414j18997j05768
35861D384072r1892q0104p0487o2125n4755m8842m4554m1044l6662k9678j9085
35850C804844n237J0303K5962M1600N8789P9469J03983J29862J52262J65731J66287
35839D733855J52617J26036R0018M9724J1231k0002m0749n0623n1529m6586l9015
35828D914977l1088k3543j5938p563J860J2153K3031L4386M6339N8906P1472Q2589
35816E167581R0503R4040R3261Q9742Q6468Q7203R5149J11637J35604J64145J93661
35805F408994K21276K45915K68290K89597L10018L28278L42391L50720L52867
$$ y = [3422350, 3589094, 3764025, 3947410, 4137408, 4328717, 4513147, 4681609, 4826217, 4941325, 5023069, 5068155, 5073472, 5037529, 4962945, 4857935, 4735251, 4608837, 4489840, 4384072, 4292180, 4212076, 4141589, 4079464, 4024709, 3975867, 3931313, 3890269, 3853607, 3823929, 3804844, 3799607, 3809910, 3835872, 3877472, 3936261, 4015730, 4119713, 4249575, 4401837, 4567568, 4733855, 4886472, 5012508, 5102526, 5152250, 5163481, 5143479, 5102730, 5052107, 5000578, 4953992, 4914977, 4883889, 4860346, 4844408, 4836845, 4838705, 4850858, 4873889, 4908275, 4954614, 5013520, 5084992, 5167581, 5258084, 5352124, 5445385, 5535127, 5621595, 5708798, 5803947, 5915584, 6051188, 6215333, 6408994, 6630270, 6876185, 7144475, 7434072, 7744090, 8072368, 8414759, 8765479, 9118346]
35796I118346L50395L47012L47651L56698L76387M06118M42737M81555N17732
35787A2744631N47594N69413N83720N93115O01452O12509O28994O52512O83966
35778A8217906P23615P70838Q24305Q82600R44782J010494J079650J151960J226816
35769B6832966J304149J385922J476754J582813J709848J861779K040327K245364
35761D0439922K475897K731401L012537L320857L658249M026601M427128M859159
35753F8951751N319789N805375O313682O844958P401925P989557Q614410R283224
35745A26524671J0001786J0774946J1606703J2499387J3452880J4464648J5529220
35738B14854241J6636099J7768556J8906298K0030857K1128989K2188383K3180114
$$ y = [9118346, 9468741, 9815753, 10163404, 10520102, 10896489, 11302607, 11745344, 12226899, 12744631, 13292225, 13861638, 14445358, 15038473, 15639925, 16252434, 16881428, 17533940, 18217906, 18941521, 19712359, 20536664, 21419264, 22364046, 23374540, 24454190, 25606150, 26832966, 28137115, 29523037, 30999791, 32582604, 34292452, 36154231, 38194558, 40439922, 42915819, 45647220, 48659757, 51980614, 55638863, 59665464, 64092592, 68951751, 74271540, 80076915, 86390597, 93235555, 100637480, 108627037, 117241447, 126524671, 136526457, 147301403, 158908106, 171407493, 184860373, 199325021, 214854241, 231490340, 249258896, 268165194, 288196051, 309325040, 331513423, 354693537]
35731C54693537K4025160K4553482K4476872K3398471K0874542J6536996J0267808
35724D98826868K367181o396312j4944265k2219433k7515991l0628145l1773253
35717C67716650l1394038k9976321k7945529k5629601k3256531k0968132j8840766
35710A89705732j6905479j5164538j3605388j2211315j0966484r856220q866354
35703A02129954p983421p194794o488662n854605n284213m770644m307886l891093
35695E6354636l517267l184579k890874k633090k407742k211222k039746j889707
35687C5580409j758076j641986j538109j443033j354287j270629j191544j117015
35679B4265730j047665r84410r27744q77532q33324p94279p58633p23704o86768
$$ y = [354693537, 378718697, 403272179, 427749051, 451147522, 472022064, 488559060, 498826868, 501194049, 494797737, 479853472, 457634039, 430118048, 399489903, 367716650, 336322612, 306346291, 278400762, 252771161, 229514630, 208546498, 189705732, 172800253, 157635715, 144030327, 131819012, 120852528, 110996308, 102129954, 94146533, 86951739, 80463077, 74608472, 69324259, 64553615, 60245729, 56354636, 52837369, 49652790, 46761916, 44128826, 41721084, 39509862, 37470116, 35580409, 33822333, 32180347, 30642238, 29199205, 27844918, 26574289, 25382745, 24265730, 23218065, 22233655, 21305911, 20428379, 19595055, 18800776, 18042143, 17318439, 16631671]
35670A6631671o46091o01651n55317n10279m69604m34847m05885l81714l61067
35661A2265216l42396l23889l03968k81917k58167k34160k11790j92625j77608
35652I938696j67342j62267j62117j65362j69610j72688j73255j70869j66090
35643H429096j60714j57317j57980j63213j71738j81037j88338j91760j91020
35634F865979j87111j81169j73676j64635j54213j43055j32003j21663j12306
35625E496148j04330r8729r6691r8304j01681j03900j03115r9865r6391r4735
35615D498407r5198r6134r4909q9350p8867o4742m9814l7707l1575l2408l7926
35604C789777m3255m3285l5197j9674l49J7881L0916L6999L7271L5275L5735M2725
$$ y = [16631671, 15985580, 15383929, 14828612, 14318333, 13848729, 13413882, 13007997, 12626283, 12265216, 11922820, 11598931, 11294963, 11013046, 10754879, 10520719, 10308929, 10116304, 9938696, 9771354, 9609087, 9446970, 9281608, 9111998, 8939310, 8766055, 8595186, 8429096, 8268382, 8111065, 7953085, 7789872, 7618134, 7437097, 7248759, 7056999, 6865979, 6678868, 6497699, 6324023, 6159388, 6005175, 5862120, 5730117, 5608454, 5496148, 5391818, 5293089, 5196398, 5098094, 4996413, 4892513, 4789398, 4689533, 4593142, 4498407, 4403209, 4307075, 4212166, 4122816, 4043949, 3979207, 3929393, 3891686, 3860111, 3827703, 3789777, 3746522, 3703237, 3668040, 3648366, 3648017, 3665898, 3696814, 3733813, 3771084, 3806359, 3842094, 3884819]
35592C884819N7900P9716J04228J26787J43350J51047J48530J36198J15684Q8595
35582E036854N5470J5895l0249q1364j33360j80271k16174k37475k43888k37557
35572C747881k21269j97352j67734j34481j00104o7394l9182j8124o459n511j5053
35561B775218l2969n5650p9036r9829j16398j28950j38772j46806j52513j53817
35551A670478j48010j32912j07695p3380l3008Q761M6619P5877R3604R9396R5377
35540A595107Q5272P2857O0549M8869L6871K3279P681q966k4834l8184m8024n4350
35528A756127n8158o1258o5599p2465q2292r5096j10654j27853j44031j55401
35518G83320j58566j52028j36735j15545r2120o9654m9823l2415j5958Q27J7584
$$ y = [3884819, 3942719, 4022435, 4126663, 4253450, 4396800, 4547847, 4696377, 4832575, 4948259, 5036854, 5092324, 5108219, 5077970, 4996606, 4863246, 4682975, 4466801, 4229326, 3985438, 3747881, 3526612, 3329260, 3161526, 3027045, 2926941, 2859547, 2820365, 2802241, 2795782, 2790271, 2775218, 2742249, 2686599, 2607563, 2507734, 2391336, 2262386, 2123614, 1976808, 1824295, 1670478, 1522468, 1389556, 1281861, 1208481, 1175473, 1184234, 1230853, 1306730, 1400334, 1499730, 1595107, 1680379, 1753236, 1813785, 1862654, 1899525, 1922804, 1930485, 1921519, 1896685, 1858501, 1810477, 1756127, 1697969, 1636711, 1571112, 1498647, 1416355, 1321259, 1210605, 1082752, 938721, 783320, 624754, 472726, 335991, 220446, 128326, 58672, 8849, -23566, -39524, -38697, -21113]
35507b1113L2040M1243M3460L9315L1407K2934J6344J2666J1587J2066J3090J4299
35495B69338J6156J9650K5691L4496M5237N6061O4470O8047O5415N6924M4444
35484G65929L0245J5896K007j1272k3702l4766m3645m9217n0207m5495l4542j7910
35472E03321K180K1943L7266M5691M7598M5601M2701M0647L9373L7483L3256K5721
35460I22781J5381M266m852r672r335m541L108J2006K1056K9680L7534M4058M8123
35447A109593M8241M3312L3283J8991J391j9054m2380o8733r7685j27287j53541
35436G46131j71238j76228j67532j47796j21820r4379o8549m5315k4396n579J0532
35425b66169K2946L1193L5733L7555L7529L6112L3541L0122K6240K2043J7179
$$ y = [-21113, 10927, 52170, 95630, 134945, 166352, 189286, 205630, 218296, 229883, 241949, 255039, 269338, 285494, 305144, 330835, 365331, 410568, 466629, 531099, 599146, 664561, 721485, 765929, 796174, 812070, 814077, 802805, 779103, 744337, 700692, 651475, 601268, 555773, 521231, 503321, 505501, 527444, 564710, 610401, 657999, 703600, 746301, 786948, 826321, 863804, 897060, 922781, 938162, 942428, 937576, 927904, 918569, 914028, 917136, 929142, 950198, 979878, 1017412, 1061470, 1109593, 1157834, 1201146, 1234429, 1253420, 1254811, 1235757, 1193377, 1124644, 1026959, 899672, 746131, 574893, 398665, 231133, 83337, -38483, -132862, -201411, -246726, -271122, -276701, -266169, -243223, -212030, -176297, -138742, -101213, -65101, -31560, -1438, 24802, 46845, 64024]
35414F4024J1110L933l004p428p320k268N831J3166J5527J0296k211j8867l5221
35401D7568m7408n3512n3960n0766m6087m0941l4978k7544j9098j1774q554j1654
35389c58708k1329l5839n2266o7421p8397q2980q0157p0571n6497m1152k7539
35378i72856j7417j1045p866p467r950j5432k3216l1457l7571l9250l5535k7350
35366a236412j6957o698K032Q793J3422J5548J4814J1486O784K460j95j117j264
35353a187304j605k339l089l516l389j983K231J0875K4253M0383N5351O4973O6717
35340i38442O0763M9580L6478K4135J3771N132k928j1543k1090l0802l8867m2852
35328h96665m0498l0772j4682M732K3512L8466M8495N4755N9629O5161P1999P9404
$$ y = [64024, 75134, 79067, 76063, 68635, 61315, 59047, 64878, 78044, 93571, 103867, 101656, 82789, 47568, 160, -53352, -107312, -158078, -204165, -245106, -280084, -307628, -326726, -338500, -347054, -358708, -380037, -415876, -468142, -535563, -613960, -696940, -777097, -847668, -904165, -945317, -972856, -990273, -1001318, -1009184, -1016651, -1026601, -1042033, -1065249, -1096706, -1134277, -1173527, -1209062, -1236412, -1253369, -1260067, -1258035, -1249242, -1235820, -1220272, -1205458, -1193972, -1187188, -1184728, -1184923, -1186040, -1187304, -1188909, -1191248, -1194337, -1197853, -1201242, -1203225, -1200994, -1190119, -1165866, -1125483, -1070132, -1005159, -938442, -877679, -828099, -791621, -767486, -753715, -748583, -751511, -763054, -784144, -814946, -853813, -896665, -937163, -967935, -982617, -977885, -954373, -915907, -867412, -812657, -753028, -687867, -615868, -536464]
35316e36464Q6038R0865R3568R4417R3735R1398Q6709P8692O6637N0497L1134
35305C27226J0461q787k3714l2223l3774k9615k2509j6187j4590k0894l6343n9402
35293C9649q5921j10495j28329j36446j33936j21679j02093p8576n4434l1796
35283i44056j1440O369K0895L0786L4684L1973K3078R258p633k5215m0581n0596
35271i22478n2590m5093k8363m682K1735M5770O3403P3420P7140P6156P0184N7166
35259e68232L5530O446k5830n5575p7776q9630r0964q3779p1195n6251m1046k6609
35247a144911j3150j56J3807L0937N3230Q1069J12506J43840J71154J91643K03908
35236a56123K07279K01174J85343J60869J30797R9561P1491M9546L4943K7555
$$ y = [-536464, -450426, -359561, -265993, -171576, -77841, 13557, 100266, 178958, 245595, 296092, 327226, 337687, 328900, 305186, 272963, 239189, 209574, 187065, 170878, 156288, 135394, 99051, 39649, -46272, -156767, -285096, -421542, -555478, -677157, -779250, -857826, -912260, -944056, -955496, -949127, -928232, -897446, -862762, -830789, -807711, -798453, -806086, -831301, -871882, -922478, -975068, -1020161, -1048524, -1053206, -1031471, -985701, -922298, -848878, -771738, -695582, -625398, -568232, -532702, -526256, -552086, -607661, -685437, -775067, -866031, -949810, -1021005, -1077256, -1118302, -1144911, -1158061, -1158217, -1144410, -1113473, -1060243, -979174, -866668, -722828, -551674, -360031, -156123, 51156, 252330, 437673, 598542, 729339, 828900, 900391, 949937, 984880, 1012435]
35226A012435K6573L1063M0193N3076O8458Q4543R9161J10144J15830J15453J09165
35215A866094R7607Q1362O0885L6950J0975j5094l9220n9702p5544q6784r4403
35204A783126r9613j02910j03721j00982r4201q4323p3835o6078o3971o8680p8906
35193H45906r1195j01237j05439j02028r1133p4010n2088k6395K375L3387O5089
35182C03232R5049J20469J39198J50490J54915J53507J46912J35170J18096R5877
35172A612915O9576M1284J3800j0184k9148m3334n4443o4436p4383q4073r2572
35161A285002r9090j03445j06056j07697j09165j10826j12166j11787j08201j00930
35151B15639r1127q1062p2912o7736o5333o4896o5805o7934p1396p5929q0341
$$ y = [1012435, 1039008, 1070071, 1110264, 1163340, 1231798, 1316341, 1415502, 1525646, 1641476, 1756929, 1866094, 1963701, 2045063, 2105948, 2142898, 2153873, 2138779, 2099559, 2039857, 1964313, 1877529, 1783126, 1683513, 1580603, 1476882, 1375900, 1281699, 1197376, 1123541, 1057463, 993492, 924812, 845906, 754711, 653474, 548035, 446007, 354874, 280864, 228776, 202381, 204756, 238143, 303232, 398281, 518750, 657948, 808438, 963353, 1116860, 1263772, 1398942, 1517038, 1612915, 1682491, 1723775, 1737575, 1727391, 1698243, 1654909, 1600466, 1536030, 1461647, 1377574, 1285002, 1185912, 1082467, 976411, 868714, 759549, 648723, 536557, 424770, 316569, 215639, 124512, 43450, -29462, -97198, -162531, -227427, -293232, -361166, -432562, -508491, -588832]
35140e88832q2333p9026o8092m9052k3932L078K6884M2998M8842M4422L2266J6488
35128f76289J425r543j4523j3121o258M165J5958K7578L8762N0416O3786P9330
35116d38314R5771J09737J16452J11522R3079O3129K7123q105l6994n7096o9264
35105G040p6288q0916q4357q5869q3470p5245o0573m0709j8536K219J7980K6304
35093e52420K6639K0531J0973J131o931j2913j8106k4543l3720m5503n7888o7930
35081g60680p3243p3051o8242o0668n2388m5179m0252l7979l7598l7043l3226
35070a319549k2993m594K1045N0107P7049R6662J06045J05722R9324R1867Q7254
35059f12061Q6452Q7496Q7182Q3037P4273O1599M6624L1388J7961Q031K566J665
$$ y = [-588832, -671165, -750191, -818283, -867335, -891267, -888189, -861305, -818307, -769465, -725043, -692777, -676289, -674864, -684407, -698930, -712051, -718309, -714144, -698186, -670608, -631846, -581430, -517644, -438314, -342543, -232806, -116354, -4832, 88247, 151376, 178499, 170394, 133400, 76304, 7040, -69248, -150164, -234521, -320390, -403860, -479105, -539678, -580387, -598923, -596704, -578724, -552420, -525781, -505250, -494277, -493146, -500077, -512990, -531096, -555639, -589359, -634862, -692750, -760680, -833923, -906974, -975216, -1035884, -1088272, -1133451, -1173703, -1211682, -1249280, -1286323, -1319549, -1342542, -1347136, -1326091, -1275984, -1198935, -1102273, -996228, -890506, -791182, -699315, -612061, -525609, -438113, -350931, -267894, -193621, -132022, -85398, -54010, -36049, -28018, -25452, -23787]
35047b3787M437Q926J2405J2362P830J53p513j1800j0835n035L401J1692J7517
35034A9753J9347J6313Q157m572k0414l7272n2897o5213p2475p3599o8670n9050
35022c90592m6699l3049j8336j926J6684L6953N6972P3899Q4906Q8317Q4368P5151
35010B6648O3687N2406M2042L1630J9733N906q710k1983l1916l7518l9171l8491
34998F4263l7732l8826m2405m7334n1029n0445m3418k9696j1090R435K9000M5676
34986b03601N8650O7976P4128P7487P7959P4934O7710N6157M1243K5050J0100
34975D27793j792j0338j6689k2529k9206l7474m7694n9986p4026q8851j03046
34964f3838j15395j25467j33656j40567j46396j50706j52538j50483j42751j27626
$$ y = [-23787, -19350, -10424, 1981, 14343, 22173, 22326, 14813, 3013, -7822, -12857, -9456, 2236, 19753, 39100, 55413, 63570, 58998, 38584, 1312, -51585, -116798, -189273, -262872, -331542, -390592, -437291, -470340, -488676, -490602, -473918, -436965, -379993, -306094, -221188, -132871, -48503, 26648, 90335, 142741, 184783, 216413, 236146, 242052, 233342, 211359, 179443, 141925, 102754, 64263, 26531, -12295, -54700, -102034, -153063, -203508, -246926, -276622, -287712, -278277, -249277, -203601, -144951, -76975, -2847, 74640, 152599, 227533, 295243, 351400, 392643, 417693, 427793, 426001, 415663, 398974, 376445, 347239, 309765, 262071, 202085, 128059, 39208, -63838, -179233, -304700, -438356, -578923, -725319, -876025, -1028563, -1179046, -1321797, -1449423]
34954a449423j04326p3704l8289j757L1772N8488P5785Q3072Q1951P5412O6409
34943a194610N6775M7134L7705K9256K3445K2264K6912L6811M9505O1657P0407
34932g32739P4184P2513O5461N3468L7559J9350N30j7753l5022n1074o5489p7497
34920f56509q6326r1613r3513r2319q7965p9930o7650n1193l1713j1416O926K0634
34908a322587K7703K7237J9945Q570k405q233n989M166J9482L6398N2278O6071
34896a077364P7862Q7995R6402J02464J05217J03735R7557Q7208P4519O2327N3417
34885a28661M9345M9841N3171N7044N9436N9117N5907N0787M5699M2784M3307
34874D37777M6842N1416N4533N4564N1642M7475M3951M1403L7896L0373J6861
$$ y = [-1449423, -1553749, -1627453, -1665742, -1667499, -1635727, -1577239, -1501454, -1418382, -1336431, -1261019, -1194610, -1137835, -1090701, -1052996, -1023740, -1000295, -978031, -951119, -914308, -864803, -803146, -732739, -658555, -586042, -520581, -467113, -429554, -410204, -409674, -427427, -462449, -513523, -579012, -656509, -742835, -834448, -927961, -1020280, -1108245, -1188175, -1255825, -1307018, -1338731, -1350147, -1343221, -1322587, -1294884, -1267647, -1247702, -1239132, -1241537, -1249770, -1255759, -1251593, -1232111, -1195713, -1143435, -1077364, -999502, -911507, -815105, -712641, -607424, -503689, -406132, -318924, -244405, -182078, -128661, -79316, -29475, 23696, 80740, 140176, 199293, 255200, 305987, 351686, 394470, 437777, 484619, 536035, 590568, 645132, 696774, 744249, 788200, 829603, 867499, 897872, 914733]
34863I14733j997k3203m3000n8570o8816p4090p5306p3209o8323o1464n4122m8297
34851B64336m5895m8030n4553o3925p3652q1137q4436q2698p6395o7535n9344
34840d73264n4936n5387n8659o0327n5797m2639k1816K648K5103M0141M4164L6216
34828f74553J7958p058l4423n9791p9604r1621r5313r1850q3514p2704o1101m9590
34816a383164l8875l0217k5449k6075l2092m1612n1543n8783o1117n7574m8331
34805a854832l4281j6345N038K9707N7003Q5214J11914J34904J52815J64937J70772
34794i93154J70044J63204J51635J37183J21578J06506R4032Q6304Q4148Q5668
34784B07148Q6481Q1794O8970M8874K5321L176j3629k3287k6181k4242k0054j6093
$$ y = [914733, 912736, 889533, 846533, 787963, 719147, 645057, 569751, 496542, 428219, 366755, 312633, 264336, 218441, 170411, 115858, 51933, -21719, -102856, -187292, -269990, -346385, -413920, -473264, -528200, -583587, -642246, -702573, -758370, -801009, -822825, -820177, -795074, -754933, -710769, -674553, -656595, -663653, -698076, -757867, -837471, -929092, -1024405, -1116255, -1199769, -1272473, -1333574, -1383164, -1422039, -1452256, -1477705, -1503780, -1535872, -1577484, -1629027, -1687810, -1748927, -1806501, -1854832, -1889113, -1905458, -1900420, -1870713, -1813710, -1728496, -1616582, -1481678, -1328863, -1163926, -993154, -823110, -659906, -508271, -371088, -249510, -143004, -48972, 37332, 121480, 207148, 293629, 375423, 444393, 493267, 518588, 521764, 508135, 484848, 458667, 434425, 414371, 398278]
34772C98278j4153j4914j7725k0762k1701j8733j1408r63R913J7729J9279J3059
34760C37899K00j5927l1471m3981n3169o0248o6460p1670p3680o8835n3897k8151
34748b29390N551M1496P2954R4160J01604R4430P4161M4252R647k3893n0888o7519
34736A66565p2641o8037n7843m7239m0676m0304m5255n2112n6172n2965l9777
34725d06456j6807J2355M1517O3877P4540P2296N9709M1576K2829P178l178p307
34713c7871n368J450J1059K0879K8480L2250L1747K7576K0864J2824M617k662
34701A45845q120j1388j2868j3715j5439j9299k5791l4525m4554n4898o4967p4588
34689b34307q3454r0378r3147q9455p8461o1648m2330k4193j0016j253J620j416
$$ y = [398278, 384125, 369211, 351486, 330724, 309023, 290290, 278882, 277919, 287832, 305561, 324840, 337899, 338099, 322172, 290701, 246720, 193551, 133303, 66843, -4827, -78507, -147342, -201239, -229390, -223839, -182343, -109389, -15229, 86375, 180805, 254966, 299218, 308865, 284972, 234084, 166565, 93924, 25887, -31956, -79195, -119871, -160175, -205430, -257542, -313714, -366679, -406456, -423263, -410908, -369391, -305514, -230974, -158678, -98969, -57393, -34564, -27386, -30564, -37871, -43239, -41789, -30730, -9851, 18629, 50879, 82626, 110202, 131066, 143890, 148507, 145845, 137725, 126337, 113469, 99754, 84315, 65016, 39225, 4700, -39854, -94752, -159719, -234307, -317761, -408139, -501286, -590741, -669202, -730850, -773180, -797373, -807389, -808642, -807022, -808438]
34677h08438j0094k3501l9603n5245o6867p1622o8343n7942m3120k7483j4440
34666a286698o361m217p515j4353k1710k6209k5221j7753m740J1280K6818L8440
34654a338239M4019M3783M0240L6647L5027L5419L6979L9710M5039N4832O9764
34643h56780Q8278J06604J20010J24930J21023J11620J02028R6690R7126J01634
34633B13163J06461J07604J02476R0912P5000N7906M2288K9264J8353Q182k608
34622H49001j4805k8536m3474n9071p4687q9470j02043j10352j12033j05414r0496
34611A8620o9224m4796k0432J541J9816L3580M2180M5401M4071L9978L4925K9732
34599A75392K4142J7583R785P31r734k2042l6488n2609o8794q2500r1041r2569
$$ y = [-808438, -818532, -842033, -881636, -936881, -1003748, -1075370, -1143713, -1201655, -1244775, -1272258, -1286698, -1293059, -1297276, -1304791, -1319144, -1340854, -1367063, -1392284, -1410037, -1414777, -1403497, -1376679, -1338239, -1294220, -1250437, -1210197, -1173550, -1138523, -1103104, -1066125, -1026415, -981376, -926544, -856780, -768502, -661898, -541888, -416958, -295935, -184315, -82287, 14403, 111529, 213163, 319624, 427228, 529704, 620616, 695616, 753522, 795810, 825074, 843427, 851609, 849001, 834196, 805660, 762186, 703115, 628428, 538958, 436915, 326563, 214530, 109116, 18620, -50604, -95400, -115832, -114291, -94475, -60895, -18715, 26686, 70757, 110735, 145660, 175392, 199534, 217117, 226902, 227633, 217899, 195857, 159369, 106760, 37966, -44534, -135575, -228144]
34587b28144q6758p4886n9337m2618k6351j0910M010J8214L0146L6950L5464K3713
34575c80507K327k4891n1890p2519q2697q1366o9996n1437k9066o452J2753K5122
34563h10619K8054K0355K626k2642n1232p7800r7083j05426j01895q8332o8320
34552a372314m5814k4153n755P931J6596K1277K4003K6780L0536L5046L9824M5006
34540a201037N1301N9053O7371P4143P6928P4106O5436N1686L3826J2782r918
34529f44323l1327m7346n4329n0972l9131k2998p217N059J3218J8916K4761L2752
34517h02937M3447N6059O8989Q0138Q6940Q6694P7319N8172L0325l676m0113p4427
34505c33070j01757j17984j20723j09788q6950n5423j9409J6466M8000P2329Q8428
$$ y = [-228144, -314902, -389788, -449125, -491743, -518094, -529004, -524994, -506780, -476634, -439684, -404220, -380507, -378180, -403071, -454961, -527480, -610177, -691543, -761539, -812976, -842042, -848494, -835741, -810619, -782565, -762210, -759584, -782226, -833458, -911258, -1008341, -1113767, -1215662, -1303994, -1372314, -1418128, -1442281, -1448036, -1440105, -1423509, -1402232, -1378229, -1351449, -1320913, -1285867, -1246043, -1201037, -1149736, -1090683, -1023312, -949169, -872241, -798135, -732699, -681013, -647187, -634405, -644323, -675650, -722996, -777325, -828297, -867428, -890426, -897643, -892584, -879366, -860450, -835689, -802937, -759490, -703431, -634442, -554304, -467364, -380670, -303351, -245179, -214854, -218530, -258643, -333070, -434827, -552811, -673534, -783322, -870272, -925695, -945104, -928638, -880638, -808309, -719881]
34494g19881R6949R9624R8684R6468R4913R4857R5483R4664R0246Q1617P0385
34483B94009N9731N2909N1847N6508O5102P4942Q3493Q9323R2409R3579R3410
34472A107262R1487Q6841P9103O9038N7686M4838K8528O233k3182n8283r5364
34461A394187j29924j58510j79973j95379k06514k14017k16554k11714j97823
34452c16221j75434j47618j19030r4277p6396o6097o2185o2767o6372p2128p9073
34441a337598q5455q9081q8651q4843p9923p6030p3544p0768o4796n2634l1954
34430b135277j748L6918Q0378J22703J57260J78843J85294J77819J60042J36575
34420i01193J11786Q9062P0497N6946M8364M4182M3580M5605M9357N4139N9557
$$ y = [-719881, -622932, -523308, -424624, -328156, -233243, -138386, -42903, 51761, 142007, 223624, 294009, 353740, 406649, 458496, 515004, 580106, 655048, 738541, 827864, 920273, 1013852, 1107262, 1198749, 1285590, 1364693, 1433731, 1491417, 1536255, 1564783, 1571016, 1547834, 1489551, 1394187, 1264263, 1105753, 925780, 730401, 523887, 309870, 93316, -118398, -316221, -491655, -639273, -758303, -852580, -928976, -995073, -1057258, -1120025, -1186397, -1258525, -1337598, -1423053, -1512134, -1600785, -1685628, -1765551, -1841581, -1915125, -1985893, -2050689, -2103323, -2135277, -2137025, -2100107, -2019729, -1897026, -1739766, -1560923, -1375629, -1197810, -1037768, -901193, -789407, -700345, -629848, -572902, -524538, -480356, -436776, -391171, -341814, -287675, -228118]
34409b28118O5418P1625P8170Q5213R3021J01579J10002J16250J17498J11060
34399G21718R5232O9728L5892l114m2599p7548j04390j22156j32302j37613j41122
34388A61726j45458j52378j62144j72959j81015j81498j70325j45744j09027o3916
34378a322738j5364L1782P3661J07768J32910J49056J57210J59129J56645J50697
34368b19244J40649J24437R9587O4796K1484k5627o9675j04309j26197j35745
34358b29844j35842j30033j21355j12035j03476r6221r0066q4455p8868p2973
34348a255168o6478n8998n0181m0135k9794k0821j4924j2901j4011j6108j6648
34337a596167j4071q749k765J412K506J087j017j913m87L496R711J7509K6047
$$ y = [-228118, -162700, -91075, -12905, 72308, 165329, 266908, 376910, 493160, 610658, 721718, 816950, 886678, 922570, 919456, 876857, 799309, 694919, 572763, 440461, 302848, 161726, 16268, -136110, -298254, -471213, -652228, -833726, -1004051, -1149795, -1258822, -1322738, -1338102, -1306320, -1232659, -1124891, -991981, -842925, -685715, -526586, -369941, -219244, -78595, 45842, 145429, 210225, 231709, 206082, 136407, 32098, -94099, -229844, -365686, -495719, -617074, -729109, -832585, -928806, -1018872, -1103327, -1182195, -1255168, -1321646, -1380644, -1430825, -1470960, -1500754, -1521575, -1536499, -1549400, -1563411, -1579519, -1596167, -1610238, -1618987, -1621752, -1620340, -1617834, -1616747, -1617764, -1619677, -1620164, -1616668, -1606957, -1589448, -1563401]
34324a563401L4400M1751M7472N1181N2770N2334M9965M5601L9248L1503K3701
34313a093475J7329J3110J0419P411J667q925k5360m7059p1877r6461j16753j28854
34301a538828j30361j21544j05415q6325o7955n1831l7041k1143j960K0542M3516
34290b098345O2426P3563P6194P2820O7566O3982O3621O6114P0236P5098Q0686
34279a326039Q7592R6263J06359J16577J25073J30202J31078J27651J20393J10045
34269a74806R7660Q4695P2713O2613N4017M5554L6089K5817J6172Q513K859k246
34257C29650q641j7259k7487l7504m5265m9416m9530m5460l6528k1570j04K6342
34245A7228N4057P8515R6245J05758J07118J00961Q7989O9068M5432J8685r184
$$ y = [-1563401, -1529001, -1487250, -1439778, -1388597, -1335827, -1283493, -1233528, -1187927, -1148679, -1117176, -1093475, -1076146, -1063036, -1052617, -1045206, -1043539, -1052464, -1077824, -1124883, -1196760, -1293221, -1409974, -1538828, -1669189, -1790733, -1896148, -1982473, -2050428, -2102259, -2139300, -2160443, -2162403, -2141861, -2098345, -2035919, -1962356, -1886162, -1813342, -1745776, -1681794, -1618173, -1552059, -1481823, -1406725, -1326039, -1238447, -1142184, -1035825, -919248, -794175, -663973, -532895, -405244, -284851, -174806, -77146, 7549, 80262, 142875, 196892, 242446, 278535, 304352, 320524, 329037, 331896, 329650, 321009, 303750, 276263, 238759, 193494, 144078, 94548, 49088, 12560, -9010, -9114, 17228, 71285, 149800, 246045, 351803, 458921, 559882, 647871, 716939, 762371, 781056, 771872]
34234G71872l5653n7951p4206q4815r2647j01418j13230j26937j38430j42605
34224a96020j35770j17168q8890n4570j8037J7184M7809P0929Q4671Q8699Q4047
34213b17116P2471N6046L7310J9504O294P25L868J3743K5362L2156K8529J2486
34201I1378j2965m0621o1959p0847o6059n1256l2617j5940m971j437n658j6742
34189b89694l2448m9420o4066p3569p6465p2820o4154n3098m2679l5512l3290
34178h87215l6650m5097n7013p0022q1717r0362r5094r5795r2896q7180p9291
34167a718332o9276n6670m1468k5214j1142k949k861j0291k1881l2846l8928l8157
34155b070015l1744k3520j7903j7244k0329k3140k1363j2877J346J7982L2902
$$ y = [771872, 736219, 678268, 604062, 519247, 426600, 325182, 211952, 85015, -53415, -196020, -331790, -448958, -537848, -592418, -610455, -593271, -545462, -474533, -389862, -301163, -217116, -144645, -88599, -51289, -31785, -25491, -24766, -20898, -7155, 18207, 50363, 78892, 91378, 78413, 37792, -24167, -95014, -161073, -212329, -244946, -260886, -265857, -267294, -272952, -289694, -322142, -371562, -435628, -509197, -585662, -658482, -722636, -775734, -818413, -853925, -887215, -923865, -968962, -1025975, -1095997, -1177714, -1268076, -1363170, -1458965, -1551861, -1639041, -1718332, -1787608, -1844278, -1885746, -1910960, -1922102, -1925051, -1927912, -1938203, -1960084, -1992930, -2031858, -2070015, -2101759, -2125279, -2143182, -2160426, -2180755, -2203895, -2225258, -2238135, -2236789, -2218807, -2185905]
34144b185905M2680M5602M2083L4485K6440K1969K4502L6044N6718Q4921J17827
34133a652634J51906J83229K07845K22410K24989K15575J96010J69450J39589
34124E8369J09907Q3042O0413M2185K7634J5714N405m287j4538k6681m1715n9564
34112B55884p8622r5997j08475j13749j11236j02117q8855p4538o2346n4917n3755
34101f88723n8998o9800q4988j03220j22506j39756j51110j52960j43022j20814
34091a835897q7732m6851k403M1209Q0476J13198J38151J54688J62924J64156
34081a118081J60691J54792J47608J38921J27880J13852R6738P6788N4437L0395
34071a5979N788j7882l9001n6102o8101p4403p4888o9711n9194m3958k5238m913
$$ y = [-2185905, -2143225, -2097623, -2055540, -2021055, -1994615, -1972646, -1948144, -1912100, -1855382, -1770461, -1652634, -1500728, -1317499, -1109654, -887244, -662255, -446680, -250670, -81220, 58369, 168276, 251318, 311731, 353916, 381550, 397264, 402669, 398382, 383844, 357163, 315448, 255884, 177262, 81265, -27210, -140959, -252195, -354312, -443167, -517705, -580051, -634968, -688723, -747721, -817521, -902509, -1005729, -1128235, -1267991, -1419101, -1572061, -1715083, -1835897, -1923629, -1970480, -1972883, -1931674, -1851198, -1738000, -1599849, -1445161, -1282237, -1118081, -957390, -802598, -654990, -516069, -388189, -274337, -177599, -100811, -46374, -15979, -10191, -28073, -67074, -123176, -191277, -265680, -340568, -410279, -469473, -513431, -538669, -543582]
34059e43582J4928L2573M6968N7527O3785O5144O0866N0431L4169J3852p342k5812
34047a36493l8985m6281m8906m8628m6566m2936l7761l1718k6282k3097k3162
34036e50815k6434l2113l9223m7054n5034o2340o7801p0337o9527o5763o0004
34025a146445n3536m7723m3546m0960l8598l4176k5295j0313J0870L6309O2410
34014a331003Q5390J03115J15955J26056J35593J45250J53810J58965J58687J52217
34004D035J40130J23666J04098Q2516N9829L6681J3360j0084l3600n7061q0360
33993C83210j03327j25283j44692j59418j67616j68517j62489j50372j32751j09708
33983a040963q1217m7995j2295K1973N0223O8886P6616P4136O2980M4383J9210
$$ y = [-543582, -528654, -496081, -449113, -391586, -327801, -262657, -201791, -151360, -117191, -103339, -110681, -136493, -175478, -221759, -270665, -319293, -365859, -408795, -446556, -478274, -504556, -527653, -550815, -577249, -609362, -648585, -695639, -750673, -813013, -880814, -951151, -1020678, -1086441, -1146445, -1199981, -1247704, -1291250, -1332210, -1370808, -1404984, -1430279, -1440592, -1429722, -1393413, -1331003, -1245613, -1142498, -1026543, -900487, -764894, -619644, -465834, -306869, -148182, 4035, 144165, 267831, 371929, 454445, 514274, 550955, 564315, 554231, 520631, 463570, 383210, 279883, 154600, 9908, -149510, -317126, -485643, -648132, -798504, -931255, -1040963, -1122180, -1170175, -1182470, -1160497, -1110274, -1041388, -964772, -890636, -827656, -783273, -764063]
33972g64063j1257m4568p7072j04612j23585j31861j29293j17455r8633p4551
33962a676950m5789j2277K5556O6104J06707J44220J75423J97383K08090K07102
33952f04431J95409J74476J45270J08307O4621J6723l1258p4256j07303j26581
33942b39023j30438j20169j00025p6052n4154l8368l0200k8914l2134l6474l8632
33931i24583l6858l1994k7009k5073k7628l3884m1877m9991n7667o4899p1181
33920a392644p4844p3415o4792m8467k5998n29K4231M4873N8703O3913N9734M6565
33908a382670K5975N51k6319n0874o9800q1226q5203q3280p7390o8873n8190m5293
33896b002592l0176j3311M212K0744L4365M3442M7346M6943M4516M3021M5079
$$ y = [-764063, -775320, -819888, -896960, -1001572, -1125157, -1257018, -1386311, -1503766, -1602399, -1676950, -1722739, -1735016, -1709460, -1643356, -1536649, -1392429, -1217006, -1019623, -811533, -604431, -409022, -234546, -89276, 19031, 83652, 100375, 69117, -5139, -112442, -239023, -369461, -489630, -589655, -665707, -719861, -758229, -788429, -817343, -849477, -885951, -924583, -961441, -993435, -1020444, -1045517, -1073145, -1107029, -1148906, -1198897, -1256564, -1321463, -1392644, -1467488, -1540903, -1605695, -1654162, -1680160, -1680689, -1656458, -1611585, -1552882, -1488969, -1429235, -1382670, -1356695, -1356144, -1382463, -1433337, -1503137, -1584363, -1669566, -1752846, -1830236, -1899109, -1957299, -2002592, -2032768, -2046079, -2041867, -2021123, -1986758, -1943316, -1895970, -1849027, -1804511, -1761490, -1716411]
33885a716411N2068O3600P7548R0779J00481J05361J06041J04436J02571J01472
33875h12054J00540R7778R0832P8406O1047M0850K0430K045j2825k3620l0788
33864c87359l5693m0119m5546n2460o0077o6614p0173o9928o6942o4091o5034
33853a024036p2746q8248j09827j33031j51627j59487j52753j31180r7891n7719
33843b178545j5365K5477O1888R1385J12365J25016J31412J34063J33938J29697
33833a248669J18937J00353P5102M6646J9557k012j5730k1943k3328k3220k3609
33822i97916k4236k3213j8293p857Q526K9651N2511P2919Q6928R2252Q8842P8409
33810e61477O3355M5677K6453O082j4934l5303n2857o5076o9935o6817n7197m4494
$$ y = [-1716411, -1664343, -1600743, -1523195, -1432416, -1331935, -1226574, -1120533, -1016097, -913526, -812054, -711514, -613736, -522904, -444498, -383451, -342601, -322171, -320126, -332951, -356571, -387359, -423052, -463171, -508717, -561177, -621254, -687868, -758041, -827969, -894911, -959002, -1024036, -1096782, -1185030, -1294857, -1427888, -1579515, -1739002, -1891755, -2022935, -2120826, -2178545, -2193910, -2168433, -2106545, -2015160, -1902795, -1777779, -1646367, -1512304, -1378366, -1248669, -1129732, -1029379, -954277, -907631, -888074, -890086, -905816, -927759, -951087, -974307, -997916, -1022152, -1045365, -1063658, -1071515, -1062989, -1033338, -980827, -907908, -820980, -728728, -639886, -561477, -498122, -452445, -425992, -419910, -434844, -470147, -523004, -588080, -658015, -724832, -782029, -826523]
33798h26523l2880k5555k3630k6338l2093l9412m7236n4895o2116o9009p5631
33787a315318q1233q3788q0515o9358n0629k7768o606O733Q471r65j6913l2449
33775a750338m1137l9136k6029m730J9206L9001M8911M6413L3153J4088m471j6941
33763a682010j9962j2972K107K1853M2559O1194P5923Q6082R1759R3236R0578
33752a149653Q3519P1618N4725L3768J1275r038k3766l1299l2194k8363k2108
33741a041516j5732j1581j1839j7756k8775m2276n4443o1934o3275n8976n0467
33730a458570l8948k5029r158Q024K5642M2658N7663O8651P3308O9902N8175L9573
33718a088109J6710p398k9731m7377n7689n8732m9795l1792p509J8532M0968N5375
$$ y = [-826523, -859403, -884958, -908588, -934926, -967019, -1006431, -1053667, -1108562, -1170678, -1239687, -1315318, -1396551, -1480339, -1560854, -1630212, -1680841, -1708609, -1715215, -1708482, -1700011, -1700976, -1717889, -1750338, -1791475, -1830611, -1856640, -1861370, -1842164, -1803163, -1754252, -1707839, -1674686, -1660598, -1665069, -1682010, -1701972, -1714944, -1712837, -1690984, -1648425, -1587231, -1511308, -1425226, -1333467, -1240231, -1149653, -1066134, -994516, -939791, -906023, -894748, -903786, -927552, -958851, -991045, -1019408, -1041516, -1057248, -1068829, -1080668, -1098424, -1127199, -1169475, -1223918, -1285852, -1349127, -1408103, -1458570, -1497518, -1522547, -1531705, -1523681, -1498039, -1455381, -1397718, -1329067, -1255759, -1185857, -1127682, -1088109, -1071399, -1078797, -1108528, -1155905, -1213594, -1272326, -1322121, -1353913, -1361422, -1342890, -1301922, -1246547]
33706a246547O0233N7801N3024N0831N3468N9601O5719O8496O6089N7674M2426
33695f11185J9501j0734m5437p9261j05873j20336j21199j11171r5922q1683p2914
33684a436214p0907p3549p6334p4581o6055n2377l8034k7556k2972k3089k4735
33673a986403k4824k1962j6972j2321j0934j4971k5034l9969n7239p3448q4798
33662b368875q7526p8707n7356k5124J4189N6105R6835J33685J64823J89108K06258
33651a756585K16871K21854K21572K15366K01851J79775J48805J09795O4606J5918
33641a60172l2716p6956j12392j35856j46472j45641j36009j20301j00701p8898
33631a246114n6441l5143j7259n102j30k053q705j6893k3711k7638k8819k8368
$$ y = [-1246547, -1186314, -1128513, -1075489, -1024658, -971190, -911589, -845870, -777374, -711285, -653611, -611185, -591684, -602418, -647855, -727116, -832989, -953325, -1074524, -1185695, -1281617, -1363300, -1436214, -1507121, -1580670, -1657004, -1731585, -1797640, -1850017, -1888051, -1915607, -1938579, -1961668, -1986403, -2011227, -2033189, -2050161, -2062482, -2073416, -2088387, -2113421, -2153390, -2210629, -2284077, -2368875, -2456401, -2535108, -2592464, -2617588, -2603399, -2547294, -2450459, -2316774, -2151951, -1962843, -1756585, -1539714, -1317860, -1096288, -880922, -679071, -499296, -350491, -240696, -176090, -160172, -192888, -269844, -382236, -518092, -664564, -810205, -946214, -1066515, -1167216, -1246114, -1302555, -1337698, -1354957, -1360059, -1360189, -1362242, -1370947, -1387840, -1411551, -1439189, -1468008, -1496376]
33619a496376k6991k3973j7514o434Q108K2374L1721L3076K6608J5653N094o52
33607a429306J138J1323K9220N2777P8675J02850J21640J33145J38033J39194
33597f21311J40123J42731J46016J46610J40840J26768J04910P7549M7458J6910
33587D68604j2668m0301o4686q3610r4256r4320q3245o2734l6346q556J6202L4288
33575f1628M3460M3330L5521K3218J0158o64p960j2381j5865k0526k7565l6683
33563b7585m6123n3396n6470n4712m8931m0352k9578j6513j296J4826K9727M1490
33551b88913M9378N3932N6236N7053N6495N4415N1104M7486M4594M2787M1486
33540B66053L9600L6086L0162K1217Q908o514k3899m1299n6353o6743p0579o6782
$$ y = [-1496376, -1523367, -1547340, -1564854, -1571288, -1563180, -1540806, -1509085, -1476009, -1449401, -1433748, -1428654, -1429306, -1428168, -1416845, -1387625, -1334848, -1256173, -1153323, -1031683, -898538, -760505, -621311, -481188, -338457, -192441, -45831, 95009, 221777, 326687, 404236, 451694, 468604, 455936, 415635, 350949, 267339, 173083, 78763, -4482, -67216, -103562, -112118, -95916, -61628, -18168, 25162, 60683, 83901, 94059, 93395, 85435, 73054, 57189, 36663, 9098, -27585, -73708, -127104, -183574, -238286, -287217, -327569, -357147, -373660, -374956, -360130, -330403, -288913, -239535, -185603, -129367, -72314, -15819, 38596, 89700, 137186, 181780, 224567, 266053, 305653, 341739, 371901, 393118, 402026, 395512, 371613, 330314, 273961, 207218, 136639, 69857]
33528F9857n5561l8663j9058J1J5999K7490L3947L5224L1405K3027J1381j492
33516A33567j3301k2278k7739l0049l0150k9121k8134k8461l1208l6735m4397
33505a88006n2950o1273o8726p4863p8965p9973p7034p0146o0395m9535l9317
33494i01183l0987k5009k0848j6857j0750p22J3426L0046M6382N9551O7042O6954
33482g22955N8391M1986J9930m698k8863n0051o6268p5908p7809p1311n6211l2695
33470a066462j717L4325P1180J03456J26318J37270J36772J27445J12523R4574
33460a24316P4999N4267L2580J0497j0759k9501m4156n3779n8308n8576n6207
33449b63259n3402n2475n5176o2098p2558q4968r7319j07439j13144j12605j04995
$$ y = [69857, 14296, -24367, -43425, -43414, -27415, 75, 34022, 69246, 100651, 123678, 135059, 133567, 120266, 97988, 70249, 40200, 10050, -19071, -47205, -75666, -106874, -143609, -188006, -240956, -302229, -370955, -445818, -524783, -604756, -681790, -751936, -812331, -861866, -901183, -932170, -957179, -978027, -994884, -1005634, -1006356, -992930, -962884, -916502, -856951, -789909, -722955, -664564, -622578, -602648, -607346, -636209, -686260, -752528, -828436, -906245, -977556, -1033767, -1066462, -1068179, -1033854, -962674, -859218, -732900, -595630, -458858, -331413, -218890, -124316, -49317, 4950, 37530, 48027, 37268, 7767, -36389, -90168, -148476, -207052, -263259, -316661, -369136, -424312, -486410, -558968, -643936, -741255, -848694, -961838, -1074443, -1179438]
33438a179438r0902p2070n0610k8242o183J4454L2201M5256N2180N2767M8510
33427a182077M2145L6545L3677L4259L8077M4491N2767O2180P2037Q1649R0301
33416e93949R7347J02384J05426J06838J07187J07082J07037J07306J07777J07964
33406D62399J07091J04220R8531Q9949P9575O9322O0668N3553M6377L7164K4826
33395A233675R721o704k2561l6034m5618n0276m9733m4750l7145k9370k3953k3017
33383H74235k7834l8185n1867o4988p3360p4293o7702n5855m2148k9728k0721
33372C27554j6173j6222k0009k5431k9301k8349k0538n857J3750L4935N3469O4860
33360C32688O5484N4057L2403M704k4532n2357p7926j01616j23601j42928j57473
$$ y = [-1179438, -1270340, -1342410, -1393020, -1421262, -1427445, -1412991, -1380790, -1335534, -1283354, -1230587, -1182077, -1139932, -1103387, -1069710, -1035451, -997374, -952883, -900116, -837936, -765899, -684250, -593949, -496602, -394218, -288792, -181954, -74767, 32315, 139352, 246658, 354435, 462399, 569490, 673710, 772241, 862190, 941765, 1011087, 1071755, 1125308, 1171685, 1208849, 1233675, 1243396, 1236692, 1214131, 1178097, 1132479, 1082203, 1032470, 987720, 950575, 921205, 897252, 874235, 846401, 808216, 756349, 691361, 618001, 543708, 476006, 420151, 378003, 348275, 327554, 311381, 295159, 275150, 249719, 220418, 192069, 171531, 165674, 179424, 214359, 267828, 332688, 398172, 452229, 484632, 489336, 464804, 412447, 334521, 232905, 109304, -33624, -191097]
33349a91097j64680j62646j51007j31308j06742q1323n8661m0682k7064j5875
33339a131085n066O327J8090K9385L9103M5678M7002M1079K7209O885j6303l7762
33327i29458n3432o1039o0620n4140m4538l4485k5322j6635o829N476K0033L4528
33315a226461M5546N0301M7928L9495K6986J2098m335k2101m0795n8867p3206
33304a203411p9829p5651o0233l6275q468J8394M0849N7152O6942P0762O9717
33293a140051O5250N8914N2122M6001M1331L8435L7020L6184L4917L2855L0652
33282f66370K9551L0535L3748L8561M3961M8829N1907N1752M7056L7500K4660
33271b28310J2079M012L508J1134K5018M1830N7754O9228P3612O9835N8711M2661
$$ y = [-191097, -355777, -518423, -669430, -800738, -907480, -988803, -1047464, -1088146, -1115210, -1131085, -1136151, -1129824, -1111734, -1082349, -1043246, -997568, -950566, -909487, -882278, -875393, -891696, -929458, -982890, -1043929, -1104549, -1158689, -1203227, -1237712, -1263034, -1279669, -1286498, -1281022, -1260989, -1226461, -1180915, -1130614, -1082686, -1043191, -1016205, -1004107, -1008442, -1030543, -1071338, -1130205, -1203411, -1283240, -1358891, -1419124, -1455399, -1463867, -1445473, -1404624, -1347472, -1280530, -1209768, -1140051, -1074801, -1015887, -963765, -917764, -876433, -837998, -800978, -764794, -729877, -697022, -666370, -636819, -606284, -572536, -533975, -490014, -441185, -389278, -337526, -290470, -252970, -228310, -216231, -212219, -208711, -197577, -172559, -130729, -72975, -3747, 69865, 139700, 198411, 241072]
33259B41072K4874Q208n660j6364k4120k8809k9765k6352j8699p895M277J5647
33247A36414K4020K7772K6481K1156J3764O455R05j955j817J246O965J4814K3827
33234C00047L2545L9223M2245M0693L4924K6717J8593J2579R328Q239Q263Q554
33222E81950Q532P757N987L387M67k417n620j0279j7749k8741m2644n7295o9400
33209C73935p5605p3994o5223n2423l9859l1221k8630l2620m2488n6479p1815
33198a96422q4959r2461r2093q3632o8742n0017k9829r815Q862K4937L6808M3000
33186e94363M3009L7954L0530K4099K1447K3834L0861M1019N2483O3563P2697
33175a52867P8240P8503P2293N9653M2360K3621P068m479r863r852o911m533o070
$$ y = [241072, 265946, 274154, 268494, 252130, 228010, 199201, 169436, 143084, 124385, 116490, 120767, 136414, 160434, 188206, 214687, 235843, 249607, 256062, 256967, 255012, 253195, 254441, 261406, 276220, 300047, 332592, 371815, 414060, 454753, 489677, 516394, 534987, 547566, 556894, 565133, 573396, 581950, 590482, 598239, 604226, 607613, 608080, 605663, 600043, 589764, 572015, 543274, 500630, 443335, 373935, 298330, 224336, 159113, 106690, 66831, 35610, 6980, -25640, -68128, -124607, -196422, -281381, -373842, -465935, -549567, -618309, -668326, -698155, -707970, -699108, -674171, -637363, -594363, -551354, -513400, -482870, -458771, -437324, -413490, -382629, -341610, -289127, -225564, -152867, -74627, 3876, 76169, 135822, 178182, 201803, 208871, 204392, 194529, 184677, 177766, 173233, 167163]
33162A67163j3256k5204l8669m9594n5017n4286m9180m3114l9759m1477m8198
33151b90591n7331o4865o7185o2610n1799l6871j9911k053J6293L4391N0273O0683
33139d91576O2085N2209L1366K636k9141n8964q2842r8138j03247r7150p9343
33128h92105n0389j2758K8895O8660J01264J23730J35862J39435J36740J29333
33118i1333J17712J02076Q3557O4810M9165L8747L3029K9072K3389J4146K051
33107D66421j0532k1363k9604l5799m0933m5381m8543m9421m7757m4867m3290
33096D8931m5340n1520o0026o7595p1083o8685o0400m7836l3659k0851j1825p722
33084d97611q350j2596j8789k4544k6597k1540p511J4295L9640O2825P8743Q4246
$$ y = [167163, 153907, 128703, 90034, 40440, -14577, -68863, -118043, -161157, -200916, -242393, -290591, -347922, -412787, -479972, -542582, -594381, -631252, -651163, -653216, -636923, -602532, -552259, -491576, -429491, -377282, -345916, -343280, -372421, -431385, -514227, -612365, -715612, -812762, -892105, -942494, -955252, -926357, -857697, -756433, -632703, -496841, -357406, -220666, -91333, 26379, 128455, 212012, 276822, 325987, 364734, 397763, 426835, 450224, 464370, 466421, 455889, 434526, 404922, 369123, 328190, 282809, 234266, 184845, 137088, 92221, 48931, 3591, -47929, -107955, -175550, -246633, -315318, -375718, -423554, -457213, -478064, -489889, -497611, -505961, -518557, -537346, -561890, -588487, -610027, -617538, -603243, -563603, -500778, -422035, -337789]
33072c37789P8627O3596M2938K1551L770q367j5854k1778k9150l8826m8801n5185
33060c45268n4093m3307k2896N034L6794O7550R2002J05748J06827R6385P7870
33049A22646N5286L1914J0089q250k1176k6979k4826j5340o46J6128L1603M2748
33037B13197M7190M3579L2216J5621j833j5526k2592k3009j9192j4714j2929j5921
33025B26087k3830l4974m6928n7981o7686p6108q2680q6009q4973q0063p3669
33014d88814o8892o7652o9445p1648p1146o6138n6921m5382l3786k3829j6351
33003a080004j1464q733p292o042m028p38L767Q800J3034J4800J2970Q063K690
32990a054177O72N208J7180L4675N3865P0659Q2149Q7242Q6467Q1331P3499O4091
$$ y = [-337789, -259162, -195566, -152628, -131077, -127307, -135674, -151528, -173306, -202456, -241282, -290083, -345268, -399361, -442668, -465564, -460530, -423736, -356186, -264184, -158436, -51609, 44776, 122646, 177932, 209846, 219935, 211685, 190509, 163530, 138704, 123364, 122718, 138846, 170449, 213197, 260387, 303966, 336182, 351803, 349970, 334444, 311852, 288843, 269651, 254937, 242008, 226087, 202257, 167283, 120355, 62374, -5312, -81420, -164100, -250109, -335082, -415145, -488814, -557706, -625358, -694803, -766451, -837597, -903735, -960656, -1006038, -1039824, -1063653, -1080004, -1091468, -1100201, -1107493, -1113535, -1117563, -1118301, -1114534, -1105734, -1092700, -1077900, -1064930, -1056867, -1054177, -1053505, -1048297, -1031117, -996442, -942577, -871918, -789769, -702527, -616060, -534729, -461230, -397139]
32978c97139N3376M1068K6914J1000o390k5006m4566o4427q3400r9907j12468
32967g00945j20379j24108j24973j24033j21076j14662j03325q6907o6844m5272
32957a732524k3770k921J6977L4766M8038N4135N1849M2485K9395J6416O376O26
32945a458152l87L693J3220K7734M5006O0969P0762P0265N7364L2604p35l7256
32933a114913p0745r5692j08422j07599r4362p2172m5955k0413J700K0106L5967
32922a672500N0193O2507P1726P6729P7258P4231O9647O6142O6117P0568P8238
32911i09144Q5835Q9524Q6856P7800O4311M8974L3907K0405R153M77n411q124
32899d05437p051j812O937J7123K5844L0697L0906K7653K3633K2267K6692L8541
$$ y = [-397139, -343763, -302695, -275781, -264781, -271171, -296177, -340743, -405170, -488570, -588477, -700945, -821324, -945432, -1070405, -1194438, -1315514, -1430176, -1533501, -1620408, -1687252, -1732524, -1756294, -1759215, -1742238, -1707472, -1659434, -1605299, -1553450, -1510965, -1481570, -1465154, -1458778, -1458152, -1458539, -1454846, -1441626, -1413892, -1368886, -1307917, -1237155, -1166890, -1109526, -1076922, -1077657, -1114913, -1185658, -1281350, -1389772, -1497371, -1591733, -1663905, -1709860, -1730273, -1728573, -1708467, -1672500, -1622307, -1559800, -1488074, -1411345, -1334087, -1259856, -1190209, -1124067, -1057950, -987382, -909144, -823309, -733785, -646929, -569129, -504818, -455844, -421937, -401532, -392379, -391902, -397313, -405437, -412488, -414300, -407363, -390240, -364396, -333699, -302793, -275140, -251507, -229240, -202548, -164007]
32887a64007N6878P8091R7162J09617J12874J06347R0790O7759L9607R683j7790
32876E87011l8503m9350m9662m1662k9724j8674j1921j0438j3079j7970k3782
32865B82246k9919l5743l9981m1073l8123l1429k2218j1972k012O504J2352J4132
32853F2764J0546Q88j4586l4721n7532p9906r7250j04178r6606p4197m1273n380
32841e31431K5538M5631N2375M6719L2565J5533J000q094j2295j4803j9177k7068
32829c93507l7370m7146n3547n5378n3408m9567m5811m3312m1932m0084l5256
32818h96318k5346j0007Q950K8408M5206N7136O3447O5000O3898O2521O2336O3098
32806d11671O2901N8977M9038L2561J1338j1110l0988m5648n4154n6915n4978
$$ y = [-164007, -107129, -29038, 68124, 177741, 290615, 396962, 487752, 555511, 595118, 604801, 587011, 548508, 499158, 449496, 407834, 378110, 359436, 347515, 337077, 323998, 306028, 282246, 252327, 216584, 176603, 135530, 97407, 65978, 43760, 31788, 29776, 36280, 48632, 62764, 73310, 74198, 59612, 24891, -32641, -112547, -209797, -313975, -410581, -484778, -526051, -531431, -505893, -460262, -407887, -361168, -328603, -313070, -312070, -320164, -332459, -347262, -366439, -393507, -430877, -478023, -531570, -586948, -640356, -689923, -735734, -779046, -820978, -861062, -896318, -921664, -931671, -922721, -894313, -849107, -791971, -728524, -663524, -599626, -537105, -474769, -411671, -348770, -289793, -240755, -208194, -196856, -207966, -238954, -284602, -338756, -395671, -450649]
32795d50649m9687m2832l6723l3729l5315m1294m9829n8176o3900o6042o5544
32784i93720o4510o4592o5729o6174o3645n6558m4735k9641j4186k018L777K041
32772a459690n712j5507k2007k0237p525J5256M3913P2700R6713J13479J23017
32761a065600J26633J25590J20618J12389J02239R2225Q4400P9919P8776Q0149
32751f2662Q2718Q4608Q3262P5982O1012L8507J0730j8449m4391o2736p0572o7462
32739A10547n5688l9556k4116j3741j0937j5703k5748l7611m8061n5065n8030
32728b73709n7651n5585n3986n4749n8734o5325p2588p7839p8445p2680o0411
32717i81702m3147k3214k464J8499L9960O1897Q3040J00949J12925J17057J12860
$$ y = [-450649, -500336, -543168, -579891, -613620, -648935, -690229, -740058, -798234, -862134, -928176, -993720, -1058230, -1122822, -1188551, -1254725, -1318370, -1374928, -1419663, -1449304, -1463490, -1465508, -1461731, -1459690, -1465402, -1480909, -1502916, -1523153, -1530678, -1515422, -1471509, -1398809, -1302096, -1188617, -1065600, -938967, -813377, -692759, -580370, -478131, -385906, -301506, -221587, -142811, -62662, 20056, 104664, 187926, 263908, 324920, 363427, 374157, 355708, 311317, 248581, 178009, 110547, 54859, 15303, -8813, -22554, -33491, -49194, -74942, -112553, -160614, -215679, -273709, -331360, -386945, -440931, -495680, -554414, -619739, -692327, -770166, -848611, -921291, -981702, -1024849, -1048063, -1050527, -1032028, -992068, -930171, -847131, -746182, -633257, -516200, -403340]
32706d03340J01461Q5500O8710N5043M7342M6151M9345N3131N4002N0463M3467
32695B51275L5445K8793K4805K3372K3190K2315J9040J2940N420p69k921P5O944
32682D49924J4394J8527J6602Q140n259k1152l7414n2609o5855p6903q6478r6097
32670F5820j06976j18750j29060j34368j31302j17769r3531o0246k1058K0013
$$ y = [-403340, -301879, -216379, -147669, -92626, -45284, 867, 50212, 103343, 157345, 207808, 251275, 286720, 315513, 340318, 363690, 386880, 409195, 428235, 441175, 446595, 445826, 442905, 442980, 449924, 464318, 482845, 499447, 507587, 502328, 481176, 443762, 391153, 325298, 248395, 161917, 65820, -41156, -159906, -288966, -423334, -554636, -672405, -765936, -826182, -847240, -827227]
$$ [...]
##END NTUPLES=NMR SPECTRUM
##END=
