##TITLE=31Pdec_34-2022
 DMSO-d6, 24 sc
 30.6.2022
##JCAMPDX= 6.0         $$ Bruker NMR JCAMP-DX V2.0
##DATA TYPE= NMR SPECTRUM
##DATA CLASS= NTUPLES
##ORIGIN= UXNMR, Bruker Analytische Messtechnik GmbH
##OWNER= root
$$ XWIN-NMR		Version 3.5
$$ Thu Jun 30 14:15:39 2022 Russian Standard Time (UT+4h)  she@DPX200
##.OBSERVE FREQUENCY= 81.013821
##.OBSERVE NUCLEUS= ^31P
##.ACQUISITION MODE= SIMULTANEOUS
##.ACQUISITION SCHEME= undefined
##.AVERAGES= 24
##.DIGITISER RES= 16
##SPECTROMETER/DATA SYSTEM= spect
##.PULSE SEQUENCE= zgpg30
##.SOLVENT NAME= DMSO
##.SHIFT REFERENCE= (INTERNAL, DMSO, 0, 248.564)
##AUDIT TRAIL= $$ (NUMBER, WHEN, WHO, WHERE, WHAT)
$$ ##TITLE= Audit trail, XWIN-NMR		Version 3.5
$$ ##JCAMPDX= 5.01
$$ ##ORIGIN= Bruker BioSpin GmbH
$$ ##OWNER= she
$$ F:/spectra/data/she/nmr/P31/1/pdata/1/auditp.txt
$$ ##AUDIT TRAIL=  $$ (NUMBER, WHEN, WHO, WHERE, WHAT)
(   1,<2022-06-30 14:14:26.70 +0400>,<she>,<DPX200>,
      <created by zg, POWCHK disabled, PULCHK disabled
       configuration hash MD5:
       00 E9 B6 7A A2 85 ED C7 34 08 36 98 17 FE 4E 26
       data hash MD5: 32K
       CD A4 B6 9B 7C F7 89 1D C2 46 3E 62 A7 1D 05 5D>)
(   2,<2022-06-30 14:14:29.62 +0400>,<she>,<DPX200>,
      <Start of raw data processing
       efp BC_mod = 2 LB = 1 FT_mod = 6 PKNL = 1 PHC0 = -10553.48 PHC1 = 1603.856 SI = 64K 
       data hash MD5: 64K
       89 41 7E 94 11 AC BF FA 14 C9 B9 7C D8 47 D0 88>)
(   3,<2022-06-30 14:15:05.00 +0400>,<she>,<DPX200>,
      <pk PHC0 = 26.56631 PHC1 = -230.4 
       data hash MD5: 64K
       D7 2E 64 2F EA D0 93 60 B4 30 77 FA BE 28 38 E6>)
(   4,<2022-06-30 14:15:08.40 +0400>,<she>,<DPX200>,
      <abs ABSG = 5 
       data hash MD5: 64K
       70 FD 38 AF 91 F2 97 64 EE B8 AC 65 88 60 42 3E>)
$$ ##END=
$$ 
$$ hash MD5
$$ FD 5D 15 44 02 1E AC C2 AB D6 77 6B 4B 3A B7 A2
##$RELAX= 
##$RELAX= 
##$RELAX= 
##$RELAX= 
##$RELAX= 
##$RELAX= 
##$RELAX= 
##$RELAX= 
$$ Bruker specific parameters
$$ --------------------------
##$DU= <F:/spectra>
##$EXPNO= 1
##$NAME= <P31>
##$PROCNO= 1
##$TYPE= <nmr>
##$USER= <she>
##$AMP= (0..31)
100 100 100 100 100 100 100 100 100 100 100 100 100 100 100 100 100 100 
100 100 100 100 100 100 100 100 100 100 100 100 100 100 
##$AQSEQ= 0
##$AQ_mod= 1
##$AUNM= <au_zg>
##$AUTOPOS= <>
##$BF1= 81.014009
##$BF2= 200.13
##$BF3= 200.13
##$BF4= 200.13
##$BF5= 200.13
##$BF6= 200.13
##$BF7= 200.13
##$BF8= 200.13
##$BYTORDA= 1
##$CFDGTYP= 0
##$CFRGTYP= 5
##$CHEMSTR= <none>
##$CNST= (0..31)
1 1 145 1 1 1 1 1 1 1 1 1 1 1 1 1 1 1 1 1 1 1 1 1 1 1 1 1 1 1 1 1 
##$CPDPRG= <waltz16>
##$CPDPRG1= <>
##$CPDPRG2= <waltz16>
##$CPDPRG3= <>
##$CPDPRG4= <mlev>
##$CPDPRG5= <mlev>
##$CPDPRG6= <mlev>
##$CPDPRG7= <mlev>
##$CPDPRG8= <mlev>
##$CPDPRGB= <>
##$CPDPRGT= <>
##$D= (0..31)
0 1 0 0 0 0 0 0 0 0 0 0.03 2e-05 3e-06 0 0 0 0 0 0 0 0 0 0 0 0 0 0 0 0 
0 0 
##$DATE= 1656584066
##$DBL= (0..7)
120 120 120 11 120 120 24 19 
##$DBP= (0..7)
150 150 150 150 150 150 150 150 
##$DBP07= 0
##$DBPNAM0= <>
##$DBPNAM1= <>
##$DBPNAM2= <>
$$ [...]
##$SUBNAM3= <"">
##$SUBNAM4= <"">
##$SUBNAM5= <"">
##$SUBNAM6= <"">
##$SUBNAM7= <"">
##$SUBNAM8= <"">
##$SUBNAM9= <"">
##$SW= 501.771253377433
##$SWIBOX= (0..15)
0 1 3 0 0 0 0 0 0 0 0 0 0 0 0 0 
##$SW_h= 40650.406504065
##$TD= 32768
##$TD0= 1
##$TE= 0
##$TE2= 300
##$TE3= 300
##$TEG= 300
##$TL= (0..7)
0 120 53 12 22 120 120 120 
##$TP= (0..7)
150 150 150 150 150 150 150 150 
##$TP07= 0
##$TPNAME0= <>
##$TPNAME1= <>
##$TPNAME2= <>
##$TPNAME3= <>
##$TPNAME4= <>
##$TPNAME5= <>
##$TPNAME6= <>
##$TPNAME7= <>
##$TPOAL= (0..7)
0.5 0.5 0.5 0.5 0.5 0.5 0.5 0.5 
##$TPOFFS= (0..7)
0 0 0 0 0 0 0 0 
##$TUNHIN= 0
##$TUNHOUT= 0
##$TUNXOUT= 0
##$USERA1= <user>
##$USERA2= <user>
##$USERA3= <user>
##$USERA4= <user>
##$USERA5= <user>
##$V9= 5
##$VALIST= <valist>
##$VCLIST= <CCCCCCCCCCCCCCC>
##$VD= 0
##$VDLIST= <DDDDDDDDDDDDDDD>
##$VPLIST= <PPPPPPPPPPPPPPP>
##$VTLIST= <TTTTTTTTTTTTTTT>
##$WBST= 1024
##$WBSW= 4
##$XGAIN= (0..3)
0 0 0 0 
##$XL= 0
##$YL= 0
##$YMAX_a= 3251
##$YMIN_a= -3399
##$ZGOPTNS= <>
##$ZL1= 120
##$ZL2= 120
##$ZL3= 120
##$ZL4= 120
##$ABSF1= 248.5645
##$ABSF2= -253.2056
##$ABSG= 5
##$ABSL= 3
##$ALPHA= 0
##$AQORDER= 0
##$ASSFAC= 0
##$ASSFACI= 0
##$ASSFACX= 0
##$ASSWID= 0
##$AUNMP= <proc_1d>
##$AZFE= 0.1
##$AZFW= 0.5
##$BCFW= 0
##$BC_mod= 2
##$BYTORDP= 0
##$COROFFS= 0
##$CY= -3
##$DATMOD= 1
##$DC= 0
##$DFILT= <>
##$DTYPP= 0
##$F1P= 0
##$F2P= 0
##$FCOR= 1
##$FTSIZE= 65536
##$FT_mod= 6
##$GAMMA= 0
##$GB= 0
##$INTBC= 1
##$INTSCL= 5.30512e-09
##$ISEN= 30
##$LB= 1
##$LEV0= 0
##$LPBIN= 0
##$MAXI= 10000
##$MC2= 0
##$MEAN= 0
##$ME_mod= 0
##$MI= 50
##$NCOEF= 0
##$NC_proc= -6
##$NLEV= 6
##$NOISF1= 182.463
##$NOISF2= 159.3651
##$NSP= 0
##$NTH_PI= 0
##$NZP= 0
##$OFFSET= 248.5645
##$PC= 4
##$PHC0= -10526.91
##$PHC1= 1373.456
##$PH_mod= 1
##$PKNL= yes
##$PPARMOD= 0
##$PSCAL= 0
##$PSIGN= 0
##$REVERSE= no
##$SF= 81.014009
##$SI= 65536
##$SIGF1= 159.3651
##$SIGF2= -187.1042
##$SINO= 113.3802
##$SIOLD= 16384
##$SREGLST= <1H.CDCl3>
##$SSB= 0
##$STSI= 65536
##$STSR= 0
##$SW_p= 40650.406504065
##$SYMM= 0
##$S_DEV= 0
##$TDeff= 32768
##$TDoff= 0
##$TI= <>
##$TILT= no
##$TM1= 0
##$TM2= 0
##$TOPLEV= 0
##$USERP1= <user>
##$USERP2= <user>
##$USERP3= <user>
##$USERP4= <user>
##$USERP5= <user>
##$WDW= 1
##$XDIM= 65536
##$YMAX_p= 381449689
##$YMIN_p= -8598324
$$ End of Bruker specific parameters
$$ ---------------------------------
##NTUPLES= NMR SPECTRUM
##VAR_NAME=  FREQUENCY,     SPECTRUM/REAL,   SPECTRUM/IMAG
##SYMBOL=    X,             R,               I
##VAR_TYPE=  INDEPENDENT,   DEPENDENT,       DEPENDENT
##VAR_FORM=  AFFN,          ASDF,            ASDF
##VAR_DIM=   65536,         65536,           65536
##UNITS=     HZ,            ARBITRARY UNITS, ARBITRARY UNITS
##FACTOR=    0.620285442955139, 1,           1
##FIRST=     20137.2065510759, 0,            0
##LAST=      -20513.1999529892, 0,           0
##MIN=       -20513.1999529892, -8598324,    0
##MAX=       20137.2065510759, 381449689,    0
$$ Real data points
##PAGE= N=1
##DATA TABLE= (X++(R..R)), XYDATA
$$ [...]
37603d0470r19385K31665L01024j70479J08542Q29541P55867J08045J99152R64132
37593B367634R69127n5899p43171m55068j72190n03695o75664k16046Q9662k16836
37583C87854l42392J39505K98084m15196r07304k47886N64566J66281q59822q85207
37573b101517J98569R27906N06022k97618m70869O0449O32586N74546j55757p12562
37563h38245k09782Q72256J002913j61168r94741k44562J029469J099151J09497
37554A664788n23945m21505k85164k37210J68425O29587M29358j57836l18928
37545I47570k35766n69733q27366j14500P84724K62488j174055j181834P65177
37536a343295K345318J823773L04063n31518p92366j070764p47099N57787J394871
$$ plain form
37603 -40470 -959855 -728190 -427166 -597645 -489103 340438 1096305 1204350 1403502 2367634
37593 2367634 3336761 3280862 2537691 2082623 1910433 1406738 731074 515028 604690 387854
37583 387854 45462 184967 483051 67855 -839449 -1087335 -522769 -356488 -1216310 -2101517
37573 -2101517 -1902948 -975042 -469020 -766638 -1237507 -1177058 -544472 30074 -125683 -838245
37563 -838245 -1048027 -175771 827142 665974 -328767 -573329 456140 1555291 1664788
37554 1664788 1140843 719338 434174 196964 365389 994976 1424334 1266498 947570
37545 947570 711804 142071 -685295 -799795 -15071 247417 -926638 -2108472 -1343295
37536 -1343295 1002023 2825796 3129859 2598341 1805975 735211 -11888 545899 1940770
37527A940770L85252j366023j714185n59056L73489K35081k90256o23291p80143
37518b398362m40324P22725J787159J318211m48557j631700j174363M1461P92794
37509a430956Q72118M94413k86270r89932p48433L60744J023777M51529m63007
37500g16017m89108K56170P78498O74477K78983j13585l42818j32149M61039P27917
37490A383407K17177m16721l07330K42012K41331l65619o73545l75194j64817
37481b19299l54655k74357M25813R50627O08384j9529q8862R2056k25739p01437
37471A93002m24523L47067M45172k06939m02638K06325L98707m18173q87985J06473
37461f43512J251992O28846j051511j190132P47954K173896J009348j372539k136787
$$ plain form
37527 1940770 2326022 959999 -754186 -1313242 -939753 -704672 -994928 -1618219 -2398362
37518 -2398362 -2838686 -2115961 -328802 989409 540852 -1090848 -2265211 -2223750 -1430956
37509 -1430956 -558838 -64425 -350695 -1340627 -2089060 -1728316 -704539 -253010 -716017
37500 -716017 -1205125 -948955 -170457 504020 783003 669418 326600 194451 655490 1383407
37490 1383407 1600584 1183863 876533 1118545 1359876 994257 320712 -54482 -219299
37481 -219299 -573954 -848311 -422498 528129 1136513 1116984 1028122 1120178 894439 193002
37471 193002 -231521 115546 560718 353779 -48859 157466 556173 138000 -749985 -643512
37461 -643512 608480 1237326 185815 -1004317 -256363 1917533 2926881 1554342 -582445
37452e82445p80124O25142N40597k29331j29963Q73108J411047O72397n75407
37443A825021j086898o84172j73310Q235K46969O86331O02112m56636j536264
37434e68612j280614J90196J392027J411784P46620J35428l73427q12255p41465
37425I9682J0987P20531O15536r447j76812M46209J130265J003637N5758r05084
37415B991262j206886j031635r41002q50476j69384Q63444R93885j71951j120409
37406f43152m77459P71169P69415j48035l3806J205739J427603j26403j344218
37397A400853o08621O04175K57662r44784r48300K31780P77806Q8240o31939n60660
37387c33788j67571M3423J24691P867l93125m67520L79193J399673J254805M7269
$$ plain form
37452 -582445 -1362569 -737427 -196830 -426161 -556124 316984 1728031 2400428 1825021
37443 1825021 738123 53951 -119359 -111124 135845 822176 1424288 967652 -568612
37434 -568612 -1849226 -1659030 -267003 1144781 1891401 2026829 1653402 841147 99682
37425 99682 110669 831200 1446736 1437289 1260477 1706686 2836951 3840588 3896346 2991262
37415 2991262 1784376 752741 -188261 -1038737 -1208121 -344677 649208 477257 -643152
37406 -643152 -1120611 -349442 419973 271938 238132 1443871 2871474 2745071 1400853
37397 1400853 792232 1396407 1654069 709285 -239015 -7235 770571 858811 226872 -333788
37387 -333788 -501359 -457936 -333245 -325378 -718503 -1186023 -806830 592843 1847648 1894917
37377A894917p56555m63414J37437K90577J50511m6870l82194n52323j3170Q74650
37367A133566J054902M49322J53450N32614M78006o96578j838591j490235m316
37358b27860R91045P89531K21630J72061L67202m0704j087994j673347q36353
37349a324789Q18741J545834N57357r02048j152511k09473N11088K43073l70929
37340b83657m69262K1501O41714R03956M99643l49402q06913l21208N57485R02013
37330A295870O35222K79662o8305n30651o65613r8840M23689k1532q09435n30736
37320i0669O25752R78801J8701q04236m42344K66386K07729l82089p39252p62166
37310a123387n48781J09620R58614J082009K88877l08162R1482P38805N33527
$$ plain form
37377 1894917 1138362 674948 812385 1102962 1253473 1206603 824409 272086 258916 1133566
37367 1133566 2188468 2637790 2791240 3323854 3801860 3105282 1266691 -223544 -227860
37358 -227860 763185 1552716 1774346 1946407 2313609 2272905 1184911 -488436 -1324789
37349 -1324789 -506048 1039786 1597143 695095 -457416 -666889 -155801 87272 -283657
37340 -283657 -752919 -731418 -89704 814252 1313895 964493 157580 -163628 393857 1295870
37330 1295870 1931092 2210754 2142449 1611798 946185 847345 1271034 1249502 440067 -90669
37320 -90669 535083 1513884 1532585 728349 286005 552391 760120 378031 -361221 -1123387
37310 -1123387 -1672168 -1562548 -603934 478075 766952 458790 550272 1289077 1822604
37301A822604m00357j119631j091987l92899N56163R56593K38403q57753q45568
37292a134432L93086J240521O38977n38849j084287j033695q08031j81341Q19572
37283a688479J252960O38869j28195k62663k46999m80366k21367Q33159J401327
37274A098246N98451l49066j11106M14289j97487j132899o54190P46069J066536
37265A478843J42219l30651Q1603K5700q37468j047842O99Q69291M59302k86337
37255E55359j14336O26900Q78223M96153J3280l21651m65698k85953N2745O8861
37245A503883k51025l33379J7185K76151J02161j55812j30840M7063J30889R1604
37235A297880q928j2355K83367N70233P5365j066488j303908J80225J615638P89741
$$ plain form
37301 1822604 1422247 302616 -789371 -1182270 -626107 330486 568889 -288864 -1134432
37292 -1134432 -741346 499175 1138152 599303 -484984 -1518679 -2326710 -2508051 -1688479
37283 -1688479 -435519 203350 75155 -187508 -434507 -914873 -1136240 -303081 1098246
37274 1098246 1696697 1347631 1236525 1650814 1453327 320428 -333762 412307 1478843
37265 1478843 1621062 1290411 1372014 1397714 560246 -487596 -486897 382394 841696 555359
37255 555359 441023 1067923 1946146 2442299 2455579 2133928 1668230 1382277 1435022 1503883
37245 1503883 1252858 919479 936664 1212815 1314976 1159164 1028324 1075387 1206276 1297880
37235 1297880 1288952 1276597 1559964 2130197 2205562 1139074 -164834 15391 1631029 2420770
37225B420770j428361j961463n131J745683J066105p92666j318727k38084P36054
37216B24180N39929l12623q54162o42602M0720L90521q2887p01680l79038O70740
37206a106902J116764O26608L83424R72856J251490J97530j412152k166734j758193
37197a895309o53812P98968J949999J728349J48487j086191p08528L22781L95266
37188A000010l52556o27050j86410J17525P709k7527N0426j86225n31398k56061
37178i91557O37466J240725Q80978k17544j268496j424440l92132R05879R54924
37169C25803l88314j386505p30095O09999R61426L74855P277k9820m25108q66854
37159a547336m25160N29012P04472J29359R4895P54362P70993k24893p82033M405
$$ plain form
37225 2420770 992409 -969054 -974185 771498 1837603 1044937 -273790 -511874 224180
37216 224180 764109 451486 -402676 -1045278 -1004558 -614037 -696924 -1398604 -1777642 -1106902
37206 -1106902 9862 636470 1019894 1992750 3244240 3441770 2029618 -137116 -1895309
37197 -1895309 -2549121 -1750153 199846 1928195 2076682 990491 281963 604744 1000010
37188 1000010 647454 20404 -166006 -48481 -40772 -68299 -17873 -204098 -735496 -991557
37178 -991557 -354091 886634 1767612 1550068 281572 -1142868 -1535000 -629121 325803
37169 325803 -62511 -1449016 -2179111 -1569112 -607686 -232831 -225554 -255374 -680482 -1547336
37159 -1547336 -1972496 -1443484 -739012 -609653 -514758 239604 1010597 785704 3671 8076
37149H076R82020P68131k98489r97836q60448j12933Q92798J415325O58077q08498
37139A646223j181033R6059J267578P93463m00668o37660j96143m36483j124861
37130a73525q06692M97838J153815N71393n3286o3162l63410j289648j404718
37121a931395J73894J786607J371325l94486j056792k5964Q00339J69679p69945
37112A23262n89982K24916M26349J32578L03698P86185M94909o25661j314727
37103c8473q58683L7199N74281Q45973R95086N87754l80228r04051l98231J83697
37093F44324j76033p44536j54755J167135J408562J75668q52405n02203K73404
37084A239161J66178m81203n81017j75995q0252k87323r5292M63790N89506R2523
$$ plain form
37149 8076 990096 1758227 1459738 461902 -398546 -511479 381319 1796644 2454721 1646223
37139 1646223 465190 561249 1828827 2622290 2221622 1583962 1387819 951336 -173525
37130 -173525 -980217 -482379 671436 1242829 1189543 1126381 762971 -526677 -1931395
37121 -1931395 -1757501 29106 1400431 1005945 -50847 -76811 723528 893207 123262
37112 123262 -466720 -241804 184545 317123 620821 1407006 1901915 1276254 -38473
37103 -38473 -897156 -859957 -285676 560297 1555383 2143137 1762909 858858 460627 644324
37093 644324 468291 -276245 -431000 736135 2144697 2320365 1467960 965757 1239161
37084 1239161 1405339 924136 343119 167124 86872 -200451 -295743 168047 757553 850076
37074H50076l06720k04112n4283k23494l69703j51835J58461K13217J56655K05249
37064B73511J46402k55564p17232p79087m39857l7914K71234N15479N91799L97102
37054c4127J64111K38329N36563O00896K46838j39574p3398M08241O93094J85206
37044B826179r63468j761783j315205N4891R94504O44106l93752r22691n57994
37035a395213K01404Q61923J199725R47903Q2817o73358n34531J14127J08111
37026I12908o70601r11490J56038J388569J203610k07162j144278o36032M86853
37017E78415Q08077k004r22890p57679M81619J429721R32353l66967p70826M6448
37007A456267N06008l86633j297155n68240J005570J166363m20402j641534j005005
$$ plain form
37074 850076 543356 339244 284961 61467 -308236 -460071 -301610 -88393 68262 273511
37064 273511 419913 164349 -552883 -1331970 -1771827 -1809741 -1538507 -1023028 -431229 -34127
37054 -34127 129984 368313 904876 1505772 1752610 1613036 1539638 1947879 2640973 2826179
37044 2826179 1862711 100928 -1214277 -1159386 -164882 479224 85472 -837219 -1395213
37035 -1395213 -1193809 -331886 867839 1815742 1898559 1225201 690670 804797 912908
37026 912908 242307 -669183 -513145 875424 2079034 1871872 727594 91562 578415
37017 578415 1386492 1384488 461598 -296081 185538 1615259 2547612 2180645 1409819 1456267
37007 1456267 1962275 1575642 278487 -289753 715817 1882180 1461778 -179756 -1184761
36998a184761M73026J072051O32834J18992j4547J6550J09108K48824J14628m59175
36988A127530q73260l54118Q98731J709520J170782l53929j532317j362749k31194
36979A98996M93236J03585n72718m04754M07935P71446M26961J19559J42247l109
36969A683384l46171k25239K84848J42501q12660j208243k76989P14639M27280
36960C83350l58708o9363J030044J292344L27823n61301n19221j32726r4614k19872
36950A077756j57916k4575M5383J51618J80813j71439p66191j045836p41749l220
36940a455356R67165J721341J447598Q4006q69068l9348J538918J505133l85915
36931D514474j776169j168296O5629J47982m74594m88622j59107m56603q10091
$$ plain form
36998 -1184761 -711735 360316 993150 1112142 1097595 1114145 1223253 1472077 1586705 1127530
36988 1127530 254270 -99848 798883 2508403 3679185 3325256 1792939 430190 198996
36979 198996 692232 795817 223099 -181655 226280 997726 1424687 1544246 1686493 1683384
36969 1683384 1337213 1111974 1396822 1539323 726663 -481580 -758569 -43930 383350
36960 383350 24642 -44721 985323 2277667 2605490 2044189 1524968 1392242 1297628 1077756
36950 1077756 919840 895265 940648 1092266 1273079 1101640 335449 -710387 -1452136 -1455356
36940 -1455356 -488191 1233150 2680748 2764754 1895686 1856338 3395256 4900389 4514474
36931 4514474 2738305 1570009 1635638 1783620 1309026 820404 661297 204694 -605397
36922f05397K0292J325892J068567p60472j676267l15696J470646J347754k50569
36913A624750j147194o36758O8704J17445J1740K54202M51582J94910k10669l56717
36903C71995k88368j08068K13009L30327k87286j241366j233593J14738J369013
36894g59599J100500j55041p97047l95401J60444K97857K44128R5248k91644n29474
36884a030029q5108N64721M42705k34436k71756M72134Q29911M10223K36440P13784
36874B048589P21871l31711j232188r29267k38999j91925j64008O83698J412040
36865A778100O84941q22155j365906p69379k05363k528L58856O30705K45022r7507
36855D34786N48631J201326K18491j537652j530107L63382J492191O73629k25354
$$ plain form
36922 -605397 -585105 740787 1809354 1048882 -627385 -943081 527565 1875319 1624750
36913 1624750 477556 -159202 -90498 26947 38687 292889 744471 939381 728712 371995
36903 371995 83627 -24441 188568 518895 231609 -1009757 -2243350 -2128612 -759599
36894 -759599 340901 185860 -611187 -1006588 -846144 -548287 -304159 -208911 -500555 -1030029
36884 -1030029 -1115137 -550416 -107711 -342147 -613903 -141769 688142 1098365 1334805 2048589
36874 2048589 2770460 2438749 1206561 277294 38295 -153630 -317638 366060 1778100
36865 1778100 2463041 1640886 274980 -494399 -699762 -702290 -343434 287271 532293 434786
36855 434786 983417 2184743 2403234 865582 -664525 -301143 1191048 1864677 1639323
36846A639323P1522J31818j020610j560338k1322J631881Q98014j110261j444114
36837g84087k1158O28917k55706p27144K74350J257834Q72929o7100k86778K9966
36827I22023J12379J2637R0533J33122r6066k63716j63364k08479n61110o00975
36817f23016j7860L69897j85022r81985p74083L19680R47255N19473n1586R7403
36807c79844N13760L72124r4284q5483K57839L6012o93702o79208N14316J465047
36797A226577Q59464m88525r06776l88593j98118m52126j12703O56478L99737
36788E95415q43586r97849O84911J943521Q72628r86989j098216R3131K22919
36779D85885r34215j281326K1560J437776J684945J161046M27108n59934j288862
$$ plain form
36846 1639323 1710845 1842663 822053 -738285 -759607 872274 1770288 660027 -784087
36837 -784087 -805245 -176328 -432034 -1159178 -884828 373006 1245935 1178835 892057 922023
36827 922023 1034402 1047039 1137572 1270694 1174628 910912 747548 539069 -22041 -623016
36817 -623016 -640876 -270979 -456001 -1437986 -2212069 -1892389 -945134 -425661 -477247 -379844
36807 -379844 133916 506040 411756 326273 584112 620124 -73578 -752786 -238470 1226577
36797 1226577 2086041 1597516 690740 302147 104029 -348097 -460800 195678 595415
36788 595415 -248171 -1246020 -561109 1382412 2255040 1268051 169835 262966 485885
36779 485885 -448330 -1729656 -1708096 -270320 1414625 2575671 3002779 2442845 1153983
36770A153983q86586L3319j64782j267438j119217P56891J925466P80378q72139
36761C39875q14365J70259J84059l29009K20203J201159O61783r81733j225689
36752e73458M58285J694529R32962m45036p12127k36530o4542K7665N29430P32948
36742B344126o9459j005110q74386j86182k88786r98105q22720N48021J604689
36733B52088J177530o7863q01895o83146k28482J96472N39269O52775L92629k0088
36723A409289j88181n0673P2791q4570m41540o85853o03513l28817k32009m10832
36713a543908l78053M02141J602606K075476J113582n83353j571239j187259r2193
36704a62200O38588N84654P4986m15635o84058p39130n89782k00004L53339P36927
$$ plain form
36770 1153983 267397 300716 135934 -1131504 -2250721 -1493830 431636 1212014 339875
36761 339875 -474490 -304231 -120172 -449181 -228978 972181 1633964 652231 -573458
36752 -573458 -115173 1579356 2512318 2067282 1355155 1118625 1054083 1081748 1611178 2344126
36742 2344126 2274667 1269557 395171 208989 -79797 -1077902 -1900622 -1352601 252088
36733 252088 1429618 1361755 559860 -123286 -351768 -155296 383973 1036748 1429377 1409289
36723 1409289 1221108 1170435 1243226 1158656 717116 31263 -572250 -901067 -1133076 -1543908
36713 -1543908 -1921961 -1519820 82786 2158262 3271844 2688491 1117252 -70007 -162200
36704 -162200 476388 1061042 1136028 720393 36335 -702795 -1292577 -1492581 -1139242 -402315
36694d02315N45917k09921r25775r76558m29680J34941M84287R09787J392863
36685E23546J232219M9734j283640j500877n59774L67853N16775K95623K60189
36676i8352K36276m3248k23432L7411L22968J54983o2693K67128O82930K46311
36666A520282p37000q58532K51196J147352N87444o84949j084476l97352K13135
36657d2900M2892l91302l97060J7585M95047Q16445P76969J87940o56046j000675
36647a51105n24994J30487J37386m51400q25520m84694K55464Q32597J061852
36638a9927R89492N20910l44101j051619q48561K13043J082622Q75817q3484p68844
36628E65348o89240j40959M56835Q00612N00551m98665j326501r56792K97329
$$ plain form
36694 -402315 143602 -66319 -992094 -1968652 -2398332 -2263391 -1779104 -869317 523546
36685 523546 1755765 1805499 521859 -979018 -1538792 -1170939 -654164 -358541 -98352
36676 -98352 137924 94676 -128756 -91345 231623 386606 323913 591041 1273971 1520282
36666 1520282 783282 -75250 175946 1323298 1910742 1225793 141317 -256035 -42900
36657 -42900 -8 -391310 -788370 -770785 -275738 540707 1317676 1505616 849570 -151105
36647 -151105 -676099 -545612 -408226 -859626 -1685146 -2169840 -1914376 -1081779 -19927
36638 -19927 969565 1490475 1146374 94755 -753806 -540763 541859 1417676 1334192 565348
36628 565348 -123892 -264851 191984 992596 1493147 994482 -332019 -1288811 -991482
36619i91482J039470P57068L84251M92165K98473o53773j218319m27074N82354
36610B63133J78815r93211q84315O44858J541926P72335l00276l60194j9802k53480
36600E89789o17169l10911K59915L19629J35344L21906N74032L46274M1044K23923
36590A883776L41274l62479j184732p81860N89534J201478L05071r25117j155733
36581h8788m24346M25101Q07152N21834k94623r69111p97257m6905K73254j32550
36571g26239m61392j66593K39856K32404J89332N08877N95342k40320j317823
36562a146556j194890K56682J441374J087109j14794n52364J65394R48942R17262
36553A808159L91715j5954l69915q18056p95558J57150J196617J005891k35764
$$ plain form
36619 -991482 47988 805056 1189307 1681472 1979945 1326172 107853 -319221 263133
36610 263133 441948 -551263 -1435578 -790720 751206 1523541 1223265 863071 843269 589789
36600 589789 -27380 -338291 -78376 241253 376597 698503 1272535 1618809 1659853 1883776
36590 1883776 2225050 1862571 677839 -104021 485513 1686991 1992062 1066945 -88788
36581 -88788 -513134 -88033 719119 1240953 946330 -22781 -820038 -866943 -593689 -726239
36571 -726239 -1187631 -1354224 -1114368 -881964 -692632 -183755 411587 171267 -1146556
36562 -1146556 -2341446 -2084764 -643390 443719 328925 -223439 -58045 890897 1808159
36553 1808159 2199874 2183920 1814005 995949 200391 357541 1554158 2560049 2324285
36544B324285r47059l99491L84114M02582L2745j05004l48515j005339j281375
36535i43057n07892M37762L73434k25234p4087O25448N05461n28164r92121j96349
36525a524799P31778O94665P5006l02300m33150n87862m75062K07967J014477
36516e99280J225948P08095r8824o62751o40664j19273L42868L55320K48062M21615
36506A181116M96448j0927n41105k18334N32020N20558j53123k27286M31055N12718
36496B523140l11518o13054K86296R16880L2289j270448j308480l18077M08896
36487C45924O94711J025500R39307j84139j386887j179049J8816M15459k79818
36478D09824m75194N79297J537247J072605k39831r99428q41267l86392j28994
$$ plain form
36544 2324285 1377226 977735 1361849 1764431 1797176 1692172 1343657 338318 -943057
36535 -943057 -1450949 -1013187 -639753 -864987 -939074 -313626 191835 -336329 -1328450 -1524799
36525 -1524799 -793021 -98356 -23350 -325650 -758800 -1346662 -1821724 -1613757 -599280
36516 -599280 626668 1334763 1235939 573188 -67476 -186749 156119 511439 759501 1181116
36506 1181116 1677564 1666637 1125532 907198 1439218 1959776 1806653 1579367 2010422 2523140
36496 2523140 2211622 1598568 1884864 2801744 2834033 1563585 255105 -62972 345924
36487 345924 1040635 2066135 3005442 2821303 1434416 255367 274183 689642 409824
36478 409824 -65370 513927 2051174 3123779 2883948 1884520 1043253 656861 527867
36469E27867j57192m46041p66369o49645O0110Q70185J186224R43931M45411j50094
36459A864387q55048j501788j638714r03530M39563J414397J119678k08931j234807
36450a504793r30534K89411J166443J066733M44046K9336L5540J73062J25795
36441H95039q6826j67448n555M0232l49694p75140n16674L37553Q53687N44805
36431G69979j2537j54556K3919J85979L24703L31669j75776r84903j104377k17965
36421a013865N29934J49675n91105l47203O50065R68397J90532n88171m60196
36412e11937K66362Q70834J063080Q23979K14267m24304o55933m58991j37437
36403A049920J53234L43469J97756k90832n53464j52098M48415M99057P4967j46633
$$ plain form
36469 527867 370675 -75366 -841735 -1491380 -1431270 -561085 625139 1569070 2014481 1864387
36459 1864387 1009339 -492449 -2131163 -3034693 -2595130 -1180733 -61055 -269986 -1504793
36450 -1504793 -2435327 -2145916 -979473 87260 531306 560642 596182 769244 895039
36441 895039 808213 640765 635210 675442 325748 -449392 -966066 -628513 225174 769979
36431 769979 757442 602886 626805 812784 1137487 1469156 1293380 308477 -795900 -1013865
36421 -1013865 -483931 -334256 -925361 -1272564 -622499 345898 536430 -51741 -511937
36412 -511937 -245575 625259 1688339 2512318 2726585 2302281 1646348 1187357 1049920
36403 1049920 1203154 1546623 1744379 1453547 900083 747985 1196400 1695457 1770424 1623791
36393A623791M7423K67860K04300j79756p93726j185477p01041M44666R72301
36384G00341K86331m27600k3007N98853o6703j361544j194769O08926J820052
36375I40880J061513l66675o97248j19915N7065m85265r19451n87720L45614J184376
36365D13174J212225L20330o71479q01426j26860M59189M76962K14029k3517j72440
36355A300187o9407K59411J93313n82566j100451l06329J056068J284247K99571
36346B334044l26601J7216K28309l13613p12172l42391J41016L32073Q02437J413883
36336C574201P93998j260219k604179j520216P40127J777509J198893L34662j18511
36327B916265m27880n73569l43444j56809l80953m15509J96405M98593m52835
$$ plain form
36393 1623791 1671214 1939074 2143374 1963618 1169892 -15585 -716626 -271960 700341
36384 700341 986672 559072 536065 1134918 1068215 -293329 -1488098 -879172 940880
36375 940880 2002393 1635718 938470 818555 875620 390355 -529096 -1116816 -771202 413174
36365 413174 1625399 1945729 1274250 472824 345964 805153 1282115 1496144 1472627 1300187
36355 1300187 1230780 1490191 1683504 1100938 487 -305842 750226 2034473 2334044
36346 2334044 2007443 2024659 2252968 1939355 1227183 884792 1025808 1357881 2160318 3574201
36336 3574201 4368199 3107980 503801 -1016415 -276288 1501221 2700114 3034776 2916265
36327 2916265 2488385 1914816 1571372 1414563 1033610 618101 814506 1313099 860264
36318H60264j562280r47909J072836K126146J014867q52717j605618j062877k39877
36309a197165J62123J43956r140m0204M5512m4207l86791n38278j58331M25233
36299a597292Q10474J160720J533646J201359l03033j916949k066607p81966L76142
36290a583506M33206r3950l98404l12749R6919P38262J055684M48209n81629p42052
36280i40010K05938R70042O19679p4246K0966N88499M55418m72709j013398m55157
36270i4978M39415N32130j95987p45698m17311M61389J074654R48017J60158q16944
36260A344845j248915n89179P34638J390344O42031n34379o30370L51680J043260
36251B503955P89666L30723K04722j37520j002400j520016r89400j34859M2813
$$ plain form
36318 860264 -702016 -1649925 -577089 1549057 2563924 1711207 105589 -957288 -1197165
36309 -1197165 -1035042 -891086 -900226 -940430 -894918 -939125 -1325916 -1864194 -2022525 -1597292
36299 -1597292 -786818 373902 1907548 3108907 2805874 888925 -1177682 -1959648 -1583506
36290 -1583506 -1150300 -1244250 -1642654 -1955403 -1858484 -1120222 -64538 383671 -197958 -940010
36280 -940010 -734072 235970 855649 781403 802369 1390868 1846286 1373577 360179 -94978
36270 -94978 344437 876567 680580 -65118 -482429 -21040 1053614 2001631 2161789 1344845
36260 1344845 95930 -493249 241389 1631733 2273764 1739385 1109015 1460695 2503955
36251 2503955 3293621 3624344 3829066 3691546 2689146 1169130 179730 44871 87684
36242H7684j76653L2897M65674L13724k87527m33714K4186L00924J0396l20407
36232A7184j83188K25150L79313J0934o57759r77461m54390M86538Q56591M86794
36222A89706K44294M88812M43946k05423m29732L12990P41316j68597j040396
36213E76916j25983J469801J129630j064820k181613q36140Q55868O87700n03725
36204G634n84163N91945J316362O18368o87633j246937n74754O25768J150863
36195A217453N30145m04903o40945l96502n41256r20640n95375L01869N39107
36186i11047q9150k61790O12936J248355N45989n99131p45333k4025M50402L92773
36176F19979K72003Q6804m91889j136066j154130n74664m1722J82638L36334M60684
$$ plain form
36242 87684 -88969 -56072 409602 723326 435799 2085 26271 327195 337591 17184
36232 17184 -166004 59146 438459 449393 -208366 -1185827 -1640217 -1153679 -297088 189706
36222 189706 434000 922812 1366758 1161335 731603 1044593 1785909 1617312 576916
36213 576916 450933 1920734 3050364 1985544 -196069 -1032209 -176341 511359 7634
36204 7634 -576529 15416 1331778 1950146 1262513 15576 -559178 66590 1217453
36195 1217453 1747598 1342695 701750 305248 -236008 -1156648 -1752023 -1450154 -911047
36186 -911047 -1000197 -1261987 -649051 599304 1145293 546162 -199171 -223196 227206 619979
36176 619979 891982 978786 486897 -649169 -1803299 -2377963 -2419685 -2237047 -1900713 -1440029
36166a440029L07031j15319m07873j83724N91919J441480J538891N52603o39932
36157A645047q14163o1067L57987j16j41719M96740R10893J96599q11843q02396
36147I75962k7518K37946k86536p19769n66827k47496j53734j21657J20433N66689
36137b22507R05860O02243n16864j523550j156667K13247O28286n91504j462473
36128c123929k45403J620066J538920k12953r60103J79237J199993O93592r5712
36119E93708K53276R34048N28075n00810o67774R1733N17335J18097l42170l84456
36109A141062n14332j068251j345025n14818J030898J852188J074918m80271j125659
36100E0710k67252Q97787R20837j31832j026582j087432p15264l30724J86481
$$ plain form
36166 -1440029 -1132998 -1248317 -1656190 -1839914 -1247995 193485 1732376 2284979 1645047
36157 1645047 830884 769817 1127804 1127688 985969 1482709 2393602 2590201 1778358 975962
36147 975962 948444 1186390 899854 180085 -386742 -634238 -787972 -909629 -789196 -222507
36137 -222507 683353 1285596 768732 -754818 -1911485 -1698238 -1069952 -1661456 -3123929
36128 -3123929 -3369332 -1749266 -210346 -423299 -1383402 -1204165 -4172 689420 593708
36119 593708 846984 1781032 2309107 1808297 1140523 1232256 1749591 1867688 1525518 1141062
36109 1141062 626730 -441521 -1786546 -2301364 -1270466 581722 1656640 1176369 50710
36100 50710 -216542 681245 1602082 1470250 443668 -643764 -1359028 -1689752 -1503271
36091a503271Q05957J020144O28987J40484k6189j06991l74358n98208n69142
36082e82587n29115n76059k63189N95447J282791J069837L32543K0135K85473
36073A635276L91439j56747j041752j610937j385444k78948J090222J533364N16296
36064F92769q49134r23534K83314J047872L81924n18523q4816J198479J427477
36055B655828N5571j320038j237787k41983K50152J3880j37415q743j87491o28752
36045g86778m55077M61520R84016M58696j78658P384L62818l1909m20395M38717
36035H40334J717467J350307n63740j537637n03239N15830j90661j173731l95800
36026E9130J129913Q98292r00870j629811m19460O70813J64712p25010n05605
$$ plain form
36091 -1503271 -697314 322830 951817 1092301 1066112 959121 584763 -13445 -582587
36082 -582587 -1111702 -1687761 -1950950 -1355503 -72712 997125 1329668 1349803 1635276
36073 1635276 2026715 1869968 828216 -782721 -2168165 -2447113 -1356891 176473 692769
36064 692769 -156365 -1079899 -796585 251287 633211 114688 29872 1228351 2655828
36055 2655828 2711399 1391361 153574 -88409 161743 175623 38208 29465 -158026 -786778
36045 -786778 -1241855 -780335 203681 662377 483719 491103 853921 822012 401617 840334
36035 840334 2557801 3908108 3344368 1806731 1303492 1819322 1628661 454930 59130
36026 59130 1189043 2087335 1186465 -443346 -862806 -191993 -27281 -752291 -1257896
36017a257896K43508K92840j33032j49757J20568N4123k70583n36247q82258j090459
36007c609193k55599J511648K355257J188777l31068k10285P14717L42576r20341
35998G86489q13941O92699J109644l50235j328412k48246J082182N29395r72441
35989D87134j205027j81332L61052r3871n20425l51493L2804M11949Q02380Q30710
35979E73881L31046K7049L80082N08874l48843j174122o63207M23281L98256m72320
35969a6023m57189N77850R73526K11955l30093L5683K64929k19049m69893m3310
35959E28386P366p57958j043476r7978P41386K92472l93677N9788Q61412M52757
35949F50478p19617r26394M8337Q21000P18419L55606J25392k14478n08238k41673
$$ plain form
36017 -1257896 -1014388 -721548 -854580 -1004337 -883769 -829646 -1100229 -1636476 -2518734 -3609193
36007 -3609193 -3864792 -2353144 2113 1190890 859822 649537 1364254 1706830 786489
35998 786489 -27452 665247 1774891 1424656 96244 -152002 930180 1459575 487134
35989 487134 -717893 -899225 -538173 -632044 -1152469 -1503962 -1471158 -1059209 -256829 573881
35979 573881 904927 931976 1312058 1820932 1472089 297967 -365240 58041 456297 -16023
35969 -16023 -473212 104638 1078164 1290119 960026 995709 1260638 1041589 571696 528386
35959 528386 535752 -222206 -1265682 -1363660 -622274 -329802 -723479 -663691 197721 650478
35949 650478 -69139 -995533 -947196 -126196 592223 947829 1073221 858743 350505 108832
35939A08832L68248N75909L21049R5817j42128o68204r26022k25070P03899M56687
35929F69017p38888j113705J6823J311468J490595Q55086J95885l54458p05748
35920A626075m19195K50311J68014r20012j602599p98910N42316R23153N25587
35911B94740N52224J013748P69181m22713j393607j315721p49577n31224n57631
35902b340580k33110N06186J171165J365451J022515K51794o53996j181087r34193
35893a025855r4199O40912O94877J75443k66734j60311K83023M72523J68476k70153
35883F18002l64163l4649M21975O81729N77331Q8359o26005j172612j084765k25593
35873a120391R19171J500733J070203P8618n75719m93521l6587L02308L74878
$$ plain form
35939 108832 477080 1052989 1374038 1469855 1327727 659523 -266499 -491569 212330 669017
35929 669017 -69871 -1183576 -1166753 144715 1635310 2490396 2686281 2331823 1626075
35920 1626075 1206880 1457191 1625205 705193 -897406 -1696316 -1154000 -230847 294740
35911 294740 846964 1860712 2629893 2207180 813573 -502148 -1251725 -1782949 -2340580
35902 -2340580 -2573690 -2067504 -896339 469112 1491627 1743421 1089425 -91662 -1025855
35893 -1025855 -1120054 -479142 215735 391178 124444 -35867 247156 719679 888155 618002
35883 618002 253839 219190 641165 1322894 1900225 1988584 1362579 189967 -894798 -1120391
35873 -1120391 -201220 1299513 2369716 2448334 1872615 1379094 1342507 1644815 2019693
35864B019693J67406l32669q08393p14768j04149K05972k08384o49760l97831
35855h22883R6160L9608k45570P2771O31327K65157q67226j143582P8696J360924
35845e34618J316446N42525L52718O51610M14403l84440p54587l88143r1450l84612
35835G39852o72221j74918R04376J504614Q30604o96218j628206r83767L96712
35826B20828O77677n00016j340394m23642J098833J136738k25151r46352j75940
35817d77419O57811K91469n46167o30088j75431o8584j47951L50540J161899J214197
35807A630276L72357l03850k30006j21151o97146j448422j371755l98494O09803
35798a958388J002229Q25591L40093k40340m77815Q7903J136974J574631Q56208
$$ plain form
35864 2019693 2187099 1854430 1046037 331269 227120 433092 224708 -425052 -822883
35855 -822883 -726723 -687115 -932685 -859914 -228587 36570 -830656 -1974238 -1895542 -534618
35845 -534618 781828 1324353 1677071 2328681 2743084 2358644 1604057 1215914 1124464 739852
35835 739852 67631 -107287 797089 2301703 3132307 2436089 807883 -175884 220828
35826 220828 898505 398489 -941905 -1365547 -266714 870024 644873 -301479 -477419
35817 -477419 180392 471861 -74306 -704394 -879825 -948409 -1096360 -745820 416079 1630276
35807 1630276 2002633 1698783 1468777 1347626 650480 -797942 -2169697 -2568191 -1958388
35798 -1958388 -956159 -130568 209525 -30815 -508630 -420727 716247 2290878 3147086
35789C147086j75792m51839k53908o52799j528823j452834M3988J347136Q73847
35780H96062o12779j081137q1016R14669Q45768K43105j41772m27779p48388n99093
35770g92360J17189M85285J3473l13057L69689J037979K13374j370734j462968
35761a702130K78730J533635O91711q13702q16195L67837P92067Q9658k39683
35752A81928L79726O11737l77314j307301p62646N30189Q88294K75162K0766L47062
35742G87603O9089j013513j297874J35971J704534J372570m01270j342426n83165
35733e68481M06477K52342m33156k92357O42419J035338J26894j276005j781986
35724a888515r61156L29142J059711J147142J149343J081098L29204j015588j698374
$$ plain form
35789 3147086 2971294 2519455 2265547 1612748 83925 -1368909 -1324921 22215 896062
35780 896062 283283 -797854 -878870 35799 881567 1124672 982900 555121 -193267 -792360
35770 -792360 -675171 -189886 -176413 -489470 -119781 918198 1131572 -239162 -1702130
35761 -1702130 -1423400 110235 801946 -11756 -827951 -460114 331953 421611 181928
35752 181928 561654 1173391 796077 -511224 -1273870 -743681 144613 419775 440541 787603
35742 787603 856692 -156821 -1454695 -1318724 385810 1758380 1357110 14684 -568481
35733 -568481 -162004 90338 -342818 -635175 7244 1042582 1169476 -106529 -1888515
35724 -1888515 -2849671 -2520529 -1460818 -313676 835667 1916765 2245969 1230381 -467993
35715d67993r25875L52893Q18411O86452Q88227J031474O3544j313957j154831
35706b1655N00286J261328R1183j010098l95584M93573j97683j391823j018207
35697a688680K72654L50316m72987p6668J350560J358823l32190j011603M22969
35688A73194J453588K20570j281362o46275Q66507O04201r57677j177934K37955
35679e07233R03734j87731j159234l89096J114727J445799L66803q14665j015016
35670b41912l15874L71849K99031k00689n3827R01356J363939M99087n32262l22541
35660A768157L89683o8766j299835j322708J8171O39236k55444p50362M66179
35651d15689J634882O62214j343562j573499L06451J796371J243890j97889p50887
$$ plain form
35715 -467993 -1393868 -1040975 -222564 463888 1352115 2383589 2447133 1133176 -21655
35706 -21655 478631 1739959 1831142 821044 425460 919033 721350 -670473 -1688680
35697 -1688680 -1416026 -1065710 -1538697 -1615365 -264805 1094018 761828 -249775 173194
35688 173194 1626782 1847352 565990 -80285 786222 1390423 432746 -745188 -507233
35679 -507233 396501 208770 -950464 -1339560 -224833 1220966 1587769 773104 -241912
35670 -241912 -557786 -185937 113094 -87595 -141422 759934 2123873 2622960 2090698 1768157
35660 1768157 2157840 2089074 789239 -533469 -515298 123938 -131506 -881868 -415689
35651 -415689 1219193 1881407 537845 -1035654 -729203 1067168 2311058 2113169 1362282
35642A362282m37663l45208n79742k68240O97153J132362K11339j117735j218572
35633e64024m9867O70296r6428j149652q15049N39954J099515L59373k66879K03970
35623f8791Q68178N15248m95583q89041l01471M54096O06792K17766j17354L6636
35613H26476M87684N97984J26437l55065l50548l06668p42402r99312j81952R55161
35603E7795P91918m25126o44188O68844J422521K16601j299482j034669L33202
35594H7416P87917K45055R8057M34622J53579n90494m83272M36537O37528k50903
35584A556042p71040j70465L64929j54462q68906o20685J95852M87787J65618
35575A84670j17477k01463l52211m14201M9777R26106J469135J054783j74431
$$ plain form
35642 1362282 924619 579411 -331 -268571 428582 1560944 1772283 654548 -564024
35633 -564024 -613891 56405 -40023 -1189675 -2004724 -1464770 -365255 -5882 -272761 -68791
35623 -68791 799387 1314635 819052 -69989 -371460 82636 689428 907194 789840 826476
35613 826476 1314160 1912144 2038581 1683516 1332968 1026300 283898 -715414 -897366 57795
35603 57795 849713 424587 -219601 449243 1871764 2088365 788883 -245786 87416
35594 87416 875333 1120388 1218445 1653067 1806646 1216152 732880 1169417 1806945 1556042
35584 1556042 785002 614537 979466 825004 -43902 -664587 -468735 19052 184670
35575 184670 67193 -134270 -486481 -900682 -850905 75201 1544336 2599119 2424688
35566B424688j300164j352713l71214M95531M42691J19963M46080Q59048J52049
35557A915959j193444j311843J14923J092783K76975j028863j017439q923N66386
35548e93486N81546Q22061J024735K73083r83006j208552j76689O05168K04285
35539E49145m96872m08189K29812O34406P15027O65857J92015q73649j730920
35530e23368j376580O107J204366J415874Q89824K38420k06033k91296N5198N56689
35520A969201O32672K3346q36230j266606j015438l50992L22935P47592Q13856
35511A040336N17429p301m53310m53553P8454O49350N16253l72048j024283n55687
35501f4360M33542M34477q25970j740715r37586P67137J495736Q41238P3920M5949
$$ plain form
35566 2424688 1124524 -228189 -599403 -103872 338819 458782 904862 1763910 1915959
35557 1915959 722515 -589328 -474405 618378 895353 -133510 -1150949 -1159872 -593486
35548 -593486 -11940 810121 1834856 2107939 1124933 -83619 -260308 344860 549145
35539 549145 52273 -355916 -126104 508302 1223329 1889186 2081201 1207552 -523368
35530 -523368 -1899948 -1893841 -689475 726399 1616223 1854643 1648610 1357314 1412512 1969201
35520 1969201 2601873 2625219 1788989 522383 -493055 -844047 -521112 226480 1040336
35511 1040336 1557765 1550464 1097154 643601 722055 1371405 1887658 1515610 491327 -64360
35501 -64360 369182 803659 -22311 -1763026 -2700612 -1933475 -437739 403499 477419 523368
35491E23368K35577P2314o9790K35273N98534N32691K42902L1093l49440j009197
35481A043325j282407o38612K81739M23683k50280q67880q37927j98180Q03046
35472a523493J648679J512498K43141r55138q57225O3699L90279k6499j0945P59070
35462A244066J077804K10189q30865q33541j18453K42694R0807Q350R3649J5019
35452A199719o1223K99873P54438M33030o03595j129504l91180P79940J075021
35443B356519L79108l66573o15745o67129p19207m31928K15035M79743l9056n08419
35433H2348o52R00664P82400m20760j188352n98531M70394Q52651O69637N90910
35423B140709M99296n7690p45094q55676m69173k39740k81593j13444M54273J064635
$$ plain form
35491 523368 758945 831259 761469 996742 1595276 2127967 2370869 2401962 2052522 1043325
35481 1043325 -239082 -877694 -595955 -172272 -422552 -1290432 -2128359 -2326539 -1523493
35472 -1523493 125186 1637684 1880825 925687 68462 132161 522440 495941 484996 1244066
35462 1244066 2321870 2532059 1701194 867653 749200 991894 1082701 1091051 1184700 1199719
35452 1199719 1138496 1438369 2192807 2625837 2022242 892738 501558 1281498 2356519
35443 2356519 2735627 2369054 1753309 1086180 366973 -64955 150080 629823 590767 82348
35433 82348 81696 982360 1764760 1344000 155648 -442883 27511 880162 1549799 2140709
35423 2140709 2640005 2582315 1837221 981545 512372 272632 -8961 -122405 331868 1396503
35413A396503J279721Q25462k53796j243367j168718j33055M82472j27451r59442
35404I8329p23798K67792Q65128R06919R47038Q53560J75133n99367o48592k83578
35394A858564l53530o45905m23210n7687l84146q45092k23240J027182J233321
35385A186257K14609n41401m42870l74320n72872j93229O78973Q72385M17576
35376A245108O17986J329137P80994j077983j832893m42730Q88348K97295q69193
35367I36069p29777q723k03184o87327j58875P05117N64292j5900K26174P32476
35357A360342K86641m57599j36999O24293K47255q91937j143358m74081j21810
35348g07253j3211P88944J568141P27029j113382j599268k96529Q20488O93183
$$ plain form
35413 1396503 2676224 3501686 3247890 2004523 835805 702750 1185222 1057771 98329
35404 98329 -625469 -357677 507451 1414370 2361408 3214968 3390101 2790734 2142142 1858564
35394 1858564 1505034 859129 435919 378232 -5914 -851006 -1074246 -47064 1186257
35385 1186257 1400866 859465 416595 42275 -530597 -723826 -44853 827532 1245108
35376 1245108 1863094 3192231 3973225 2895242 1062349 619619 1507967 1805262 936069
35367 936069 206292 197569 -5615 -692942 -851817 -146700 417592 401692 627866 1360342
35357 1360342 1646983 1189384 1052385 1676678 1923933 1031996 -111362 -585443 -707253
35348 -707253 -720464 68480 1636621 2363650 1250268 -349000 -645529 174959 868142
35339H68142L27972L43645P2904m04459j6874Q48742L49975j466179k047299l21345
35329a444776J321708O98202q65016r18853L27165Q73751K48437k86376o1955
35320a07713M19979P86022J033408P95397k27879j314241j383198m78720L58465
35311a18480N23707L29770K33020L11399M27327M05995J56513j34698j95544j30833
35301A808176k07536j92723L22149Q96296N70392n43816j160088p30616k33759
35292E28475m20894n73439M1702O82503L65164l42695k01734O33352R25321M37062
35282B074817J85852N34027M74757o06746j579271r64474Q08827J657188N38730
35273C123707j021384q92896O72407J278872k29543k049114j945538k57255J000201
$$ plain form
35339 868142 1196114 1539759 1612663 1208204 1191330 2040072 2390047 923868 -1123431 -1444776
35329 -1444776 -123068 575134 -289882 -1208735 -881570 -7819 240618 -45758 -107713
35320 -107713 312266 1098288 2131696 2927093 2699214 1384973 1775 -476945 -118480
35311 -118480 405227 734997 968017 1279416 1706743 2112738 2269251 2134553 1939009 1808176
35301 1808176 1600640 1407917 1730066 2626362 3196754 2652938 1492850 762234 528475
35292 528475 107581 -465858 -424156 258347 623511 280816 79082 712434 1637755 2074817
35282 2074817 2260669 2794696 3269453 2662707 1083436 118962 927789 2584977 3123707
35273 3123707 2102323 1209427 1881834 3160706 2931163 882049 -1063489 -1320744 -320543
35264c20543J053765O43843N8012r88008j726654q90495Q49139J259187m7956
35255a09710q44734J69776J360987J045736J86639L49877Q55207K16817r66823
35246B263772r99173p2556J56165m92531n49335M11518J076161O41870j07680
35237B328211l89636m59623n62946k92289L80124O23376j1175p74526p56403k5251
35227E9862P61359J234436J299133P87826k75615j294050j479189p08774J98864
35218E83852K91870l77952p56014k39149L60922P6933m81921K199J148216J149548
35208A758504k07568q48491L27429J536200R46272m59928p87275l24844m24730
35199A515569o63945J89915J326912Q98601o16757r67165J09967O13015j05932
$$ plain form
35264 -320543 733222 1377065 1435077 447069 -1279585 -2170080 -1320941 -61754 -109710
35255 -109710 -954444 -784668 576319 1622055 1808694 2158571 3013778 3230595 2263772
35246 2263772 1264599 1192043 1348208 855677 306342 717860 1794021 2435891 2328211
35237 2328211 1938575 1478952 916006 623717 1003841 1627217 1616042 841516 85113 59862
35227 59862 821221 2055657 3354790 4142616 3867001 2572951 1093762 384988 583852
35218 583852 875722 497770 -258244 -497393 -136471 -59538 -541459 -539260 608956 1758504
35208 1758504 1550936 702445 1029874 2566074 3512346 3052418 2265143 1940299 1515569
35199 1515569 851624 1041539 2368451 3267052 2650295 1683130 1793097 2406112 2300180
35190B300180m57980J57718K77612n79845p49539M02668R53652k34407j232118
35181H37941j77150J531176J514602J15766o31536l64263k65951n67611n42089
35172A450885l34155o15177q97515k20846Q68038R57214J02935l17965J25079
35163A118493N51280N07643L90754K55903j88502n35801j92430K80017n1784o60328
35153A475245l09939O13788N67068m24184p10928R8994N11242r3623l98986K94742
35143A623419P17648K6496n32482J65416J091070R04228K17055J99734L23432
35134D736016m89566j531878j253629J08281Q53989M19428j57537j41825J83832
35125B727111N27683P63019L12331j063115k082979j277443N98417J309050L76404
$$ plain form
35190 2300180 1842200 1999918 2277530 1697685 948146 1350814 2304466 2070059 837941
35181 837941 660791 2191967 3706569 3822335 3190799 2826536 2560585 1992974 1450885
35172 1450885 1116730 501553 -395962 -616808 251230 1208444 1311379 993414 1118493
35163 1118493 1669773 2177416 2568170 2824073 2635571 2099770 1907340 2187357 2135573 1475245
35153 1475245 1165306 1779094 2346162 1921978 1211050 1310044 1821286 1727663 1328677 1623419
35143 1623419 2341067 2367563 1835081 2000497 3091567 3995795 4212850 4412584 4736016
35134 4736016 4246450 2714572 1460943 1569224 2423213 2842641 2685104 2543279 2727111
35125 2727111 3254794 4017813 4330144 3267029 1184050 -93393 505024 1814074 2190478
35116B190478l81420Q8335N32696k23540j216475r82744R9566N49769R23o20378
35106C7210n94424m0170N69418P44925K34128m90663n42119J08417M35705o392
35096D56035k50406M30007J058631M01433q96601j111018j5034Q27186L66718
35087A266951o06633p22780L01659J519890J686284L38497j504607j999842n47369
35078b67950J197784J317978J71462l57254J86929L49509n74235j249586n12451
35069B62186O65296O74264l08773p65705j28447O60634O78097P2960m07764k36533
35059A166215N08698J092332P06027m22331r66663k09789P46341M63871n90270
35050B494431o46301N80635J267107J96819j311710j281894J08432R94854O07791
$$ plain form
35116 2190478 1809058 1897393 2430089 2206549 990074 7330 106896 656665 657588 37210
35106 37210 -557214 -597384 -27966 716959 951087 460424 -81695 26722 462427 456035
35096 456035 205629 635636 1694267 2095700 1199099 88081 73047 900233 1266951
35087 1266951 660318 -62462 239197 1759087 3445371 3783868 2279261 279419 -267950
35078 -267950 929834 2247812 2419274 2062020 2248949 2598458 2024223 774637 262186
35069 262186 927482 1601746 1292973 527268 398821 1059455 1737552 1810512 1402748 1166215
35059 1166215 1674913 2767245 3473272 3050941 2084278 1874489 2620830 3084701 2494431
35050 2494431 1848130 2428765 3695872 3892691 2580981 1299087 1407519 2402373 3010164
35041C010164K4447R3298J71113m11959r29409m53953L69054J86628p57807p63546
35031E38030O62653J807362J180317l20205q38071k44080P6205l44383m73647
35022B044181K60890R48281O90572p5171n12380o95706j080811j360792q71989
35013f52925K15384J035001J179365R20971M35940l21598r48944o98832M25190
35004A589552J365224J235233L59086l45851n66600o01205n00299m330O12130
34995C142940M41773q18204k046375j834290k98255R60801Q08574j86753p52039
34986e81828m76164J50643P09831J099517J104243N60070r5210j95209J79877
34977B455770L16829L9551k3280M30858P80380M35255k87989p43213q18808p00705
$$ plain form
35041 3010164 3034611 3127909 3299022 2887063 1957654 1503701 1872755 2059383 1301576 538030
35031 538030 1200683 3008045 4188362 3868157 3030086 2786006 2862211 2517828 2044181
35022 2044181 2305071 3253352 3943924 3868753 3356373 2660667 1579856 219064 -652925
35013 -652925 -437541 597460 1776825 2697796 3133736 2812138 1863194 1164362 1589552
35004 1589552 2954776 4190009 4549095 4203244 3636644 3035439 2535140 2530810 3142940
34995 3142940 3584713 2766509 720134 -1114156 -1412411 -451610 356964 170211 -581828
34986 -581828 -1057992 -907349 -197518 901999 2006242 2566312 2471102 2275893 2455770
34977 2455770 2772599 2812150 2788870 3219728 4000108 4435363 4147374 3404161 2585353 1884648
34967A884648l41228K08743M28969O471m86530l26452K45872M18814Q5579j45559
34957A979327j16528l22936q00185p57628K32372J415052J771121J210028L10622
34948D921245n94641j360503j458746m40163J010119J413834L13867r35376q14664
34939B054972L59322Q60336j41307j530648j750100o55993O28908J232382J212893
34930B270765R17353M17247k20132o16452l96534L48538J070572J137779K75393
34921E204529j038125j642240o97585J126731J970385Q05307j160503j777206
34913B791293n97034N80099J53052j065455r83733P59845K170489J634809J12669
34904E556034l79052L46502O80602j54256j096301j133419p14419n97242n72771
$$ plain form
34967 1884648 1543420 1752163 2181132 2187603 1701073 1374621 1620493 2039307 2124886 1979327
34957 1979327 1862799 1539863 739678 -17950 214422 1629474 3400595 4610623 4921245
34948 4921245 4326604 2966101 1507355 1067192 2077311 3491145 3805012 2869636 2054972
34939 2054972 2414294 3274630 3133323 1602675 -147425 -803418 -174510 1057872 2270765
34930 2270765 3188118 3605365 3385233 2768781 2372247 2720785 3791357 4929136 5204529
34921 5204529 4166404 2524164 1826579 2953310 4923695 5729002 4568499 2791293
34913 2791293 2194259 2774358 2927410 1861955 878222 1638067 3808556 5443365 5556034
34904 5556034 5176982 5523484 6204086 6049830 4953529 3820110 3105691 2508449 1935678
34895A935678k57067n0948k32769q5323Q25430J390375M48196j143513j537388
34886A292671n36573M43709O88523O55452L64666o33189j571776r20968R54960
34877G37475J694941L42697j136172q43985M19902Q97775N21135J71284k23635
34868B581417r83838j251252k54200Q82847O10154m34162l77106P51769J065016
34859B590645k2032q94461m51453K85310J22054l88686j07118P62682J098933
34850B995874N86939k4772j55046r6014m15513j043021j185743k77301J074558
34841A459961J569077Q51031K7988P8637N06132L89722J7012K53968P95854N02133
34831F451515o43427j322366p75448L29465J108148J364641J090354K62617n60720
$$ plain form
34895 1935678 1678611 1627663 1394894 1309571 2135001 3525376 3973572 2830059 1292671
34886 1292671 756098 1199807 1888330 2543782 2908448 2275259 703483 -217485 737475
34877 737475 2432416 2775113 1638941 794956 1214858 2112633 2633768 2805052 2581417
34868 2581417 1597579 346327 92127 974974 1585128 1150966 773860 1525629 2590645
34859 2590645 2568613 1674152 1222699 1508009 1630063 1241377 1134259 1896941 2995874
34850 2995874 3582813 3558041 3402995 3306981 2891468 1848447 662704 385403 1459961
34841 1459961 3029038 3880069 3908057 3986694 4492826 4882548 4899560 5153528 5949382 6451515
34831 6451515 5808088 4485722 3710274 4039739 5147887 6512528 7602882 7865499 7304779
34822G304779n89297m3077Q6664k53283l8328R11710J378503P55907J05409L15644
34812I934631O85962M76770M26364J256010J941645J272653J85028N64222K322008
34803A9065293L688440M055203M421277N154188N597201O100818Q014796J1050455
34795F7147671J3171530J4154102J6629244K2058621K8564907L5008149M3533469
34788B40267693N3269135N4019823L3893038m621985m1979269n9204223n5149006
34781B20495206m2969235l3350386k6790727k0316102j4388123j0985960r668182
34774F2026491q719929p741591o881348n529785l640386k503055k558930k326548
34766B2124919j104123o20664k019340l323559k394866n59196l87159j355401
$$ plain form
34822 7304779 6715482 6672405 6759069 6505786 6467458 7379168 8757671 9513578 9618987 9934631
34812 9934631 10620593 11097363 11523727 12779737 14721382 15994035 16179063 16743285 19065293
34803 19065293 22753733 26808936 31230213 36384401 41981602 48082420 56097216 67147671
34795 67147671 80319201 94473303 111102547 133161168 161726075 196734224 240267693
34788 240267693 293536828 347556651 381449689 376827704 334848435 275644212 220495206
34781 220495206 177525971 144175585 117384858 97068756 82680633 71694673 62026491
34774 62026491 53306562 45564971 38683623 33153838 29513452 27010397 24451467 22124919
34766 22124919 21020796 20400132 18380792 15057233 12662367 12103171 11716012 10360611
34758A0360611j025571M12480M20722j240272j815315j82125J165075J40298j682698
34749F553205j693686j07363Q15025J77551p65230o91182K79334J007203N80103
34740F154960o88288j382193o35755N00906L54389q47794j193696j3130J080058
34731C329457P14761k59127l54859K85307M65257j14728p28407r12511q16396
34722A608754n69039j56338K09648J98197k03058o11653n11228L24812J330654
34713A620749J361091P2727j224909j033158K81215J024707N61247j82628m92231
34704A988810n98099n45116J9413O53131L96295m04807l47322N25258N22171o85858
34694A523876j126893K19382J492967R40986k64155k86698J34614p37406k163593
$$ plain form
34758 10360611 9335040 9747520 10168242 8927970 7112655 6930530 8095605 8235903 6553205
34749 6553205 4859519 4752156 5567181 5744732 4979502 4288320 4567654 5574857 6154960
34740 6154960 5466672 4084479 3448724 3949630 4304019 3456225 2262529 2249399 3329457
34731 3329457 4044218 3785091 3430232 3715539 4180796 4066068 3337661 2425150 1608754
34722 1608754 1039715 883377 1093025 1291222 1088164 476511 -34717 290095 1620749
34713 1620749 2981840 3054567 1829658 796500 1077715 2102422 2663669 2481041 1988810
34704 1988810 1390711 845595 865008 1518139 1914434 1509627 1162305 1687563 2209734 1523876
34694 1523876 396983 616365 2109332 3050318 2786163 2499465 2634079 1896673 -266920
34685b66920j879665R8542J364824P72743k17392j30613O47762J082107R02034
34676B373422L03880m31067o91953j18402M42319j44459j334949j341664J88840
34667g54033J475563J146170M2599l45775j7157O2436k64881l30265j1470K2398
34657A025585m86381p97338j88317Q98861J281630N73108k55245k04937L06281
34648B153247Q4360r20286j357202m36704Q43603J083244L13989l54841l66142
34639A043268j32499j43472m02180o01866l94054K74845Q11905M59328n60020
34630C55255j057071m55359M23802O66191M65022L50980J68206l18960o67754
34621f9688n37694l96423n19007k34073P58619J360089P00708j87253R1065R24948
$$ plain form
34685 -266920 -2146585 -2048043 -683219 89524 -127868 -258481 389281 1471388 2373422
34676 2373422 2677302 2246235 1554282 1435880 1878199 1733740 398791 -942873 -754033
34667 -754033 721530 1867700 1910299 1564524 1547367 1609803 1344922 1014657 1003187 1025585
34657 1025585 539204 -258134 -446451 452410 1734040 2307148 2051903 1846966 2153247
34648 2153247 2237607 1317321 -39881 -476585 367018 1450262 1764251 1409410 1043268
34639 1043268 910769 767297 365117 -236749 -630803 -355958 455947 915275 355255
34630 355255 -701816 -1157175 -733373 -67182 397840 748820 917026 598066 -69688
34621 -69688 -607382 -1003805 -1522812 -1756885 -998266 361823 1062531 875278 966343 1891291
34611A891291O81513n25515r91327j17554Q92071J051332O55480K14681k05106
34602C546866m48774l54587l60080q53086j185500o29539J43096J03538j41563
34593a79629O66460J850676J473565m16430j584405r71964N0152K75565J73019
34584A337009J40889l53331r81724l32180J342338J601020m20234k115505j225810
34575a007528O77450Q90277j93268l56114M05999K78362p20324p00245N52888
34566a72503J012701j03397r71521k25183Q94419P13043l47989q30220m97107
34557e27757j18711O1494K94881L79079l2610n26905l69498L71073R83308J149033
34547A663387R98370M22737o56804j456123r48435M37793R22573j95448j272732
$$ plain form
34611 1891291 2572804 2047289 1055962 938408 1830479 2881811 3537291 3751972 3546866
34602 3546866 3098092 2743505 2383425 1530339 344839 -284700 -141604 -38066 -179629
34593 -179629 486831 2337507 3811072 3394642 1810237 838273 888425 1163990 1337009
34584 1337009 1477898 1124567 142843 -189337 1153001 2754021 2333787 218282 -1007528
34575 -1007528 -330078 560199 366931 10817 416816 695178 -25146 -725391 -172503
34566 -172503 840198 736801 -234720 -459903 434516 1147559 799570 -30650 -527757
34557 -527757 -646468 -584974 -290093 88986 56376 -470529 -840027 -468954 514354 1663387
34547 1663387 2661757 3084494 2427690 971567 23132 460925 1383498 1188050 -84682
34538h4682n13361J363980K053735R33951k02672L9042O83405J24926j325899
34529C072425j925122r76869L80336P62259K5785q53779q33280J70739R69940
34520G92434K55410j536705k261419p06684J610007K352576J338903K50336l3733
34511B061125j28651l98965l36776P6704K4458o43597r52158l80432L44003N53100
34501B18811N39736O05717L94698j88457m80357j35313K83319L45115L55910L95630
34491B334809p6092r86640j230123l35376N60981L76588k93304k72161L64303
34482D42985O86587M42336N5741l76632r89578j369523q63315L92783J407767
34473a70849J325348K64967o77876m09398P35414R91308m69728j806088q28306
$$ plain form
34538 -84682 -598043 765937 2819672 3753623 3550951 3589993 4273398 4398324 3072425
34529 3072425 1147303 170434 550770 1313029 1338814 485035 -348245 -177506 792434
34520 792434 1047844 -488861 -2750280 -3456964 -1846957 505619 1844522 2094858 2061125
34511 2061125 1932474 1533509 1196733 1273437 1297895 654298 -297860 -678292 -334289 218811
34501 218811 758547 1364264 1758962 1570505 1090148 954835 1238154 1583269 1939179 2334809
34491 2334809 2258717 1272077 41954 -293422 267559 644147 350843 78682 442985
34482 442985 1129572 1571908 1627649 1251017 261439 -1108084 -1971399 -1578616 -170849
34473 -170849 1154499 1419466 741590 332192 1067606 2058914 1589186 -216902 -1045208
34464a045208J389931J655860m36224j681424l28341J167782L83565j054280n39006
34455d87345Q81897N28389r33550n91342J377607J683392n06446j983834o33091
34446f64323J352382J179643m46588j113060m74127Q2650J35014L40694O48913
34437A041198L77106k84040m61492j41966j64133o72223p64019P7111J091374
34428I8916J197956L36899n62855p66318m84813l10778k37903J92727P94890O48788
34418I07509m15155j100479l21463J044154J235867O8042r50152q21674j30638
34409d83989J84866j1735l42251m32459k8605O02597N49423n07105j284452m55612
34399b209322J099971J317169J38194l68574N61076J095704o0078j371989r19957
$$ plain form
34464 -1045208 344723 2000583 1564359 -117065 -445406 722376 1105941 51661 -487345
34455 -487345 394552 922941 -10609 -601951 775656 2459048 1952602 -31232 -664323
34446 -664323 688059 1867702 1421114 308054 -166073 -83423 51591 392285 1041198
34437 1041198 1418304 1134264 672772 530806 366673 -305550 -1069569 -992458 98916
34428 98916 1296872 1633771 1070916 304598 -180215 -490993 -728896 -536169 258721 907509
34418 907509 492354 -608125 -929588 114566 1350433 1418475 468323 -353351 -483989
34409 -483989 -299123 -310858 -653109 -1085568 -1114173 -511576 37847 -469258 -1753710 -2209322
34399 -2209322 -1109351 207818 346012 -22562 538514 1634218 1574140 202151 -717806
34390g17806N31590Q60382j10345o74930p6016O42024N53372L0637k26291j43767
34380F68850L9834J66741N096o05802j266158j231367l17247P64053J104569M86657
34370a84774m00158n94174J03656Q12772O74222O9053P130M48347L51095m60785
34360H26384q26742j84858L92687k730n62947k11361N00962M00103k60065l44388
34350b72955J54551L00699M3307J77759O13209L71689n59341r92514m94169o3199
34340g20964l49534n99195q0278O67227Q53083O94556P34149P07685P0941q80330
34330A097340j321688j017116m14142R7824M06744M24475K03617R4346K64557
34321a64043K99440j70794o61559l19734P85030J481254Q44785o56707j648432
$$ plain form
34390 -717806 -186216 674166 563821 -111109 -187125 454899 1008271 1038908 812617 668850
34380 668850 708684 875425 880521 274719 -991439 -2222806 -2540053 -1776000 -671431 -184774
34370 -184774 -584932 -1179106 -1075450 -262678 411544 480597 487727 936074 1287169 826384
34360 826384 -358 -185216 207471 204741 -358206 -569567 -68605 331498 71433 -272955
34350 -272955 -118404 182295 225602 403361 1016570 1388259 828918 -163596 -657765 -720964
34340 -720964 -1070498 -1669693 -1749971 -1082744 -229661 464895 1199044 1906729 1977670 1097340
34330 1097340 -224348 -1241464 -1655606 -1557782 -1151038 -726563 -522946 -428600 -164043
34321 -164043 135397 -35397 -696956 -1016690 -231660 1249594 2094379 1437672 -210760
34312b10760j302518r0578Q35143P98517Q5752n43559o06383j76369L14925M27385
34302d68445P1296l42719l23469L8860J91751N5270K62208J036883J480918P70957
34292B773510m24870p74649k48115j6784m12227m11908M34419R95909L48296o10198
34282A653383n08225L74872O59972K7475n60974o06431o64706j053898j195849
34273a874381o45292J92069Q12109J242611J457234J003532j15306q83763m52875
34264G35938N34903O76037l04036j227698j084607k19392L59088K48741j83087
34255d64113m95071n12882j58595N26733J139334J140996N45144M4677J49276
34246A915499M46939J56514o96736j192501p18950K20253O73581L34288l51026
$$ plain form
34312 -210760 -1513278 -1603856 -768713 29804 115556 -428003 -1034386 -1210755 -895830 -468445
34302 -468445 -397149 -739868 -1063337 -1024477 -832726 -777456 -515248 521635 2002553 2773510
34292 2773510 2348640 1573991 1325876 1309092 896865 484957 919376 1915285 2263581 1653383
34282 1653383 1145158 1520030 2180002 2207477 1646503 1040072 375366 -678532 -1874381
34273 -1874381 -2519673 -2327604 -1515495 -272884 1184350 2187882 2072576 1188813 735938
34264 735938 1270841 1946878 1642842 415144 -669463 -888855 -529767 -281026 -464113
34255 -464113 -959184 -1472066 -1630661 -1103928 35406 1176402 1721546 1766223 1915499
34246 1915499 2362438 2518952 1822216 629715 -89235 131018 804599 1138887 787861
34237G87861q14872p26936m8992P89782J030570M22867k87428k65173K44973L34370
34227A467022j72673n70690m59606j45682J98940P12062R51505O4257j580741
34218D64394k166604p87775J018752J296282L43014p9610M31410O19176p9754
34209A059285o40785k61531L97726L94253j66166n73260m49735J86010J009516
34200I55313J270002M74117n96385o28968K00426K87711q14063j392722j32236
34191c76805J726478K126612J019659m6833l65112n16919q80600j180643j260301
34182B45536j066919k54439R94628J368075J47776j089578l78941J440347J669220
34173C075705j40582j511302j002921k64967q86694j572255m30783J636435K162564
$$ plain form
34237 787861 -27011 -753947 -802939 -13157 1017413 1440280 1152852 887679 1132652 1467022
34227 1467022 1294349 723659 264053 118371 317311 1029373 1980878 2045135 464394
34218 464394 -1702210 -2489985 -1471233 -174951 168063 88453 519863 1139039 1059285
34209 1059285 418500 156969 554695 948948 782782 209522 -240213 -54203 955313
34200 955313 2225315 2699432 2103047 1474079 1674505 1962216 1148153 -244569 -376805
34191 -376805 1349673 3476285 4495944 4449111 4083999 3567080 2686480 1505837 245536
34182 245536 -821383 -1075822 -81194 1286881 1434657 345079 -33862 1406485 3075705
34173 3075705 2935123 1423821 420900 155933 -730761 -2303016 -2733799 -1097364 1065200
34164A065200P88133n29124n91049k09139l32759o84619o74139l76552j07981
34155a652029R8814K44888K42752K05926K99619L21677K6877k66248q7138L35303
34145b29559M29041L21878N85576J009588P28279k59236q19868l80720J23527
34136A508506l05964j130682j008396K75488J463480J358556R3101j204154j584230
34127e34295r70835M8381Q37109J067096O81361j30540q30423q10155r4903N42297
34117a94907N34854K31878J66193O4129n98617j340996j059630K46914J214056
34108g36126R51856J85872j6213K17113J23170k52721k23950K00177K16820l91253
34098B74745o95369N0186J096441R76579m70895j596395r02198R42219J826300
$$ plain form
34164 1065200 1853333 1324209 733160 524021 191262 -493357 -1167496 -1544048 -1652029
34155 -1652029 -1553215 -1308327 -1065575 -859649 -560030 -238353 -211476 -477724 -564862 -229559
34145 -229559 199482 521360 1106936 2116524 2844803 2585567 1765699 1384979 1508506
34136 1508506 1202542 71860 -936536 -661048 802432 2160988 2254089 1049935 -534295
34127 -534295 -1505130 -1456749 -619640 447456 1128817 998277 167854 -642301 -737204 -194907
34117 -194907 339947 571825 738018 802147 203530 -1137466 -2197096 -1950182 -736126
34108 -736126 215730 401602 385389 602502 725672 472951 249001 449178 665998 274745
34098 274745 -420624 -370438 726003 1702582 1231687 -364708 -1266906 -324687 1501613
34089A501613Q75944n49993r00171m35420l12154n46053k76912L90834M44341
34080A92029j40614k26487M16074N53300l06216q33921j05267O60864R3222r05007
34070f02023n87648O74692R56107j08263q79312m43263J93316O6486l11728j49312
34060a190948L93454Q46366J124366J018634J77768q62712r03429L7503M28974
34051A069976l84820r60457n9106J223946J148340J238o87172p23525j023809
34042c95389j317562l53798J495465K065259N39872j130079j028136Q2568L10311
34033B68511l72500m34308M85437R78083J63265r22932q97910M0469O43150M65032
34023D16297J82279K23635J28591m03824p01615r7942Q03612P97841j55223q51670
$$ plain form
34089 1501613 2377557 1827564 927393 491973 179819 -366234 -643146 -252312 192029
34080 192029 51415 -175072 241002 794302 488086 -345835 -451102 209762 302984 -602023
34070 -602023 -1189671 -514979 441128 332865 -546447 -989710 -796394 -729908 -1041636 -1190948
34060 -1190948 -797494 48872 1173238 2191872 2369640 1506928 603499 641002 1069976
34051 1069976 685156 -275301 -334407 889539 2037879 2039117 1351945 628420 -395389
34042 -395389 -1712951 -2066749 -571284 1493975 2033847 903768 -124368 -41800 268511
34033 268511 -103989 -538297 -52860 925223 1088488 165556 -732354 -691885 -48735 416297
34023 416297 598576 822211 950802 546978 -154637 -252579 551033 1348874 1193651 341981
34013C41981o39641k13684k11058j36909N06626J008042N27724l08236k76375
34004E98470L68279K11854r38773j563285p28632N06660P08223j1342n22506k95058
33994a666110L46543R21525R85663K46764p71004q45482L01029J162030L69511
33985A050469j081215r60121R59868K340781J405242p16555j676170r94378k13174
33976A14747l45626n74786J07174J051190P79324o88995j514272m38475J368644
33967a41075J725600K76123j141391r85912J80414Q18484M53397j80662m73003
33958E31975n13089n31509n47903n65938n14501n4260R04087J535443Q16840q29050
33948B32095j497078r7080J938230K223491M61033j217952j152482j92071m9530
$$ plain form
34013 341981 -297660 -511344 -722402 -859311 -352685 655357 1183081 874845 598470
34004 598470 966749 1178603 239830 -1323455 -2052087 -1545427 -837204 -848546 -1371052 -1666110
33994 -1666110 -1319567 -398042 587621 834385 63381 -782101 -481072 680958 1050469
33985 1050469 -30746 -990867 -30999 2309782 3715024 2998469 1322299 327921 114747
33976 114747 -230879 -805665 -698491 352699 1132023 443028 -1071244 -1509719 -141075
33967 -141075 1584525 1860648 719257 -266655 -86241 732243 1185640 1004978 531975
33958 531975 18886 -512623 -1060526 -1626464 -2140965 -2195225 -1291138 244305 1061145 232095
33948 232095 -1264983 -1362063 576167 2799658 3260691 2042739 890257 698186 648656
33939F48656o36425m78349O38038J196219M35141m00935j86902K19716l90013
33930A045146j310580j077609p0997R7913n77771n02723O06914J110104L02628
33921c76975l35071K55554R24074M90939j40319K54154Q93377L70867q06314j075328
33911D54958l90568J9909j53680k57130k94645o80099q07162J34159J233881Q67859
33901A27482n13057q20441L40567J072027L36414n63503m20279P6672J593k17241
33891e79766k0423J19766p7012J33884R41096J111062K6465r23980n06966K51425
33881D75551j04292q15654k07639J253113J481859K5809j347696j365505o57018
33872a261472j76161Q6392L23894K75759k1956J8591M68092N30489j78119q78201
$$ plain form
33939 648656 12231 -466118 171920 1368139 1803280 1402345 1215443 1435159 1045146
33930 1045146 -265434 -1343043 -1414040 -1316127 -1893898 -2396621 -1789707 -679603 -376975
33921 -376975 -712046 -456492 467582 958521 818202 1072356 1965733 2336600 1530286 454958
33911 454958 64390 84299 -69381 -326511 -621156 -1301255 -2108417 -1974258 -740377 127482
33901 127482 -385575 -1206016 -865449 206578 542992 -20511 -440790 -364118 -362525 -579766
33891 -579766 -600189 -480423 -557435 -423551 517545 1628607 1655072 731092 224126 475551
33881 475551 371259 -444395 -652034 601079 2082938 2108747 761051 -604454 -1261472
33872 -1261472 -1437633 -1351241 -1027347 -751588 -773544 -754953 -286861 243628 65509 -812692
33862h12692p77248k40280j07713l53701j85758O75952J454458J240092J79179
33853A072289n86576k76971N17121O18617r9557o08310l52803k4214k30437m15973
33843c86814K7041M78106J05419n27535k87367N22756N53034l13665p19148r2829
33833f41002M62823J25114k85260K17211J128125J328360P45557J05640k93256
33824B893312n39220m07303K28812O79767K00267p70724j144351p82643n03267
33815a45350n64645l50734K39673L41872l69108q22274p4686J132872J375356
33806G62976N28554l50273p20268q78997p75200M3728J088400J021705k94774
33797D25851j241512q29974k76785q62169j477891k52790K101349K860771J211238
$$ plain form
33862 -812692 -1589940 -1830220 -1937933 -2291634 -2477392 -1801440 -346982 893110 1072289
33853 1072289 485713 208742 725863 1344480 1244923 636613 283810 259596 29159 -386814
33843 -386814 -359773 118333 223752 -303783 -591150 -68394 484640 170975 -548173 -641002
33833 -641002 -178179 -53065 -338325 -121114 1007011 2335371 3080928 3186568 2893312
33824 2893312 2354092 1946789 2175601 2855368 3055635 2284911 1140560 357917 -145350
33815 -145350 -709995 -1060729 -821056 -479184 -848292 -1670566 -1745252 -612380 762976
33806 762976 1291530 941257 220989 -658008 -1433208 -1389480 -301080 720625 425851
33797 425851 -815661 -1645635 -1922420 -2784589 -4262480 -4515270 -2413921 446850 1658088
33788A658088o22712p16803J27346K85402j59650k11781M8593j18347n22501l78240
33778f10605K51498O22861N43728L20312j09521q40484j173238l68225R40149
33769d23525J270460K67316q38271q19244K80178J463677J704527O79795p96044
33760B788869j336058n87538J88826j34819q93830p50585J78592O65912M08296
33751E27665K21197L75022K48866l08514o63654n65667l70564q4803M96515P62390
33741F38453o3030j207613j017098M23213J162111L52631n39617k46031M63423
33732c3558M95724K37963L49554L15394l30645p04028o3099N90571O2103r39327
33722a9348j017643m88172o09585j083267m55568J194196K053794J287337J27586
$$ plain form
33788 1658088 1035376 318573 445919 731321 571671 359890 408483 290136 -232365 -610605
33778 -610605 -359107 263754 807482 1127794 1018273 177789 -995449 -1363674 -423525
33769 -423525 846935 1114251 275980 -543264 -263086 1200591 2905118 3584913 2788869
33760 2788869 1452811 865273 1054099 919280 25450 -725135 -546543 119369 527665
33751 527665 748862 1123884 1372750 1064236 400582 -165085 -535649 -620452 -123937 638453
33741 638453 575423 -632190 -1649288 -1226075 -63964 288667 -250950 -496981 -33558
33732 -33558 462166 700129 1049683 1365077 1034432 330404 267305 857876 919979 -19348
33722 -19348 -1036991 -1525163 -2134748 -3218015 -3673583 -2479387 -425593 861744 989330
33713I89330j87414J5045l6955k15160q6344J14567o3958m60095n78452l27375
33703h36811k1217R3967L4688j5028J09443L05297K33711j81774n06115l39682
33693a123521J72139O96464J153280J375996R00750k51085j126783r95397m55542
33684C46301m63535p47922l52554N78038R03113L29164j91382r2463L4979l23054
33674B0685p25734o34631k21682J57712M79316O30984L20724j70008j5040Q49989
33664F92315J299494N47038o47189j043694n88330j94943k81140l55454O7352
33655e04551P90137J211554R35448J26314n79405o47831k04777J81162K12958
33646A521009R782l25929p17261p81258k24705M33970L99165p3628R0590R99611
$$ plain form
33713 989330 801916 816961 780006 564846 478502 593069 529111 69016 -509436 -836811
33703 -836811 -858028 -764061 -729373 -744401 -634958 -329661 -95950 -277724 -783839 -1123521
33693 -1123521 -951382 -254918 898362 2274358 3175108 2924023 1797240 801843 346301
33684 346301 -117234 -865156 -1217710 -639672 263441 592605 401223 308760 343739 20685
33674 20685 -705049 -1339680 -1561362 -1403650 -924334 -293350 27374 -142634 -157674 692315
33664 692315 1991809 2538847 1891658 847964 259634 64691 -216449 -571903 -504551
33655 -504551 285586 1497140 2432588 2558902 1979497 1331666 1126889 1308051 1521009
33646 1521009 1530791 1204862 487601 -293657 -518362 -84392 314773 241145 331735 1331346
33636A331346J421406O92227k26505l64563k12878n28443p94407k54458M08454
33627A472179O5191p63909o02178M24362O29506m27080j072593j58744J104440
33618F71174J057320L0541m88799k45958k44468p65096q82429j32052N80080K98650
33608a21037n36385o62152L19070J421222J451373L48907q05136r99446l36333
33599H0083K21235K9972n65749q06564m58675O9816L48611L08840P6801k04214
33589h99844l29817j43318J69993J70628k55943o24369m02086K95693Q21185P45634
33579d52244K59500j61101k58662j19870K6935N8335O3489J95045L78231L23058
33569C12716l2766l16745k45294j23200l61298o75954m30687K35600M30001j05798
$$ plain form
33636 1331346 2752752 3444979 3218474 2853911 2641033 2112590 1318183 1063725 1472179
33627 1472179 1537370 773461 171283 595645 1225151 798071 -274522 -433266 671174
33618 671174 1728494 1759035 1270236 1024278 779810 14714 -867715 -999767 -419687 -121037
33608 -121037 -657422 -1319574 -1000504 420718 1872091 2220998 1415862 416416 80083
33599 80083 301318 331290 -234459 -1041023 -1499698 -1429882 -1081271 -772431 -695630 -899844
33589 -899844 -1229661 -1372979 -1202986 -1032358 -1288301 -1912670 -2314756 -2019063 -1197878 -452244
33579 -452244 -192744 -353845 -612507 -732377 -705442 -647107 -583618 -388573 -10342 312716
33569 312716 279950 -36795 -282089 -405289 -766587 -1442541 -1873228 -1637628 -1207627 -1313425
33559a313425m81401m3868N33373L39240k63570k56415L11278L98590l10514r36284
33549b022996q26752l75778o2011L30536R78347J346964R48592J63840l55869
33540A24873n92962q07825p60294q2448Q48609J209265Q27147K96052j575l11058
33530G49784p86755r73885m24421M88468Q56711L50491l30125l57221J16133K21243
33520h9577k76249n71380j09405M43701K68083j72318J40258R59117J051889K90144
33510A934263n4901N20183Q34969M4920q65154p16285l4880J5265m05496m04492
33500H68392j16155k64423n40929j05796O54856O11155m3001j3276P48572P97642
33490B597037l28081j205583p82087J25267M59371N10336P70106N95929n72109
$$ plain form
33559 -1313425 -1794826 -1838694 -1305321 -966081 -1229651 -1486066 -1174788 -776198 -1086712 -2022996
33549 -2022996 -2849748 -3225526 -3287537 -2957001 -1978654 -631690 316902 480742 124873
33540 124873 -468089 -1275914 -2036208 -2118656 -1270047 -60782 766365 1062417 1060842 749784
33530 749784 -36971 -1010856 -1435277 -946809 -90098 260393 -69732 -426953 -310820 -89577
33520 -89577 -365826 -937206 -1046611 -602910 -334827 -507145 -366887 592230 1644119 1934263
33510 1934263 1879362 2399545 3234514 3279434 2414280 1697995 1663115 1678380 1272884 868392
33500 868392 752237 487814 -53115 -158911 495945 1107100 1064099 1050823 1799395 2597037
33490 2597037 2268956 1063373 281286 406553 865924 1376260 2146366 2742295 2170186
33481B170186j691458j362558Q503P46435K85075l32600k41619J90018K81729
33472E3711N3698l0983K45042O83677Q65505M70069l27934q89079q13082l97691
33462h7067q8622J78728O09159Q58944L96877n56913j112460q03458q4298L78201
33452c10909M58584M16508L30821K6937m79987p43802l29607N08540R22850M91635
33442A291570j68864k41195J47354K55688l4944j89607j45197m01441q22491n28126
33432h37253N44016J120201L81238p35596r12486k39305L46950N74010O73374
33423I15149M47712k51255o97878k51692L42572p708q14950o59842M40152R52610
33413D14870J97782p86972j012511o67818j27921O55988J252779P41030o57257
$$ plain form
33481 2170186 478728 -883830 -875327 -128892 156183 -176417 -418036 -228018 53711
33472 53711 107409 76426 321468 1005145 1870650 2340719 2012785 1123706 310624 -87067
33462 -87067 -175689 3039 612198 1471142 1868019 1311106 198646 -604812 -689110 -310909
33452 -310909 147675 564183 895004 921941 441954 -301848 -631455 -122915 799935 1291570
33442 1291570 1122706 881511 1028865 1284553 1249609 1060002 914805 513364 -309127 -837253
33432 -837253 -293237 826964 1208202 472606 -439880 -679185 -332235 241775 915149
33423 915149 1362861 1111606 413728 162036 504608 496900 -318050 -977892 -537740 414870
33413 414870 612652 -174320 -1186831 -1854649 -1982570 -1326582 -73803 667227 9970
33404I970j325465n12317M70054L11341l31185j90342M56631N28716J42711J62626
33394b77260L40915k42820j123202p65438Q31234J684514O49410q90539j114569
33385i07755k38372L19281K33789K62590M92102J84939o33464q69500l7934Q98343
33375b95981R53032M59068K65464L55648J66845k46962l92051l91520p90899j349984
33365a267340j130095k2267Q38974O46672P052j41259J24603K16596J99793M84796
33355d2475P89902M56741l31165o13505l0020O60130O29701o3225p71689j008786
33345c24391p14238j75480J56869O2958j84762k00895l5204l836j01150j6023
33335a536152L23857O49208P58834O49698L07465k27752o41528n92782j70008
$$ plain form
33404 9970 -1315495 -1827812 -1357758 -1046417 -1377602 -1567944 -1111313 -582597 -439886 -277260
33394 -277260 63655 -179165 -1302367 -2067805 -1236571 447943 1097353 206814 -907755
33385 -907755 -1146127 -826846 -593057 -330467 161635 346574 -286890 -1156390 -1194324 -295981
33375 -295981 657051 1116119 1381583 1737231 1904076 1657114 1265063 873543 82644 -1267340
33365 -1267340 -2397435 -2419702 -1580728 -934056 -927004 -1068263 -943660 -727064 -527271 -42475
33355 -42475 747427 1204168 873003 259498 229478 889608 1519309 1456084 684395 -324391
33345 -324391 -1038629 -1214109 -1057240 -994282 -1179044 -1379939 -1415143 -1418979 -1520129 -1536152
33335 -1536152 -1212295 -563087 195747 845445 1152910 925158 283630 -309152 -479160
33326d79160K07736K84805J28890m2374O208L01249M16690p5077p24832n11690
33316d87555N85713J228262N97313l28284l38376J17006j18935q67549j037616
33307f50021n10225j2703M19609J156427J544162O66773o65957p26048L31799
33298A553816O11943l80963j019461m69029J9969l98205o48750J01383Q31388
33289B02091N89491J56757L48191M38923j76256n02372J84733O76671q7217q84258
33279I46754k38422Q75944O61287m16534o39231j39493l75010j171001r73395
33270a469101K31041Q17216L19399o4005J50770J53850j65776R3598Q36155Q23382
33260A726529k3768k93515M18501P68430P5126n77369m41740l13155o82103o16718
$$ plain form
33326 -479160 -271424 13381 142271 99897 106105 407354 824044 748967 24135 -487555
33316 -487555 98158 1326420 1923733 1595449 1257073 1374079 1255144 387595 -650021
33307 -650021 -1160246 -1172949 -753340 403087 1947249 2614022 1948065 1222017 1553816
33298 1553816 2165759 1784796 765335 296306 316275 -81930 -730680 -629297 202091
33289 202091 791582 948339 1296530 1735453 1559197 1056825 1241558 1918229 1831012 946754
33279 946754 708332 1584276 2245563 1829029 1189798 1050305 675295 -495706 -1469101
33270 -1469101 -1238060 -420844 -101445 -165450 -14680 139170 -26606 66992 903147 1726529
33260 1726529 1702761 1409246 1827747 2596177 2671303 2093934 1652194 1339039 656936 40218
33250D0218L48637R79668L17921o50645o60318j12385L3458K8154M84429Q52897
33240A662034L41340m67575m68058J22439K38758k05211m06542k41822l13252
33231B62111n61495k08554P68381J279273O13145n38396r76423m22227L04738
33222E20553L30162k60288n16816J50995J017167Q21414m77243j467144j100524
33213i81724J7608O73551O47880N10875L80727j26445q91566j184509p22987j39257
33203a815847o1915k01649J73272J014704J321855M88439o08675o00907L64148
33194G3425O37305m79335j437564o39117J029981J412074K80299n27319j19211
33185B30538K94188k50424q52749m70722K89431L55212j5574N2882M14892L02251
$$ plain form
33250 40218 388855 1368523 1686444 1035799 375481 263096 296554 324708 809137 1662034
33240 1662034 2003374 1535799 1067741 1190180 1428938 1223727 817185 575363 262111
33231 262111 -299384 -507938 260443 1539716 2152861 1614465 638042 215815 520553
33222 520553 850715 590427 73611 224606 1241773 2063187 1585944 118800 -981724
33213 -981724 -964116 -290565 357315 868190 1248917 1122472 230906 -953603 -1676590 -1815847
33203 -1815847 -1877762 -2079411 -1906139 -891435 430420 918859 310184 -290723 73425
33194 73425 710730 231395 -1206169 -1845286 -815305 596769 877068 349749 230538
33185 230538 524726 274302 -578447 -1049169 -759738 -404526 -420100 -367218 47674 349925
33175C49925k28280m73357l07322j38601L8284N19639J018564Q48298n8044r97933
33165E71173j317123r16720j62812L18608J19657l01503L2666J194104J933597
33156A471647J287006r1356r44639j082353j114131j109737o50140Q7559M04264
33147a741880J91462N5110L02621N75012N39505L08911J22274R3946K30310L07222
33137I84493m0665o74465p70573R6473J040595Q18450m67807j406799j025110
33128a445408J64288R46903P20326q8701n73937k54559M22596O31218K74622R0727
33118H88075M42688O67065J34331o70805q55003m21437n9150K2522J89401N02698
33108H40385N69520K36007k29052n83815o91766l36042M22083R11323N93072k8903
$$ plain form
33175 349925 121645 -351712 -659034 -797635 -759351 -239712 778852 1627150 1569106 571173
33165 571173 -745950 -1662670 -1825482 -1506874 -1387217 -1688720 -1656054 -461950 1471647
33156 1471647 2758653 2667297 1722658 640305 -473826 -1583563 -2233703 -2146144 -1741880
33147 -1741880 -1550418 -1495308 -1192687 -617675 -78170 230741 353015 446961 677271 984493
33137 984493 943828 269363 -501210 -404737 635858 1454308 986501 -420298 -1445408
33128 -1445408 -1281120 -334217 386109 297408 -276529 -531088 -108492 522726 797348 888075
33118 888075 1330763 1997828 2132159 1461354 606351 184914 125764 148286 337687 840385
33108 840385 1409905 1645912 1416860 833045 141279 -194763 227320 1138643 1731715 1702812
33098A702812k9925M98448N29108k78886r59986o45013J57163L09614l43981q36079
33088A03275m96604J27500J13451m67891o45805p381O63652N90888J53717R9185
33078B33987K01711k05307p39677m08224M95181N10418n70104j017808K25921
33069a273902J693753J413667k58851j273447p40508K43559L96929k95620r57844
33060a052264q40595R0963J124099J430120R23331J79939m56612r54425q60650
33051d16094K42967J336008O43365j569435k610614r54454J407032J758395L48950
33042A86120n93206l28321Q1963J35064L14729N22889J59057l75135j13815O43335
33032F32680P05069O2657j87186J11897N0862m18929l19013M08862O03293j31351
$$ plain form
33098 1702812 1672887 2171335 2700443 2421557 1461571 816558 973721 1283335 939354 103275
33088 103275 -393329 -265829 -152378 -620269 -1266074 -1273455 -609803 -18915 134802 233987
33078 233987 435698 230391 -509286 -917510 -422329 88089 -482015 -1499823 -1273902
33069 -1273902 419851 1833518 1574667 301220 -439288 -195729 201200 -94420 -1052264
33060 -1052264 -1892859 -1801896 -677797 752323 1675654 1855593 1398981 444556 -416094
33051 -416094 -173127 1162881 1806246 236811 -2373803 -3328257 -1921225 -162830 186120
33042 186120 -407086 -735407 -653444 -518380 -203651 319238 478295 103160 -10655 632680
33032 632680 1337749 1400406 1213220 1325117 1375979 957050 638037 1046899 1650192 1518841
33022A518841p98254p33515m21381k48624P3139N09318N26521J81877O8776J04283
33012G80981k10665m32180K06967R21561J89768j418360j555884K16191J446984
33003A45363M84191j099731j130911P2850Q52072Q68119Q58790Q45841K73618
32994B170202o91605j292522j175255m52635O04251J349749J069868N0618n75441
32985A057230m69542m50205q34482q25590j24745L72834K45044L51211J084969
32976D06724J391435N66674m81184q53508r96013j276829r10368L31009J011908
32967h10152K43948n86927o2322Q37264N15078m62160n77143j14542k88933o12370
32957a918259K65117J701004J696706J83715q24065m18697J95995J20517l4655
$$ plain form
33022 1518841 720587 -12928 -434309 -682933 -609794 -100476 426045 607922 676698 780981
33012 780981 570316 138136 345103 1266664 1456432 38072 -1517812 -1301621 145363
33003 145363 629554 -470177 -1601088 -1528238 -676166 191953 1050743 1896584 2170202
32994 2170202 1478597 186075 -989180 -1441815 -837564 512185 1582053 1632671 1057230
32985 1057230 587688 137483 -696999 -1522589 -1647334 -1274500 -1029456 -678245 406724
32976 406724 1798159 2364833 1883649 1030141 34128 -1242701 -2153069 -1822060 -810152
32967 -810152 -566204 -1153131 -1215453 -378189 136889 -325271 -902414 -1016956 -1305889 -1918259
32957 -1918259 -1653142 47862 1744568 1928283 1104218 685521 881516 1002033 967378
32948I67378J85850K11213j64042k45987J13987R4625n26968q35523l38577K90377
32938b47667N12985O31119P11873J79650r04696j425604p82141J91832N17670
32929f14979K98966P1586j12671l32550l73861k32444k87855n20983l46158L48883
32919b102066Q17411N66054N4258j72560k32802k89990j5046O82686J073664M86184
32909H67793o64358j321542r72372J4108R21220J233136R24561M34336J61276
32900A598158R871k64630m85795l75512j87071k73844k71054L32604R79430O05952
32890A668109n16156q39012J90112J212096R34503j31916p00544m83654p7653
32881A255885J03890o6840o67788j265764r72986J96944Q52113J17692q13590
$$ plain form
32948 967378 1153228 1364441 1200399 954412 1068399 1163024 636056 -199467 -538044 -247667
32938 -247667 265318 896437 1608310 1787960 883264 -542340 -1324481 -1132649 -614979
32929 -614979 -316013 -244427 -357098 -689648 -1063509 -1295953 -1583808 -2104791 -2450949 -2102066
32919 -2102066 -1284655 -718601 -664343 -836903 -1069705 -1359695 -1374741 -692055 381609 867793
32909 867793 203435 -1118107 -2090479 -2076371 -1155151 77985 1002546 1436882 1598158
32900 1598158 1608029 1343399 857604 482092 295021 21177 -249877 82727 1062157 1668109
32890 1668109 1151953 312941 503053 1715149 2649652 2517736 1817192 1333538 1255885
32881 1255885 1359775 1292935 625147 -640617 -1613603 -1416659 -564546 -446854 -1260444
32872a260444l36051J007720J234075m3562j023129m62214N82378N42073l86814
32863a45968q49533m31434N7484P8047m162J43292K21462J9835m537N28405J052261
32852F65152O70161m80689j215761q23426K8760K67932k17079o96957p04937l69479
32842b876323J33101P07340R43990M05108m75431n48609N32762J597676J399392
32833A819006K93689l23672J2161L71851J014o15621p18508n08748o32745r08574
32823a210147n55878L76651Q34686L27425k37538O8289P18159N81383j97863l79525
32813C25642L12970N93604l80117j471328j045503N91032J426269M08944j176503
32804d14990j446465k95754P05464N02091k29570l11932K08381L19547k53012
$$ plain form
32872 -1260444 -1596495 -588775 645300 601738 -421391 -883605 -301227 240846 -145968
32863 -145968 -995501 -1426935 -1369451 -1291404 -1295566 -1152274 -930812 -910977 -915514 -387109 665152
32852 665152 1335313 854624 -361137 -1184563 -1155803 -887871 -1104950 -1801907 -2506844 -2876323
32842 -2876323 -2743222 -2035882 -1091892 -686784 -1162215 -1710824 -1178062 419614 1819006
32833 1819006 2112695 1789023 1801184 2173035 2174049 1558428 839920 331172 -301573 -1210147
32823 -1210147 -1766025 -1389374 -554688 -227263 -464801 -396512 321647 903030 705167 325642
32813 325642 638612 1232216 852099 -619229 -1664732 -1073700 352569 761513 -414990
32804 -414990 -1861455 -2157209 -1451745 -949654 -1179224 -1491156 -1282775 -963228 -1216240
32795a216240n85960l0067P84322J005762Q17234P64320N31252m04588j340035
32786C26000j034468K34632Q33413K25834k93056J59611O73363L12073k26037
32777A211365L449L73762j87349j138337j088123j15198L66692j21483n80384
32768a275606l17362J84877M20184N60223O43567K61062m68543o69631l7377N12817
32758a85789J75321n29864o13414j15405R4246k35615l01367N73063J799164J973595
32748B633935N02386j463775k062546p61255R93199J403278K64386j057885j285370
32739h33647m28454M75153M33112n51183j364824q99200N41840J457028J062066
32730a08109K78502K60329P20371O29142m4505m35507k95512k32520n09064o60437
$$ plain form
32795 -1216240 -1802200 -1832267 -1047945 -42183 775051 1539371 2070623 1666035 326000
32786 326000 -708468 -473836 359577 585411 292355 451966 1125329 1437402 1211365
32777 1211365 1214814 1588576 1401227 262890 -825233 -940431 -573739 -695222 -1275606
32768 -1275606 -1592968 -1408091 -987907 -427684 215883 476945 8402 -661229 -698606 -185789
32758 -185789 -10468 -540332 -1153746 -1269151 -1174905 -1410520 -1711887 -1138824 660340 2633935
32748 2633935 3136321 1672546 -390000 -1151255 -158056 1245222 1509608 451723 -833647
32739 -833647 -1262101 -786948 -353836 -905019 -2269843 -3169043 -2627203 -1170175 -108109
32730 -108109 170393 430722 1151093 1780235 1735730 1300223 1004711 772191 263127 -397310
32720c97310l92673K0353L19802M99862M87795K98783L55359Q55927J074480K78873
32710C401251q70973j038777k70764o71p88871j423945q16334M09386R78945P14766
32700B94013L79991L75611L73063k0086p07684j086365n33409P24501J401981
32691A201616N53053r08092j089681L29715J559759J132966k22036q61915m62021
32682A233364k6385k41239p64396r33035m74826L89865J091717J077506L54753
32673A707324m56257p68974n13502L4096M94099M45630j96240p94360o02888J51275
32663d99797N27677L01010J91540M28300K42528n95988r27529N4512J171137P80888
32653A674278o31058j007759K02989J183709M56881r91077j292489l65174L30876
$$ plain form
32720 -397310 -789983 -769630 -449828 50034 537829 836612 1191971 2047898 3122378 3401251
32710 3401251 2530278 1491501 1220737 1220066 431195 -992750 -1809084 -1399698 -420753 294013
32700 294013 674004 1049615 1422678 1402592 694908 -391457 -924866 -200365 1201616
32691 1201616 1754669 846577 -243104 86611 1646370 2779336 2557300 1695385 1233364
32682 1233364 1206979 965740 201344 -731691 -1206517 -816652 275065 1352571 1707324
32673 1707324 1251067 482093 -31409 2687 496786 942416 746176 -48184 -651072 -499797
32663 -499797 27880 328890 520430 948730 1191258 595270 -332259 -277747 893390 1674278
32653 1674278 1043220 35461 238450 1422159 1879040 887963 -404526 -769700 -438824
32644d38824J65154l9771K18686K30354m48024r07858l32143M44334J82281n96968
32634a522779l40061Q76636J258853J50066q65188m71715M33359M19645k73079
32625c34263n29153j94525K50280Q28366J469889J267084j52554j437910j312283
32616a45069o18204p76854j193012l80825J097914J337745L47268k0812O59579
32607C07730Q65839J10202k85691N3382k08573j223564j067422Q79202K227021
32598A658126J069302r88646j326310p4643P41238M45637m1027k14361k59325
32589A009991j5942N93733P28541k15278j236257j023884r144L96178N4389J4968
32579B97295N28951P12338J53157m35131l17869L44137P47183J99376j085268
$$ plain form
32644 -438824 -273670 -313441 -94755 135599 -312425 -1220283 -1552426 -1108092 -925811 -1522779
32634 -1522779 -1862840 -986204 272649 422715 -442473 -914188 -480829 -61184 -334263
32625 -334263 -863416 -1057941 -807661 20705 1490594 2757678 2605124 1167214 -145069
32616 -145069 -763273 -1540127 -2733139 -3113964 -2016050 -678305 -331037 -351849 307730
32607 307730 1173569 1283771 998080 1051462 842889 -380675 -1448097 -568895 1658126
32598 1658126 2727428 1738782 412472 337829 1079067 1524704 1483677 1269316 1009991
32589 1009991 994049 1587782 2316323 2101045 864788 -159096 -168240 227938 282327 297295
32579 297295 826246 1538584 1691741 1256610 938741 1282878 2030061 2229437 1144169
32570A144169j754936o74361J215954J615625P22j448313r95260K18289L21758
32561c56353k73950K3626J036546J185115J95853o49744o76009l68154J093N48270
32551F66293P64390J6995j043280j161515m16527O8785J05581M26046Q87943N58787
32541H73498l88157p26693k76591q6585k93256J99163J402048J660091K92475
32532B655993j031984p56736K78899L85829l95904p61245l10582K29499M42913
32523G36682N41108N14919J46638k43424j03274L01713J18358o71066r87952k19064
32513A34638P54659P65832M9192k06085K11731K20156o08718j012478L7130J321869
32503A667926Q62812r84465j774647n04196R96315R22562n2818m03972k63424
$$ plain form
32570 1144169 -610767 -1285128 -69174 1546451 1547173 98860 -896400 -678111 -356353
32561 -356353 -630303 -606677 429869 1614984 1810837 1161093 485084 116930 118023 666293
32551 666293 1430683 1447678 404398 -757117 -1173644 -1104859 -999278 -573232 314711 873498
32541 873498 485341 -241352 -517943 -604528 -897784 -698621 703427 2363518 2655993
32532 2655993 1624009 867273 1146172 1532001 1136097 374852 64270 293769 736682
32523 736682 1277790 1792709 1939347 1695923 1592649 1894362 2012720 1341654 353702 134638
32513 134638 889297 1655129 1704321 1498236 1709967 1930123 1321405 308927 346057 1667926
32503 1667926 2530738 1546273 -228374 -732570 263745 1186307 1133489 729517 466093
32494D66093o51144j288253j033419M8407P53158O32623L66863L94514M79738
32485A68580N39787P03916O26808j49969j208468j594507j039611m3541R16044
32476a080961J423864R61504k42198q32119m0077Q88167M39341o64681n32643
32467C20197P49700J139629j34147j423397j239649k08943K82868r719m13246
32458i36707m15491N6369O28163N21689n13755j336085o27206J034745J675360
32449H7082O42842n84250o06227K56779R36816R45170K99150o78533j119544l67332
32439a88047P34005O16174o49949j244123l11738P84911O70683q8869k55017J20152
32429A88182J85654j31417j91471K01047N63927L91143l79859j205779j162572
$$ plain form
32494 466093 -185051 -1473304 -2506723 -2458316 -1705158 -1072535 -705672 -311158 168580
32485 168580 708367 1412283 2039091 1889122 680654 -913853 -1953464 -1997005 -1080961
32476 -1080961 342903 1304407 1062209 230090 190013 1078180 1517521 852840 320197
32467 320197 1069897 2209526 2075379 651982 -587667 -796610 -513742 -523461 -936707
32458 -936707 -1352198 -1295829 -667666 -145977 -659732 -1995817 -2623023 -1588278 87082
32449 87082 729924 145674 -460553 -203774 733042 1678212 1977362 1298829 179285 -188047
32439 -188047 545958 1162132 512183 -731940 -1043678 -258767 411916 323047 68030 188182
32429 188182 373836 242419 50948 251995 815922 1207065 827206 -378573 -1541145
32420a541145M8254J355479J435278N07198m7876J96860L03625k09786n99451
32411A448436l21499J36824L17877M29881N04747J65835l99228n09417l04744
32402A468712n85196j131273q39256J71726M64011k26663m33379L99968Q58283
32393A46933J31963m93237M864O00627K67981j64264J72172M36810q4830l19539
32383F99480M45472O92594p28665j976201r24193J049195J065878n80951j079962
32374a337353J81436R88291L69952o2121N79508R00567K2647p27149k61666L70769
32364A024881L4725m17847K18120J220935J045900j86275r47330o38803k61748
32355A092558p05704j384046j011175O03079J993350J598615k28823j481085j039338
$$ plain form
32420 -1541145 -1492891 -137412 1297866 1805064 1757188 1954048 2257673 2047887 1448436
32411 1448436 1126937 1263761 1581638 2011519 2516266 2682101 2282873 1773456 1468712
32402 1468712 883516 -247757 -1087013 -915287 -451276 -677939 -1111318 -711350 146933
32393 146933 278896 -214341 -209477 391150 659131 494867 667039 1103849 1019019 699480
32383 699480 1144952 1837546 1108881 -867320 -1791513 -742318 323560 -257391 -1337353
32374 -1337353 -1155917 -167626 202326 140205 719713 1620280 1642927 915778 654112 1024881
32364 1024881 1059606 641759 859879 2080814 3126714 2940439 1993109 1354306 1092558
32355 1092558 386854 -997192 -2008367 -1405288 588062 2186677 1957854 476769 -562569
32346e62569k522K43052J29898P05379J308691M76233j229260j567712m2604J204109
32336F62695O23360n94967o73058J71709O45338N25022M01084K53311k39806o52553
32326A122135m39078p7786k88827n75801N4430J180848J261023o8914j348904
32317H19126j332833n14490l6642l8545J02504N13332P10348M97200J95516r310
32307I06206l06469o99691p41677j47006O39423Q44588K53037n41571p46465j12765
32297f52390Q58977J349369R39619j6250q23689j216003j408811j397136p69705
32288c136019M40952J300408J036296K12381M0797O66375J004245L74304n51434
32279A388305p72196k69080J72367N8608l18690l57383R2223M56846Q1926p88097
$$ plain form
32346 -562569 -565091 -322039 -192141 513238 1821929 2298162 1068902 -498810 -541414 662695
32336 662695 1286055 691088 18030 189739 835077 1360099 1761183 2014494 1774688 1122135
32326 1122135 683057 605271 316444 -259357 -204927 975921 2236944 2168030 819126
32317 819126 -513707 -1028197 -1064839 -1103384 -1000880 -487548 222800 720000 915516 906206
32307 906206 599737 -99954 -841631 -988637 -349214 495374 748411 206840 -539625 -652390
32297 -652390 206587 1555956 2495575 2479325 1655636 439633 -969178 -2366314 -3136019
32288 -3136019 -2695067 -1394659 -358363 -145982 -105185 561190 1565435 1939739 1388305
32279 1388305 616109 347029 519396 578004 259314 -98069 -5846 451000 532926 -255171
32269b55171j122867n00440K59034M37687N83658J312471J755466P46359r33134
32260B283063j341783l13687L54734j41870n51653k3026M70244J30732j90789
32251F75965K29857N17086r7978p41915n85089m51109j049602j224463Q611J186997
32241a531640N77761o13464j3869J717196J588774q54211k466571j085492J439949
32232a241567K084475N64089j009855j084978K2716R91427P48854n97881j632884
32223a155604j067920N15993J267395N66266k35674K5949O71888M70292l91749
32214F66836o61842J19758J032963J003835N1261q48821r61753o26411o47624
32205h71798r95243p82055K52118J103202R32466K72806j7975j36790n71340p80540
$$ plain form
32269 -255171 -1378038 -1878478 -1619444 -1181757 -598099 714372 2469838 3216197 2283063
32260 2283063 941280 627593 982327 840457 288804 265778 736022 866754 675965
32251 675965 905822 1422908 1324930 583015 -2074 -453183 -1502785 -2727248 -2718637 -1531640
32241 -1531640 -953879 -1567343 -1581212 135984 1724758 870547 -1596024 -2681516 -1241567
32232 -1241567 842908 1406997 397142 -687836 -665120 326307 1075161 477280 -1155604
32223 -1155604 -2223524 -1707531 -440136 126130 -109544 -83595 588293 1058585 666836
32214 666836 4994 124752 1157715 2161550 2212811 1363990 402237 -224174 -871798
32205 -871798 -1867041 -2649096 -2396978 -1293776 -361310 -88504 -106479 -243269 -814609 -1595149
32195a595149n5079Q86053P37393k61069o17161R5390P51237N47935q5319n67801
32185a63570p84257n00381M79866J411454J188138Q127q04183p44339n59223o47342
32175a115710n02490J6854L26675L35978O14686J044185P48089k78379r11225
32166B78663o36445j27150J90753N84103P59245k3932j136146q57442P98757J580646
32156A411052L59010j019252o30656O18266P06432l80956j129623r88386n31745
32147a585858P0187R79083J600612J143106k8603q25627q78727n52889o0354M31270
32137B92200M19545j64003m44748R7324N51141m5715r89974r12476R7151P78494
32127c21061O93519N08813N23434K95265k79274o84807o41745l19094K17010Q80102
$$ plain form
32195 -1595149 -1650228 -764175 -26782 -287851 -905012 -809622 -58385 489550 404231 -163570
32185 -163570 -947827 -1448208 -968342 443112 1631250 1639377 835194 90855 -468368 -1115710
32175 -1115710 -1618200 -1601346 -1274671 -938693 -324007 720178 1468267 1189888 278663
32166 278663 -357782 -484932 -294179 289924 1049169 1025237 -110909 -968351 -169594 1411052
32156 1411052 1770062 750810 120154 738420 1444852 1063896 -65727 -1054113 -1585858
32147 -1585858 -1515671 -536588 1064024 2207130 2178527 1352900 474173 -78716 -139070 292200
32137 292200 711745 547742 102994 200318 751459 705744 -284230 -1196706 -1099555 -321061
32127 -321061 372458 881271 1404705 1699970 1420696 735889 94144 -224950 -7940 872162
32117H72162J079274L41768o89534q61600j05329M83729K12721m04987n75663
32108C52541k47921O9846Q7381M9081L25156P33463N33187m81494j200365m46172
32098b25297J089227J456188K44408p46203k74552N24779K05241o47453o88711
32089I37627j86130k83198p70568n39361K52235L78180l10424p17858m27251j35772
32079a802520j26152J07132N49725M96062m3706j55132M20750Q02479M16435k13567
32069D51506m85924m66426k77238K18329P44144O02146k37586q75177o90021p6069
32059a092316L05651K75082q4066o21415q59433k84993Q14553J448514J095310
32050I96887K39924l58818l86323M7882N49946N78122K810n79676o17509l59343
$$ plain form
32117 872162 1951436 2293204 1603670 742070 636741 1120470 1333191 928204 352541
32108 352541 104620 174466 261847 310928 636084 1369547 1902734 1421240 220875 -225297
32098 -225297 863930 2320118 2564526 1818323 1543771 2068550 2273791 1626338 937627
32089 937627 751497 468299 -302269 -841630 -589395 -211215 -521639 -1239497 -1666748 -1802520
32079 -1802520 -1928672 -1821540 -1271815 -775753 -819459 -974591 -553841 248638 665073 451506
32069 451506 -34418 -500844 -778082 -559753 184391 786537 548951 -326226 -1016247 -1092316
32059 -1092316 -786665 -511583 -595649 -1217064 -2076497 -2361490 -1546937 -98423 996887
32050 996887 1236811 877993 491670 539552 1089498 1667620 1670430 1090754 473245 113902
32040A13902k08229J14483Q01473R70324j98817j721937j778318l24502Q52130
32031a379491P62510K46096J29939J03502k6251L39599J164360J187996j80060
32022B348200j623532j672986o66051J11566L12346M34914O04532N74483M31178
32013H54650L51552J05759m17012p03620l90288J0519p4529k85806M2610P48672
32003B42507J121472Q85239K10647p42385j560768j445126k52028P92655M16150
31994c31637r29542j549889o31790R29278J759293J364865K96737m85996m50315
31985b8996k7324p8941o03777n98510L27558J039559M70665n99255n82294N27462
31975a53853J166212N11483n54749r80198q21963n94871l74280p3563J80031M14111
$$ plain form
32040 113902 -94327 20156 821629 1791953 1593136 -128801 -1907119 -2231621 -1379491
32031 -1379491 -616981 -370885 -240946 -137444 -163695 175904 1340264 2528260 2348200
32022 2348200 724668 -948318 -1614369 -1502803 -1190457 -755543 -151011 423472 854650
32013 854650 1206202 1311961 894949 191329 -198959 -188440 -262969 -548775 -506165 242507
32003 242507 1363979 2249218 2459865 1717480 156712 -1288414 -1540442 -747787 -331637
31994 -331637 -1261179 -2811068 -3442858 -2513580 -754287 610578 907315 421319 -28996
31985 -28996 -56320 -135261 -739038 -1337548 -1009990 29569 500234 -99021 -681315 -153853
31975 -153853 1012359 1523842 969093 -11105 -833068 -1427939 -1802219 -1875782 -1695751 -1281640
31965a281640Q46194J170711O39764o11462j181740j72651J315878J466560J48560
$$ plain form
31965 -1281640 -435446 735265 1375029 763567 -418173 -590824 725054 2191614 2340174
$$ [...]
##END NTUPLES=NMR SPECTRUM
##END=
