##TITLE=31Pdec_33-2022
 CDCl3, 24 sc
 30.6.2022
##JCAMPDX= 6.0         $$ Bruker NMR JCAMP-DX V2.0
##DATA TYPE= NMR SPECTRUM
##DATA CLASS= NTUPLES
##ORIGIN= UXNMR, Bruker Analytische Messtechnik GmbH
##OWNER= root
$$ XWIN-NMR		Version 3.5
$$ Thu Jun 30 14:24:21 2022 Russian Standard Time (UT+4h)  she@DPX200
##.OBSERVE FREQUENCY= 81.013821
##.OBSERVE NUCLEUS= ^31P
##.ACQUISITION MODE= SIMULTANEOUS
##.ACQUISITION SCHEME= undefined
##.AVERAGES= 24
##.DIGITISER RES= 16
##SPECTROMETER/DATA SYSTEM= spect
##.PULSE SEQUENCE= zgpg30
##.SOLVENT NAME= CDCl3
##.SHIFT REFERENCE= (INTERNAL, CDCl3, 0, 248.564)
##AUDIT TRAIL= $$ (NUMBER, WHEN, WHO, WHERE, WHAT)
$$ ##TITLE= Audit trail, XWIN-NMR		Version 3.5
$$ ##JCAMPDX= 5.01
$$ ##ORIGIN= Bruker BioSpin GmbH
$$ ##OWNER= she
$$ F:/spectra/data/she/nmr/P31/1/pdata/1/auditp.txt
$$ ##AUDIT TRAIL=  $$ (NUMBER, WHEN, WHO, WHERE, WHAT)
(   1,<2022-06-30 14:22:57.45 +0400>,<she>,<DPX200>,
      <created by zg, POWCHK disabled, PULCHK disabled
       configuration hash MD5:
       00 E9 B6 7A A2 85 ED C7 34 08 36 98 17 FE 4E 26
       data hash MD5: 32K
       1B 1C 8D 79 22 E9 60 EF 99 D8 84 11 CE 13 F3 E8>)
(   2,<2022-06-30 14:23:00.20 +0400>,<she>,<DPX200>,
      <Start of raw data processing
       efp BC_mod = 2 LB = 1 FT_mod = 6 PKNL = 1 PHC0 = -10526.91 PHC1 = 1373.456 SI = 64K 
       data hash MD5: 64K
       0C 9B AC 8E 84 A9 45 9B B5 DB 91 DD 99 E9 78 29>)
(   3,<2022-06-30 14:23:40.10 +0400>,<she>,<DPX200>,
      <pk PHC0 = 518.5622 PHC1 = -1035.8 
       data hash MD5: 64K
       09 C5 C1 9F A4 8E B3 33 A2 BC 47 A0 C3 99 F4 78>)
$$ ##END=
$$ 
$$ hash MD5
$$ 28 65 2A 5A 56 4E F4 58 61 8A 93 B9 76 9D A0 75
##$RELAX= 
##$RELAX= 
##$RELAX= 
##$RELAX= 
##$RELAX= 
##$RELAX= 
##$RELAX= 
##$RELAX= 
$$ Bruker specific parameters
$$ --------------------------
##$DU= <F:/spectra>
##$EXPNO= 1
##$NAME= <P31>
##$PROCNO= 1
##$TYPE= <nmr>
##$USER= <she>
##$AMP= (0..31)
100 100 100 100 100 100 100 100 100 100 100 100 100 100 100 100 100 100 
100 100 100 100 100 100 100 100 100 100 100 100 100 100 
##$AQSEQ= 0
##$AQ_mod= 1
##$AUNM= <au_zg>
##$AUTOPOS= <>
##$BF1= 81.014009
##$BF2= 200.13
##$BF3= 200.13
##$BF4= 200.13
##$BF5= 200.13
##$BF6= 200.13
##$BF7= 200.13
##$BF8= 200.13
##$BYTORDA= 1
##$CFDGTYP= 0
##$CFRGTYP= 5
##$CHEMSTR= <none>
##$CNST= (0..31)
1 1 145 1 1 1 1 1 1 1 1 1 1 1 1 1 1 1 1 1 1 1 1 1 1 1 1 1 1 1 1 1 
##$CPDPRG= <waltz16>
##$CPDPRG1= <>
##$CPDPRG2= <waltz16>
##$CPDPRG3= <>
##$CPDPRG4= <mlev>
##$CPDPRG5= <mlev>
##$CPDPRG6= <mlev>
##$CPDPRG7= <mlev>
##$CPDPRG8= <mlev>
##$CPDPRGB= <>
##$CPDPRGT= <>
##$D= (0..31)
0 1 0 0 0 0 0 0 0 0 0 0.03 2e-05 3e-06 0 0 0 0 0 0 0 0 0 0 0 0 0 0 0 0 
0 0 
##$DATE= 1656584576
##$DBL= (0..7)
120 120 120 11 120 120 24 19 
##$DBP= (0..7)
150 150 150 150 150 150 150 150 
##$DBP07= 0
##$DBPNAM0= <>
##$DBPNAM1= <>
##$DBPNAM2= <>
##$DBPNAM3= <>
##$DBPNAM4= <>
##$DBPNAM5= <>
##$DBPNAM6= <>
##$DBPNAM7= <>
##$DBPOAL= (0..7)
0.5 0.5 0.5 0.5 0.5 0.5 0.5 0.5 
##$DBPOFFS= (0..7)
$$ [...]
##$SUBNAM2= <"">
##$SUBNAM3= <"">
##$SUBNAM4= <"">
##$SUBNAM5= <"">
##$SUBNAM6= <"">
##$SUBNAM7= <"">
##$SUBNAM8= <"">
##$SUBNAM9= <"">
##$SW= 501.771253377433
##$SWIBOX= (0..15)
0 1 3 0 0 0 0 0 0 0 0 0 0 0 0 0 
##$SW_h= 40650.406504065
##$TD= 32768
##$TD0= 1
##$TE= 0
##$TE2= 300
##$TE3= 300
##$TEG= 300
##$TL= (0..7)
0 120 53 12 22 120 120 120 
##$TP= (0..7)
150 150 150 150 150 150 150 150 
##$TP07= 0
##$TPNAME0= <>
##$TPNAME1= <>
##$TPNAME2= <>
##$TPNAME3= <>
##$TPNAME4= <>
##$TPNAME5= <>
##$TPNAME6= <>
##$TPNAME7= <>
##$TPOAL= (0..7)
0.5 0.5 0.5 0.5 0.5 0.5 0.5 0.5 
##$TPOFFS= (0..7)
0 0 0 0 0 0 0 0 
##$TUNHIN= 0
##$TUNHOUT= 0
##$TUNXOUT= 0
##$USERA1= <user>
##$USERA2= <user>
##$USERA3= <user>
##$USERA4= <user>
##$USERA5= <user>
##$V9= 5
##$VALIST= <valist>
##$VCLIST= <CCCCCCCCCCCCCCC>
##$VD= 0
##$VDLIST= <DDDDDDDDDDDDDDD>
##$VPLIST= <PPPPPPPPPPPPPPP>
##$VTLIST= <TTTTTTTTTTTTTTT>
##$WBST= 1024
##$WBSW= 4
##$XGAIN= (0..3)
0 0 0 0 
##$XL= 0
##$YL= 0
##$YMAX_a= 2929
##$YMIN_a= -3215
##$ZGOPTNS= <>
##$ZL1= 120
##$ZL2= 120
##$ZL3= 120
##$ZL4= 120
##$ABSF1= 0
##$ABSF2= 0
##$ABSG= 0
##$ABSL= 0
##$ALPHA= 0
##$AQORDER= 0
##$ASSFAC= 0
##$ASSFACI= 0
##$ASSFACX= 0
##$ASSWID= 0
##$AUNMP= <proc_1d>
##$AZFE= 0.1
##$AZFW= 0.5
##$BCFW= 0
##$BC_mod= 2
##$BYTORDP= 0
##$COROFFS= 0
##$CY= -3
##$DATMOD= 1
##$DC= 0
##$DFILT= <>
##$DTYPP= 0
##$F1P= 0
##$F2P= 0
##$FCOR= 1
##$FTSIZE= 65536
##$FT_mod= 6
##$GAMMA= 0
##$GB= 0
##$INTBC= 1
##$INTSCL= 5.30512e-09
##$ISEN= 30
##$LB= 1
##$LEV0= 0
##$LPBIN= 0
##$MAXI= 10000
##$MC2= 0
##$MEAN= 0
##$ME_mod= 0
##$MI= 50
##$NCOEF= 0
##$NC_proc= -5
##$NLEV= 6
##$NOISF1= 182.463
##$NOISF2= 159.3651
##$NSP= 0
##$NTH_PI= 0
##$NZP= 0
##$OFFSET= 248.5645
##$PC= 4
##$PHC0= -10008.35
##$PHC1= 337.656
##$PH_mod= 1
##$PKNL= yes
##$PPARMOD= 0
##$PSCAL= 0
##$PSIGN= 0
##$REVERSE= no
##$SF= 81.014009
##$SI= 65536
##$SIGF1= 159.3651
##$SIGF2= -187.1042
##$SINO= 113.3802
##$SIOLD= 16384
##$SREGLST= <1H.CDCl3>
##$SSB= 0
##$STSI= 65536
##$STSR= 0
##$SW_p= 40650.406504065
##$SYMM= 0
##$S_DEV= 0
##$TDeff= 32768
##$TDoff= 0
##$TI= <>
##$TILT= no
##$TM1= 0
##$TM2= 0
##$TOPLEV= 0
##$USERP1= <user>
##$USERP2= <user>
##$USERP3= <user>
##$USERP4= <user>
##$USERP5= <user>
##$WDW= 1
##$XDIM= 65536
##$YMAX_p= 320129830
##$YMIN_p= -2890227
$$ End of Bruker specific parameters
$$ ---------------------------------
##NTUPLES= NMR SPECTRUM
##VAR_NAME=  FREQUENCY,     SPECTRUM/REAL,   SPECTRUM/IMAG
##SYMBOL=    X,             R,               I
##VAR_TYPE=  INDEPENDENT,   DEPENDENT,       DEPENDENT
##VAR_FORM=  AFFN,          ASDF,            ASDF
##VAR_DIM=   65536,         65536,           65536
##UNITS=     HZ,            ARBITRARY UNITS, ARBITRARY UNITS
##FACTOR=    0.620285442955139, 1,           1
##FIRST=     20137.2065510759, 0,            0
##LAST=      -20513.1999529892, 0,           0
##MIN=       -20513.1999529892, -2890227,    0
##MAX=       20137.2065510759, 320129830,    0
$$ Real data points
##PAGE= N=1
##DATA TABLE= (X++(R..R)), XYDATA
$$ [...]
40475A046833k42908r38487q46939r9210N66123N06194j45932m80149J09907R27484
$$ 1046833 803925 -134562 -981501 -1080711 -514588 -8394 -154326 -634475 -524568 402916
40465D02916P65081k96367q63435k72451M48131K38864m35868n57519j66181M6058
$$ 402916 1167997 871630 8195 -264256 183875 422739 -13129 -570648 -736829 -690771
40455f90771M3204K03055K95877r8220n13129j70302N70323N94531j50418n05733
$$ -690771 -647567 -444512 -148635 -246855 -759984 -930286 -359963 234568 84150 -421583
40445d21583K8758N29868K30024k67323r4829M19705L20066m45911r57972o22457
$$ -421583 -392825 137043 367067 99744 4915 424620 744686 298775 -659197 -1281654
40435a281654J73408P00393O48207K02769k19488k33731J94223N95349M16073
$$ -1281654 -1108246 -407853 240354 443123 223635 -10096 184127 779476 1195549
40426A195549l08130r00712p76762o5604O04203P69417M28878j36474n54472m66868
$$ 1195549 887419 -13293 -790055 -855659 -251456 517961 946839 810365 255893 -210975
40416b10975J67127P96196O97944j09015p38761n54066m7971r7015o12275o70443
$$ -210975 -43848 752348 1450292 1341277 602516 48450 479 -96536 -708811 -1379254
40406a379254L0598O65171N21250K1289m3396K46479K03375k27747l29907J90147
$$ -1379254 -1348656 -683485 -162235 -140946 -184342 62137 265512 37765 -292142 -101995
40396a01995O08854K11268n80578p34947j04607L26173r4512o52139l19663N94236
$$ -101995 506859 718127 137549 -597398 -702005 -375832 -470344 -1122483 -1442146 -847910
40386h47910Q00969L266n71898l5535P74523N88493l71619q26855l52107K72811
$$ -847910 -46941 -43675 -615573 -651108 123415 711908 340289 -486566 -838673 -565862
40376e65862M22393K44841k4590l21484l03278L10967Q83011M39519p25544j187892
$$ -565862 -143469 101372 76782 -244702 -547980 -237013 645998 1085517 359973 -827919
40366h27919m17221N13724O45376L43257K33250J35904j79647k75051P2862K55779
$$ -827919 -1245140 -731416 -86040 257217 490467 626371 446724 171673 244535 500314
40356E00314m9984j59172L18229N26559j73162q44749m17125M47841M53937j28063
$$ 500314 450330 291158 609387 1135946 962784 118035 -299090 148751 602688 474625
40346D74625o5134N53119M79044m12922q25075j77048N74069N87065J83207j54258
$$ 474625 409491 962610 1441654 1028732 203657 26609 600678 1187743 1370950 1216692
40336A216692n20146q64524p07647q2610K60254L8490j34954J07727L15676J94807
$$ 1216692 696546 -167978 -875625 -958235 -697981 -659491 -794445 -686718 -371042 -176235
40326a76235J48717L72039L83081j1265k21013R1405L71008J47340k09411k96192
$$ -176235 -27518 344521 727602 716337 495324 586729 957737 1105077 895666 599474
40316E99474l62417n52852l76845L05066O39311K0846p86807p45154r4080K26515
$$ 599474 237057 -315795 -692640 -387574 251737 272583 -514224 -1259378 -1353458 -1126943
40306a126943J42296K80217O15854M97148r1218m09221j82587L9019q4506j75980
$$ -1126943 -984647 -704430 -88576 408572 317354 -91867 -274454 -235435 -319941 -495921
40296d95921N8380K87478J79403n0616j09399j32259k90568l14110P6622N21387
$$ -495921 -437541 -150063 29340 -21276 -130675 -262934 -553502 -867612 -790990 -269603
40286b69603L89403k31541m90428N6528P07790N23385l11407o98755j97476L95940
$$ -269603 119800 -111741 -602169 -545641 162149 685534 374127 -324628 -522104 -126164
40276a26164L38502J7642R5025K75673q8813o25346l79713M89379P40305k7560
$$ -126164 212338 229980 325005 600678 511865 -113481 -493194 -3815 736490 708930
40266G08930p16303m45997K10419L54024J04124J0404j7762k78518m48873j28557
$$ 708930 -7373 -453370 -242951 111073 215197 225601 207839 -70679 -519552 -648109
40256f48109L02217K58479o5501j46852j17841l77618o23272k82700L53633M68568
$$ -648109 -345892 -87413 -152914 -299766 -417607 -795225 -1418497 -1701197 -1347564 -878996
40246h78996M6029j46155J47649L86094K93326K43174M19708M72958K34644n740
$$ -878996 -832967 -979122 -831473 -445379 -152053 91121 510829 983787 1218431 1212691
40236A212691j46206m31178p61506o39249p4251K41990J2696j86394P4990L54167
$$ 1212691 1066485 635307 -126199 -765448 -839699 -597709 -585013 -771407 -696417 -342250
40226c42250J76182j02297M1448L35755K03185j90047k04439J64232K75474p4024
$$ -342250 -166068 -268365 -226917 108838 312023 121976 -82463 81769 357243 283219
40216B83219l30690j12703K01407J31624j58212j96151L6142J49446K4334l2273
$$ 283219 -47471 -160174 41233 172857 14645 -181506 -145364 4082 28416 -3857
40206c857J31524K01890p9678l90276k14944L61293O93686M53508L0079j14685
$$ -3857 127667 329557 249879 -140397 -355341 5952 699638 1153146 1183225 1068540
40196A068540p4706j64859l05230j92234J01313J72711r8317l84161l88092j74354
$$ 1068540 993834 828975 523745 331511 432824 605535 507218 123057 -265035 -439389
40186d39389J5527K9277j12618j98501K5006M61079N87507R9221n46812o52926
$$ -439389 -423862 -394585 -507203 -705704 -680698 -219619 367888 467109 -79703 -732629
40176g32629k15938J52721J57554R1150J55944J37016p9042k18259r0217J33742
$$ -732629 -948567 -795846 -638292 -547142 -391198 -254182 -333224 -551483 -641700 -507958
40166e07958L19779N40650O30391J79609o62410j003126l66905M89882N83744
$$ -507958 -188179 352471 982862 1162471 500061 -503065 -869970 -380088 203656
40157B03656Q4747r9852J84896K24422k19383m37733L3611N87295M62556j08392
$$ 203656 288403 188551 373447 597869 378486 -59247 -25636 561659 1024215 915823
40147I15823l50562j74687j88221n64512o76316j07195N81203N88986M2100j93341
$$ 915823 565261 390574 202353 -362159 -1038475 -1145670 -564467 24519 66619 -126722
40137a26722K07782N78294L14457j93187k02162J84970J97326l07498n41770m6562
$$ -126722 81060 659354 973811 780624 578462 763432 960758 653260 111490 64928
40127F4928N01932L11198k76115l36338J55569L24886j50364n36823k76291J44037
$$ 64928 566860 878058 601943 265605 421174 746060 595696 58873 -217418 -73381
40117g3381Q8191j65004R899M41247M44775R719j94322K2549Q5927k77553n19246
$$ -73381 14810 -150194 -140295 300952 745727 755446 561124 583673 669600 392047 -127199
40106a27199k07806K14066J54102j94495k60853l0385R7251R8714K57956M46836
$$ -127199 -335005 -120939 33163 -161332 -422185 -452570 -355319 -256605 1351 448187
40096D48187K16960l51911n87633j99063K70984K43564j19451k70343n4456K24104
$$ 448187 665147 313236 -274397 -473460 -202476 41088 -78363 -348706 -403162 -179058
40086a79058L04695K21403J33872J07035M6246j73995m48323m18568N9430N44445
$$ -179058 125637 347040 480912 587947 634193 460198 11875 -406693 -347263 197182
40076A97182M67055q4196m47299k67584J55869M46085N44957M06168j20309q03596
$$ 197182 664237 580041 132742 -134842 21027 467112 1012069 1418237 1297928 494332
40066D94332r66748l28648M80394O66310K31368j93231j92340J35134M83328N82374
$$ 494332 -472416 -801064 -320670 345640 577008 383777 191437 326571 809899 1392273
40056A392273L17489j12305l38994l03265k92410l62099j91248K29251L26594
$$ 1392273 1709762 1597457 1258463 955198 662788 300689 109441 338692 665286
40047F65286j89931p07380n17161J65046N82179M89796K13973l5288k56694k93840
$$ 665286 475355 -232025 -749186 -584140 -1961 487835 701808 666520 409826 115986
40037A15986j8048K83342K59722N4095l980J0976j03145j35909J46831L92522
$$ 115986 97938 381280 641002 695097 691117 702093 598948 463039 609870 1002392
40027A002392J60438k67388l34927j57884j83304k40249R1157M58460K11193l05907
$$ 1002392 1162830 895442 560515 402631 219327 -20922 70235 528695 739888 433981
40017D33981j91381L62550K58391n52445q10521l5680O27433L11833k38572j28668
$$ 433981 242600 605150 863541 311096 -499425 -535105 92328 404161 165589 36921
40007C6921J87120k2032k90002J43845P82005N99381k07833n49792k04722L0435
$$ 36921 224041 202009 -87993 55852 837857 1437238 1229405 679613 474891 505326
39997E05326j83186l17054r6360O9046j8934L2507L75019M96645M0203n33264
$$ 505326 322140 5086 -91274 -22228 -41162 -8655 366364 863009 903212 369948
39987C69948n32515N1949N65627M52853j86854p16716n91444O3446N71280M77346
$$ 369948 -162567 -110618 455009 907862 721008 4292 -587152 -523706 47574 524920
39977E24920K8284k36682j26600J53968L45076L00453M0110j96991j98905j53086
$$ 524920 553204 316522 189922 343890 688966 989419 1029529 832538 633633 480547
39967D80547l80228o38056l00831N53187R61039M12203l41318l96936L5703J93475
$$ 480547 100319 -537737 -838568 -285381 675658 1087861 746543 349607 385310 578785
39957E78785j2591j52325j73703k66973k21910J83895M92958J93874k64104q6223
$$ 578785 566194 413869 240166 -26807 -248717 -64822 428136 622010 357906 271683
39947B71683M75242M41919k82874p76285o12245l54325l31642q7003N35062Q15327
$$ 271683 746925 1188844 905970 129685 -482560 -836885 -1168527 -1255530 -720468 94859
39937I4859K93715l67206l33668K18936N30630L66187P2321j10881k06765j84406
$$ 94859 388574 21368 -312300 -93364 437266 803453 875774 764893 558128 373722
39927C73722K7870L01517L96870K32384q3243l68798m64633l78658l21526l90175
$$ 373722 401592 703109 1099979 1332363 1249120 880322 415689 37031 -284495 -674670
39917f74670l42960n369K95582J72524j26148n6660L12024M24851K09356J25271
$$ -674670 -1017630 -1022999 -727417 -554893 -681041 -737701 -425677 -826 208530 333801
39907C33801K14959j6774n86211p81893k75719L25694M46088K92081J98019m940
$$ 333801 548760 531986 -54225 -836118 -1111837 -786143 -340055 -47974 150045 145105
39897A45105m06445n23468n4260M63607M18025K9904j54179j57756k44793j78773
$$ 145105 -261340 -784808 -839068 -375461 42564 72468 -81711 -239467 -484260 -663033
39887f63033L50099Q88041O85301j37649o85545n21174j03817L7444n6276p2181
$$ -663033 -312934 575107 1260408 1122759 437214 -83960 -187777 -150333 -206609 -278790
39877b78790J19630M23291N96401L77665j62649n15529l30429N2480J04815m8070
$$ -278790 -159160 264131 860532 1238197 1075548 560019 229590 282070 386885 338815
39867C38815J31923O05737O94373J25150m96141n46721k09314n3321j83329k68780
$$ 338815 470738 1076475 1770848 1895998 1399857 853136 643822 590501 407172 138392
39857A38392j92689j60404k01752o3047K52527K75683k46637p63861n35605K68742
$$ 138392 -54297 -214701 -416453 -479500 -226973 48710 -197927 -961788 -1497393 -1228651
39847a228651O95184L38942j12170j5355K22876p0723n93160n12425J23333M38246
$$ -1228651 -533467 -194525 -306695 -322050 -99174 -169897 -763057 -1275482 -1152149 -713903
39837g13903J64284r039K78818M31867l176m87371l54241J41832K97973N050k86709
$$ -713903 -549619 -558658 -279840 152027 148851 -338520 -692761 -550929 -252956 -247906 -534615
39826e34615k81827m800M21347P15563M96154j76268o45836m53431N2988K72798
$$ -534615 -816442 -821242 -399895 315668 811822 635554 -10282 -463713 -410725 -137927
39816a37927J47923J0609K429N3535J20667R8904j62699m76680l84898R9447L40976
$$ -137927 9996 20605 23034 76569 197236 296140 133441 -343239 -728137 -628690 -287714
39805b87714K2272l35322k11265J32525J89822j8564j94031k46770j11113L11353
$$ -287714 -265442 -600764 -812029 -679504 -489682 -508246 -702277 -949047 -1060160 -748807
39795g48807O41339K42313o01032p05282J83872P20194K4501p69440l07315P39159
$$ -748807 -107468 134845 -466187 -1171469 -987597 -267403 -242902 -1012342 -1319657 -580498
39785e80498Q23660P3690j50663K94399K96946k96431m04490K13400M69289q8589
$$ -580498 243162 316852 166189 460588 757534 461103 56613 270013 739302 650713
39775F50713n26587k63971N733k33889l89350j2391K98296L8797k87854j71770
$$ 650713 124126 -139845 -134112 -368001 -757351 -769742 -471446 -432649 -720503 -892273
39765h92273L0860l0361L6793M60330O24324J20629l93722k30930K21891K57337
$$ -892273 -861413 -891774 -854981 -394651 229673 350302 -43420 -274350 -52459 204878
39755B04878j5408j01480k6168k9829K1281J92771R2361l64862m91970R8161O56298
$$ 204878 189470 87990 61822 31993 53274 246045 338406 -26456 -518426 -420265 236033
39744B36033L86432k88356m71496j92578o1704o0127K34651O01881M64372r606
$$ 236033 622465 334109 -137387 -329965 -391669 -451796 -217145 384736 849108 839502
39734H39502j47284L2558r6170n37013n72044k0596L64060N6850m59781m68332
$$ 839502 692218 724776 628606 91593 -480451 -501047 -136987 -80137 -539918 -1008250
39724a008250N144L91665L86930J88185R6714J51492J63644L1637p8092N719J18598
$$ -1008250 -1003106 -611441 -224511 -36326 60388 211880 375524 407161 329069 334788 453386
39713D53386j360j94897q8798J54329m6687o30264p21234M0747P60303N34740
$$ 453386 452026 257129 168331 322660 275973 -354291 -1075525 -1034778 -274475 260265
39703B60265k03086m08033K350K23713n8803l08986j19372K48202M03310L06719
$$ 260265 57179 -350854 -348504 -124791 -183594 -492580 -611952 -363750 39560 346279
39693C46279J06050o3949q1470K0104j3177k64253l81444q2611L10701K92639
$$ 346279 452329 388380 306910 327014 313837 49584 -331860 -414471 -103770 188869
39683A88869p2132k76570r7814K29070M13275L18805l0202l29395j61663L85225
$$ 188869 116737 -159833 -257647 -28577 384698 703503 673301 343906 182243 567468
39673E67468O44860K95255j12349l1904J96405r271m34965m71030j84599j34552
$$ 567468 1212328 1507583 1395234 1363330 1559735 1550464 1115499 644469 459870 325318
39663C25318l40745k88674J36413M89052M92780K71864n5532l99035m65450j36199
$$ 325318 -15427 -304101 -167688 321364 814144 1086008 1030476 631441 165991 29792
39653B9792J29279o7535k92784O9277O60898N88730j09726m50154j5980M73073
$$ 29792 159071 91536 -201248 -131971 528927 1117657 1007931 557777 541797 1014870
39643A014870L26554k06552m87504l06559J01771L74578K32074k11878m14129
$$ 1014870 1341424 1134872 647368 340809 442580 817158 1049232 837354 423225
39634D23225j23726J11847k29606o63922l89906L31917N20964M9431k42828J835
$$ 423225 299499 411346 181740 -482182 -872088 -540171 -19207 30224 -212604 -210769
39624b10769K41101J72629J38407J89811r3046n71887n18636L6541J56627l36691
$$ -210769 30332 202961 341368 531179 438133 -133754 -652390 -615849 -459222 -795913
39614g95913l58470N80146J297932P11439m26841p22881k04525P3347j42231j96971
$$ -795913 -1154383 -574237 723695 1435134 1008293 285412 80887 154234 12003 -184968
39604a84968P2487J08368k26908l51745L6542M83867N06752K00591o1282j12118
$$ -184968 -112481 -4113 -231021 -582766 -546224 -62357 444395 644986 583704 471586
39594D71586m5933m8660j89954k51165M8684N15336N46326N319m32692k36808
$$ 471586 425653 376993 187039 -64126 -15442 499894 1046220 1051539 618847 382039
39584C82039J45502J61m95332n65027p9896K83232J40190q4467N1154L10765K46372
$$ 382039 527541 527702 32370 -532657 -612553 -329321 -189131 -273598 -222444 88321 334693
39573C34693m3164p5400K39410M15885R2797l84942l80251J34459M78200J86537
$$ 334693 291529 216129 455539 871424 964221 579279 199028 333487 811687 998224
39563I98224l55637n09419k59899m9111j1853N5608J46760Q6404N038J20737J58679
$$ 998224 642587 133168 -126731 -175842 -187695 -132087 14673 101077 106115 226852 385531
39552C85531k62039p45437n26455K02889M07489j33785m04709J52780O45148J85825
$$ 385531 123492 -621945 -1148400 -945511 -538022 -671807 -1076516 -923736 -278588 -92763
39542i2763o24888o49977P1594N93529N41839L05867Q5837k51087n18971l26037
$$ -92763 -717651 -1367628 -1296034 -702505 -160666 145201 231038 -20049 -539020 -865057
39532h65057J73438L85358J50411j06414r2722M1122J01397Q0258M803o4775R884
$$ -865057 -691619 -306261 -155850 -262264 -354986 -313864 -212467 -132209 -127406 -192181 -182297
39521a82297J72816R7432k61171l94912P098M37968L01280j26572j80984P9360
$$ -182297 -9481 87951 -173220 -568132 -561034 -123066 178214 51642 -129342 -49982
39511d9982Q6359j39414l9071L97056N37390J95106r5651p1990j15424l35943
$$ -49982 36377 -103037 -142108 254948 792338 987444 891793 819803 704379 368436
39501C68436j90463M80599Q53917K72576o21806p41776j45821J38978k52485n38300
$$ 368436 177973 658572 1512489 1785065 1163259 421483 275662 414640 162155 -376145
39491c76145j42164L51966J66901l64862k87780M36190P95073K76217l31695j85765
$$ -376145 -518309 -166343 558 -364304 -652084 -215894 579179 855396 523701 337936
39481C37936K91116J53311m65382n36488J52754N62814k778p94274p05863J84245
$$ 337936 629052 782363 316981 -219507 -66753 496061 493283 -300991 -1006854 -822609
39471h22609Q55353P28670J47715l11039m16393k37572J5340Q8237q7860k78590
$$ -822609 32744 761414 909129 598090 181697 -55875 -40535 47702 -40158 -318748
39461c18748k35288k672K15146L38677L87251L16675O7324k89994n38947m29644
$$ -318748 -554036 -556708 -341562 -2885 384366 701041 768365 478371 -60576 -490220
39451d90220P9240N76679M71399k02607o10653k26015L08245J50151l39596k11035
$$ -490220 -410980 165699 637098 434491 -176162 -402177 -93932 56219 -283377 -494412
39441d94412L53762K75839m70198o56813J05656O26293J40709m26513j39323L75691
$$ -494412 -140650 135189 -335009 -991822 -886166 -259873 -119164 -545677 -685000 -309309
39431c09309J91019k74647j75526J91761J00308j79412m4723J31526k07012m46941
$$ -309309 -118290 -392937 -568463 -376702 -276394 -455806 -500529 -369003 -576015 -1022956
39421a022956J95573R76929O35503l88289n54811K38086N99666O4924l33370r7857
$$ -1022956 -827383 149546 785049 396760 -158051 80035 679701 744625 411255 313398
39411C13398j1257m05600m20218L45713R48643O30606n4245l79286n20897p44267
$$ 313398 302141 -103459 -523677 -177964 770679 1401285 1347040 967754 446857 -297410
39401b97410o40950j5120M44665K30681q2752J72087O08812M71051j21605m22242
$$ -297410 -938360 -953480 -508815 -278134 -360886 -188799 420013 891064 769459 347217
39391C47217j62599K42086L25918j8209m98180n84216p4702M63923L66585q2761
$$ 347217 184618 426704 752622 734413 236233 -347983 -422685 41238 407823 325062
39381C25062o0892L73928L14252l94719p66141k83536K63234J44324j93260r5805
$$ 325062 264170 638098 952350 557631 -208510 -492046 -228812 -84488 -277748 -373553
39371c73553J95715K19154J88600L74525L75554j24670n83825m54599j55103l01139
$$ -373553 -177838 41316 229916 604441 979995 855325 271500 -183099 -338202 -639341
39361f39341n78101l10438L40264O56056M51518Q4323k23979l50873k9713O07214
$$ -639341 -1217442 -1527880 -1187616 -531560 -80042 4281 -219698 -570571 -600284 6930
39351F930P60201M1988p08978n66931Q3032K69836J8471M6951K97436Q4649m61792
$$ 6930 767131 809119 100141 -466790 -383758 -113922 -95451 -48500 248936 333585 -128207
39340a28207m48381K10864N37395P3443m16694k47903J82229K28502J3376p045
$$ -128207 -576588 -365724 171671 245114 -171580 -419483 -237254 -8752 4624 -2421
39330b421J24635Q7644p9873j09623J426N9988M2111M4241L2692o5615j46493
$$ -2421 122214 209858 129985 20362 21788 81776 123887 168128 200820 135205 -11288
39319a1288n5828J33584J74802k1437k27236j34412K42405M83235K45856j98530
$$ -11288 -67116 66468 241270 219833 -7403 -141815 100590 583825 829681 631151
39309F31151k22595K53383N08331p653p88503q63669j11507N83574N25016L3943
$$ 631151 408556 661939 1170270 1162617 374114 -489555 -601062 -17488 507528 541471
39299E41471j39753J41945L21630q350n23727n87498j01541L43972K56821j09368
$$ 541471 401718 543663 865293 856943 333216 -254282 -355823 -11851 244970 135602
39289A35602j77752J07931L10447K53928J87047J70767n8512m36130m41302L8245
$$ 135602 -42150 65781 376228 630156 817203 987970 929458 493328 52026 90271
39279I0271L41164P557m45236l15328J89495L46897O8198j03530L9163J52726
$$ 90271 431435 438992 -6244 -321572 -132077 214820 283018 179488 218651 371377
39269C71377O1290P81O4882J0487k21356k87819L7024M83757O21500L31991j47710
$$ 371377 432667 433448 498330 508817 287461 -358 36666 520423 1141923 1473914 1326204
39258A326204m42080k76517K42649N72042K52135m48966p11916j39940O77537
$$ 1326204 884124 607607 850256 1422298 1674433 1225467 513551 373611 1051148
39249A051148Q06295P1363p35460q17283l19472m7900l21039n55789k04833L74464
$$ 1051148 1857443 1928806 1193346 376063 56591 8691 -312348 -868137 -1072970 -698506
39239f98506M96587K32837J88812L71153J69934m44268o52851p7716N23809M00036
$$ -698506 -201919 30918 219730 590883 760817 316549 -336302 -414018 109791 509827
39229E09827r2217j88159Q8768J79048k0544j88229k84482m80327n85764k57772
$$ 509827 417610 229451 318219 497267 476723 288494 4012 -476315 -1062079 -1319851
39219a319851L19896N79002L48396M192r9467N1566K71539L00643j7872m03888
$$ -1319851 -999955 -420953 -72557 -68365 -167832 -116266 155273 455916 438044 34156
39209C4156l12899K41202N04958P3233l85302j24156M69916M69205j63157o16579
$$ 34156 -278743 -37541 467417 540650 155348 31192 501108 970313 807156 190577
39199A90577m91808j49440Q7334K47766K65245j2238l37520k63325J65186M97768
$$ 190577 -301231 -450671 -363337 -115571 149674 137436 -200084 -463409 -298223 199545
39189A99545N57478M43396Q0080n22923q14439l54501K88805K44446k44197k05094
$$ 199545 757023 1200419 1280499 757576 -56863 -411364 -122559 121887 -122310 -327404
39179c27404L56733M26446k07449m79198J63436P85224M80796k54697n22857m32169
$$ -327404 29329 455775 248326 -230872 -67436 717788 1198584 943887 421030 -11139
39169a1139n34339o21495j73191M98880O24811K26721K9523K53017L78433J21685
$$ -11139 -545478 -1166973 -1340164 -841284 -216473 10248 39771 292788 671221 792906
39159G92906j55477j45916o4654j90219l99431l99362j36215K10087M64801N67924
$$ 792906 637429 491513 426859 236640 -162791 -562153 -698368 -488281 -23480 544444
39149E44444N28461L38786k6392m54099o27207l61626K6675N0392k22204k27674
$$ 544444 1072905 1411691 1385299 931200 303993 -57633 -30958 19434 -202770 -430444
39139d30444J76340M13620J18329k14129k9371L22289J45819l77057l84854K64572
$$ -430444 -254104 159516 277845 63716 34345 356634 502453 125396 -259458 5114
39129E114O53755J47082o39135p11714o9911M15226K68308r0118j55156o0294
$$ 5114 658869 805951 166816 -544898 -614809 -199583 68725 -21393 -176549 -236843
39119b36843j76059l83825k39142K55156N33159K50015j95221j81894L12334P05959
$$ -236843 -412902 -796727 -1035869 -780713 -247554 2461 -192760 -374654 -62320 643639
39109F43639N32940p5754n92934n96239j04126M44634N91920L36353R9565J27291
$$ 643639 1176579 1100825 507891 -88348 -192474 252160 844080 1180433 1279998 1407289
39099A407289J42388j93338o83163p92210l55353K17745M33123J86841k14732
$$ 1407289 1549677 1356339 673176 -119034 -474387 -256642 176481 363322 148590
39090A48590l31424K4644N13568N38618p578m95619l45911J80884L70432L4659
$$ 148590 -182834 -158190 355378 893996 886418 390799 44888 225772 596204 630863
39080F30863l53370l85674j10450K42110M67077L47981j36395n67795m75847K6945
$$ 630863 277493 -108181 -218631 23479 490556 838537 702142 134347 -341500 -314555
39070c14555L96643M03644K84336J90918K963k69006l78063k33234n169J82195
$$ -314555 82088 485732 770068 960986 963949 694943 316880 83646 78477 260672
39060B60672K87462J60062k26052m70567k37848R1497o1977m48088l25067K33761
$$ 260672 548134 708196 482144 11577 -226271 -134774 -196751 -644839 -969906 -736145
39050g36145L96874M7305L1150N72074O78043j69940r00524m41322N26715O50692
$$ -736145 -339271 -291966 -260816 311258 989301 819361 -81163 -522485 4230 654922
39040F54922N2115l5012N68760O98172j69063j006950q12504l0074K70273p6110
$$ 654922 707037 672025 1240785 1938957 1769894 762944 -49560 -79634 190639 114529
39030A14529l49121j11831L06796M13263J78922j9194R0128L09866J91557l34592
$$ 114529 -234592 -346423 -39627 373636 552558 533364 623492 933358 1124915 790323
39020G90323p34277n10833J00056M41012L18785J16819O4738l6607k38772j88485
$$ 790323 56046 -454787 -354731 86281 405066 521885 586623 550016 311244 122759
39010A22759K34680N31450K88033j25687j14769J64807N7859m58975o49090j85226
$$ 122759 357439 888889 1176922 1051235 936466 1101273 1159132 700157 51067 -134159
39000a34159K75316J15178k41387j8598N99790O90326M4652m76968k71296J46526
$$ -134159 141157 256335 14948 -3650 596140 1286466 1331118 854150 582854 729380
38990G29380Q6391k13808j48605Q8929j88231q72584j020478k37017O96937R02336
$$ 729380 815771 601963 453358 542287 354056 -518528 -1539006 -1776023 -1079086 -176750
38980a76750M79132J09625P9701J56172J14289n3183k69776l83083j95125K43452
$$ -176750 302382 412007 491708 647880 762169 708986 439210 56127 -138998 104454
38970A04454N31374L58480j01874m52086n34620m17573j40491K25180M26154K69344
$$ 104454 635828 994308 892434 440348 -94272 -511845 -652336 -427156 -1002 268342
38960B68342n4706j66490K3041K53047K84877J16111j41774l80955m73183k97462
$$ 268342 213636 47146 70187 323234 608111 724222 582448 201493 -271690 -569152
38950e69152J33842O10248Q00153M68178k36628p51131o09519k5150L21747J47968
$$ -569152 -435310 174938 975091 1443269 1206641 455510 -154009 -179159 142588 290556
38940B90556j43542j83655j76106l65788m27004K4392N95390N31408q2776l16567
$$ 290556 147014 -36641 -212747 -578535 -1005539 -981147 -385757 145651 62875 -253692
38930b53692K18752P18847L69809m17429o13613n5570M30027K98452n9000q5388
$$ -253692 -34940 683907 1053716 636287 22674 -32896 397131 695583 636583 551195
38920E51195J53408K68751J50889j03381m63196p51113n36784K35752Q24037N26109
$$ 551195 704603 973354 1124243 1020862 557666 -193447 -730231 -494479 329558 855667
38910H55667k51004m78379K0050L94550J57431j53017l3351J30905j32317m45453
$$ 855667 604663 126284 146334 540884 698315 545298 511947 642852 510535 65082
38900F5082k19628K78264L28793q5459l38858j90321J1915M3899J0939p4401k29413
$$ 65082 -154546 123718 452511 367052 28194 -162127 -150212 -106313 -95374 -169775 -399188
38889c99188j30383M41621Q96331M68515m48327o25454J43006N97687p5820r27837
$$ -399188 -529571 -87950 808381 1276896 828569 203115 346121 943808 867988 -59849
38879e9849o59836M15122Q58527J56754p45684r01463m46663l5808J08468J90760
$$ -59849 -719685 -304563 553964 710718 -34966 -936429 -1383092 -1418900 -1310432 -1119672
38869a119672K91035K53932L7377j34510n1878J81703K67392J09391o3762l6370
$$ -1119672 -828637 -574705 -537328 -671838 -723716 -542013 -274621 -165230 -228992 -265362
38859b65362J17981K24386K57187K01784p5780n01793o02802j01541N00857N04640
$$ -265362 -147381 77005 334192 535976 460196 -41597 -644399 -745940 -245083 259557
38849B59557M1569j32636J69592L47429R5749j07844Q4398K60703J7953l03209
$$ 259557 301126 168490 338082 685511 781260 673416 757814 1018517 1036470 733261
38839G33261k48306o7455k19749m72430k50619L40271N89503K35139k07788k41419
$$ 733261 484955 417500 197751 -274679 -525298 -185027 404476 639615 431827 190408
38829A90408K9937K30915J94574l0938l01281l68257o3624L76015M57913O2454
$$ 190408 220345 451260 645834 614896 313615 -54642 -118266 257749 715662 778116
38819G78116l49711l55426j22916n4467j06911P6088M18990L72935j78728n32113
$$ 778116 428405 72979 -49937 -104404 -211315 -135227 283763 656698 477970 -54143
38809e4143j48309M23634L06100l13119m52928M4906K45180k50784n27917J21171
$$ -54143 -202452 221182 527282 214163 -238765 -193859 51321 -199463 -727380 -606209
38799f06209Q90471O49062l02626p67599m26427O0691L40461N59952N28128o2442
$$ -606209 284262 933324 630698 -136901 -563328 -502637 -162176 397776 925904 863462
38789H63462o72198m28279L80920N79213m0519m49310j82067p785l67689n25103
$$ 863462 191264 -237015 143905 723118 682599 233289 51222 43437 -324252 -849355
38779h49355L9475O08864M38947l5607p3018J65730J39045p7606j25691o3784
$$ -849355 -809880 -201016 237931 202324 129306 295036 434081 356475 230784 167000
38769A67000l5022J39838M27099L28479k46094o08819l87119j43234k68582k20311
$$ 167000 131978 271816 698915 1027394 781300 172481 -214638 -357872 -626454 -846765
38759h46765L52770P18099K59981l55062k86593P4134k8888k72949J9063M37567
$$ -846765 -493995 224104 484085 129023 -157570 -83436 -112324 -385273 -366210 71357
38749G1357J85763l57961k47918L06670L40864p1288J886N29488M93173k42534
$$ 71357 257120 -100841 -348759 -42089 298775 227487 229373 758861 1252034 1009500
38739A009500n87230m1959N35994M01762o6076k89136l40373l72436j47105L35608
$$ 1009500 422270 380311 916305 1318067 1251991 962855 622482 250046 102941 438549
38729D38549N22904J18916m08140n03679j88420J89104L62958K05456j36392k07756
$$ 438549 961453 1080369 672229 168550 -19870 169234 532192 737648 601256 393500
38719C93500J07938J49230n62878j240859p62765M90439R84858K76203m19741
$$ 393500 501438 650668 87790 -1153069 -1915834 -1425395 -440537 -164334 -584075
38710e84075j91081L40103K88190j54046l40032k06034O756K93204N35285L32054
$$ -584075 -775156 -435053 -146863 -300909 -640941 -846975 -840219 -547015 -11730 320324
38700C20324k65915n63511k75986j4747j82587k28284L00939P73800M23935l35926
$$ 320324 54409 -509102 -785088 -799835 -982422 -1210706 -909767 -135967 287968 -47958
38690d7958m94453O8016N64650N26205K15844o0941l25281n71407n93970k80311
$$ -47958 -542411 -474395 90255 616460 832304 771363 446082 -125325 -719295 -999606
38680i99606K08534N56351M78361k3291m86282l83148J68394M69080J82243k27492
$$ -999606 -791072 -234721 243640 220349 -265933 -649081 -480687 -11607 170636 -56856
38670e6856k29252O4832K23585J12733j09306k41225p5163L96638O78157K33360
$$ -56856 -286108 -221276 2309 115042 5736 -235489 -310652 85986 764143 997503
38660I97503n95439q34088k69181K34132J49038M1085L29213L62410l33500q56570
$$ 997503 402064 -432024 -701205 -467073 -318035 -276950 52263 414673 81173 -775397
38650g75397k40597P49225O25711l99216o33228M32779J304338P82029l59820
$$ -775397 -1015994 -266769 358942 -40274 -673502 -240723 1063615 1845644 1485824
38641A485824p88689n39577m60524n44612p6498Q58148J208447M65965n50529
$$ 1485824 697135 157558 -302966 -847578 -924076 -65928 1142519 1608484 1057955
38632A057955p93566k82364J47849L1556k90862l18246k5256K56274L00780J36771
$$ 1057955 264389 -17975 129874 161430 -129432 -447678 -472934 -216660 84120 220891
38622B20891j09840l03786k97629n1186K44244L37397K25578J16664P7460m1308
$$ 220891 111051 -192735 -490364 -541550 -297306 40091 265669 382333 459793 418485
38612D18485k55740l02290m0893K19851R9125k69917l69177j3204L99235M63708
$$ 418485 162745 -139545 -180438 39413 138538 -131379 -500556 -513760 -114525 349183
38602C49183K80676J50313L6690k54218n00050k21538M69513P54102K02961n03086
$$ 349183 629859 780172 816862 562644 62594 -158944 310569 1064671 1267632 764546
38592G64546n11786o1020k6241m37374m39618J85585N32995L7446n59135m03081
$$ 764546 252760 191740 165499 -271875 -711493 -525908 7087 44533 -514602 -917683
38582i17683J38477K25238m4386j2823K16682N479m93970m30394K92758P72931
$$ -917683 -779206 -553968 -598354 -611177 -394495 -389016 -882986 -1313380 -1020622 -247691
38572b47691N29742J52868J89180L09203O4029k92901k96102j9672J58893J17064
$$ -247691 282051 434919 624099 933302 997331 704430 408328 388656 547549 664613
38562F64613p3608l59957n49771l62144R4710L31032J85265L1916O9884K463k79450
$$ 664613 591005 231048 -318723 -680867 -586157 -255125 -69860 -37944 31940 34403 -245047
38551b45047l53750l2283J71332j15194l95010p6374N04406N87007J94586M7533
$$ -245047 -598797 -631080 -459748 -574942 -969952 -1046326 -541920 45087 239673 287206
38541B87206L93210O59569L46866l04098o88032n08914L0754M60624M17318k8229
$$ 287206 680416 1339985 1686851 1382753 694721 185807 216561 677185 1094503 1066274
38531A066274m30773m70397k69697r8611N744J16676J53341K1647j49461j76469
$$ 1066274 635501 165104 -104593 -203204 -197460 -80784 72557 94204 -55257 -231726
38521b31726q3912J5788J22167K11300J26296j37469k66992n2999K33500K13188
$$ -231726 -315638 -299850 -177683 33617 159913 22444 -244548 -297547 -64047 149141
38511A49141m4788j93119j64411j64226k20117j51563M8608J87632K21834K65642
$$ 149141 104353 -88766 -253177 -417403 -637520 -789083 -740475 -552843 -331009 -65367
38501f5367K48822k7861m15969m26976P3319N45261M61258L1215j48875J4865
$$ -65367 183455 155594 -260375 -687351 -614032 -68771 392487 423702 274827 289692
38491B89692P2820j46748k38967M7175L03907J11118k22366j45131J80442J21372
$$ 289692 362512 215764 -23203 23972 327879 438997 216631 71500 251942 373314
38481C73314l22678m59032n0241K92130J44092r1406n462J17658k8812j31702
$$ 373314 50636 -408396 -458637 -166507 -22415 -113821 -119283 -1625 -30437 -162139
38471a62139N5945R5656k88430m42912J76513Q35065N28151l42784n87584j64355
$$ -162139 -106194 -10538 -298968 -741880 -565367 269698 797849 455065 -132519 -296874
38461b96874p1256m53347l64886M21340Q78047M17539k30879l71804l20452m09675
$$ -296874 -368130 -821477 -1186363 -765023 113024 530563 299684 -72120 -392572 -802247
38451h02247k21255M24258P74238K96598l62115l97173j9138J83457K48922L68957
$$ -802247 -1023502 -599244 174994 471592 109477 -287696 -306834 -123377 125545 494502
38441D94502J86829m97266r78897n63804L06241P30698O27107M49371J85446l68224
$$ 494502 681331 184065 -794832 -1358636 -1052395 -321697 305410 754781 940227 572003
38431E72003p87396n32935K3438J06501j66537l1922N16005O41566P4150l77345
$$ 572003 -215393 -748328 -724890 -618389 -784926 -816848 -300843 340723 414873 37528
38421C7528j8927P30960R08027J68447q59781j216283n71842L64044N97555P6282
$$ 37528 18601 749561 1657588 1826035 966254 -250029 -821871 -457827 139728 216010
38411B16010k92344q351L30177J24912k10278n2559K95374J93594j34734k5575
$$ 216010 -76334 -84685 245492 370404 160126 107567 402941 596535 461801 436226
38401D36226L50694K24980m11929p40147m04274P8470K77371L31295L46615J42269
$$ 436226 786920 1011900 599971 -140176 -544450 -465980 -188609 142686 489301 631570
38391F31570k05578k92168p2830Q869k31568m30499l11756o8093O9851J60594
$$ 631570 425992 133824 60994 69863 -161705 -592204 -903960 -972053 -902202 -741608
38381g41608K82324L46876L03601J96659P788k35157k93162l7716K19849J45204
$$ -741608 -459284 -112408 191193 387852 395640 160483 -132679 -170395 49454 194658
38371A94658q1612j18372p0476j75068j98297J33956M04916P3427m46180k66695
$$ 194658 113046 -5326 -75802 -250870 -449167 -315211 89705 163132 -283048 -549743
38361e49743M78632O92145k0556p80511p96329l19129J14654M52481O65489L89702
$$ -549743 -71111 621034 600478 -180033 -976362 -1295491 -1180837 -728356 -62867 326835
38351C26835l64576q41173n05591J58106L86151J80691N4636J58354K40867J87054
$$ 326835 -37741 -878914 -1384505 -1226399 -840248 -659557 -604921 -446567 -205700 -18646
38341a8646Q5334m0804j90555k60624k13493j35342J7939L65549O64344M41422
$$ -18646 66688 25884 -164671 -425295 -638788 -774130 -756191 -390642 273702 715124
38331G15124k12463n63324k77110O6838n8270k81353n7872L34457K93329l5399
$$ 715124 502661 -60663 -337773 -270935 -329205 -610558 -668430 -333973 -40644 -76043
38321g6043l6866K75097L24690L7176o4054J20184M7934m13010n82023p8742M05314
$$ -76043 -112909 162188 486878 524054 460000 580184 628118 215108 -366915 -445657 -40343
38310d0343J13329n46699n85102O6798N21330L45605R5067K10876K58498j93083
$$ -40343 72986 -473713 -1058815 -992017 -470687 -125082 -30015 180861 439359 246276
38300B46276o36418l61963L05234M19721j04932l95359o9885J91985j21329m65519
$$ 246276 -390142 -752105 -446871 -27150 -132082 -527441 -597326 -405341 -526670 -992189
38290i92189j88274L61031M30513O4264j02853Q8624K55897K58274K85380K98025
$$ -992189 -1180463 -819432 -388919 -324655 -427508 -338884 -82987 175287 460667 758692
38280G58692J09883p9490M1057J98093r4087n47280m07140K09955L21698l17042
$$ 758692 868575 789085 830142 1028235 934148 386868 -20272 189683 511381 194339
38270A94339o85353j09805N80253L32035m54895n46548K57527R14042O91589J8234
$$ 194339 -491014 -600819 -20566 311469 -143426 -689974 -432447 481595 1173184 1191418
38260A191418l51023k77964q9239n347l2577j22100j98037j84376j01168k088
$$ 1191418 840395 562431 473192 467845 435268 313168 115131 -69245 -170413 -172501
38250a72501J54716L65339L80253l3832o28480q28041m45948Q7392L53560M51055
$$ -172501 -17785 347554 727807 693975 65495 -762546 -1208494 -1121102 -767542 -316487
38240c16487O24805P22094M29723j08900l75544j96692K5638o5245k81575k49533
$$ -316487 308318 1030412 1460135 1351235 975691 778999 804637 739392 457817 208284
38230B08284J422J32426M3924j6131R9694J77144m9044m83937p09873m19634K13418
$$ 208284 209706 342132 386056 369925 469619 646763 597719 113782 -596091 -1015725 -802307
38219h02307O20181L94130j99631m54210q1210L89481L19887j46632l10195O6444
$$ -802307 -182126 212004 12373 -441837 -523047 -133566 186321 39689 -270506 -204062
38209b04062M41687K88793k02559m28211j22961L78046N13685P5852m90253m71137
$$ -204062 237625 526418 323859 -104352 -227313 150733 664418 740270 250017 -221120
38199b21120K28397P94121M89505k71019m39412J47461N25968M9937o97235q42409
$$ -221120 7277 801398 1290903 1019884 580472 727933 1253901 1303838 606603 -235806
38189b35806m17080n2773K1941M5529R7006K9727j06528q8992R0988K39472K75457
$$ -235806 -652886 -705659 -683718 -638189 -541183 -511456 -617984 -706976 -615988 -376516 -101059
38178a01059K32556Q1941j49038k33995k3219K77039L69001K53570J13217n824
$$ -101059 131497 213438 64400 -169595 -192814 84225 453226 706796 820013 814189
38168H14189j39657k29221k43598k74074k82785l5096M38169O21854J53015n42976
$$ 814189 674532 445311 201713 -72361 -355146 -390242 47927 669781 822796 279820
38158B79820o78284p4778O29662P11191P3124p09858r19983l75683L46832N39397
$$ 279820 -398464 -473242 156420 867611 940735 230877 -689106 -1064789 -717957 -178560
38148a78560J97218p4574L7811K16199J45392m3535j40350j49763l3183K96358
$$ -178560 18658 -55916 -18105 198094 343486 299951 159601 9838 -23345 273013
38138B73013N44048K41273l91030n31641l0799K45261j91745o14064l11454K07892
$$ 273013 817061 1058334 667304 135663 104864 350125 158380 -455684 -767138 -559246
38128e59246J44080k05012l6578N04256N78075N7584l62667l13058q6204P6194
$$ -559246 -415166 -620178 -656756 -152500 425575 483159 120492 -192566 -278770 -202576
38118b02576K13283K39352L2190j77233j43491j30278m40752p05474l79296L07883
$$ -202576 10707 250059 282249 105016 -38475 -168753 -609505 -1314979 -1694275 -1386392
38108a386392O61682N44260L31690J33356j44984k56818P057J93688j52819n35950
$$ -1386392 -724710 -180450 151240 284596 139612 -117206 -110149 83539 -69280 -605230
38098f05230k24909L99879L97898p2846Q707O74202P84480o2908q15648o15522
$$ -605230 -830139 -430260 -32362 -105208 -96501 577701 1362181 1299273 483625 -131897
38088a31897M6390L84165M30010M36042J47254n41376r69690n71654J81424M15811
$$ -131897 -85507 298658 728668 1164710 1311964 770588 -199102 -770756 -589332 -173521
38078a73521L6795l41037l23603m2532K50776M32755M55436L38051J40246j38555
$$ -173521 -136726 -477763 -801366 -843898 -593122 -160367 295069 633120 773366 634811
38068F34811m60526n78916k81344K08953M39205L29935K00481K32032L10004L36153
$$ 634811 174285 -404631 -685975 -477022 -37817 292118 492599 724631 1034635 1370788
38058A370788K61208q6066p00422j062242o93435M8263L86983K64075L03261O33776
$$ 1370788 1631996 1545930 845508 -216734 -910169 -861906 -474923 -210848 92413 726189
38048G26189O04051r7257q12012q13926k72540J14516O7362r4184j0894K65314
$$ 726189 1330240 1232983 420971 -392955 -665495 -550979 -483617 -577801 -588695 -323381
38038c23381L57661M1519l93627m45183r0995J88149J88252K31708M01305K50731
$$ -323381 34280 75799 -317828 -763011 -854006 -665857 -477605 -245897 155408 406139
38028D06139k75241m48033O0996M62714J64889j18886L05695O19114j84444j237730
$$ 406139 130898 -317135 -256139 206575 371464 252578 558273 1177387 992943 -244787
38018b44787q93770N41486J147331L86589k64034N0902L25024k46574q04681m31692
$$ -244787 -1138557 -597071 550260 936849 672815 723717 1048741 802167 -2514 -434206
38008d34206K68434L27302n898K8186K91812J44030l50643n43904j81473L86780
$$ -434206 -165772 161530 155632 183818 475630 619660 269017 -274887 -456360 -69580
37998f9580O91578M81604p7920m07025j72025J21339j31600n02714j38403O44688
$$ -69580 621998 1103602 1025682 618657 446632 567971 436371 -66343 -204746 439942
37988D39942O53650k21081p51212l57526J05363J6250m5366L16871L97554k44276
$$ 439942 1093592 872511 121299 -236227 -130864 -114614 -159980 156891 554445 310169
37978C10169p64517l85623L11223M44260J99520J43620R0781k95885n67197j95000
$$ 310169 -454348 -839971 -528748 -84488 115032 258652 349433 53548 -513649 -708649
37968g08649M30564O34142M73376L15789Q4046k63466k27728L79856P79007L17764
$$ -708649 -278085 356057 829433 1145222 1229268 965802 738074 1117930 1896937 2214701
37958B214701m26105n48687j86423l7533j24984m8615K6881l22093q12088p44877
$$ 2214701 1788596 1239909 1053486 1015953 890969 842354 869235 547142 -264946 -1009823
37948a009823p0473O05817Q74788P57372L65121r9325k97734j92574j73539l75851
$$ -1009823 -1080296 -474479 400309 1157681 1522802 1423477 1125743 933169 759630 383779
37938C83779l88262k4294K65208K07771K13052N21211O12996J05008n10265o79275
$$ 383779 -4483 -28777 236431 444202 657254 1178465 1791461 1896469 1386204 706929
37928G06929n81868m52363R403P46386Q14063k10719j138039p10141M35038O86618
$$ 706929 125061 -327302 -317899 428487 1242550 1031831 -106208 -816349 -381311 305307
37918C05307j24436o57468k20577M01107M11647J03434J09904M10999N27752K25392
$$ 305307 180871 -476597 -697174 -296067 115580 219014 328918 739917 1267669 1493061
37908A493061k79830n67908l84480P3885L24739J68589j29495l14285m13000m10457
$$ 1493061 1213231 645323 260843 334728 659467 828056 698561 384276 -28724 -439181
37898d39181j56130K07640K75225N4099P275K09623J85199j46361k00994J99036
$$ -439181 -595311 -387671 -112446 -58347 -51072 158551 343750 197389 -3605 195431
37888A95431L72587p2424n09009l45733J0018m6750l08936k92291q9914M0777
$$ 195431 568018 495594 -13415 -359148 -349130 -395880 -704816 -997107 -1087021 -1046244
37878a046244K73827O62339O64177k371o58658o06613j74013m0676j14255R1214
$$ -1046244 -772417 -110078 554099 551728 -106930 -713543 -887556 -928232 -1042487 -951273
37868i51273M71021N59710L48126J45444o625j69739j63991P0215J95846J7073
$$ -951273 -480252 79458 427584 573028 566403 396664 232673 302888 498734 515807
37858E15807j95547k61490l42642l48979Q7843P08247O70471n7023m34325k5084
$$ 515807 320260 58770 -283872 -632851 -545008 163239 833710 776687 342362 317278
37848C17278K65380j71885n50914j55735L40560J40093k35931j3451L46624O9244
$$ 317278 582658 410773 -140141 -295876 44684 184777 -51154 -64605 282019 351263
37838C51263m05160k04349L80815M56343Q9535J648J99894J58961o7399o7914
$$ 351263 -53897 -258246 122569 578912 668447 670095 869989 1028950 961551 893637
37828H93637K255k28342m96146l65064o9265n802M6694L28738L87501j11728n56755
$$ 893637 895892 667550 171404 -193660 -262925 -268727 -222033 106705 494206 382478 -174277
37817a74277l15066K15356L82009L08931K57201j05683q02588r31907o8506P55562
$$ -174277 -489343 -273987 108022 416953 674154 568471 -234117 -1166024 -1234530 -478968
37807d78968O34053K28658L67984M59548j88619p13423j34918O74045L85555m14746
$$ -478968 155085 383743 751727 1211275 1022656 309233 174315 848360 1233915 819169
37797H19169l18592L25791J46279o30510o20200J10497K34126k88539k14612M78924
$$ 819169 500577 826368 972647 342137 -278063 -167566 66560 -221979 -436591 42333
37787D2333M69626l49922n14724L52667P21484k72585j353224j109184Q0106R93464
$$ 42333 511959 162037 -352687 -20 721464 448879 -904345 -2013529 -1933423 -939959
37777i39959J156468P22979j00452q16283p67364p0152L79318J75552j36466r8099
$$ -939959 216509 939488 839036 22753 -744611 -814763 -435445 -259893 -396359 -494458
37767d94458M5929J8832j6146R5380K39321L36537L48898Q7660m07002n88882
$$ -494458 -448529 -429697 -445843 -350463 -111142 225395 574293 661953 254951 -333931
37757c33931j69736K69997J87722J9031K95194N04793Q997n51858j71799O79687
$$ -333931 -503667 -233670 -45948 -26917 268277 773070 782067 230209 58410 738097
37747G38097O57655k81581q34053m06804K17880L36915J38917p1577l20148m81992
$$ 738097 1395752 1114171 280118 -126686 91194 428109 567026 495449 175301 -306691
37737c06691l01327M2040J60669J33883K36679L01511R6806q5055K4026Q8453
$$ -306691 -608018 -565978 -405309 -271426 -34747 266764 363570 278515 302541 390994
37727C90994r8679n2199L78817L57565n04233j072075l40765Q13183R62036K89732
$$ 390994 292315 240116 618933 976498 472265 -599810 -940575 -127392 834644 1124376
37717A124376r2337r3947k89776m54800j40401O7031m40215q15214n4398J028023
$$ 1124376 1032039 938092 648316 193516 53115 120146 -320069 -1135283 -1189681 -161658
37707a61658R78625J05129k13862R4486P7053k51256j87404p67l39671o15005
$$ -161658 816967 922096 708234 802720 879773 628517 441113 440346 100675 -514330
37697e14330K6897P99182M16411n50105o07713N9993J59376k39751j16957K77160
$$ -514330 -487433 311749 728160 178055 -429658 -369665 -210289 -450040 -566997 -289837
37687b89837L329m19295Q4914P82493K72712o92196l35720Q05382O95358m87569
$$ -289837 -286508 -705803 -620889 161604 434316 -257880 -593600 211782 907140 419571
37677D19571o50741L87300O62418k32467m85216M83605J031676L83547j84670
$$ 419571 -231170 156130 818548 586081 100865 584470 1616146 1999693 1815023
37668A815023M9751J48347l02415m11482j2983q8638o56517n71448J85815L59712
$$ 1815023 1864774 2013121 1710706 1299224 1286241 1197603 541086 -30362 155453 515165
37658E15165j74884k39430K61017K43276k04627J7461N27234p1996j229757r69386
$$ 515165 340281 100851 361868 605144 400517 417978 945212 873216 -356541 -1325927
37648a325927N29218J036069J67278j54186N16918M24079o99792q23133N22120
$$ -1325927 -796709 239360 406638 252452 769370 1193449 493657 -329476 192644
37639A92644J088283j14970j041345k75732O42078J94381o29252m91873J08416
$$ 192644 1280927 1165957 124612 -151120 490958 685339 56087 -435786 -327370
37630c27370L20020L89723M25080j40082r10415n89480N90710Q64125m7205m51806
$$ -327370 -7350 382373 807453 667371 -243044 -832524 -241814 622311 575106 123300
37620A23300K13391N26890o2933l34588R2473O6008n31246l82502M98789N36809
$$ 123300 336691 863581 800648 466060 558533 624541 93295 -289207 209582 746391
37610G46391l36986m27408M11297M07180o45289q43404K73293R47886N45998L24821
$$ 746391 409405 -18003 393294 800474 155185 -688219 -414926 532960 1078958 1403779
37600A403779M53534k10248j079219l78464J029854N03439j430465j520768L82674
$$ 1403779 1857313 1647065 567846 189382 1219236 1722675 292210 -1228558 -845884
37591h45884R00869p02455j180054N99294J556161J66869q84893Q1424Q73754
$$ -845884 54985 -647470 -1827524 -1228230 327931 494800 -390093 -308669 565085
37582E65085L2426m94042L98905O98029m47806p62353N98574J127304k03477q76712
$$ 565085 597511 103469 502374 1200403 752597 -9756 588818 1716122 1512645 635933
37572F35933K31249O70715o14188j083815L47143J081186j7837l62216J136769
$$ 635933 867182 1537897 923709 -160106 187037 1268223 1250386 888170 2024939
37563B024939J787040L79737n71378m7421m01678j920778j522862R16963J351433
$$ 2024939 3811979 4191716 3620338 3572917 3171239 1250461 -272401 644562 1995995
37554A995995r94917j766539M46380J433842m57103j173783Q55256J445807q61714
$$ 1995995 1001078 -765461 -319081 1114761 657658 -516125 339131 1784938 923224
37545I23224j411291J494992K739429l6493j823989J47776J324677p59425j512037
$$ 923224 -488067 1006925 3746354 3709861 1885872 2033648 3358325 2598900 1086863
37536A086863J098671J950144p84961j237056K395284L204174j089701k703200
$$ 1086863 2185534 4135678 3350717 2113661 4508945 7713119 6623418 3920218
37528C920218J396170K947689j489033k902366K550530M678632j226323l801723
$$ 3920218 5316388 8264077 6775044 3872678 6423208 11101840 9875517 6073794
37520F073794K800595O186835l75800k792463O809385J1708185K300007k43408
$$ 6073794 8874389 15061224 14685424 11892961 18702346 30410531 32710538 32467130
37512C2467130J7817635K9460378J3104932M737821M6422517R8981792P7137625
$$ 32467130 50284765 79745143 92850075 97587896 144010413 242992205 320129830
37505C20129830k2650944j00920070q6722969k6425190k453336j9603303k6206075
$$ 320129830 297478886 196558816 109835847 83410657 80957321 61354018 35147943
37498C5147943p993703K816813o071870j1094992j527719M439824k251618o516479
$$ 35147943 27154240 29971053 23899183 12804191 11276472 15716296 13464678 6948199
37490F948199j76812M151955r26245m741057n82568K645414o77123k686164J148966
$$ 6948199 6771387 10923342 9997097 5256040 4673472 7318886 6641763 3955599 5104565
37481E104565L120488j061706l946207r48209J484733q77311k322943P16255K577514
$$ 5104565 8225053 7163347 3217140 2268931 3753664 2876353 553410 1269665 3847179
37472C847179k22053k213272K11931K081343j62052k091857l82815J045305o13926
$$ 3847179 3625126 1411854 1623785 3705128 3543076 1451219 1068404 2113709 1499783
37463A499783j515373P91988K220292P0645j813053n40847P27436l84398q85555
$$ 1499783 -15590 776398 2996690 3067335 1254282 713435 1440871 1056473 170918
37454A70918J043515K045255K89713p02080J022079J857175m06920k231574r86020
$$ 170918 1214433 3259688 3549401 2847321 3869400 5726575 5319655 3088081 2102061
37445B102061L82465o14111j407768J13195J315891R3875j049944n9283P91918
$$ 2102061 2484526 1870415 462647 575842 1891733 1985608 935664 876381 1668299
37436A668299k72687r89079J54976P27678o34623j202700M46486J251594n66218
$$ 1668299 1395612 406533 561509 1289187 654564 -548136 -101650 1149944 583726
37427E83726j806109j31685J517713L78688j170594l20467J069237M29067o60119
$$ 583726 -1222383 -1354068 163645 542333 -628261 -948728 120509 549576 -110543
37418a10543N8408J017787J17725r96974j56211J069493L98614q60933m73060
$$ -110543 -52135 965652 1083377 86403 -69808 999685 1398299 537366 64306
37409F4306N54355K40871n33987r8887N61902r8172r54887l67111O32286L94896
$$ 64306 618661 859532 325545 226658 788560 690388 -264499 -631610 676 395572
37399C95572k45223J31416O65907P7885o92023l74169J52610k12753n07926K30942
$$ 395572 150349 281765 947672 1025557 333534 -40635 111975 -100778 -608704 -377762
37389c77762Q01309J09883n90664p3312N09685m1493n95755J5067O38779R4544
$$ -377762 423547 533430 -57234 -130546 379139 337646 -258109 -243042 395737 490281
37379D90281m91874P832M39065k44423p21621J01576P06992k08956r93994L2123
$$ 490281 -1593 6239 445304 200881 -520740 -419164 287828 78872 -915122 -882999
37369h82999J280983O14540p82553n32811P37596P18447m47403o84865K73986
$$ -882999 397984 1012524 229971 -302840 434756 1153203 705800 20935 294921
37360B94921P57833K08139l22739l45512l35236l16542M0235L26287j127m67034
$$ 294921 1052754 1260893 938154 592642 257406 -59136 -18901 307386 306259 -160775
37350a60775l75780k4948M8525R2645L30451K53056k47580l29410K25758L65270
$$ -160775 -536555 -561503 -512978 -420333 -89882 163174 -84406 -413816 -188058 177212
37340A77212k99273n71073K03662Q47633M25563j75516m0954J84292j44346k91677
$$ 177212 -122061 -693134 -489472 358161 783724 608208 567254 751546 607200 315523
37330C15523L16317Q98863R13352J010591J245497M39253j370280k113392q58007
$$ 315523 631840 1530703 2444055 3454646 4700143 5139396 3769116 1655724 797717
37321G97717M85366K94106k84188J35120N47895k86031j223307p22076L71559
$$ 797717 1283083 1577189 1293001 1428121 1976016 1689985 466678 -255398 116161
37312A16161M36359j35696r3172K38323l7761l39040K11401Q35367M48907k82136
$$ 116161 552520 416824 323652 561975 524214 185174 396575 1231942 1680849 1398713
37302A398713k31435J26663j13114m00202L0413L92520j90291q14155l85910K78791
$$ 1398713 1167278 1293941 1180827 780625 811038 1203558 1013267 199112 -186798 91993
37292I1993j0931n53905j47864N56998K96547l97949k46139L77982K70828l08146
$$ 91993 81062 -472843 -620707 -63709 232838 -165111 -411250 -33268 237560 -70586
37282g0586k78001J69454J18417k11159k9609L64776K39217o6914Q1793K28038
$$ -70586 -348587 -179133 -60716 -271875 -301484 63292 302509 235595 317388 545426
37272E45426k16519n99608j73543M19441L17907j8703Q2672J08335m20603o72644
$$ 545426 328907 -270701 -444244 -24803 293104 274401 357073 465408 44805 -627839
37262f27839k9035N25619J42969k70783J54528M95339j08416n76964J00978P35535
$$ -627839 -656874 -131255 11714 -259069 -104541 390798 282382 -294582 -193604 541931
37252E41931L8101q65807m46592L72845O445p02893n3163J171175R50068l73535
$$ 541931 580032 -285775 -732367 -359522 -353077 -1055970 -1109133 62042 1012110 638575
37242F38575p65019k7549K78691j16838r0186L42148J39212m09763r0343P24433
$$ 638575 -126444 -153993 124698 7860 -82326 259822 399034 -10729 -101072 623361
37232F23361N52037m06216n26643K75658M15974m44841q39797j44501M90865K89049
$$ 623361 1175398 769182 242539 518197 934171 489330 -350467 -494968 -4103 284946
37222B84946p5226p616J07417m7113j92057k07949k43651j18333L09744N22064
$$ 284946 209720 202104 309521 262408 70351 -137598 -381249 -499582 -189838 332226
37212C32226J68084j02924K09591L68221k03597n34580K49145J049008M83111
$$ 332226 500310 397386 606977 975198 771601 237021 486166 1535174 2018285
37203B018285o41091o68882P9685J19157m42493l86204Q1062k13184r23710o88062
$$ 2018285 1377194 708312 787997 907154 464661 78457 159519 -53665 -977375 -1665437
37193a665437K44922L81593k56895k20471O16467Q22578J8812n59515l08418j143
$$ -1665437 -1420515 -1038922 -1295817 -1516288 -899821 -77243 -58431 -617946 -926364 -927507
37183i27507r2073j31547J0317N318P3686N49699P77636R2548o20351j53280Q38813
$$ -927507 -1019580 -1151127 -1140810 -1135492 -1061806 -512107 265529 358077 -262274 -415554 423259
37172D23259Q28297k4581l48951K28P8177j66692j04049N5291p4143J85719J115459
$$ 423259 1251556 1226975 878024 878252 956429 789737 685688 740979 666836 852555 1968014
37161A968014J268014n3274p52883P28723K172974J458541J378430N314292R625614
$$ 1968014 3236028 3182754 2429871 3158594 5331568 6790109 8168539 13482831 23108445
37152B3108445O976468k404455r466773q262606l082780p83701j561734j523643
$$ 23108445 30084913 27680458 18213685 9951079 6868299 6084598 4522864 2999221
37144B999221l6219N12270k80441o81225l71955m68994q68346n51507J88169K89353
$$ 2999221 2963002 3475272 3194831 2513606 2141651 1672657 804311 252804 440973 730326
37134G30326l9567Q3426L96380J42253l34581l31967j92846m23008m64799J54981
$$ 730326 690759 774185 1170565 1312818 978237 646270 453424 30416 -434383 -279402
37124b79402O00737J46131l78928n5905M52243K27593j86746J1276K51761j73855
$$ -279402 321335 467466 88538 32633 484876 712469 525723 536999 788760 614905
37114F14905n26215r795N02618j2544o92062k49902O19699M24914m56140n07021
$$ 614905 88690 78895 581513 568969 -123093 -372995 246704 671618 215478 -291543
37104b91543K18904L71777j59919k16233L26295L59989k85354m72242J75304O03707
$$ -291543 -72639 299138 139219 -77014 249281 609270 323916 -148326 26978 630685
37094F30685J45084n11328o18231l57493j02167J85348M24838K84898p4310l9691
$$ 630685 775769 264441 -353790 -711283 -813450 -628102 -203264 81634 7324 -32367
37084c2367L65135L35126l94381r33078m65504N52590J006932N36046j98446m60008
$$ -32367 332768 667894 273513 -659565 -1125069 -572479 434453 970499 772053 312045
37074C12045k03147J21505K06909J33291P4758M0630J2879P5032J84900R7788
$$ 312045 108898 230403 437312 570603 645361 685991 698870 773902 958802 1056590
37064A056590j78731j99439K05460M34820k1835o11774m56336K26276M41512J7329
$$ 1056590 877859 678420 883880 1318700 1296865 685091 228755 455031 896543 913872
37054I13872k27494N3765K39246q0487m68444m86675k61762M1102M33837O29082
$$ 913872 686378 740143 979389 898902 430458 -56217 -317979 -276877 156960 786042
37044G86042K66487k62872j99636K94237L16744k24707m71857j68380j0122j90798
$$ 786042 1052529 789657 590021 884258 1201002 976295 504438 336058 325936 135138
37034A35138l4349N13746M99028l57198r87788o66664m4876J74956K70793M89060
$$ 135138 100789 614535 1113563 756365 -231423 -898087 -942963 -768007 -497214 -8154
37024h154L48540k36199m38316M2829L20137p2682k79539K47996O37925J90303
$$ -8154 340386 104187 -334129 -291300 28837 -43845 -323384 -75388 562537 752840
37014G52840l05479m4356L34162N1985l21746p8423J64419l00713p24976j98141
$$ 752840 447361 403005 737167 789152 467406 388983 553402 252689 -472287 -670428
37004f70428N62117M11368j73899l4644N05734L09426l71607l17247M21180O23157
$$ -670428 -108311 303057 129158 94514 600248 909674 538067 220820 642000 1265157
36994A265157O3302k53227N056Q1996k71555l94858j09165m1899l19349l01596
$$ 1265157 1328459 1075232 1080288 1162284 890729 495871 386706 344807 25458 -276138
36984b76138J19040K55090n9411j46423J96803K85288j31916l12250J73702O17105
$$ -276138 -157098 97992 38581 -107842 88961 374249 242333 -69917 103785 720890
36974G20890K98365l99760o67691m11650j04044K4106Q9387J75804K68759L57019
$$ 720890 1019255 619495 -48196 -459846 -563890 -539784 -450397 -274593 -5834 351185
36964C51185L57460J54359j52275k85361j66816j3226j5605j58147l42606m45191
$$ 351185 708645 863004 710729 425368 258552 245326 229721 71574 -271032 -716223
36954g16223k91018J63308O40428P49107L68968k57966o97933n74209O4126N80938
$$ -716223 -1007241 -843933 -203505 545602 914570 656604 -41329 -615538 -551412 29526
36944B9526L71016k84302n07141q6736K39057K4130j83419J23093M80070K82529
$$ 29526 400542 116240 -390901 -477637 -238580 -214450 -397869 -274776 205294 487823
36934D87823j40192j27881J59186R3541k95791m46972k56350j07966r5291J4025
$$ 487823 347631 219750 378936 472477 176686 -270286 -526636 -634602 -729893 -715868
36924g15868J83404J89280J49961K97988L93584N6638m62439n46179j55054J59900
$$ -715868 -532464 -343184 -193223 104765 498349 554987 92548 -453631 -608685 -448785
36914d48785J42839J07068L14847O04710O61861L09936l51381q25245n60531K26837
$$ -448785 -305946 -198878 115969 720679 1382540 1692476 1341095 515850 -44681 182156
36904A82156N40437q3597p75804n25285L36098O94852K95455j57243k75287l20767
$$ 182156 722593 638996 -136808 -662093 -325995 368857 664312 507069 231782 -88985
36894h8985l44779m5761M04191L59694k26861n74036k21374L14164L81437P5236
$$ -88985 -433764 -479525 -75334 284360 57499 -516537 -737911 -423747 -42310 32926
36884C2926j11559k7800J23678J69906O4500j45319k60778q2838K69096M51506
$$ 32926 -78633 -106433 17245 187151 251651 106332 -154446 -237284 31812 483318
36874D83318L72039K64808K28816N1653l53483o56984n05458k9175K74421J21814
$$ 483318 855357 1120165 1348981 1400634 1047151 390167 -115291 -144466 129955 251769
36864B51769k38187l18487N1992N44089P19103M86801O7449l43040o38186o79324
$$ 251769 13582 -304905 -252913 291176 1010279 1497080 1564529 1221489 583303 -96021
36854i6021m49584k33393k55870k48126J44043O17771N18804r7192m34797j39813
$$ -96021 -545605 -778998 -1034868 -1282994 -1138951 -521180 -2376 -99568 -534365 -674178
36844f74178K37436K17689P0645J38207K11399O9898j2336J62723K31596q9889
$$ -674178 -436742 -219053 -148408 -10201 201198 271096 258760 421483 653079 563190
36834E63190m19601l22420o634J39597K00724L56246L55961j1844l75885l19006
$$ 563190 143589 -178831 -185465 -45868 154856 511102 867063 855219 479334 160328
36824A60328n7003k086n1499J12913L95712M99001L90967J10554m19254r27931
$$ 160328 103325 101239 49740 162653 558365 1057366 1448333 1558887 1139633 211702
36814B11702p53706J55606Q19182M88110k48943l74185R3125L54470Q8045l76584
$$ 211702 -542004 -386398 432784 920894 671951 297766 390891 745361 833406 456822
36804D56822p45936q59336m99225J66694M10945m4493l78085J41816Q89114P82561
$$ 456822 -289114 -1148450 -1647675 -1480981 -1070036 -1114529 -1492614 -1350798 -461684 320877
36794C20877l9512n22484l00767Q3158K77511L70639K66874j52787m43435j59567
$$ 320877 281365 -241119 -541886 -458728 -181217 189422 456296 303509 -139926 -299493
36784b99493K34066L0666m30374k82571L05611L55578k31746n21055j45330K09211
$$ -299493 -65427 -34761 -465135 -747706 -442095 -86517 -318263 -839318 -984648 -775437
36774g75437J17372J3235J81570K55075O7388J2470K06454K10380r4285k38592
$$ -775437 -658065 -644830 -463260 -208185 -140797 -128327 78127 288507 194222 -44370
36764d4370n9869J9427j30962j07673J16553R678m50029n14648P6474N50290L53391
$$ -44370 -104239 -84812 -215774 -323447 -206894 -197216 -647245 -1161893 -1085419 -535129 -181738
36753a81738K4661J65901L93479R5796m42228m95814j4800M48882N68960L73353
$$ -181738 -157077 8824 402303 498099 55871 -439943 -454743 -5861 563099 936452
36743I36452j12614p35145r88879n12006L35285Q28749O84573J88487k59976m02131
$$ 936452 823838 88693 -900186 -1412192 -1076907 -248158 436415 624902 364926 -37205
36733c7205j46693L01548M96232K26572j99389l71917k94805k51054l40821m17909
$$ -37205 -183898 117650 613882 840454 641065 269148 -25657 -276711 -617532 -1035441
36723a035441l69058k20037j8436K13919M19879M93102L53255O1333j44470n9578
$$ -1035441 -1404499 -1624536 -1642972 -1429053 -1009174 -516072 -162817 -101484 -245954 -305532
36713c05532J83284K20855j8223j71457j6122J52954L4630j41955l8920J44044
$$ -305532 -122248 98607 80384 -91073 -107195 45759 80389 -61566 -100486 43558
36703D3558L849l11595l13205j7162P3040j74472l14707p8618K37369L03130K00714
$$ 43558 47407 -264188 -577393 -594555 -521515 -695987 -1010694 -1089312 -851943 -548813 -348099
36692c48099J42399J21518M1147p5361j46771j37482o0533l438p5333k04445j71046
$$ -348099 -205700 -84182 -43035 -118396 -265167 -402649 -463182 -466620 -541953 -746398 -917444
36681i17444J2798N0984j03937n7699L73560P46229O30483K41759j7212j77452
$$ -917444 -904646 -853662 -957599 -1015298 -641738 104491 734974 976733 959521 782069
36671G82069l52045k84310J20981L33138j4123l83425j92652J33060o5930l81484
$$ 782069 430024 145714 266695 599833 585710 202285 9633 142693 76763 -304721
36661c04721J5248P83836P77371j23663q15825o55266j47533J56943L18015L77465
$$ -304721 -289473 494363 1271734 1148071 332246 -323020 -470553 -313610 4405 381870
36651C81870J37711k26361k87562j95301m12417o49137k07910O07507P42950J65512
$$ 381870 519581 293220 5658 -189643 -602060 -1251197 -1459107 -851600 -108650 56862
36641E6862m5076L79666M27627k86206p36417l10558J24908j22738l21357K02203
$$ 56862 11786 391452 819079 532873 -203544 -514102 -389194 -511932 -833289 -631086
36631f31086O88219L13570k65173j10513L09457J01891l13094m3495M55289J33553
$$ -631086 57133 370703 105530 -4983 304474 406365 93271 49776 505065 638618
36621F38618o02314m18393N87867Q93202K1164p28188m23377J86126J45902k45978
$$ 638618 36304 -382089 205778 1098980 1120144 391956 -31421 154705 300607 54629
36611E4629k80901q9468j37615k36373L5418M31264M03528M7397p8134J13661
$$ 54629 -226272 -315740 -453355 -689728 -654310 -223046 180482 227879 149745 263406
36601B63406J68993r3446l17483k40570q2712j08426j74651K233L40207M63213
$$ 263406 432399 338953 21470 -219100 -301812 -410238 -584889 -582656 -242449 220764
36591B20764K32277o2681j04748O7537K07759K17196J56485K7964j91681l45303
$$ 220764 453041 390360 285612 353149 560908 778104 934589 962553 770872 425569
36581D25569k09376J36598L08394R0545k79100m05528j75304J76254L11374O4893
$$ 425569 216193 352791 661185 751730 472630 67102 -108202 68052 379426 444319
36571D44319l88882o19157l34199K79287P28431P06005L00627j84002m43446l26698
$$ 444319 55437 -563720 -897919 -618632 109799 815804 1116431 932429 488983 162285
36561A62285o898J14041r5631k65059p7085J82910O9645k45625k15823J76869
$$ 162285 155387 269428 173797 -91262 -168347 14563 84208 -161417 -377240 -200371
36551b00371M04772K83046J89636K84917K10085j89050m86616l67777j25954q8909
$$ -200371 204401 487447 677083 962000 1172085 983035 496419 128642 2688 -86221
36541h6221p7798J23723K46650L709l06018k26609Q3072Q2264k80742m79499j99555
$$ -86221 -164019 -40296 206354 210063 -95955 -322564 -239492 -157228 -437970 -917469 -1117024
36530a117024K39820L68280J43657j16045j84470j15713k4916J29206L95673N52894
$$ -1117024 -877204 -508924 -365267 -481312 -665782 -781495 -806411 -677205 -281532 271362
36520B71362K80210k90084n41084j81081K35942M6648n12627o15497n2735N15175
$$ 271362 551572 261488 -279596 -460677 -224735 -178087 -690714 -1306211 -1358946 -843771
36510h43771N54017K74147Q9729L3092k7227l6998Q7813K60049L54194K91781
$$ -843771 -289754 -15607 74122 107214 79987 42989 130802 390851 745045 1036826
36500A036826j5609m66042n93502j03022M82618L62829l31348o25817j45428L70988
$$ 1036826 1021217 555175 -38327 -141349 341269 704098 372750 -253067 -398495 -27507
36490b7507L09118O5328J74050L54696J49428j37831J1828L06670P8287n16016
$$ -27507 281611 346939 520989 875685 1025113 887282 899110 1205780 1284067 768051
36480G68051o51706j52600K40533Q6826o7558L79425J073709J219789Q04250O30423
$$ 768051 116345 -36255 204278 291104 223546 602971 1676680 2896469 3700719 4331142
36470D331142J073800J403980P52878n93711j474052j355039q87021p68110p70511
$$ 4331142 5404942 6808922 7561800 6968089 5494037 4138998 3251977 2483867 1713356
36461A713356l99209R5855J27569j92962k63788j8844R0849j325K2444N4713k66643
$$ 1713356 1314147 1410002 1537571 1344609 1080821 1061977 1152826 1151501 1173945 1228658 962015
36450I62015n81737j21542Q14033Q99435k28859j196075q25568J84958M55562
$$ 962015 380278 258736 1072769 1972204 1743345 547270 -278298 -93340 362222
36441C62222o6441m02847k50093j63415k96178j39707M06370O86633K92709k95923
$$ 362222 295781 -107066 -357159 -520574 -816752 -956459 -550089 136544 429253 133330
36431A33330m12912p1415J96105Q5280j66441j27549K93165O82688N63163O073
$$ 133330 -279582 -350997 -154892 -69612 -236053 -363602 -70437 612251 1175414 1181487
36421A181487l79711j76688L22982M91705J09321m34758o02271k67111J61027
$$ 1181487 801776 625088 948070 1439775 1549096 1114338 512067 244956 405983
36412D05983K06790n5743r1621K42504L49934j73257o98028l92688M03015N85496
$$ 405983 612773 557030 465409 707913 1057847 884590 186562 -206126 196889 782385
36402G82385j3565m09753j03478J93919r5212m10677q5865M85665N30917R8520
$$ 782385 768820 359067 255589 449508 354296 -56381 -142246 343419 874336 972856
36392I72856k25405k92047l09236k15958J03210L22139J12648k08898j53598J00230
$$ 972856 747451 455404 146168 -69790 33420 355559 468207 259309 105711 205941
36382B05941L2946k88661l36408l4042J65710P7774m183O2622L9808j45853j46923
$$ 205941 238887 -49774 -386182 -420224 -254514 -176740 -180923 -118301 -78493 -224346 -371269
36371c71269K49881O62865N38114q1226m94986j72109N03851O02423j64131r75344
$$ -371269 -121388 541477 1079591 998365 503379 331270 835121 1437544 1273413 298069
36361B98069r26458j83315L60413L02180o302k15770k84855j31954K71977N30808
$$ 298069 -628389 -811704 -451291 -149111 -155413 -371183 -656038 -787992 -516015 14793
36351A4793L14026Q9585M44816Q38032K40971r72774j243373k41611M93400r154
$$ 14793 328819 418404 863220 1701252 1942223 969449 -273924 -515535 -22135 -31289
36341c1289o34896j34730Q04819P99914J0125l59626p9001P0125j53878k38539
$$ -31289 -666185 -800915 3904 803818 813943 454317 375316 445441 291563 53024
36331E3024n4767k7144k43155l30012j30171K22906O59071R64082O54332k42191
$$ 53024 -1743 -28887 -272042 -602054 -732225 -509319 149752 1113834 1768166 1525975
36321A525975q20353m96526L3330r0527m98238l67071O5781J4975l36961j80439
$$ 1525975 705622 209096 242426 151899 -346339 -713410 -647629 -632654 -969615 -1150054
36311a150054L90056N26177J29996o5482J69507L32512K29108J33002j002m12966
$$ -1150054 -759998 -233821 -103825 -169307 200 332712 561820 694822 693820 280854
36301B80854p73084o07121k53604k74690k65345M21155J127222O89796m00418
$$ 280854 -492230 -1099351 -1352955 -1627645 -1892990 -1471835 -344613 345183 -55235
36292e5235m68860O03160J032801o479j061202p52346K20448N06511J53342J1844
$$ -55235 -524095 79065 1111866 1105387 44185 -708161 -487713 18798 172140 183984
36282A83984J44850N8928j88827j87591J9940J46248K12628K74736J33250j58796
$$ 183984 328834 387762 198935 11344 31284 177532 390160 664896 798146 639350
36272F39350j35911K36165K92918k15967n56558j83690L42691L37475P0011M6101
$$ 639350 503439 739604 1032522 816555 259997 76307 418998 756473 826484 872585
36262H72585Q426l94019o48827j67138N21796M76812j52896m40835k14021j43180
$$ 872585 881011 486992 -161835 -328973 192823 669635 516739 75904 -138117 -281297
36252b81297m30217n11602j34890K43998L01414K55433K60738J34558j31709k55489
$$ -281297 -711514 -1223116 -1358006 -1114008 -812594 -557161 -296423 -161865 -293574 -549063
36242e49063k17452k91547l91748q7552N40656Q09497N02059K67308M88177N13612
$$ -549063 -766515 -1058062 -1449810 -1537362 -996706 -187209 314850 582158 1070335 1583947
36232A583947k47402j068189p37912N78224J356527P32932m18477q24473m52187
$$ 1583947 1336545 268356 -469556 108668 1465195 2198127 1779650 955177 502990
36223E02990j64207k78675l07795M4733M14894M05468R0893k59664m92653m75548
$$ 502990 338783 60108 -247687 -202954 211940 617408 708301 448637 -44016 -519564
36213e19564j47398K12748K32948O3096J92413N37368M29207k07284m90171N6697
$$ -519564 -666962 -454214 -221266 -158170 34243 571611 1000818 793534 303363 360060
36203C60060N79916J54926o93188p70398q5082K49019j53524m36687j3971N19947
$$ 360060 939976 1094902 401714 -368684 -453766 -204747 -358271 -794958 -808929 -288982
36193b88982M46633R146j51114Q80P5436R922L5434J31475L6587k70864m74735
$$ -288982 157651 166797 15683 16563 91999 101921 137355 268830 305417 34553 -440182
36182d40182l12728J31843N17681N39768K04439j48403j91878J9520J53176M1356
$$ -440182 -752910 -621067 -103386 436382 640821 492418 300540 320060 473236 514592
36172E14592j50884k00189j00610k6747j08716k58302k36304O783J30167j82061
$$ 514592 363708 163519 62909 36162 -72554 -330856 -567160 -560377 -430210 -612271
36162f12271o32871n70539O6664N71093M57523R9950L9523J97275K24874J33183
$$ -612271 -1245142 -1815681 -1749017 -1177924 -720401 -620451 -580928 -383653 -158779 -25596
36152b5596N6829j30144m18669l80283J18041M33847Q1264l74867j62122M47490
$$ -25596 31233 -98911 -517580 -897863 -779822 -345975 -264711 -639578 -801700 -354210
36142c54210O35899L57924J61886O0296l12597o69464l80659K85235M14910m7666
$$ -354210 281689 639613 801499 861795 549198 -120266 -500925 -215690 199220 151554
36132A51554k32676J19374K57235j75777m81344r4675N24538O77494L41479j05459
$$ 151554 -81122 38252 295487 119710 -361634 -456309 68229 745723 1087202 981743
36122I81743m20424m58344j99829J1927j45502l52022j10937K83473J60368k56683
$$ 981743 561319 102975 -96854 -84927 -230429 -582451 -693388 -409915 -249547 -506230
36112e06230j16734N16503O59593J17531j54315K43292M57959m1902n17478l14651
$$ -506230 -622964 -106461 553132 670663 516348 759640 1217599 1175697 658219 343568
36102C43568L4804j00232l50217k17326n4332k50807l57734K3996L35090K7356
$$ 343568 378372 278140 -72077 -289403 -343735 -594542 -952276 -928280 -593190 -565834
36092e65834l48428o2312M91818M92598R3219K6798K82929K65345o7873k40894
$$ -565834 -914262 -976574 -484756 7842 101061 127859 410788 676133 608260 367366
36082C67366j97049k80180m62704m02446j06846J45580L24900M79060L71367p4324
$$ 367366 170317 -109863 -572567 -975013 -1081859 -936279 -611379 -132319 239048 164724
36072A64724l44459l5781M00220L25125p0393j79273k0702m6759k34780k21506
$$ 164724 -179735 -215516 184704 509829 439436 260163 239461 192702 -42078 -263584
36062b63584p9888j25788j91106N6425K88241p0390p19507p23753Q8912Q32729
$$ -263584 -343472 -469260 -660366 -603941 -315700 -386090 -1105597 -1829350 -1740438 -907709
36052i07709Q10468L06646n0061o8040R2362K66971L15719J56172q5919k05569
$$ -907709 -97241 209405 159344 91304 183666 450637 766356 922528 836609 631040
36042F31040k01361j93960j67102o7529j3278r3342j27129N4877K72080K64315
$$ 631040 429679 235719 68617 1088 -12190 -105532 -232661 -177784 94296 358611
36032C58611J14424P1166J29645J00542o2346k52368l59408k85167n5135L6642
$$ 358611 473035 544201 673846 774388 712042 459674 100266 -184901 -240036 -203394
36022b03394k16808m45714j59255L07951J39407n34921n90286L31351J123084
$$ -203394 -420202 -865916 -1025171 -717220 -577813 -1112734 -1703020 -1371669 -248585
36013b48585Q88110J97479j18512k91961p03106p62432j1781O21194J69395n61391
$$ -248585 639525 837004 718492 426531 -276575 -1039007 -1050788 -429594 -260199 -821590
36003h21590j78254R04332J057009P3123o58296n27003l58519n27087k86861N31309
$$ -821590 -999844 -95512 961497 1034620 376324 -150679 -509198 -1036285 -1323146 -791837
35993g91837Q77639K51875l72605j92392J80636j3954l61151j80019K29113K32589
$$ -791837 85802 337677 -34928 -227320 -46684 -60638 -421789 -601808 -372695 -140106
35983a40106k8628r1071n1032j58943j68627J09404K29627j10333l42169N2271
$$ -140106 -168734 -259805 -310837 -469780 -638407 -529003 -299376 -409709 -751878 -699607
35973f99607M98573K08287l96735k78566M71221O84978n5527p78249o08463N0347
$$ -699607 -201034 7253 -389482 -668048 -196827 488151 432624 -345625 -954088 -903741
35963i03741L22651J29064J4603J53101K01353j226j78939j26355j4666k3083
$$ -903741 -581090 -452026 -437423 -284322 -82969 -84195 -263134 -389489 -404155 -427238
35953d27238k1065J24969K10421J4170k27002j05774K73223L89616R6235k26044
$$ -427238 -448303 -323334 -112913 -98743 -325745 -431519 -158296 231320 327555 101511
35943A01511l68079m95407m75194J82769J257689J540121M17004r44196r97459
$$ 101511 -266568 -761975 -1237169 -1054400 203289 1743410 2160414 1216218 218759
35934B18759O4117P07006K95072k92581k66309P3342J98792J49787O4310j89122
$$ 218759 282876 989882 1284954 992373 726064 799406 998198 1147985 1212295 1023173
35924A023173m92535l88023R3390K78702p4296l38991r8360J60997j1386k15539
$$ 1023173 530638 142615 236005 514707 440411 101420 3060 164057 152671 -62868
35914f2868l2966Q3221l74981q66909n23920L86868P39687J69887n06920n30544
$$ -62868 -95834 -12613 -387594 -1254503 -1778423 -1391555 -651868 -481981 -988901 -1519445
35904a519445m5755M15921O05980N02259J63663j10363N0642N03334N83958k1453
$$ -1519445 -1565200 -1149279 -543299 -41040 122623 12260 62902 566236 1150194 1128741
35894A128741p29884p28901J202O70438O27008M1267m06817l19587Q4988L53389
$$ 1128741 398857 -330044 -328842 341596 968604 1009871 603054 283467 368455 721844
35884G21844L17179J47504J8965q8124k47814m21943n02663m19004j63912J76591
$$ 721844 1039023 1186527 1205492 1117368 869554 447611 -55052 -474056 -637968 -461377
35874d61377L98113L23385L0992j86362j51782K3943J41648J35551K8780j62471
$$ -461377 -63264 260121 291113 104751 -47031 -23088 118560 254111 282891 120420
35864A20420l51145l42346m8543L22235M57556L02740Q5890k1957r5879k18834
$$ 120420 -230725 -573071 -621614 -299379 158177 460917 546807 524850 428971 210137
35854B10137k33511L0128L46384K57113k34562m90300p6036N09840M39967k53429
$$ 210137 -23374 6754 353138 610251 375689 -114611 -190647 319193 759160 505731
35844E05731o98284m24398P0536K19675K00752M16081O92150N77574J06677k96894
$$ 505731 -192553 -616951 -546415 -326740 -125988 290093 982243 1559817 1666494 1369600
35834A369600m58728m96213m29579k44839j51374k71487k64469J85356O70650
$$ 1369600 910872 414659 -14920 -259759 -411133 -682620 -947089 -761733 -91083
35825i1083M90836k62969o99982l06848M19712O84288K98650k92965n56424l05583
$$ -91083 399753 136784 -563198 -870046 -450334 233954 532604 239639 -316785 -622368
35815f22368J52769K81406n7462l35811k7883O11093Q50261M49056j44502m77371
$$ -622368 -469599 -188193 -245655 -581466 -609349 1744 852005 1301061 1156559 679188
35805F79188m86799k70803K8785J36090p6073k54829k4084L21059J95118k65664
$$ 679188 192389 -78414 -49629 86461 10388 -244441 -268525 52534 247652 -18012
35795a8012l24127J47370L90459l5650n44160m58451j7107J18800j04544k02966
$$ -18012 -342139 -194769 195690 160040 -384120 -842571 -859678 -740878 -845422 -1048388
35785a048388J5588K55850K81639K09215K18213K58337J46089j43558l60028k23019
$$ -1048388 -1032800 -776950 -495311 -286096 -67883 190454 336543 192985 -167043 -390062
35775c90062J93909M90748M60812L35554K98515R3214m77001r65285p74979p1766
$$ -390062 -196153 294595 755407 1090961 1389476 1482690 1005689 40404 -734575 -806341
35765h06341L99899L24462M3259j46896k72549k83167m9016K00572R5526j81412
$$ -806341 -406442 -81980 -38721 -185617 -458166 -741333 -790349 -589777 -494251 -675663
35755f75663j08481K37033K35380j82531l53081r957K71206R5884j19016K2725
$$ -675663 -784144 -547111 -311731 -494262 -847343 -857300 -586094 -490210 -609226 -586501
35745e86501K07634O5058j75085j94504j32442j28630N2920M46624N73985K35836
$$ -586501 -378867 -313809 -488894 -683398 -815840 -944470 -891550 -444926 129059 364895
35735C64895l9547R8641J68637k36500n94245l05133K32607K97221M6395P1375
$$ 364895 325348 423989 592626 356126 -238119 -543252 -310645 -13424 32971 104346
35725A04346K13247q4718n49361l72759L48821O20863J16190l34209j06623L19220
$$ 104346 317593 232875 -316486 -689245 -340424 280439 396629 62420 -44203 275017
35715B75017K80606m8511j31498J6675N079j92697k44532n1739J26366J12418
$$ 275017 555623 507112 375614 392289 397368 204671 -39861 -91600 34766 147184
35705A47184L4583O0375J40566J31844N4962P1464J93158J86940q1357l42736
$$ 147184 181767 242142 382708 514552 569514 640978 834136 1021076 939719 596983
35695E96983k32879J47225L07556L0967l87228o09184n67531k44263L55927Q44728
$$ 596983 364104 511329 818885 849852 462624 -146560 -714091 -958354 -602427 242301
35685B42301O44593j36057n96692k49607K38848Q4270l86109l12297K82517N65294
$$ 242301 886894 750837 154145 -95462 143386 227656 -158453 -470750 -188233 377061
35675C77061K37510r6045K4919K98175L01519R0821j26032l73884o44345o51919
$$ 377061 614571 518526 543445 841620 1143139 1233960 1107928 734044 89699 -562220
35665e62220j97136M55483P98436N58380r7205o47878n60893J58375P85441O03450
$$ -562220 -759356 -303873 494563 1052943 955738 307860 -253033 -94658 690783 1294233
35655A294233j88335o95738m90912o7545J3341r5690L2500K83740J65377l40719
$$ 1294233 1105898 410160 -80752 -148297 -134956 -230646 -198146 85594 250971 -89748
35645h9748o15191k36879L74204M57023o9996m54152j12456N19201N35142j51438
$$ -89748 -704939 -941818 -567614 -110591 -180587 -634739 -747195 -227994 307148 155710
35635A55710o16989k06319N30046O24414L3275m28036l14643j8983M6473M4279
$$ 155710 -461279 -667598 -137552 486862 520137 92101 -222542 -241525 -195052 -150773
35625a50773J90496K04103k20827p18706o00048J58694P56377N28947k49950p24279
$$ -150773 39723 243826 22999 -695707 -1295755 -1137061 -380684 148263 -101687 -825966
35615h25966m29868K80670O99861M76397j18700n00438l25309J79034M49621K26456
$$ -825966 -1255834 -975164 -275303 201094 82394 -418044 -743353 -564319 -114698 111758
35605A11758j25724r9597K43339L60575M6586k52956j48489Q3054k3079l50946
$$ 111758 -13966 -113563 129776 490351 536937 283981 135492 218546 195467 -155479
35595a55479m17817j65200K4657L6091J57593M43378M99285J15658l31409l73205
$$ -155479 -573296 -738496 -713839 -677748 -520155 -76777 422508 538166 206757 -166448
35585a66448l3255K96628L30027Q7254j81866k09893j9250M7205j65335k82584
$$ -166448 -199703 96925 426952 514206 332340 122447 103197 150402 -14933 -297517
35575b97517L5386M30647L36937n7038q4419K52643K96581o6252k09137L0999
$$ -297517 -262131 168516 505453 448415 363996 616639 913220 846968 637831 668830
35565F68830J5949m32070n20823J42432P05925M01781k15872k98633j11417l15797
$$ 668830 684779 252709 -268114 -125682 580243 982024 766152 467519 356102 40305
35555D0305n89868k37258L60447K74312k89704k43074N19106Q88225L47626k82955
$$ 40305 -549563 -786821 -426374 -152062 -441766 -684840 -165734 722491 1070117 787162
35545G87162k79442l7795j27378k93278q6226K25259R7133l56839m98830n3638
$$ 787162 507720 469925 342547 49269 -36957 188302 285435 -71404 -570234 -623872
35535f23872N48351O57456R0704n87070n60980K27433Q10953L79071n37486p43182
$$ -623872 -75521 581935 672639 85569 -475411 -247978 562975 942046 404560 -338622
35525c38622p3099M47975J81862l15800l49027q1982q84o1844M2037K31965K07044
$$ -338622 -411721 36254 218116 -97684 -446711 -528693 -529577 -591421 -549384 -317419 -110375
35514a10375m2361k87756l70752j93876K57624O48207M74268j83314n41515j45242
$$ -110375 -152736 -440492 -811244 -1005120 -747496 -99289 374979 191665 -349850 -495092
35504d95092M05117K55711m75411q32631k74085O85389J118910O75846j38852
$$ -495092 -89975 165736 -309675 -1142306 -1416391 -731002 387908 1063754 924902
35495I24902n35601k58461J86695K03007j32955k63681l595K52664K00649Lj58317
$$ 924902 389301 130840 317535 520542 387587 123906 120311 372975 573624 573627 415310
35484D15310l47888n45662m68745o6825K76040L44170M23189O61784O13430m7782
$$ 415310 67422 -478240 -946985 -1013810 -737770 -393600 29589 691373 1304803 1257021
35474A257021p67212p20635L4989O43950N77258J03639l17103n43400n81165l93996
$$ 1257021 489809 -230826 -195837 448113 1025371 1129010 811907 268507 -312658 -706654
35464g06654o1859J87816K43740J90669R3797n8533j84154j38479M1621J49125
$$ -706654 -768513 -580697 -336957 -146288 -52491 -111024 -295178 -433657 -392036 -242911
35454b42911R2435k8207j19207j46492j7423L11629N92514M57610o5227m79287
$$ -242911 -150476 -178683 -297890 -444382 -461805 -150176 442338 899948 834721 355434
35444C55434m07756l9470J76128R6137m6901k2185J49271K74340J78104j43713
$$ 355434 -52322 -91792 84336 180473 133572 111387 260658 534998 713102 569389
35434E69389m55174m33022k5017M01877M34657J12220j27869j5445K35341K58677
$$ 569389 114215 -318807 -343824 58053 492710 604930 477061 461616 696957 955634
35424I55634J2317k26324k29897l3078J63032J67418o6971l71724m89033l69235
$$ 955634 967951 741627 511730 478652 641684 809102 742131 370407 -118626 -487861
35414d87861k33775k25096j75304O7202K90462K35651R1980K27101N14186M68956
$$ -487861 -721636 -946732 -1122036 -1054834 -764372 -528721 -436741 -209640 304546 773502
35404G73502P6963j24317N4044J11455k63578n92834l74144P5165J49523o2604
$$ 773502 850465 726148 780192 891647 628069 35235 -338909 -263744 -114221 -176825
35394a76825p643L63712N46372L09348m0862k05853j76931J65K43333K61878j26710
$$ -176825 -184468 179244 725616 1034964 994102 788249 611318 611483 854816 1116694 989984
35383I89984n54262n00629q2044J29879K6437K8639K12762J43523k21507k54539
$$ 989984 435722 -64907 -146951 -17072 9365 38004 250766 394289 172782 -81757
35373h1757L06340P45560L79320l56689n25101o6551J90513j72991n81226l90505
$$ -81757 224583 970143 1349463 992774 467673 401122 591635 418644 -162582 -553087
35363e53087J38977K39871k25494n43017j74027M35227M87424L6093q8340L94701
$$ -553087 -414110 -174239 -399733 -942750 -1116777 -681550 -194126 -158033 -246373 148328
35353A48328P14368K65712l81155l85367J2095l3216m90163n43487p6354J02601
$$ 148328 862696 1128408 747253 361886 373981 340765 -149398 -692885 -769239 -666638
35343f66638k88191m53733J18698P50933O59476J26974j21215k4025P9891K25839
$$ -666638 -954829 -1408562 -1289864 -538931 120545 247519 126304 102279 182170 408009
35333D08009N20873N57422k525o10333m81875J63061L94413j4395l58935k15138
$$ 408009 928882 1486304 1483779 873446 391571 554632 949045 934650 575715 360577
35323C60577l673j33642l42233k39261O3396K42207K56225K04751L2700k77518
$$ 360577 356904 223262 -118971 -358232 -294836 -52629 203596 408347 441047 163529
35313A63529m67508k90707R0629K59119M2541l02626l80097n2624M04349N39328
$$ 163529 -303979 -594686 -504057 -244938 -202397 -505023 -885120 -937744 -533395 5933
35303E933J97468k68438l79522p5243K92271M48653M25547K91246k9393n03085
$$ 5933 203401 -65037 -444559 -519802 -227531 221122 646669 937915 908522 405437
35293D05437p92438n72099K4755M80845M44276R5959p1446K02197O54128P66938
$$ 405437 -387001 -959100 -934345 -453500 -9224 86735 15289 217486 871614 1638552
35283A638552L35141k81387n43035l40004p6159j03730k68439k19181l4832j61807
$$ 1638552 1973693 1692306 1149271 809267 733108 629378 360939 141758 106926 -54881
35273e4881o39924q19192k21804O07905O93286M00m49648l7118N62291M12506
$$ -54881 -694805 -1513997 -1735801 -1127896 -434610 -434210 -883858 -920976 -358685 53821
35263E3821k93217n64237m7788N94713O78809K16554l83556p52640o26159k5933
$$ 53821 -239396 -803633 -851421 -256708 422101 638655 255099 -497541 -1123700 -1149633
35253a149633N11527M07287j44245l52643O3209N29779N51742L47586K52036J27432
$$ -1149633 -638106 -230819 -375064 -727707 -664498 -134719 417023 764609 1016645 1144077
35243A144077j70919k98763L3796M32933L39081j05749k98696j02187M6177j20778
$$ 1144077 973158 674395 708191 1141124 1480205 1374456 1075760 973573 1019750 898972
35233H98972l69603m22729l29363k69057k45789q8307L22640Q05951Q82763K69594
$$ 898972 529369 106640 -222723 -491780 -737569 -825876 -503236 302715 1185478 1455072
35223A455072n77741p90865j62070N09826M69382o92j08627K41895M00778K9777
$$ 1455072 877331 86466 -75604 434222 903604 902912 794285 1036180 1436958 1466735
35213A466735m09251l68705K7218K01473j03163n09264m84002l6621K40900l7985
$$ 1466735 1057484 688779 715997 917470 814307 305043 -178959 -215580 25320 -12665
35203a2665m47072l18366K16122L66125p3400l58830J4252N04558M40286O9384
$$ -12665 -459737 -778103 -561981 -195856 -269256 -628086 -613834 -109276 331010 400394
35193D00394j3426P9746r2297l02638k6254M36733K72455m30028o34629N9930
$$ 400394 386968 466714 374417 71779 45525 482258 754713 324685 -309944 -250014
35183b50014P68469O43479J4371l22965k74915k71182l82152k91193N2076L10789
$$ -250014 518455 1161934 1176305 853340 578425 307243 -74909 -366102 -314026 -3237
35173c237K61557L7406j34651j77010j21104k589J39680K16891J16812j29961
$$ -3237 258320 295726 161075 -15935 -137039 -139628 52 216943 333755 203794
35163B03794k34329O3558N01163M37598k41965p51225l97723L79940O03416J55069
$$ 203794 -30535 33023 534186 971784 729819 -21406 -419129 -39189 564227 719296
35153G19296j83854k2706J73394M1385j15475m4078m0626k80992l43372M9480
$$ 719296 535442 512736 686130 727515 612040 567962 527336 246344 -97028 -47548
35143d7548M03662J95706k40307k38389J54788L50625J70962n7401j88539l56722
$$ -47548 356114 551820 311513 73124 227912 578537 749499 692098 503559 146837
35133A46837m68816k56012J50427K92151R6222l5043P0714J12762p4420k05508
$$ 146837 -321979 -577991 -427564 -135413 -39191 -74234 -3520 109242 34822 -170686
35123a70686o5985J25502J48819J47605K54975K60297K5041j35730N0379K33856
$$ -170686 -236671 -111169 37650 185255 440230 700527 725568 589838 640217 874073
35113H74073p8525o43706p22486j94889K35023J34067k2400K78420O47275L79298
$$ 874073 795548 151842 -570644 -765533 -530510 -396443 -418843 -140423 506852 886150
35103H86150l53582o71361k86634J30804M6991j99753j13569J30436J02790r7213
$$ 886150 532568 -138793 -425427 -294623 -247632 -447385 -560954 -430518 -327728 -424941
35093d24941r6212K0780j05464l57528k52016K22801N21048L68456R3171R53k1258
$$ -424941 -521153 -500373 -605837 -963365 -1215381 -992580 -471532 -103076 -9905 -8952 -30210
35082c0210r8160r5319J8380L2135n1029P5054M02954M64923J32611m2324K45760
$$ -30210 -128370 -223689 -205309 -173174 -224203 -149149 253805 718728 851339 809015 1054775
35071A054775M01224j42232q46951p56545N3238N91452M01101K2641k5106J10435
$$ 1054775 1455999 1313767 466816 -289729 -236491 354961 756062 778703 753597 864032
35061H64032J73564K41170L04892O9778m55889p18461l75091J54102K91791P6036
$$ 864032 1037596 1278766 1583658 1653436 1197547 479086 103995 258097 549888 625924
35051F25924p7435n0240l1366r3611j49607j61326r9669J08479L47103K91762
$$ 625924 548489 498249 466883 373272 223665 62339 -37330 71149 418252 710014
35041G10014j02156l97842k91740j05237k52298n17161l68922J96318O40748O14693
$$ 710014 607858 210016 -81724 -186961 -439259 -956420 -1325342 -1129024 -488276 126417
35031A26417K56030j47912l81459k87174N8429K64619J04812j00941P535K11685
$$ 126417 382447 234535 -146924 -434098 -375669 -111050 -6238 -107179 -99644 112041
35021A12041J38396j685J88481M10385P0467n61501o10171n9629J42728l02877
$$ 112041 250437 248752 437233 847618 918085 356584 -253587 -313216 -170488 -473365
35011d73365m93231J13563O98663M18145k30057l22765n746m483k43990j10773
$$ -473365 -966596 -853033 -154370 263775 33718 -289047 -294793 -299276 -543266 -654039
35001f54039K86446K75678j32876k45429J06922L54077K30383J15264K21583K82212
$$ -654039 -367593 -91915 -224791 -470220 -363298 -9221 221162 336426 558009 840221
34991H40221J85207J53860J64807p4073m48598m79986j54410M2189K5193K28246
$$ 840221 1025428 1179288 1344095 1270022 821424 341438 187028 229217 254410 482656
34981D82656O54124O81810J15398l98429l62041q2558J4676k0774j07162l79678
$$ 482656 1136780 1818590 1933988 1535559 1173518 1090960 1105636 1084862 977700 598022
34971E98022o13038k35066O16409R24708K60414m61420l86838j1731k03011p29920
$$ 598022 -15016 -250082 366327 1291035 1551449 1090029 703191 691460 488449 -241471
34961b41471p96407m05160j06411J06492N24055P54190K33202n50355n76373O3394
$$ -241471 -1037878 -1443038 -1549449 -1442957 -918902 -164712 68490 -481865 -1058238 -994844
34951i94844K87918j60142l09245L39040R21444N92824j94381m98219k48210n5194
$$ -994844 -706926 -867068 -1176313 -837273 84171 676995 482614 -15605 -263815 -319009
34941c19009j38392j56249R9221L82476L48135k6729l45159j25383N65435R44784
$$ -319009 -457401 -613650 -514429 -131953 216182 189453 -155706 -281089 284346 1229130
34931A229130M08019n19585p32371n2279N35936L21254k36630l99503k00857p8208
$$ 1229130 1637149 1117564 385193 332914 868850 1190104 953474 553971 353114 274906
34921B74906p5399l3013q4781l15251l34310J21385N18543K23257l95440m16564
$$ 274906 199507 166494 81713 -233538 -567848 -446463 72080 295337 -100103 -516667
34911e16667J84732M70116L5416l58138l5514N21284M71114j05468m61702l67262
$$ -516667 -331935 138181 173597 -184541 -220055 301229 772343 666875 205173 -162089
34901a62089k48955k80446j27331K84265M55670Q9523l69219l71942l6367J65062
$$ -162089 -411044 -691490 -818821 -534556 -78886 10637 -358582 -730524 -766891 -601829
34891f01829J55994J83289K23041L9677k41463k05264J50591L24205Q3144j51716
$$ -601829 -445835 -262546 -39505 172 -241291 -446555 -295964 28241 111385 -40331
34881d0331M8470M70754N58846J23233m85257p48202m07353K78650O55168L24651
$$ -40331 8139 478893 1037739 1160972 675715 -72487 -479840 -201190 453978 778629
34871G78629k96989m32624L4612M63371M30968K08800Q9412p9516l51656l57640
$$ 778629 481640 49016 83628 546999 977967 1186767 1276179 1196663 845007 487367
34861D87367n570J38146k53032o12520m07866q9317k53314m42416J22380J000039
$$ 487367 481797 619943 366911 -245609 -653475 -742792 -996106 -1438522 -1316142 -316103
34851c16103R90760N2275n36768j24020M33290K73368j91565j82646J49727J76007
$$ -316103 674657 726932 190164 66144 499434 772802 581237 398591 548318 724325
34841G24325p5856j11338M8744p9361n05632o20719j15534M95361N38631O0470
$$ 724325 648469 537131 585875 506514 882 -619837 -735371 -240010 298621 359091
34831C59091k86665j52888O1212j42919n28674m21534J88059M86635O5330l70199
$$ 359091 72426 -80462 -19250 -162169 -690843 -1112377 -924318 -437683 -372353 -742552
34821g42552r5558M36200L44862j79964k04443L25333M70804j01074n77987l76913
$$ -742552 -838110 -401910 -57048 -237012 -441455 -116122 354682 253608 -324379 -701292
34811g01292K7394J11510J23851L04675K38662k78695n70176j12734M67381L30325
$$ -701292 -673898 -562388 -438537 -133862 104800 -173895 -744071 -856805 -389424 -59099
34801e9099k53937m53921k16146n3469N3927M39877P50014L54292l63620l64940
$$ -59099 -313036 -766957 -983103 -1036572 -982645 -542768 207246 561538 197918 -167022
34791a67022L22121M95796k83770q75709l00998P31783R04995J55928m85513m58796
$$ -167022 155099 650895 367125 -508584 -809582 -77799 827196 983124 497611 38815
34781C8815j25411J13575K56611K73916J7459l25786l31671l5694N5270j86030
$$ 38815 -86596 26979 283590 557506 574965 249179 -82492 -118186 -62916 -248946
34771b48946k66218L8875J93970k16898o73106m42564K49754N43387K43693j5098
$$ -248946 -515164 -476289 -282319 -499217 -1172323 -1614887 -1365133 -821746 -578053 -593151
34761e93151J03495J97285J116j18240P4781J59849j76000m74485k28144K46603
$$ -593151 -489656 -292371 -291255 -409495 -334714 -174865 -350865 -825350 -1053494 -806891
34751h06891L37802J13830M7467J28166L9173o8719J57332M27307J55475m24684
$$ -806891 -469089 -355259 -307792 -179626 -140453 -209172 -51840 375467 530942 106258
34741A06258m68011R9666M05319M7866k98241p9682K67290J85883p5296n6541
$$ 106258 -361753 -262087 143232 191098 -107143 -186825 80465 266348 191052 134511
34731A34511N6777j19491l76951k82789L2870J29152K0942P2852L17789M31678
$$ 134511 191288 71797 -305154 -587943 -555073 -425921 -404979 -332127 -14338 417340
34721D17340K61818n7210l68195n09428k86380K04532M73024K43865j01348j08105
$$ 417340 679158 621948 253753 -255675 -542055 -337523 135501 379366 278018 169913
34711A69913K6577j68902n77923o08426r2243M67671N79276K73858j05730l01151
$$ 169913 196490 27588 -550335 -1158761 -1251004 -783333 -204057 69801 -35929 -337080
34701c37080k76736j74248j22365r201L59219P75565O93639M2510m57799k35048
$$ -337080 -613816 -788064 -910429 -919630 -560411 215154 908793 951303 493504 258456
34691B58456K75538K82512j70617l65921r3826R4035j41957m12032k61872K00637
$$ 258456 533994 816506 645889 279968 186142 280177 138220 -273812 -535684 -335047
34681c35047N90573P14655N23346K890o10675q40702m87240R0034M27434M55434
$$ -335047 255526 970181 1493527 1496417 885742 45040 -442200 -352166 75268 530702
34671E30702L18069q029n25966q29229m21677M79456R28908L75300n02117n66235
$$ 530702 848771 840742 314776 -514453 -936130 -456674 472234 847534 345417 -220818
34661b20818K63433Q64658M52242l53200m84156L4630K74009q1864l21935K9130
$$ -220818 42615 907273 1359515 1006315 522159 556789 830798 748934 426999 456129
34651D56129L94828Q0101n93539p26367j00843N98382P32013L93826R8291Q8805
$$ 456129 850957 931058 337519 -388848 -489691 108691 840704 1234530 1332821 1421626
34641A421626J00224k33090p88966r52758l93996L54472N06489R1674j41721J17473
$$ 1421626 1521850 1288760 499794 -452964 -846960 -492488 14001 105675 -36046 81427
34631H1427L52884J42124k18096l15155k20850j19812O3176K59723J02119l47040
$$ 81427 434311 576435 358339 43184 -177666 -297478 -234302 25421 127540 -219500
34621b19500l55010L72079R54069M94717n11439q30813k48397K73275J05083k92978
$$ -219500 -574510 -202431 751638 1246355 734916 -95897 -344294 -71019 34064 -258914
34611b58914k68736J25180M24051M22088K39099K0187j80416l36212l88454k54037
$$ -258914 -527650 -402470 21581 443669 682768 702955 522539 186327 -202127 -456164
34601d56164L7154K36137J31371p9474r825K80017L06723p5818m54700n43495
$$ -456164 -419010 -182873 -51502 -130976 -140801 139216 445939 370121 -84579 -628074
34591f28074m97160l58367R1625O33028N73341j28274n30572q4977M98020M50327
$$ -628074 -1125234 -1483601 -1391976 -758948 -185607 -313881 -844453 -929430 -431410 18917
34581A8917J43850K29980M32716K33197p925K26133M40852m1059o67299m53681
$$ 18917 162767 392747 825463 1058660 1050735 1276868 1717720 1676661 1009362 555681
34571E55681K72725L96995p0405j70501J29516p8435p69911q17851L0478O39978
$$ 555681 828406 1225401 1154996 984495 1114011 1035576 265665 -552186 -521708 118270
34561A18270M02892J26373M09232N90625R4260m67630m14943j34334k05040l39241
$$ 118270 521162 647535 1056767 1647392 1741652 1274022 859079 724745 519705 180464
34551A80464q3863K39706J66242m1658M1319J91123L0674k43237l09552l20510
$$ 180464 96601 336307 502549 460891 502210 693333 724007 480770 171218 -149292
34541a49292m09756k23068L74458P30764L04669l80648m46372R3489N14307M60084
$$ -149292 -559048 -782116 -407658 323106 627775 247127 -199245 -105756 408551 868635
34531H68635J61212j31367l01566j97393J49595L48697J38276j98120k77887j67280
$$ 868635 1029847 898480 596914 399521 549116 897813 1036089 837969 560082 392802
$$ [...]
##END NTUPLES=NMR SPECTRUM
##END=
