##TITLE=31Pdec_30-22
 CDCl3, 24 sc
 7.6.2022
##JCAMPDX= 6.0         $$ Bruker NMR JCAMP-DX V2.0
##DATA TYPE= NMR SPECTRUM
##DATA CLASS= NTUPLES
##ORIGIN= UXNMR, Bruker Analytische Messtechnik GmbH
##OWNER= root
$$ XWIN-NMR		Version 3.5
$$ Tue Jun  7 14:10:43 2022 Russian Standard Time (UT+4h)  she@DPX200
##.OBSERVE FREQUENCY= 81.013821
##.OBSERVE NUCLEUS= ^31P
##.ACQUISITION MODE= SIMULTANEOUS
##.ACQUISITION SCHEME= undefined
##.AVERAGES= 24
##.DIGITISER RES= 16
##SPECTROMETER/DATA SYSTEM= spect
##.PULSE SEQUENCE= zgpg30
##.SOLVENT NAME= DMSO
##.SHIFT REFERENCE= (INTERNAL, DMSO, 0, 248.564)
##AUDIT TRAIL= $$ (NUMBER, WHEN, WHO, WHERE, WHAT)
$$ ##TITLE= Audit trail, XWIN-NMR		Version 3.5
$$ ##JCAMPDX= 5.01
$$ ##ORIGIN= Bruker BioSpin GmbH
$$ ##OWNER= she
$$ F:/spectra/data/she/nmr/P31/1/pdata/1/auditp.txt
$$ ##AUDIT TRAIL=  $$ (NUMBER, WHEN, WHO, WHERE, WHAT)
(   1,<2022-06-07 14:09:35.39 +0400>,<she>,<DPX200>,
      <created by zg, POWCHK disabled, PULCHK disabled
       configuration hash MD5:
       00 E9 B6 7A A2 85 ED C7 34 08 36 98 17 FE 4E 26
       data hash MD5: 32K
       02 21 A3 EC 98 84 BC 06 8C 48 9F 26 85 8C 18 8E>)
(   2,<2022-06-07 14:09:38.67 +0400>,<she>,<DPX200>,
      <Start of raw data processing
       efp BC_mod = 2 LB = 1 FT_mod = 6 PKNL = 1 PHC0 = -10160.63 PHC1 = -172.7461 SI = 64K 
       data hash MD5: 64K
       9E 8E C5 33 F7 B3 78 00 E3 6A 2B 93 5F 5C 20 3B>)
(   3,<2022-06-07 14:10:03.34 +0400>,<she>,<DPX200>,
      <pk PHC0 = -72.73904 PHC1 = 208.7999 
       data hash MD5: 64K
       29 37 59 AB BE 0F 3C 1A F0 D6 A1 5E A2 DF AD FE>)
(   4,<2022-06-07 14:10:07.70 +0400>,<she>,<DPX200>,
      <abs ABSG = 5 
       data hash MD5: 64K
       B8 B2 BF DA EB 18 7C 4F C3 72 2C E4 9A AE 82 C5>)
$$ ##END=
$$ 
$$ hash MD5
$$ 04 C6 44 14 B5 7D E7 04 94 E6 53 F4 C0 93 69 10
##$RELAX= 
##$RELAX= 
##$RELAX= 
##$RELAX= 
##$RELAX= 
##$RELAX= 
##$RELAX= 
##$RELAX= 
$$ Bruker specific parameters
$$ --------------------------
##$DU= <F:/spectra>
##$EXPNO= 1
##$NAME= <P31>
##$PROCNO= 1
##$TYPE= <nmr>
##$USER= <she>
##$AMP= (0..31)
100 100 100 100 100 100 100 100 100 100 100 100 100 100 100 100 100 100 
100 100 100 100 100 100 100 100 100 100 100 100 100 100 
##$AQSEQ= 0
##$AQ_mod= 1
##$AUNM= <au_zg>
##$AUTOPOS= <>
##$BF1= 81.014009
##$BF2= 200.13
##$BF3= 200.13
##$BF4= 200.13
##$BF5= 200.13
##$BF6= 200.13
##$BF7= 200.13
##$BF8= 200.13
##$BYTORDA= 1
##$CFDGTYP= 0
##$CFRGTYP= 5
##$CHEMSTR= <none>
##$CNST= (0..31)
1 1 145 1 1 1 1 1 1 1 1 1 1 1 1 1 1 1 1 1 1 1 1 1 1 1 1 1 1 1 1 1 
##$CPDPRG= <waltz16>
##$CPDPRG1= <>
##$CPDPRG2= <waltz16>
##$CPDPRG3= <>
##$CPDPRG4= <mlev>
##$CPDPRG5= <mlev>
##$CPDPRG6= <mlev>
##$CPDPRG7= <mlev>
##$CPDPRG8= <mlev>
##$CPDPRGB= <>
##$CPDPRGT= <>
##$D= (0..31)
0 1 0 0 0 0 0 0 0 0 0 0.03 2e-05 3e-06 0 0 0 0 0 0 0 0 0 0 0 0 0 0 0 0 
0 0 
##$DATE= 1654596574
##$DBL= (0..7)
120 120 120 11 120 120 24 19 
##$DBP= (0..7)
150 150 150 150 150 150 150 150 
##$DBP07= 0
##$DBPNAM0= <>
##$DBPNAM1= <>
##$DBPNAM2= <>
$$ [...]
##$SUBNAM3= <"">
##$SUBNAM4= <"">
##$SUBNAM5= <"">
##$SUBNAM6= <"">
##$SUBNAM7= <"">
##$SUBNAM8= <"">
##$SUBNAM9= <"">
##$SW= 501.771253377433
##$SWIBOX= (0..15)
0 1 3 0 0 0 0 0 0 0 0 0 0 0 0 0 
##$SW_h= 40650.406504065
##$TD= 32768
##$TD0= 1
##$TE= 0
##$TE2= 300
##$TE3= 300
##$TEG= 300
##$TL= (0..7)
0 120 53 12 22 120 120 120 
##$TP= (0..7)
150 150 150 150 150 150 150 150 
##$TP07= 0
##$TPNAME0= <>
##$TPNAME1= <>
##$TPNAME2= <>
##$TPNAME3= <>
##$TPNAME4= <>
##$TPNAME5= <>
##$TPNAME6= <>
##$TPNAME7= <>
##$TPOAL= (0..7)
0.5 0.5 0.5 0.5 0.5 0.5 0.5 0.5 
##$TPOFFS= (0..7)
0 0 0 0 0 0 0 0 
##$TUNHIN= 0
##$TUNHOUT= 0
##$TUNXOUT= 0
##$USERA1= <user>
##$USERA2= <user>
##$USERA3= <user>
##$USERA4= <user>
##$USERA5= <user>
##$V9= 5
##$VALIST= <valist>
##$VCLIST= <CCCCCCCCCCCCCCC>
##$VD= 0
##$VDLIST= <DDDDDDDDDDDDDDD>
##$VPLIST= <PPPPPPPPPPPPPPP>
##$VTLIST= <TTTTTTTTTTTTTTT>
##$WBST= 1024
##$WBSW= 4
##$XGAIN= (0..3)
0 0 0 0 
##$XL= 0
##$YL= 0
##$YMAX_a= 6991
##$YMIN_a= -7591
##$ZGOPTNS= <>
##$ZL1= 120
##$ZL2= 120
##$ZL3= 120
##$ZL4= 120
##$ABSF1= 248.5645
##$ABSF2= -253.2056
##$ABSG= 5
##$ABSL= 3
##$ALPHA= 0
##$AQORDER= 0
##$ASSFAC= 0
##$ASSFACI= 0
##$ASSFACX= 0
##$ASSWID= 0
##$AUNMP= <proc_1d>
##$AZFE= 0.1
##$AZFW= 0.5
##$BCFW= 0
##$BC_mod= 2
##$BYTORDP= 0
##$COROFFS= 0
##$CY= -3
##$DATMOD= 1
##$DC= 0
##$DFILT= <>
##$DTYPP= 0
##$F1P= 0
##$F2P= 0
##$FCOR= 1
##$FTSIZE= 65536
##$FT_mod= 6
##$GAMMA= 0
##$GB= 0
##$INTBC= 1
##$INTSCL= 5.30512e-09
##$ISEN= 30
##$LB= 1
##$LEV0= 0
##$LPBIN= 0
##$MAXI= 10000
##$MC2= 0
##$MEAN= 0
##$ME_mod= 0
##$MI= 50
##$NCOEF= 0
##$NC_proc= -6
##$NLEV= 6
##$NOISF1= 182.463
##$NOISF2= 159.3651
##$NSP= 0
##$NTH_PI= 0
##$NZP= 0
##$OFFSET= 248.5645
##$PC= 4
##$PHC0= -10233.37
##$PHC1= 36.0538
##$PH_mod= 1
##$PKNL= yes
##$PPARMOD= 0
##$PSCAL= 0
##$PSIGN= 0
##$REVERSE= no
##$SF= 81.014009
##$SI= 65536
##$SIGF1= 159.3651
##$SIGF2= -187.1042
##$SINO= 113.3802
##$SIOLD= 16384
##$SREGLST= <1H.CDCl3>
##$SSB= 0
##$STSI= 65536
##$STSR= 0
##$SW_p= 40650.406504065
##$SYMM= 0
##$S_DEV= 0
##$TDeff= 32768
##$TDoff= 0
##$TI= <>
##$TILT= no
##$TM1= 0
##$TM2= 0
##$TOPLEV= 0
##$USERP1= <user>
##$USERP2= <user>
##$USERP3= <user>
##$USERP4= <user>
##$USERP5= <user>
##$WDW= 1
##$XDIM= 65536
##$YMAX_p= 428108569
##$YMIN_p= -38488670
$$ End of Bruker specific parameters
$$ ---------------------------------
##NTUPLES= NMR SPECTRUM
##VAR_NAME=  FREQUENCY,     SPECTRUM/REAL,   SPECTRUM/IMAG
##SYMBOL=    X,             R,               I
##VAR_TYPE=  INDEPENDENT,   DEPENDENT,       DEPENDENT
##VAR_FORM=  AFFN,          ASDF,            ASDF
##VAR_DIM=   65536,         65536,           65536
##UNITS=     HZ,            ARBITRARY UNITS, ARBITRARY UNITS
##FACTOR=    0.620285442955139, 1,           1
##FIRST=     20137.2065510759, 0,            0
##LAST=      -20513.1999529892, 0,           0
##MIN=       -20513.1999529892, -38488670,   0
##MAX=       20137.2065510759, 428108569,    0
$$ Real data points
##PAGE= N=1
##DATA TABLE= (X++(R..R)), XYDATA
$$ [...]
39707I032034M33490r57247k370687j832777r6508O76419k49059j538935j732362
39698A364368q73060M4703M89494O51048O67539K98315n25992j239652j081837
39689b05074n4291Q16543N73110l42111n00391M74543J142652L28292q78477n98116
39679G56680Q54379J288734J0689j112914o28269L72308L04641l45623j60749
39670A339876O71572Q00430M4413m74315k29781K33650N67890R11907R73712K20291
39660E059645r15513j279515o24512J14343L06947K99724M38810N05843L84861
39651D290633L23778K92369j8507l92935k33207L33623M99275J20626m6906K72263
39641E441012M15471J20702J27768P77448J110237K70856j015917j348256m89993
$$ plain form
39707 9032034 9465524 8508277 6137590 4304813 4208305 4884724 4635665 3096730 1364368
39698 1364368 491308 536011 1025505 1676553 2344092 2642407 2116415 876763 -205074
39689 -205074 -259365 557178 1130288 788177 287786 762329 1904981 2233273 1354796 756680
39679 756680 1611059 2899793 2910482 1797568 1169299 1541607 1846248 1500625 1339876
39670 1339876 2011448 2811878 2856291 2381976 2152195 2385845 2953735 3865642 4839354 5059645
39660 5059645 4144132 2864617 2240105 2354448 2661395 2961119 3399929 3905772 4290633
39651 4290633 4614411 4906780 4888273 4495338 4262131 4595754 5095029 5215655 5168749 5441012
39641 5441012 5856483 5977185 6104953 6882401 7992638 8263494 7247577 5899321 5409328
39632E409328N52654R19758O25732J78198P3601M68716R65767J011422P31981
39623A0937157Q51834J529267K000271J816067J635588K135830K887274L148837
39615B6942125L165725L741386M964675O280029P446840Q497174R063855Q741476
39607G8843285P920986P336966P002646O592134O662925Q277343J1322244J4324130
39599A48282659J6127866J6754855J6520390J5563397J4580247J4705868J6051721
39592B58587003J7505055J8450724J9038710J7658079J0113690n997884k6378512
39585C08976865m1910181m6335726m1033930l2110294k4418879j9099883j5226270
39578H8841702j1954936r191933p305754o526631o389853n964325m871529l708892
$$ plain form
39632 5409328 5961982 6881740 7507472 7685670 7759271 8227987 9193754 10205176 10937157
39623 10937157 11788991 13318258 15318529 17134596 18770184 20906014 23793288 26942125
39615 26942125 30107850 33849236 38813911 45093940 52540780 61037954 70101809 78843285
39607 78843285 86764271 94101237 101103883 107696017 114358942 122636285 133958529 148282659
39599 148282659 164410525 181165380 197685770 213249167 227829414 242535282 258587003
39592 258587003 276092058 294542782 313581492 331239571 341353261 335355377 308976865
39585 308976865 267066684 220730958 179697028 147586734 123167855 104067972 88841702
39578 88841702 76886766 67694833 60389079 53862448 47472595 41508270 36636741 32927849
39570C2927849l158980l113202l040329k743635k300993j722499j172792j062332
39562A4613087j362830j346281o71306j73071o90870j588281j535298m75075M02127
39553G172202N35333N08111N74760J32886q40423j225465m67606L53366K00518
39544F943682k31302K03931R80864O60783o23066j132465j04211J136991J119556
39535H954763O7894q26405r92057o00044J09636P67468O77267m18794j615684
39526F124044j680989n76954M85526N50492p0865m20834q2765M97756O44363J73808
39516E643582m69289p13808m71790j87039k70621o38377q84077p38709k42110
39507A027762L49761O71215M65014r6105m84247m20515j99421j83136k50565r7764
$$ plain form
39570 32927849 29768869 26655667 23615338 20871703 18570710 16848211 15675419 14613087
39562 14613087 13250257 11903976 11232670 11059599 10368729 8780448 7245150 6770075 7172202
39553 7172202 7707535 8215646 8790406 8923292 8082869 6857404 6389798 6743164 6943682
39544 6943682 6712380 6916311 7897175 8557958 7934892 6802427 6698216 7835207 8954763
39535 8954763 9022657 8196252 7204195 6604151 6713787 7481255 8158522 7739728 6124044
39526 6124044 4443055 3866101 4351627 4902119 4831254 4410420 4327655 4825411 5469774 5643582
39516 5643582 5174293 4460485 3988695 3801656 3531035 2892658 2008581 1269872 1027762
39507 1027762 1377523 2048738 2513752 2417647 1933400 1512885 1313464 1130328 879763 781999
39497G81999J85024L05310L21326M41926M35451o4917o87713n58288L79714J046776
39487B586608O38345l01104p31541n03376k90220n20531r62586j126625o35374
39478a846404N01615J587719J644045N94688m35592n61960k98706n49418j066148
39469d30161r41812j93314L15207K96364K30378K79190J68269L5945K10502K88604
39459B59172k53419p30880j12371R38157Q05273k43353k67373Q81053R69183o86115
39449A559327j531114J16536J910523J041048j203399j599922j58780M09179m66858
39440G6540o42043N37258J069320P612q68454j90666R11537J085524P18686L87958
39430C093272l94628j553707j705830m87303L83542j20173n10361N33824J625456
$$ plain form
39497 781999 967023 1272333 1593659 2035585 2471036 2406119 1718406 1160118 1539832 2586608
39487 2586608 3224953 2923849 2192308 1688932 1398712 878181 -84405 -1211030 -1846404
39478 -1846404 -1344789 242930 1886975 2481663 2046071 1484111 1185405 635987 -430161
39469 -430161 -1371973 -1565287 -1250080 -953716 -723338 -444148 -275879 -239934 -29432 259172
39459 259172 5753 -725127 -837498 100659 905932 662579 395206 1276259 2245442 1559327
39449 1559327 28213 144749 2055272 3096320 1892921 292999 134219 543398 76540
39440 76540 -565503 -28245 1041075 1048687 180233 -10433 901104 1986628 2705314 3093272
39430 3093272 2698644 1144937 -560893 -1048196 -664654 -784827 -1295188 -761364 864092
39421H64092R39935n95760p61666M32630J049023L52676n41286p69210n61383
39412D09051k18133J58499J77384k46317k86191N07125J051424L57225n55050
39403A355017j74683Q37246O25266p22222j308229n56685J01971j41418l85378
39394c69115k5587K08317q3145r8398N62440J022023O74705J77952J00591o9651
39384B100132p49312j328532j225134p48315k15907O11133J510041J484559L48234
39375A786899n71900k92557L54276J51955n98465p59448j43451N21653Q05203
39366A254165P35839K88536l79240o84159l97296j03464j88673j27551M10989
39357H09146O26716j66151j108565q42188N29213J670774J753218R02733m98375
$$ plain form
39421 864092 1804027 1208267 446601 879231 1928254 2280930 1739644 970434 409051
39412 409051 190918 349417 526801 280484 -5707 501418 1552842 1910067 1355017
39403 1355017 1180334 2017580 2642846 1920624 612395 55710 157681 16263 -369115
39394 -369115 -394702 -186385 -269530 -367928 194512 1216535 1891240 2069192 2169783 2100132
39384 2100132 1350820 22288 -1202846 -1951161 -2167068 -1555935 -45894 1438665 1786899
39375 1786899 1214999 922442 1276718 1428673 830208 70760 -72691 448962 1254165
39366 1254165 1990004 2278540 1899300 1215141 817845 714381 525708 398157 809146
39357 809146 1435862 1269711 161146 -681042 -151829 1518945 3272163 4174896 3676521
39348C676521j762440j772559l47335P84350J7105j498069j190088J009898K283746
39339A201129J023785q45583q48073N46498J103687K66767n43981n08182l41426
39330A054621n83000o02747J29193R52058R31498J71120m53584m49685m1212L70306
39320A478568N62798M27428r004m56472n57069k96743l2854l3686j62936j53807
39310G66223m3072p4373k01954m9026M52072P21291K52078n31097p14251j75709
39300D02182K56125J19595J3606M48971P42238k0749j333229j679850n60899R19848
39290f92162J609543J426319O92635m88347j615617j654405m22188P47389P25508
39281C28675K03529M21916R92146N17530r33695j666840q55766L26359N66299
$$ plain form
39348 3676521 1914081 141522 -205813 578537 595642 -902427 -2092515 -1082617 1201129
39339 1201129 2224914 1379331 531258 1077756 2181443 2448210 1904229 1396047 1054621
39330 1054621 471621 -131126 -1933 950125 1881623 2052743 1599159 1149474 1108262 1478568
39320 1478568 2041366 2468794 2459790 2003318 1446249 1149506 1116652 1082966 920030 766223
39310 766223 723151 648778 446824 397798 849870 1571161 1823239 1292142 577891 402182
39300 402182 658307 777902 791508 1240479 1982717 1961968 628739 -1051111 -1612010 -692162
39290 -692162 917381 2343700 3036335 2547988 932371 -722034 -1144222 -396833 328675
39281 328675 532204 954120 1946266 2463796 1530101 -136739 -992505 -666146 -99847
39272i9847J07637q0121K24996O02411P71158O04802K4315o06597o51275j82562
39262G14917k0082l97970n52551j40917N5330l91062n37546L63040J297875Q69409
39252A260443m79680j082203m57036L38365N47765M96295N06534L13981j93248
39243A251216o28270p16796n20218m6707O10312Q59129J92123q79951j298211
39234a177373p76783J09780R05424J425925J247278J85372q79900q62497p2773
39225A04453K52241j00581k51174o4027l61098j020297p06773P49374J466558
39216F8676K12211j447941j229949O14199J767354J090250j78794m51260K92564
39207G37310R47375P62098q4916r32905j264303r96953l71385L13428P79981P81205
$$ plain form
39272 -99847 7790 -72331 152665 755076 1526234 2131036 2155351 1548754 897479 714917
39262 714917 694835 296865 -255686 -396603 -341273 -732335 -1269881 -906841 391034 1260443
39252 1260443 780763 -301440 -758476 -420111 127654 623949 1130483 1444464 1251216
39243 1251216 622946 -93850 -614068 -660775 -50463 808666 1000789 120838 -1177373
39234 -1177373 -1954156 -1844376 -938952 486973 1734251 1919623 1039723 177226 104453
39225 104453 356694 256113 4939 -59088 -420186 -1440483 -2147256 -1397882 68676
39216 68676 280887 -1167054 -2397003 -1782804 -15450 1074800 896006 444746 737310
39207 737310 1684685 2446783 2361867 1428962 164659 -832294 -1203679 -890251 -110270 670935
39197F70935L40083j22152k57101k69383n04759p48327n20582P2746M73089N42988
39187c22463N49602L92359k30775r06127q08212p4319K11085k87463n64543J36384
39177a904472J137625J356001P14696p9442n04826m49528n5251K54929J38886
39168F08618o1806K56555Q53855Q46092J21601m84579o00493p22376r65549p32899
39158h80981k0457L27052J38483K27467O61420M03780n90642q05783K43914Q19768
39148E24021j69289j038103o367J700826J758411M09063l23403j16521l21086
39139B417552r92894p59345L71390P18538j93675q54700m21251N8090j89239l35767
39129a81301K22343N55797q7506p70133l70779N38708O31607j28262n79408r1058
$$ plain form
39197 670935 1011018 888866 631765 362382 -142377 -890704 -1411286 -1338540 -865451 -322463
39187 -322463 227139 619498 388723 -517404 -1325616 -1399935 -1188850 -1476313 -2040856 -1904472
39177 -1904472 -766847 589154 1303850 1224408 719582 270054 214803 469732 608618
39168 608618 546812 803367 1657222 2503314 2624915 2140336 1539843 817467 -148082 -880981
39158 -880981 -901438 -574386 -435903 -208436 452984 856764 266122 -539661 -295747 524021
39148 524021 354732 -683371 -689738 1011088 2769499 3178562 2855159 2738638 2417552
39139 2417552 1424658 665313 1036703 1755241 1561566 706866 285615 343705 154466 -181301
39129 -181301 41042 596839 509333 -260800 -631579 -92871 538736 410474 -168934 -259992
39119b59992P33807R28612K07141p37437q35075J51774J107692Q24252l65683
39110A755091j030673o33736o0367m2874j58856J93513P35923P73527J54559n99223
39100A086884p66637k7351R88624J042446j72084j284834r70515J30039M60032
39091D86604k4878j33425K07203r5484r33539p86220N94879J419535O51902m22995
39081I63582n11951k54143m91636m66649N12158J199753K62034j181024j023863
39072i91739N70088J519317J006183K22177K6677j35468o66436q95043l61404
39063B94352K35586P8624n83033q51513l20040N16829P59314M6600q29364o79469
39053a332114M25674J024033L75054l03919K16941J009298L99719j096428j279719
$$ plain form
39119 -259992 473815 1402427 1609568 872131 37056 188830 1296522 2120774 1755091
39110 1755091 724418 90682 30315 -12559 -171415 22098 758021 1531548 1686107 1086884
39100 1086884 320247 292896 1281520 2323966 2151882 867048 -103467 26572 486604
39091 486604 461726 328301 535504 440020 -493519 -1279739 -684860 734675 1386577 963582
39081 963582 451631 197488 -294148 -760797 -248639 951114 1213148 32124 -991739
39072 -991739 -421651 1097666 2103849 2326026 2352703 2217235 1550799 655756 294352
39063 294352 529938 608562 25529 -825984 -1146024 -629195 130119 176719 -652645 -1332114
39053 -1332114 -906440 117593 492647 188728 405669 1414967 1814686 718258 -561461
39044e61461L33137J652723J077419l89500r75812o01724l25793m15787l18849
39035e25647Q244K56l90643m36620L00310J196028J161986o4940j373500j291981
39025a416507K45885J548347J140586k84556q11867Q05O46298J17431n85176k16759
39015C84487O28079M95419n29256q73646J27097J193078Q89541m33890j165293
39006G15616n09490N93086P00288l46422j231534q12200M30776J035394M54608
38997A030122l97342n92913l59650l43881m67465k97431j8077p4984j50227M15726
38987a256122J192817Q32817r08190k330528j751740L20384J831642J670843O54231
38978B56154Q6322J93261L07671K9521l38292l70257j20811q969k19984l98727
$$ plain form
39044 -561461 -228324 1424399 2501818 2112318 1136506 534782 208989 -206798 -525647
39035 -525647 -517403 -517147 -907790 -1344410 -1044100 151928 1313914 1248974 -124526 -1416507
39025 -1416507 -1170622 377725 1518311 1233755 421888 422693 1068991 1186422 601246 384487
39015 384487 1012566 1507985 978729 105083 232180 1425258 2314799 1880909 715616
39006 715616 206126 799212 1499500 1153078 -78456 -890656 -459880 575514 1030122
38997 1030122 632780 39867 -319783 -663664 -1131129 -1428560 -1446637 -1521621 -1671848 -1256122
38987 -1256122 -63305 769512 -138678 -2469206 -4220946 -3900562 -2068920 -398077 256154
38978 256154 342476 535737 843408 872929 534637 164380 43569 34600 -185384 -584111
38968e84111r7605M95128O00438j20607q74801o13568M70433J017311L09725o98960
38958i6617p41622l4614J98258k92466m48798K60652Q72078M89233j54346K12960
38948B64718J308870J567727L99851j016767j408392q28980o7563M01551L89075
38939A010090k04096r44058j000067l36408M2016k98741l59180N67716J365579
38930a57149P36826m82250m97633M62812N03169o77556j253582m73045P3008n48178
38920b313578p51858O77443J945612Q64849j391642j838389j18343J347862J278854
38911b99190Q17270P68724L02295q77208j481935q28276m6399M184J28021Q62573
38901f49941J023391k22267j421674q43874P54047J286875M37948l05137j84013
$$ plain form
38968 -584111 -681716 -186588 413850 293243 -581558 -1195126 -724693 292618 602343 -96617
38958 -96617 -838239 -872853 -674595 -967061 -1415859 -1155207 -283129 206104 51758 264718
38948 264718 1573588 3141315 3541166 2524399 1116007 287027 219464 621015 1010090
38939 1010090 805994 -138064 -1138131 -1474539 -1432523 -1731264 -2090444 -1522728 -157149
38930 -157149 579677 97427 -400206 62606 565775 -111781 -1365363 -1838408 -1765400 -2313578
38920 -2313578 -3065436 -2387993 -442381 422468 -969174 -2807563 -2925906 -1578044 -299190
38911 -299190 518080 1286804 1589099 711891 -770044 -1598320 -1644719 -1640535 -1512514 -649941
38901 -649941 373450 151183 -1270491 -2114365 -1360318 -73443 364505 59368 -124645
38892a24645J12253O2436j5283N0852k1064k19216k67563l11193n57460n04498
38882a795381L24084J175516R19538q3227l84027L15161Q00282L81244j90456
38873A462734k28117j46238l89675n19295r7354M47720N48080L45200K04856M8531
38863A676442k72795n21229m85110l42904k39781l5791K11337J18654l18659n05935
38853g15771j16946L83053M59941K07621n0951l05737n78001n86275j46256M50245
38843i99077Q01585Q26315O10433K10549j97809l86102m44260o41793q08127m07796
38833a436082N69620J348161J263734M76829m04700r59909j051132p54232l69823
38824a317534j43725M5973L62607N71922M67913M15118O85559O11949n17336j950193
$$ plain form
38892 -124645 -12392 50044 34761 85613 64549 -154667 -422230 -733423 -1290883 -1795381
38882 -1795381 -1471297 -295781 623757 540530 156503 471664 1271946 1653190 1462734
38873 1462734 1234617 1088379 698704 179409 82055 529775 1077855 1423055 1627911 1676442
38863 1676442 1403647 882418 397308 54404 -185377 -221168 -9831 108823 -209836 -715771
38853 -715771 -832717 -449664 10277 217898 166947 -138790 -716791 -1303066 -1449322 -999077
38843 -999077 -197492 628823 1239256 1449805 1251996 865894 421634 -220159 -1028286 -1436082
38833 -1436082 -866462 481699 1745433 2222262 1817562 857653 -193479 -947711 -1317534
38824 -1317534 -1461259 -1415286 -1052679 -480757 -12844 402274 1087833 1699782 1182446 -767747
38814g67747k155181r83787K21238P19582J009718J186429N19992p17247r19011
38805a886014L23213J146159K18387j051098p86261L51448M76541l09932l35769
38796a853326N97058R35446J11366n79810j99213N10443N52810J7903n13411p38831
38786a159565m32616M39242J130804P46845l16893p30128k20117J24478j56855
38777e74805j41677O00239R40022O6367q96061n13861O60570Q95714k04067j404211
38767e71770j706905j175042j19934J161137J855673J212107j28967o26016J6920
38758h2797M48800j11933o28094p9464P32489N26125k73787l01895L59384L64527
38748I53355m39532o50546J98472O35714l38232j420216r21000O54173J459389
$$ plain form
38814 -767747 -2922928 -3906715 -3685477 -2965895 -1956177 -769748 -249756 -967003 -1886014
38805 -1886014 -1562801 -416642 -198255 -1249353 -2035614 -1684166 -1207625 -1517557 -1853326
38796 -1853326 -1256268 -320822 -209456 -789266 -988479 -478036 74774 92677 -420734 -1159565
38786 -1159565 -1592181 -1152939 -22135 724710 407817 -322311 -542428 -417950 -574805
38777 -574805 -716482 -116243 823779 890146 -5915 -519776 140794 1036508 832441 -571770
38767 -571770 -2278675 -3453717 -3573651 -2412514 -556841 655266 526299 -99717 -82797
38758 -82797 366003 254070 -374024 -453488 279001 805126 531339 229444 588828 953355
38748 953355 513823 -136723 61749 697463 359231 -1060985 -1981985 -1327812 131577
38739A31577R57774J48572l56517q41269j204642p64800L94816J152547Q01730
38730D19788j57408q82713r65841k90575Q68045J515096Q10827n46274r42409
38721a71464q3744O06343J69410o15567p18226l37817p7201K43692R43202J495791
38711A454419J216259L40020m26505q83120j101989q20587N6652P87081M87130
38702A109360o86944j655502j541683l46851J127745J737262Q88063o45929j292819
38693a307298m17090R78560J507092Q01990m72253j337377j102832O782P71744
38684e70682L51693l91519o9465R50512J025471k6745o40252k65422j83689q23494
38674f43592o87718P41671J427058k8825j736936j346935K59984O63400j24241
$$ plain form
38739 131577 1089351 1237923 881406 40137 -1164505 -1929305 -1534489 -381942 419788
38730 419788 262380 -620333 -1586174 -1876749 -1008704 506392 1317219 770945 -171464
38721 -171464 -255208 351135 520545 -95022 -813248 -1151065 -1228266 -984574 -41372 1454419
38711 1454419 2670678 3010698 2584193 1701073 599084 -221503 -164851 622230 1109360
38702 1109360 422416 -1233086 -2774769 -3121620 -1993875 -256613 631450 -14479 -1307298
38693 -1307298 -1724388 -745828 761264 1563254 1091001 -246376 -1349208 -1342426 -570682
38684 -570682 -218989 -610508 -679973 270539 1296010 1269265 629013 363591 179902 -643592
38674 -643592 -1331310 -589639 837419 808594 -928342 -2275277 -2015293 -1351893 -1476134
38665a476134j89318O97539R22167R9038l88769L4069L70245P7014j81961n9110
38655i5220J745N823M67084J091982R69775J78048k70051j06214k2567k60956
38645A959449l69496k71901k94374l56712l23146o26826j281375j152301K08281
38636b508401J103898R8090j257064o03289J297394J755142N60824r9213K06525
38627E53906k85225j627234j577914K61923J330697L71548n67238P0090P91064
38618f78383J68682n08964R8996P42182j6993j048355p39073J41671P0700m75644
38608b245181k63395K49548K7820l51512J24137P84734N23501l090M16436J199965
38598D62963R70019j5443m64997k57981j51183j16187K24451L60633j78376n86830
$$ plain form
38665 -1476134 -1665452 -967913 -45746 53292 -335477 -301408 68837 145851 -36110 -95220
38655 -95220 -93475 -87652 379432 1471414 2441189 2619237 2349186 2242972 2220405 1959449
38645 1959449 1589953 1318052 1023678 666966 343820 -283006 -1564381 -2716682 -2508401
38636 -2508401 -1404503 -1306413 -2563477 -3166766 -1869372 -114230 446594 347381 553906
38627 553906 268681 -1358553 -2936467 -2674544 -1343847 -972299 -1539537 -1469447 -678383
38618 -678383 -509701 -1018665 -919669 -177487 -194480 -1242835 -1981908 -1840237 -1769537 -2245181
38608 -2245181 -2508576 -2259028 -2231208 -2582720 -2458583 -1673849 -1150348 -1153438 -737002 462963
38598 462963 1432982 1417539 952542 694561 543378 427191 651642 1012275 833899 247069
38588B47069j23297M01873J55041j5376P17983J195128K07854r96496o46931L84602
38578A527450R8902j039736j035977o8843m7658r13869p12789O69975J145518
38569c77027J58815l81735L91160Q61926K231q34661m18585M17822N96017M48141
38559H64104L80690j02864q67361o33880P05320J212334j60230j569637r62625
38550a134149P59903J190129l7223j082997p37737K81402P22913K39217n81182
38541c79724q60621k15094O96227P77697n4337o58205k47747N74183Q23769M23268
38531H79416n4133k72391k66280k16479l90727p68768o99979K62899J269842J067328
38521H10728O967k92530M56331O48499n23147j574617j055269J86848N22505P3015
$$ plain form
38588 247069 123772 525645 680686 665310 1383293 2578421 2786275 1789779 1142848 1527450
38578 1527450 1626352 586616 -449361 -518204 -565862 -1479731 -2192520 -1522545 -377027
38569 -377027 -218212 -599947 -208787 653139 655370 -179291 -597876 -180054 415963 864104
38559 864104 1244794 1141930 274569 -359311 346009 1558343 1398113 -171524 -1134149
38550 -1134149 -374246 815883 778660 -304337 -1042074 -760672 -37759 201458 -379724
38541 -379724 -1240345 -1455439 -759212 18485 -35852 -694057 -941804 -367621 456148 879416
38531 879416 825283 552892 286612 70133 -320594 -1089362 -1789341 -1526442 -256600 810728
38521 810728 817695 525165 981496 1629995 1106848 -467769 -1523038 -1336190 -813685 -740670
38511g40670M3205M16954J55898o95610q62857J09256J070772R02540m0287n61441
38501b02240j39852N48304M65010n11875j255485p02474N96673J009575M1332
38492a51032r76967q51053p6002L27604M38452P77576R22809J89742q25587q59241
38482a083699M2693N48357J00987l48766K9801P43501R26563N96029L04252J54663
38472B014381j39800n32816o21155l18496q0014k69960n63646l22369M18158P58040
38462C42323J03532p97686o71642M98970J336841R33050l411l37254o2174N0138
38452A392687k49058n71135o83282o03017j95837N09252Q44366K30859p19399
38443d4564p56829K58510J044473O23217m01740p71738k31288L46821K75288j04083
$$ plain form
38511 -740670 -697465 -280511 -124613 -820223 -1683080 -1573824 -503052 399488 359201 -202240
38501 -202240 -342092 206212 671222 159347 -1096138 -1798612 -1201939 -192364 -151032
38492 -151032 -1127999 -1979052 -2055054 -1727450 -1288998 -511422 411387 601129 -224458 -1083699
38482 -1083699 -1041006 -492649 -391662 -740428 -710627 32874 959437 1555466 1859718 2014381
38472 2014381 1874581 1341765 720610 402114 322100 52140 -511506 -833875 -415717 342323
38462 342323 445855 -351831 -1023473 -524503 812338 1745388 1741977 1404723 1342549 1392687
38452 1392687 1143629 572494 -110788 -713805 -909642 -400390 443976 674835 -44564
38443 -44564 -801393 -542883 501590 1124807 723067 -48671 -279959 66862 342150 238067
38433B38067n7403M13493N37906m1620n62380j82734N83385M30705o69434j151483
38423d61498j75009R32353O21243n01574p49136j21629j14612r35667j000548
38414b506077L05025J333249P02536n05871n04428M66410Q11908K13819j54697
38405A61874K59639O91294N34169J54903j2028r7878k89203n39618q46843j015347
38395i99038l90628J073864J853636N56830j535070j640428M65157J805818N39493
38386A729634j366263j366244j02505K88277j15697K20681R59519M17645j000096
38377c35049j026904O13250J565006O82786l40908j87873J5493p05660j085487
38368h05346m5133R91818M31639o52579m18363M99035K57242p57615n69075Q47499
$$ plain form
38433 238067 180664 594157 1132063 1090443 528063 345329 928714 1359419 689985 -461498
38423 -461498 -636507 295846 917089 415515 -333621 -455250 -569862 -1505529 -2506077
38414 -2506077 -2201052 -867803 -165267 -671138 -1175566 -709156 102752 316571 161874
38405 161874 421513 1112807 1646976 1801879 1789851 1691973 1402770 863152 16309 -999038
38395 -999038 -1389666 -315802 1537834 2094664 559594 -1080834 -615677 1190141 1729634
38386 1729634 363371 -1002873 -1105378 -817101 -932798 -712117 247402 665047 -335049
38377 -335049 -1361953 -748703 816303 1499089 1158181 970308 985801 280141 -805346
38368 -805346 -850479 141339 572978 -79601 -497964 1071 258313 -499302 -1068377 -220878
38358b20878J429064M23783o10510n56191k07915l73216m96865l5883M09467K59190
38348B0046j0444J68891M71708L80342L9007j78874k51931k39606p5711J08062
38338D31490Q0555J0255J75985K73212j33868o40949n33825j06174j95152n44758
38328a183229j39475P99701Q80726o7378m98092K66671P78961r9055j148294o99582
38318a109046O52532R91553J6188p13115k53440N51026O05677Q2399j35969J40155
38308H27960J81475n52101j464290j370495q6604J054780Q22809k28624n70981
38299a386071J21533P56654O87291M28155L07799j38605q84957r26504P1444Q51811
38289a11450L33646o88002p44240J70010Q24102N95855R9l09606j62407K75288
$$ plain form
38358 -220878 1208186 1631969 1021459 465268 257353 -115863 -612728 -648611 -239144 20046
38348 20046 9602 178493 650201 1030543 1069550 890676 638745 399139 323428 431490
38338 431490 512045 522300 698285 971497 837629 196680 -337145 -443319 -638471 -1183229
38328 -1183229 -1322704 -523003 357723 290345 -207747 58924 837885 738830 -409464 -1109046
38318 -1109046 -456514 535039 551227 -161888 -415328 135698 741375 823774 687805 827960
38308 827960 1009435 457334 -1006956 -2377451 -2464055 -1409275 -586466 -815090 -1386071
38299 -1386071 -1264538 -507884 179407 607562 915361 776756 -108201 -1034705 -963261 -111450
38289 -111450 222196 -465806 -1210046 -1040036 -215934 379921 380020 70414 -91993 183295
38279A83295N75927K70402m67307p96177l74575P3720l4748j45573L65495Q80715
38269E31174M50702m90876o18998K53191Q91648M88977l31323o85983o51663p46756
38259i09907q43891l38606P48348J443236Q79450m97185j184435l06669J239515
38250B29856J777050Q62780k97953n36827j35079j41224p81386j188518o45115
38241h56416M10811Q91708M26742j81077j28914J62424k35734r94856p18717P47250
38231d76779J623508P41008n83965n93101K22365K41669m84054o41318j38460
38222h9127R6524K71005J187045J891418O74114j567140j969692j45654J096522
38213A445015K40872q97169p75092m97180r10273n41247J313637K352069P83142
$$ plain form
38279 183295 759222 1029624 562317 -233860 -608435 -534715 -569463 -715036 -349541 531174
38269 531174 981876 491000 -127998 125193 1016841 1505818 1174495 488512 -163151 -909907
38259 -909907 -1753798 -2092404 -1344056 99180 978630 481445 -702990 -1009659 229856
38250 229856 2006906 2869686 2571733 2034906 1899827 1758603 977217 -211301 -856416
38241 -856416 -445605 446103 872845 691768 562854 725278 489544 -505312 -1224029 -476779
38231 -476779 1146729 1887737 1303772 710671 933036 1174705 690651 49333 -89127
38222 -89127 7397 278402 1465447 3356865 4030979 2463839 494147 348493 1445015
38213 1445015 1685887 788718 13626 -483554 -1393827 -1935074 -621437 1730632 2513774
38204B513774j420729j625353o41161o88358j285911n55639R21283J066495Q8191
38195a627408p3012O57619O96776N3608J57720P75964K65938j181397j579277
38186a853469n10505L76315L51923L52149O18118L17360k92600j0784P98287N38331
38176F85125n91719p14130L42786P43697J04075R0190R36738O97219r91149j743713
38166d40881m95816N02781l75509j276211k51274J229789Q74728n22357o74361
38157a429111L05590N01842l61903p82977k03330M61266O78489P20804N10603
38148D01273k27661q92111o06592K84528O26315J52694l39613k64869K42368P47496
38138A23828O79616l67019j750978j964950n64471R17585R61221J00239j40634
$$ plain form
38204 2513774 1093045 -532308 -1173469 -1861827 -3147738 -3703377 -2782094 -1715599 -1627408
38195 -1627408 -1700420 -1042801 -346025 -292417 -134697 641267 907205 -274192 -1853469
38186 -1853469 -2363974 -1987659 -1635736 -1283587 -665469 -348109 -640709 -651493 146794 685125
38176 685125 93406 -620724 -277938 465759 569834 660024 1596762 2293981 1302832 -440881
38166 -440881 -936697 -433916 -809425 -2085636 -2336910 -1107121 -232393 -754750 -1429111
38157 -1429111 -1123521 -621679 -983582 -1766559 -1969889 -1508623 -830134 -109330 401273
38148 401273 173612 -718499 -1325091 -1040563 -414248 -261554 -601167 -866036 -623668 123828
38138 123828 803444 436425 -1314553 -3279503 -3843974 -2926389 -1965168 -1864929 -2005563
38129b005563M72400R27380O68051K4191n65474o88849J06588J438971J801093
38120B178788L64695j493344j773055n09996M98116L02222k80570k92944J74614
38111h31474O27889Q84942Q07808J66930q41472j496015j264954l19774P18865
38102a547255J262516J047368K83595m74676p81649n80087m5879N67891Q99440
38093F31264O61877j4348o63437q83470m69709M95911J295462R02818o06434j620181
38083b70247r86899K45743M25553j20868Q2452Q47523O53980l95759n52751L90319
38073C19046O23456l13185n44748O29686J131975l14279j691856r16366P78206
38064b98065J058416J04160m58631m57531m73313Q9087J530719K001249N3228
$$ plain form
38129 -2005563 -1533163 -605783 62268 86459 -479015 -1167864 -1061276 377695 2178788
38120 2178788 2543483 1050139 -722916 -1232912 -734796 -432574 -713144 -1006088 -831474
38111 -831474 -203585 681357 1489165 1656095 814623 -681392 -1946346 -2266120 -1547255
38102 -1547255 -284739 762629 1046224 571548 -210101 -790188 -836067 -268176 631264
38093 631264 1293141 1278793 615356 -268114 -737823 -241912 1053550 1956368 1349934 -270247
38083 -270247 -1257146 -1011403 -585850 -706718 -624266 223257 877237 481478 -71273 319046
38073 319046 942502 629317 84569 714255 1846230 1531951 -159905 -1076271 -298065
38064 -298065 760351 864511 405880 -51651 -524964 -435877 1094842 3096091 3149319
38055C149319k241015j865787M43100J372218K14248o03191K9851M64760k54403
38046G09100p39222J3294R06313P84929M2926o11536j066984r57605J28580J199335
38036D09130P14216p53089r92728K76981Q63170j75875r70148j93240O46368m6256
38026b21471j178851r44390K09100O42469K23310p284J33297P1194j29816k9788
38016a232230J45364M887j27531M8924M455n73154q36680j15438P24979O08261
38006a348163N6962J85230O59991L43594n55229p26813O0335P01044O77676O48151
37996G02778Q95347P10388j59520p41768k75101N25642M83876l57224q96924n42037
37986C45457J32794L05213q6797m99132n82418m19279r1616M42835Q82247N96070
$$ plain form
38055 3149319 908304 -957483 -514383 857835 1072083 468892 498743 963503 709100
38046 709100 -30122 -16828 889485 1674414 1717340 1105804 38820 -918785 -790205 409130
38036 409130 1123346 370257 -622471 -345490 517680 341805 -628343 -821583 -175215 -221471
38026 -221471 -1400322 -2344712 -2135612 -1493143 -1269833 -1277117 -1143820 -1072626 -1202442 -1232230
38016 -1232230 -1086866 -1081979 -1209510 -1160586 -1156131 -1729285 -2565965 -2681403 -1956424 -1348163
38006 -1348163 -1291201 -1105971 -445980 -102386 -657615 -1384428 -1324093 -623049 54627 702778
37996 702778 1598125 2308513 2148993 1407225 1132124 1657766 2141642 1784418 887494 345457
37986 345457 478251 783464 696667 197535 -384883 -804162 -895778 -452943 429304 1025374
37976A025374l90109r50133j97506J064654J231543J16055q51892p50474k40423
37967E7089j15775p7034K72057L66499k77009q46435l62704N55473M71775n42639
37957d98703q20121M30864J833088J660328R6266j130554r61026p3216K62760
37948G99686k10080o29261k83141M83970Q17392M71263k9554k11971j29038L1069
37938A110335K63053M40791J95494n01260r78707n62252N18373J301527J120763
37929B908117J87967p78331j233520j110214o57198j03281M76208R46720R55000
37920A591468K90848o08452r16441l77279L01865L11201k27397m75738o7512L81725
37910B04288J79115l85100l85042L84103J002633O68647j98765o41613m97705
$$ plain form
37976 1025374 635265 -314868 -512374 552280 1783823 1899878 1047986 297512 57089
37967 57089 -58686 -135720 136337 502836 225827 -620608 -983312 -427839 43936 -498703
37957 -498703 -1318824 -887960 945128 2605456 2701722 1571168 610142 536926 799686
37948 799686 589606 -39655 -322796 161174 978566 1449829 1420275 1208304 1079266 1110335
37938 1110335 1373388 1814179 2009673 1508413 529706 -32546 485827 1787354 2908117
37929 2908117 3096084 2317753 1084233 -25981 -683179 -786460 -310252 636468 1591468
37920 1591468 1882316 1273864 357423 -19856 282009 593210 365813 -109925 -177437 204288
37910 204288 383403 -1697 -386739 -2636 999997 1668644 1469879 828266 330561
37901C30561k75035k4309O04994J245916R84789p5960o75764l36914j58499q61205
37891G58574j348256m52125R71470J241785M07880o5810K39767K75990m60056
37882A569219j080925p73946J31105Q73001J047809N18498n09333j195184p67658
37873a87414L52339R32512M42903n33640j194403j036221Q2099J408393J409086
37864A675654l10916j822917j208161N14592P97902m87327r52452L41808J446733
37855e084Q22041l65322m79001J05157K13248r7120j95218k02524l18969p4156
37845e96948N31694M45164o28658j193426j69649J152004R84172k17882o24477
37836c18006J66557R14754Q05747J88054m15330p22755m35374L30559P22366K13742
$$ plain form
37901 330561 55526 31217 636211 1882127 2866916 2790956 2115192 1778278 1619779 758574
37891 758574 -589682 -1041807 -70337 1171448 1579328 1513518 1753285 2029275 1569219
37882 1569219 488294 -285652 -154547 718454 1766263 2284761 1775428 580244 -187414
37873 -187414 164925 1097437 1540340 1006700 -187703 -1223924 -1141825 266568 1675654
37864 1675654 1364738 -458179 -1666340 -1151748 -353846 -841173 -1793625 -1451817 -5084
37855 -5084 816957 451635 -27366 77791 291039 193919 -1299 -203823 -522792 -596948
37845 -596948 -65254 379910 -248748 -1442174 -1611823 -459819 524353 306471 -318006
37836 -318006 -151449 763305 1569052 1757106 1341776 619021 183647 514206 1236572 1450314
37826A450314n01580n41263r6006K19684M51034P32476N35913l48934r60395n46356
37816C94887O5042j72404o60867k03833Q13302R66546O3710p13541o47942q6329
37806a81429M72471O49931M0504r70261r51337N78897J754867P54790j192246
37797I56187j384767K34426J043034j06543j260357o20843Q12426J099817K19729
37788I93109l49036O8334P22473P18879O3569n08348m48136j26444l81786j134203
37778c81589j159613J12648J440137J460077P00940N06913P04901J02794j141678
37769B345530j596814r20170k76479k69502k25858K09869M39013K07049L3377
37760e3985P0856m8774j30085L17500P44419J98510p42007o10153L60581M88464
$$ plain form
37826 1450314 948734 407471 311465 531149 982183 1714659 2250572 1901638 941243 394887
37816 394887 459929 287525 -373342 -577175 236127 1202673 1266383 552842 -95100 -181429
37806 -181429 291042 940973 981477 11216 -940121 -361224 1393643 2148433 956187
37797 956187 -428580 -194154 848880 742337 -518020 -1138863 -326437 773380 993109
37788 993109 644073 712407 1434880 2153759 2217328 1708980 1260844 1134400 752614 -381589
37778 -381589 -1541202 -1428554 11583 1471660 2172600 2679513 3384414 3487208 2345530
37769 2345530 748716 -171454 -447933 -717435 -943293 -733424 -294411 -87362 -53985
37760 -53985 16871 -31903 -161988 155512 899931 1098441 356434 -253719 106862 595326
37750E95326l63400n44183K09229J39609j099409j311135M60640J844254Q76599
37741H07530p22389n08082O44444L85739q67605p83547O99856J268024J11678
37732A035648j003780q37943l13174m29622o45389k00028N06319P07789L85204
37723g94976p463j47036R7560N03002M01033m75156j232740q04916N29243J550559
37713c80890J701395J250963L26648r07501j503477p09529N02848N19855m07511
37704C92801n26221M90226J005072K53055l98550O0069N19764j66640j058275
37695E71301p80690L4908r8801q53530o43632N65753J085000K25723o70717m11522
37685i76207M07112O56298L07635m4392k98289n44209l95869L80326J065663Q03511
$$ plain form
37750 595326 231926 -312257 -103028 36581 -1062828 -2373963 -1913323 -69069 807530
37741 807530 85141 -422941 221503 607242 -260363 -1043910 -344054 923970 1035648
37732 1035648 31868 -806075 -1119249 -1548871 -2194260 -2394288 -1887969 -1180180 -794976
37723 -794976 -802439 -949475 -851915 -348913 52120 -423036 -1655776 -2460692 -1931449 -380890
37713 -380890 1320505 2571468 2898116 1990615 487138 -222391 280457 800312 392801
37704 392801 -133420 356806 1361878 1614933 1216383 1276452 1796216 1629576 571301
37695 571301 -209389 -174481 -273282 -1126812 -1770444 -1204691 -119691 106032 -564685 -976207
37685 -976207 -569095 87203 394838 350446 52157 -492052 -887921 -507595 558068 1361579
37675A361579p8241m98061k06303L0348j69433k47100J51396M32618M9045n07298
37665C18550m79893j05059j85493o54904n78131K97950R48705N20987l26894k95767
37655e39949O62952J177607L16718j062893j325900j09548J238949J335308L30128
37646B023372n40737n89144k56054j55200k35699j66166m883j8725j52639j54285
37636b50160l9376Q131N7219K87757M99780K64885l56636o93670k73492N32133
37626C6571R16184N54323j07159m45835l14821K7216M18404Q16232Q41417k4317
37616B718215j390209j834332o81511O79550M91456p24890q56342M43764J082076
37607g2223j00138j331338o97800Q25315J062668O6536l74985J46253L98487M1673
$$ plain form
37675 1361579 1283338 785277 578974 609322 439889 192789 344185 776803 825848 318550
37665 318550 -161343 -266402 -451895 -1106799 -1684930 -1386980 -438275 82712 -244182 -539949
37655 -539949 123003 1300610 1617328 554435 -771465 -881013 357936 1693244 2023372
37646 2023372 1482635 893491 637437 482237 246538 80372 75489 56764 -95875 -250160
37636 -250160 -289536 -281405 -224186 63571 563351 828236 471600 -222070 -495562 36571
37626 36571 952755 1507078 1399919 954084 639263 666479 1084883 1901115 2742532 2718215
37616 2718215 1328006 -506326 -1187837 -508287 -16831 -741721 -1598063 -1154299 -72223
37607 -72223 -172361 -1503699 -2201499 -1376184 -313516 -246980 -621965 -475712 -77225 -35552
37597c5552P4830O52115O39917k49244q61586o67162n43318q41758n34822P70709
37587a595871J651016R01041n44023r39716l1824J015618J211943M25620p88202
37578A305602j397248p02792N69472Q90360K0552o50150k73674L30130L47467
37569D39719K52922M90492L61602n67486j269552q16256O676L5576l55772j39196
37559a561275M80991N90394K36509Q3400J9482m34853q71047n52538K42904P41206
37549a024827R79702J284761J115517l7344j179701r50384J42678L83916m40527
37540B73791q10679k4111Q05906P03146K11221J84684M20120K27818m27278r51140
37530F13478q46873j71060M21760K17335n94803r11538k19390N15106K52114n45087
$$ plain form
37597 -35552 39278 691393 1331310 1082066 220480 -446682 -990000 -1831758 -2366580 -1595871
37587 -1595871 55145 956186 412163 -527553 -559377 456241 1668184 2093804 1305602
37578 1305602 -91646 -794438 -224966 665394 685946 35796 -237878 92252 439719
37569 439719 692641 1183133 1544735 977249 -292303 -1108559 -1101883 -1066307 -1422079 -1561275
37559 -1561275 -1080284 -489890 -253381 -169981 -150499 -585352 -1456399 -2008937 -1766033 -1024827
37549 -1024827 -45125 1239636 2355153 2317809 1138108 187724 330402 714318 273791
37540 273791 -536888 -560999 244907 948053 1159274 1343958 1764078 1991896 1564618 613478
37530 613478 -233395 -404455 17305 234640 -360163 -1271701 -1491091 -975985 -723871 -1268958
37520a268958p98463n49917m79920l49460M58945J267950P79357o53672j205636
37511b799774k33248Q76600Q65349J26922l77344m04276j17069L99973Q54541
37502h08326Q76648O73577O96231O88733J21863n69377m82996R6482J9450p06153
37492F06132q11726P6183P87736N24761j01758m13293n66681o29146k14951M34287
37482c08456M40814j45825k39593L83692O69140K27061o4361N0707l16646j082819
37472c86286p37862Q56452J457616j71802j948825j504580K80821J003873M65005
37463f85588K05122M73593K72511k60924o2695N92836M04977m94955o41977J56957
37453d0143M80515j91704o72669k40940K54063J02983q8867K97816P71636O76519
$$ plain form
37520 -1268958 -2067421 -2617338 -3097258 -3446718 -2987773 -1719823 -940466 -1594138 -2799774
37511 -2799774 -3033022 -2156422 -1291073 -1164151 -1541495 -1945771 -2062840 -1662867 -808326
37502 -808326 68322 741899 1438130 2126863 2248726 1679349 1196353 1292835 1312285 606132
37492 606132 -205594 -129411 658325 1183086 1081328 668035 101354 -527792 -742743 -308456
37482 -308456 132358 -13467 -253060 130632 799772 1026833 962472 1013179 696533 -386286
37472 -386286 -1124148 -267696 1189920 1018118 -930707 -2435287 -2154466 -1150593 -685588
37463 -685588 -480466 -6873 265638 4714 -57981 534855 939832 444877 -197100 -40143
37453 -40143 440372 248668 -424001 -664941 -410878 -307895 -396762 -98946 672690 1349209
37443A349209K08089j33495k27496p4835K74311L20274l86061j211248j030142
37434i11394J884N36121J34088j22043M31495R49816O43609P5239j8763J5146
37424A735198k80588l25098M51780J243030Q65512l90399j154648r17048m29727
37415G98012l08642k90353K8367N26176Q17730O74237J24524n16632q12440o69284
37405C71695l97496r5704N11853J255569J252103J63766r22200q25991Q803K31999
37395A554397l46165o87043l78153j32717k70998j57519L62022L72936m50847
37386a34087q79056O2602J349268J382763M02590o9274K57901K16211n33767p75649
37376A279502J32770R50716L87802q81457j254239n25809J24422J25898J55822
$$ plain form
37443 1349209 1557298 1423803 1196307 1121472 1395783 1716057 1329996 118748 -911394
37434 -911394 -909510 -373389 -239301 -361344 70151 1019967 1663576 1738815 1720052 1735198
37424 1735198 1454610 1129512 1581292 2824322 3689834 3299435 2144787 1227739 798012
37415 798012 489370 199017 227384 753560 1571290 2245527 2370051 1853419 1040979 371695
37405 371695 -25801 -121505 390348 1645917 2898020 3061786 2139586 1313595 1322398 1554397
37395 1554397 1208232 521189 143036 10319 -260679 -418198 -56176 316760 -134087
37386 -134087 -1013143 -950541 398727 1781490 2184080 2114806 2372707 2588918 2055151 1279502
37376 1279502 1412272 2362988 2750790 1869333 615094 89285 213707 339605 495427
37367D95427O75983J013969M45057n75639r54181l98506K70246J85134n97232
37358E60258j252512j063171o2686J014887J338558O92411k72077o33358k42936
37349G9374K2611n54543j282137p69699R33831J916602Q72289q75974j069789
37340g27435K82625J001165K3361j148462q85386K60317P47259L35314r1642j44857
37330c47741n6942K28493P93450R55237K7201j291388j477834j73405J352075
37321I146J753955Q38199o58864j685292j394592P1700J366342J266884J09063
37312A676541q11475r49029p34606m51953q17L95226L65614J87766L47976M86167
37302E11410m5169p69048o22914J49868J91681p17195j196448m81487M44829N92128
$$ plain form
37367 495427 1171410 2185379 2630436 2054797 1100616 702110 972356 1157490 560258
37358 560258 -692254 -1755425 -1818111 -803224 535334 1227745 955668 322310 79374
37349 79374 101985 -452558 -1734695 -2504394 -1570563 346039 1218328 342354 -727435
37340 -727435 -444810 556355 579716 -568746 -1454132 -1193815 -446556 -111242 -202884 -347741
37330 -347741 -404683 -176190 617260 1572497 1599698 308310 -1169524 -1342929 9146
37321 9146 1763101 2601300 1942436 257144 -1137448 -1065748 300594 1567478 1676541
37312 1676541 865066 -83963 -818569 -1270522 -1271339 -876113 -510499 -322733 25243 511410
37302 511410 466241 -302807 -925721 -775853 -584172 -1301367 -2497815 -2979302 -2534473 -1942345
37292a942345M13767O56835R57075N84082k39038o50801k64169N69812J110821
37283A196039O49529p03683j615344q96815P03317J284768M26262m26515l68590
37274B48968j10512k14644j22478K95998P5267r40621j303870k80707P47375N48857
37264a056367P767K82235O88538K45872k42665K57709P74514l7008j184549p98242
37254a062196N77279Q45533n1056k46263N27566M94389p51779j289833k08996
37245a165356P33570J11064p86918k30321J102104J436439P60879L92087M94597
37236B848145M3882r67689j175833p5569Q88088L04598j074431j298332L1289
37227d75852J157059O18759p21517r89516L5318Q57761O72606K95641L44034P4209
$$ plain form
37292 -1942345 -1528578 -871743 85332 669414 430376 -220425 -484594 85218 1196039
37283 1196039 1845568 1141885 -473459 -1370274 -666957 617811 1044073 617558 248968
37274 248968 138456 -76188 -198666 97332 172599 -768022 -2071892 -2352599 -1605224 -1056367
37264 -1056367 -1048600 -766365 -77827 168045 -74620 183089 957603 920595 -263954 -1062196
37254 -1062196 -484917 360616 309560 63297 590863 1085252 333473 -956360 -1165356
37245 -1165356 -431786 -320722 -1107640 -1337961 -235857 1200582 1961461 2353548 2848145
37236 2848145 2892027 1924338 748505 672936 1561024 1865622 791191 -507141 -475852
37227 -475852 681207 1299966 578449 -411067 -375749 482012 1154618 1450259 1794293 1868502
37217A868502j025100j810128j003966P10048J493517P48123m77570j042367o23460
37208a162401M38778J206862O54020q81213j531895l65331R68638N85753o62811
37199g49600o16054N84197Q20538l14529q91963p6174N08070j98558p54895J90023
37189a498945J391989R95731l85330o34514N50470J265554K63167j351243j707526
37180a110647n27212O96004O16124l12275m54231P20001J684989Q95863q49954
37171A358662j356933j36921R51814M71458o80249q75198p0156N05105K13701
37162C81283m15169n86653j6116R05972J298669N28463r10960j730340j338739
37153a883590m51559N8298K17520M38711O46151N40515K69070K12412L69149M42263
$$ plain form
37217 1868502 843402 -966726 -1970692 -1260644 232873 980996 503426 -538941 -1162401
37208 -1162401 -723623 483239 1137259 256046 -1275849 -1641180 -672542 -86789 -749600
37199 -749600 -1365654 -781457 39081 -275448 -1167411 -1243585 -735515 -934073 -1688968 -1498945
37189 -1498945 -106956 888775 503445 -131069 419401 1684955 1948122 596879 -1110647
37180 -1110647 -1637859 -941855 -325731 -638006 -1092237 -372236 1312753 2208616 1358662
37171 1358662 1729 -135192 816622 1288080 607831 -267367 -337523 167582 381283
37162 381283 -33886 -620539 -636655 269317 1567986 2096449 1185489 -544851 -1883590
37153 -1883590 -2335149 -2276851 -2059331 -1620620 -974469 -433954 -164884 47528 416677 858940
37143H58940L53939K79486K72639J60533j64106m63830k94619L90156Q56709L22014
37133B571861q05028j145231k23676P17428M83590l76606o56398m16572m54341
37124c04973n25892K01270J236384J138723j11609q70680l25492L93310J80792
37115A011833m26102m13377R1591K66403j12947n62824n79879j6168P91445J119432
37105A169407N90493k34674n71526m65964m11840l47365j0729J78467k07941n12937
37095h24609O3569Q91674Q16570J55321J9667J18572o46342j679319j213424N78502
37085a719819J500807P59633j7315K07765L76976k58394o73873j81813K15253
37076B09220j82772m88565j20264Q2753j90718J70125J356215J663490L41075
$$ plain form
37143 858940 1212879 1492365 1765004 1925537 1761431 1297601 1002982 1393138 2249847 2571861
37133 2571861 1766833 621602 397926 1115354 1598944 1222338 565940 149368 -304973
37124 -304973 -830865 -629595 606789 1745512 1633903 763223 437731 831041 1011833
37115 1011833 585731 172354 263945 530348 417401 -145423 -725302 -741470 49975 1169407
37105 1169407 1759900 1525226 953700 487736 75896 -271469 -282198 -103731 -311672 -824609
37095 -824609 -761040 130634 947204 1102525 1122192 1240764 594422 -1084897 -2298321 -1719819
37085 -1719819 -219012 540621 523306 731071 1108047 849653 175780 -6033 209220
37076 209220 26448 -462117 -582381 -499628 -690346 -520221 835994 2499484 2840559
37067B840559q56906o15822k32607r38114j390157j50327J440238J420768M37905
37058A955537J77942K41952n74850j326719l26975J497797J771527N45412l9601
37049C922022M01383R7284j328163j909427o42124P96200O79691l44824o32490
37040A039552K5779N03176J47680m41888l63434K68787K98696q33699j860179
37031a215530j177516O29178J395230O34141J05889O06166O71952l94675q78938
37022C75897K22088J032636J4731j121935m32571O66976J8791j115793k24614
37013e63794J678190J504547n82280j433369j95673P24818J74774j72896N54631
37004A688948Q38270q1887o05308L39162J427983J296669N42680J74650R140k87435
$$ plain form
37067 2840559 1983653 1367831 1135224 197110 -1193047 -1343374 96864 1517632 1955537
37058 1955537 2133479 2375431 1800581 473862 146887 1644684 3416211 3961623 3922022
37049 3922022 4323405 4420689 3092526 1183099 540975 1337175 2016866 1672042 1039552
37040 1039552 1065331 1568507 1716187 1274299 910865 1179652 1478348 644649 -1215530
37031 -1215530 -2393046 -1763868 -368638 265503 371392 977558 1649510 1254835 375897
37022 375897 597985 1630621 1645352 523417 90846 757822 776613 -339180 -563794
37013 -563794 1114396 2618943 2036663 603294 407621 1132439 1307213 1134317 1688948
37004 1688948 2527218 2445331 1840023 2179185 3607168 4903837 5446517 5621167 5630307 5342872
36994E342872k56438K73630N69239J68810n04625j023685j283377j000951j77327
36985B108148K71810k20384n93203J86875J082606O55639k60452q4913L72908
36976C519034o15225j942688j009926J531845K265012M23549j085740o79495j71052
36967B235314p73880q94633M48435J454320P13389l89817l39065Q2594j71435
36958B365222l89261J34236N40813K09920J0804L98337M27526j23218R700R97180
36948D581259J081743l19470j213761k57710J067979J106968N05005M19656M86148
36939G457817J68689N7533L86624L08118j54417L59063J948654K767033K039045
36930A5338159J332446J766079K464225K756061L344694M494182N639915P125540
$$ plain form
36994 5342872 5086434 5360064 5929303 6098113 5593488 4569803 3286426 2285475 2108148
36985 2108148 2379958 2159574 1566371 1753246 2835852 3491491 3231039 3146126 3519034
36976 3519034 2903809 961121 -48805 1483040 3748052 4171601 3085861 2406366 2235314
36967 2235314 1461434 566801 1015236 2469556 3182945 2793128 2454063 2536657 2365222
36958 2365222 1975961 2110197 2651010 2860930 2871734 3270071 3697597 3574379 3584079 4581259
36948 4581259 5663002 5343532 4129771 3872061 4940040 6047008 6552013 6971669 7457817
36939 7457817 7626506 7684039 8070663 8378781 8224364 8583427 10532081 13299114 15338159
36930 15338159 16670605 18436684 20900909 23656970 27001664 31495846 37135761 44261301
36922D4261301R460422J1215601J1350407J2694443J8042122K3884215K4953764
36915A55862275K4472798L0881841M3301752N0670428M8028365M1292413L0453363
36908D24963235L145334m2570925q1431701q5091108n7657039k9803934j9878550
36901A11675312j8710073j3638392p994628r134072j2831435j1078662n694116
36894C2593934l470209m299181l569189j544877j734409l339163k975220j344833
36886A0316853j420765k197731o44457J891306J429430j601854k890168j297236
36878C585378n589n74731q43561M92419J504267N56488j041063j349986m95886
36869A827736J80503J35258j39605n0365L54929L07879o82573j670446j201553
$$ plain form
36922 44261301 53721723 64937324 76287731 88982174 107024296 130908511 155862275
36915 155862275 180335073 211216914 254518666 305189094 353217459 394509872 424963235
36908 424963235 428108569 385537644 304105943 219014835 161357796 131553862 111675312
36901 111675312 92965239 79326847 71332219 62198147 49366712 38288050 32593934
36894 32593934 29123725 24824544 21255355 19710478 17976069 14636906 11661686 10316853
36886 10316853 8896088 6698357 6053900 7945206 9374636 7772782 4882614 3585378
36878 3585378 3579789 3005058 2161497 2653916 4158183 4714671 3673608 2323622 1827736
36869 1827736 2008239 2143497 2003892 1953527 2308456 2616335 1933762 263316 -938237
36860i38237L54959J032169L14601j03781N52315O98907n24123j282540j46058
36851d1788J208987P80493l91304l12788L65750j76504j311821r86146N52593
36842c12528J131788K87465l28154K7141L78021K75508M55798J003996R12849
36833C831884j29044j106340j138381l65526O48505J364181J322402O72163K27432
36824E327276K44699l8568q36199j022586n7369O97276P3696q84453p52461j94524
36814B556787n57079j227275p08132N91715R93973L08189k69137l88889n13291
36805G86861l19300N98358J083447j16355j790167j686214p8589O94046p697n28892
36795a364502o5048L13903L1106j58506m2683k64105m81675L27976J463269J022503
$$ plain form
36860 -938237 -583278 448891 763492 659711 1212026 1910933 1386810 104270 -41788
36851 -41788 1167199 1947692 1556388 1243600 1609350 1432846 121025 -865121 -312528
36842 -312528 819260 1106725 778571 805712 1183733 1459241 1915039 2919035 3831884
36833 3831884 3702840 2596500 1458119 1092593 1741098 3105279 4427681 5099844 5327276
36824 5327276 5571975 5533407 4697208 3674622 3617253 4314529 4388225 3503772 2751311 2556787
36814 2556787 1999708 772433 64301 656016 1649989 1958178 1689041 1300152 786861
36805 786861 467561 1065919 2149366 2033011 242844 -1443370 -1521959 -827913 -835610 -1364502
36795 -1364502 -1429550 -1115647 -1084541 -1243047 -1285730 -1549835 -2031510 -1703534 -240265 782238
36785G82238p35893j330277m4951Q63550j9454j066852o47325K66852K78663J8297
36775a635152M50017P40985o1228q72989k62918R89449J122511J93518l33313
36766C30880n7373J51417q1866k93562k80226k32535j04098J23880N3931l44803
36756g34355k94740M92680R74879L70115l43658J05475J115348J047110k85239
36747B447615j465774j531867q44787j04373L26185K78282l3299P3041P64580
36738i0397J089046L02870p87620r41983l43497m3532r4731K62785Q91996Q24482
36728A069419j6066o01669l92573R9650L59805L30844o1252o75061o96627K94393
36718b89137J181908P64119j30509Q4462P88046j9779j913360k061884J58280
$$ plain form
36785 782238 46345 -1283932 -1328883 -465333 -484787 -1551639 -2198964 -1932112 -1653449 -1635152
36775 -1635152 -1185135 -444150 -505378 -1378367 -1641285 -651836 470675 664193 330880
36766 330880 273507 424924 343058 49496 -230730 -463265 -567363 -443483 -389552 -734355
36756 -734355 -1029095 -536415 438464 808579 464921 570396 1685744 2732854 2447615
36747 2447615 981841 -550026 -1394813 -1499186 -1173001 -894719 -928018 -854977 -90397
36738 -90397 998649 1301519 513899 -428084 -771581 -815113 -909844 -647059 244937 1069419
36728 1069419 1053353 451684 59111 158761 518566 849410 788158 113097 -583530 -289137
36718 -289137 892771 1656890 1526381 1610843 2398889 2379110 465750 -1596134 -1437854
36709a437854J663321L66646j499641j063167O83103R63574j03627k70765N86693
36700a11717N43685m98749n64042N69559P15997p48056j484488j25027J300370
36691d02468P32333n74622l45581R70078J259634K96781l06899m2489j0251o26151
36681I50365r03503k91634L79866K26272n25616j018115o90843L12106J135241
36672d25861R08138n2348l90311K99167O28634m12653j592983j237160J36884
36663b138493Q21444O92421Q21235R77486M9436j291168j086860N19443J167843
36654E32787J43939m85005L71641Q38402m83109j766185r42945P48132Q58984
36645a83359k56176l88399O49652J050301L99774J30196N56181K26792j186890
$$ plain form
36709 -1437854 225467 592113 -907528 -1970695 -1287592 -324018 -427645 -698410 -111717
36700 -111717 431968 -66781 -630823 -61264 654733 -93323 -1577811 -1702838 -402468
36691 -402468 329865 -244757 -590338 379740 1639374 1936155 1629256 1586767 1576516 950365
36681 950365 46862 -244772 135094 361366 -164250 -1182365 -1873208 -1561102 -425861
36672 -425861 482277 429929 39618 338785 967419 554766 -1038217 -2275377 -2138493
36663 -2138493 -1317049 -624628 196607 1174093 1223529 -67639 -1154499 -635056 532787
36654 532787 676726 191721 563362 1401764 918655 -847530 -1790475 -1042343 -183359
36645 -183359 -439535 -827934 -178282 872019 1271793 1401989 1958170 2184962 998072
36636I98072j824929n38663J093486J026778l33428r50678j26669P69744M20929
36627E34642o77617r92551m0560R16905N24550p76146j323406o14225R5614k4750
36617b377544l4241Q83557J542494N00774j237532j394722O1894Q42537l2631
36608a245414q11858k2426J177279J035455r06k68120L41321M57298k92888o77594
36598c07853L7359Q35879M78937o75161j243978p28217M0167K60526J22050J10157
36588a070134P8324l18984o98092l58409M52033O70953O4892k68706L83001J072976
36578G854N84979n75928q09212J89664R13094J75618j211594j477720j02712J583682
36568g22275J929193P28170o97058j075251m96518R0715K62435L16282L31703
$$ plain form
36636 998072 -826857 -1365520 -272034 754744 421316 -529362 -656031 113713 534642
36627 534642 -142975 -1135526 -1176086 -259181 265369 -510777 -1834183 -2448408 -2352794 -2377544
36617 -2377544 -2411785 -1528228 14266 515040 -722492 -2117214 -2055320 -1212783 -1245414
36608 -1245414 -2057272 -2079698 -902419 133036 132130 -135990 205331 662629 369741 -307853
36598 -307853 -270494 565385 1044322 369161 -874817 -1603034 -1562867 -1302341 -1180291 -1070134
36588 -1070134 -991810 -1310794 -2008886 -2367295 -1915262 -1244309 -1179417 -1448123 -1065122 7854
36578 7854 592833 16905 -792307 -602643 310451 486069 -725525 -2203245 -2305957 -722275
36568 -722275 1206918 1935088 1238030 162779 -333739 -243024 19411 335693 667396
36559F67396L0113l57333j84780L45755J94279p35590j093374j61451Q16638M90566
36549A2219n20800p10380P1093Q29127J121507J141332P83720L4653l55253J6641
36539B423859J55154p55482j575117q34354O40784Q70892p1636l71105L06966
36530G89961M60209l03581n81165J08361M49415j07160l45674K24163K79339p25589
36520B48279j200894j37505R79371P20117K04369R87515K088272J451951o84458
36511D657017k137329j868294p71282J80714P80021Q58829L24432k21508j88144
36502A614456m3394m70742r42432m99769M21372M41135o00088j327499p81468
36493b188429M80095J365634J378420O82962j21862k88049K83647O50935r969
$$ plain form
36559 667396 697509 340176 155396 501151 695430 -40160 -1133534 -1294985 -478347 12219
36549 12219 -508581 -1218961 -1147868 -318741 802766 1944098 2727818 2762471 2407218 2423859
36539 2423859 2579013 1823531 248414 -585940 54844 925736 854100 482995 789961
36530 789961 1250170 946589 365424 473785 923200 816040 470366 694529 973868 248279
36520 248279 -952615 -1090120 -110749 609368 813737 1801252 3889524 5341475 4657017
36511 4657017 2519688 651394 -119888 60826 840847 1699676 2024108 1802600 1614456
36502 1614456 1571062 1100320 157888 -341881 79491 520626 -79462 -1406961 -2188429
36493 -2188429 -1708334 -342700 1035720 1718682 1596820 1308771 1592418 2243353 2233384
36484B233384j071311j180486j91874N98627K35117p35879j130244n48601L39082
36475a452185O19148J04322m54515k57013M90796Q67112N79510K56452K09248
36466I62875j15730r49329j452942r21870Q2671N99635N22625K38390j63089m87483
36456a684247j17627R49296J580218J013473L2144l75806n07198q76177p93315
36447g79239L62894J404967P85440q15079j316583l10752O44677O25454K66092
36438H67871N6682l34080p63074m57626M10584O19614j67389q34646o04692J2394
36428a194362M24323O84179O71681L7222o65635l55752O39466O97262m82989j157404
36418g02009k69265Q64683P52033K1324J06762Q82533J104783L66336o93014j468715
$$ plain form
36484 2233384 1162073 -18413 -210287 388340 623457 -112422 -1242666 -1791267 -1452185
36475 -1452185 -833037 -728715 -1183230 -1440243 -949447 -82335 497175 753627 962875
36466 962875 847145 -102184 -1555126 -2476996 -2394325 -1794690 -1272065 -1033675 -1196764 -1684247
36456 -1684247 -1801874 -852578 727640 1741113 1773257 1397451 890253 14076 -779239
36447 -779239 -416345 988622 1774062 958983 -357600 -668352 -23675 601779 867871
36438 867871 924553 590473 -172601 -630227 -219643 399971 232582 -602064 -1206756 -1194362
36428 -1194362 -770039 -85860 585821 623043 -42592 -398344 241122 938384 455395 -702009
36418 -702009 -971274 -106591 645442 666766 773528 1656061 2760844 3127180 2434166 965451
36408I65451j628193r41039J97780P66135M20899J800O8177L7520m07164l88978
36398i07612N22572J068345J85420j007111q00153M42648R98825M52188j70304
36389G84818l69648m55174k92627L90024Q08544J01607q48871n76319L33323O1514
36379f2809j148780j172711K70110R61317N9582l66083Q52429J561313p4907k013683
36369a134222j323268J062179J820592M05339o44978j77709J91883m65470p40556
36360a006210K62731J114293N35649m73359n36628j15722k04542l85108Q7040
36351g21856N74665K22748k73068J23072P81593N22887j19829J46461Q23140L53690
36341B433503r31527j117272l4785L10125p75537j325334k2824J423623Q83383
$$ plain form
36408 965451 -662742 -1603781 -1406001 -639866 -218967 -217167 -148990 -111470 -518634 -907612
36398 -907612 -385040 683305 868725 -138386 -938539 -495891 502934 955122 784818
36389 784818 415170 -40004 -332631 57393 865937 967544 118673 -457646 -124323 -62809
36379 -62809 -1211589 -2384300 -2114190 -1152873 -1093291 -1459374 -606945 954368 879461 -1134222
36369 -1134222 -2457490 -1395311 425281 830620 185642 7933 199816 -265654 -1006210
36360 -1006210 -743479 370814 906463 433104 -103524 -219246 -423788 -808896 -721856
36351 -721856 -147191 75557 -197511 -74439 707154 1230041 1110212 1256673 2079813 2433503
36341 2433503 1501976 384704 349919 660044 -115493 -1440827 -1463651 -40028 843355
36332H43355r55124j785387r04313N21585J482162J731701J082053k76163j203507
36323E36362q02592K00456N04390J27936n3472m5068m49529r11568n52894K65462
36313a180517L43196k52161k43336N48452P63038j80347j024705o59892K86671
36304a599601O78499M58789J57770j09055k86220K3944P41592R29352R7405q39252
36294B53223p46823K00537R33274Q50903J12759q09896j219686n20283Q10578
36285a35414J265674J53489j242197j258009l2044R17770Q35199L29112O6150
36276H99730k1437j55904k44208k01343j51718j78061k65330m41621o13246m59968
36266a833106R2776N70020N74437L82357L94946M07673Q9315k27521o6895K08896
$$ plain form
36332 843355 -111769 -1897156 -2801469 -2279884 -797722 933979 2016032 1739869 536362
36323 536362 -266230 -65774 438616 566552 513080 468012 18483 -893085 -1445979 -1180517
36313 -1180517 -837321 -1089482 -1332818 -784366 -21328 -201675 -1226380 -1886272 -1599601
36304 -1599601 -921102 -462313 -304543 -413598 -699818 -675874 65718 995070 1092475 253223
36294 253223 -493600 -293063 640211 1491114 1603873 793977 -425709 -945992 -135414
36285 -135414 1130260 1283749 41552 -1216457 -1248501 -330731 504468 833580 899730
36276 899730 878293 722389 478181 276838 125120 -52941 -318271 -759892 -1373138 -1833106
36266 -1833106 -1740330 -1170310 -595873 -213516 181430 589103 678418 450897 384002 592898
36256E92898r2268o86803n96838K25459O55994Q0370o76167o11517N8649M05612
36246f44611J25016k99878m55317m15715m01436m28174l00709J96206R75043J451401
36236a98174R94888k08826j057507o59045N75860J312824P66483m68784j141238
36227h3519p07586K02068O31473L48942j31412l65084l86668l12738q4733J50891
36217g38366l4745n81959o20750L46545J328240R17054n88742j292112k79676
36208a544511J010435P93339n52639j139569l19944N53213K76140n19176n12895
36199a955607L05420P75291L71925j45262k6813L66114K25981m66481r74372q46452
36189b370256l48741J26977N53260R73338J107349O12595l53718j109714j091262
$$ plain form
36256 592898 500630 -186173 -783011 -557552 98442 178812 -497355 -1108872 -1050223 -644611
36246 -644611 -519595 -819473 -1274790 -1690505 -2091941 -2520115 -2820824 -2624618 -1649575 -198174
36236 -198174 796714 587888 -469619 -1128664 -552804 760020 1526503 1057719 -83519
36227 -83519 -791105 -589037 42436 391378 259966 -105118 -491786 -804524 -889257 -738366
36217 -738366 -773111 -1355070 -1975820 -1629275 -301035 616019 27277 -1264835 -1544511
36208 -1544511 -534076 259263 -293376 -1432945 -1752889 -1199676 -923536 -1442712 -1955607
36199 -1955607 -1650187 -874896 -502971 -648233 -675046 -308932 -82951 -549432 -1523804 -2370256
36189 -2370256 -2718997 -2592020 -2038760 -1065422 41927 654522 300804 -808910 -1900172
36180a900172m42908J56243L03193L40789P67433J300586J059826j37220j248835
36171A98935j261772m96476k13j8061O6009M61625O60775M51893K28056O8503
36161C59274m26025j004066o46833P04315J440231L95851j234950j450693k87121
36152b150017M55344O6011k29633M48586J160453P71556k12813n61171k42817
36143d94501k06996o33933o60223Q1054P24911M36900l21112m48762K24377P48883
36133e49402M49004j48168j38041M40089O90841J48896o38534r35920o68807j79494
36123a529536L54107Q30474R56894N87741Q0930j53095k22702m11999n62975l88779
36113d58940j34592j96238k59460K95777J123340J045361j99949j252094q04513
$$ plain form
36180 -1900172 -2343080 -2186837 -1883644 -1542855 -775422 525164 1584990 1447770 198935
36171 198935 -1062837 -1559313 -1559526 -1577587 -1511578 -1049953 -389178 62715 290771 359274
36161 359274 -66751 -1070817 -1717650 -1013335 426896 822747 -412203 -1862896 -2150017
36152 -2150017 -1694673 -1628662 -1858295 -1409709 -249256 522300 309487 -251684 -494501
36143 -494501 -701497 -1335430 -1995653 -1914599 -1189688 -752788 -1073900 -1522662 -1298285 -549402
36133 -549402 -100398 -248566 -386607 53482 744323 893219 254685 -681235 -1350042 -1529536
36123 -1529536 -1175429 -344955 611939 1199680 1280610 1127515 904813 492814 -70161 -458940
36113 -458940 -593532 -789770 -1049230 -753453 369887 1415248 1215299 -36795 -841308
36104h41308O41134J428717Q02242l94643r40108n51927O8763J13782n13337j081947
36094a268632p73451L44575J256647J113569K06843m66032m39877j72042k11536
36085d09936m34673l51473J08163M95301N00587L47964L56331M06707K05120j03891
36075A120200j02407J35132P0491l20414l18825L40978P84828K64611n22387m26699
36065A025508K67750K45669o53776j077569k85956P12371P66691J52445k54763
36056H98370l48358m14829k74761J77283L23527k01067n51852J09012J003783
36047G21108P02729o46160j460097r75051M794O05764P65181N02298k87526j028023
36037a094983q13626O9116L52712q0291J07929J194285J394158l21107k047927
$$ plain form
36104 -841308 -200174 1228543 2030785 1636142 696034 144107 212870 326652 -186685 -1268632
36094 -1268632 -2042083 -1697508 -440861 672708 879551 413519 -26358 -198400 -409936
36085 -409936 -844609 -1196082 -1087919 -592618 -92031 255933 612264 1018971 1224091 1120200
36075 1120200 1017793 1152925 1223416 903002 584177 925155 1709983 1974594 1452207 1025508
36065 1025508 1293258 1538927 885151 -192418 -478374 233997 1000688 1153133 898370
36056 898370 550012 135183 -139578 37705 361232 160165 -391687 -282675 721108
36047 721108 1423837 777677 -682420 -1657471 -1652677 -1046913 -281732 220566 -66960 -1094983
36037 -1094983 -1908609 -1839493 -1486781 -1567072 -1459143 -264858 1129300 808193 -1239734
36028a239734j458950O63337J566045N82259k69072K74692R75215M69824n19389
36019A044227n30226L54213Q31258K94153o45168j192727j134352p41304m18520
36010b138446l03203l3575P26743J490825J350319L66476k74071R2034O51001
36001A928103M20555k92160n64088l40347k78973n10071n06955l4773N48443Q35118
35991A204852O39116k6011p00626o42845J04124L74811m95532j325790o23058
35982a490959R77099J393081J79894p96036j97919R21042R82672K09010j57280
35973B020604K9230j03691p33069j042529n75721J46510M78550L75695J29640
35964G25219q2538k50796m47249o92271p42139k58906N70891R82618N97271L8477
$$ plain form
36028 -1239734 -2698684 -2035347 -469302 112957 -156115 118577 1093792 1563616 1044227
36019 1044227 514001 868214 1699472 1993625 1348457 155730 -978622 -1719926 -2138446
36010 -2138446 -2441649 -2475224 -1748481 -257656 1092663 1459139 1185068 1277102 1928103
36001 1928103 2348658 2056498 1492410 1152063 873090 363019 -143936 -178709 369734 1204852
35991 1204852 1843968 1817957 1117331 474486 578610 953421 457889 -867901 -1490959
35982 -1490959 -513860 879221 1059115 263079 65160 986202 1968874 2177884 2020604
35973 2020604 2049834 1946143 1213074 170545 -405176 -258666 219884 595579 725219
35964 725219 642681 391885 -55364 -747635 -1489774 -1748680 -1177789 -195171 402100 440577
35954D40577O8106M73548M61810q7598m79924k53856K66992N37360M15406J25894
35944A968315p7588j58806l35175p11085q42326j84088Q09912Q23759m78331j551918
35934g37331r05745O97761J239998K62412p58447p57369k50636P1068L49309N81801
35924b07179J19393r72723j346652k85802Q97041O75676l53498m51819N26222
35915a399341J037181L37682n53820o41013k77928j72169k03411M7881M02769
35906a422169M22948J04465l11022p20686q99333m19233O15213J268709Q62077
35897d99031k8857l23698J19263N03666L27657j11497l75785l63215r7943L37422
35887e12018N99665M02238Q5274K24006N89399L01278o92049j168058l05294R22051
$$ plain form
35954 440577 508683 982231 1444041 1356443 876519 622663 889655 1427015 1842421 1968315
35944 1968315 1890727 1731921 1396746 685661 -156665 -340753 469159 1292918 814587 -737331
35934 -737331 -1643076 -945315 294683 557095 -201352 -958721 -1209357 -1138289 -788980 -207179
35924 -207179 -87786 -1060509 -2407161 -2692963 -1795922 -1120246 -1473744 -1925563 -1399341
35915 -1399341 -362160 -24478 -578298 -1219311 -1497239 -1669408 -1872819 -1824938 -1422169
35906 -1422169 -999221 -894756 -1205778 -1926464 -2825797 -3245030 -2629817 -1361108 -499031
35897 -499031 -527888 -851586 -732323 -228657 99000 -12497 -388282 -751497 -849440 -512018
35887 -512018 87647 489885 575159 799165 1388564 1689842 997793 -170265 -475559 446492
35877D46492R54080j69006r01715m11427L87010L48078k82914m51721O8692M58212
35867D45781J20269n60316q68279o22409j12137M29871Q81439R71102M66409l36209
35857H15521p46752m97019o3535O4658L6935J55169J56887l35319r03150p42040
35847b058645M0394M78567K52739R7998L63266L36994l15586o48702j2667N82281
35837h83361O7456o81631j92067R52581Q85011m03122r67348j31863N48067J72289
35827f33988k1982P97122J262275K02706j062345q08696K40249L27269k99275
35818C335j64971M81896J20327j018154j037824L67653J273457O70707q5273J54577
35808G65730M57867k41924j085144o79653O57882J456855J044618j74163j566410
$$ plain form
35877 446492 1400572 1231566 329851 -81576 305434 653512 370598 -81123 -12431 445781
35867 445781 566050 5734 -862545 -1484954 -1597091 -1167220 -285781 685321 1151730 815521
35857 815521 68769 -428250 -491785 -427127 -390192 -235023 -78136 -413455 -1316605 -2058645
35847 -2058645 -2018251 -1539684 -1286945 -1188947 -825681 -488687 -804273 -1452975 -1465642 -883361
35837 -883361 -815905 -1497536 -1689603 -737022 147989 -255133 -1222481 -1354344 -806277 -633988
35827 -633988 -655970 141152 1403427 1606133 543788 -264908 -24659 302610 3335
35818 3335 -161636 320260 440587 -577567 -1615391 -1247738 25719 696426 611153 765730
35808 765730 1223597 981673 -103471 -783124 -125242 1331613 2376231 2202068 635658
35799F35658k359665j719692J32660J555702J313581J77195k99478O4944L04324
35790a94771J07187M1924K48603K36252r121R1382N41657N42963k36572j027224
35780C42280r96072k62056M90076Q32112O61479N542p41014p98452J46069J213887
35770H93851J096948l11061j555431j263668J72014J088604O30690l25704n40867
35761a14624m1861J87966k63026p58655o01028J17466P45430P71872K44983k82146
35751F377l17065n6668j04541m40282l58254K37553M53315M119K7638J128674
35741E80866J808161N95308j226499j267568J90237O70511l88016r05208J5488
35732G3280N74830k96765r19541K6527R93248L13538p77084l23300R49378J018915
$$ plain form
35799 635658 -1724007 -3443699 -3311039 -1755337 -441756 -264561 -564039 -499095 -194771
35790 -194771 -87584 -45660 202943 439195 430074 521456 1063113 1606076 1369504 342280
35780 342280 -653792 -915848 -425772 406340 1067819 1073361 332347 -466105 -320036 893851
35770 893851 1990799 1679738 124307 -1139361 -967347 121257 751947 426243 -114624
35761 -114624 -156485 31481 -231545 -990200 -1591228 -1473762 -728332 43540 288523 6377
35751 6377 -310688 -367356 -471897 -912179 -1270433 -1032880 -579565 -575446 -547808 580866
35741 580866 2389027 2984335 1757836 490268 680505 1351016 963000 57792 73280
35732 73280 648110 351345 -568196 -541669 451579 765117 -11967 -335267 614111 1633026
35722A633026k9322n60429k75923q4483l1777K80586J75446q10693j188241L14486
35712e77324J928323J180622q85820j221326J46454L41101j168571j686315j89929
35703b132785R49504L77868o902R97187J399362j75801j483606l31283J482119
35694A075663J082587p58692j185068k8861L87486n74672j099430j71252J074659
35685a97580J426257R37312P0368p99113j033948l66076L00171M4984n34268l48459
35675e00352K17833J1399p19472o67409K77678Q76461N67581L5686k11510l26270
35665d38375k21228L59959R08612O83421J02484K06438Q33018P94146j52624r79599
35655B096252j081646q70594o12617r7777L92552J73124n75394q76948m67488
$$ plain form
35722 1633026 1603704 1043275 767352 682869 651092 931678 1107124 296431 -891810 -577324
35712 -577324 1350999 2531621 1645801 424475 570929 912030 -256541 -1942856 -2132785
35703 -2132785 -1183281 -805413 -812315 184872 1584234 1408433 -75173 -406456 1075663
35694 1075663 2158250 1399558 214490 185629 573115 -1557 -1100987 -1272239 -197580
35685 -197580 1228677 2165989 2236357 1437244 403296 37220 337391 382375 -151893 -500352
35675 -500352 -282519 -271120 -990592 -1658001 -1380323 -503862 63719 99405 -112105 -438375
35665 -438375 -659603 -299644 608968 1292389 1394873 1601311 2434329 3228475 3075851 2096252
35655 2096252 1014606 144012 -468605 -566382 -173830 -706 -576100 -1453048 -1920536
35646a920536m7726M1926J74334M09737L68736J98717M34496Q56630P23425J27260
35636A366999j54887r7182l47343p83887o09186J10473M39431J15950k71349m91999
35626g22980o17800j44025J118639J779793N94294j040109q23770N95231N43427
35617A282700r85710j148360O66897J481587j25715j396816j63175J340987L90997
35608A343392j544282j478488J14599O62441M8323Q1555O83480L07207o30553
35599d12326l21999Q66336Q34060m27949p88259J78733N53257l57657r13828k53033
35589a042665L43295L912l82841j85802j7644R78N77692J201316L29271j567627
35579g40115j871734J27496J767740J087515k78970j48020P34167N54911k63549
$$ plain form
35646 -1920536 -1968262 -1926336 -1752002 -1342265 -973529 -774812 -340316 516314 1239739 1366999
35636 1366999 1212112 1114930 767587 -16300 -625486 -515013 -75582 40368 -230981 -722980
35626 -722980 -1340780 -1484805 -366166 1413627 2007921 967812 144042 739273 1282700
35617 1282700 296990 -851370 -184473 1297114 1171399 -225417 -388592 952395 1343392
35608 1343392 -200890 -1679378 -1564779 -902338 -854015 -772460 -88980 218227 -412326
35599 -412326 -734325 132011 966071 538122 -250137 -71404 481853 124196 -789632 -1042665
35589 -1042665 -699370 -695458 -1078299 -1264101 -1281745 -1280767 -703075 498241 827512 -740115
35579 -740115 -2611849 -2484353 -716613 370902 91932 -56088 678079 1232990 969441
35570I69441j88986M84406L75191l47103m40222O1672J70770k7303K27978N12648
35560A798492j23095j061246q38808K56218M86661m15055q08557L6759P89384
35551A20753M24258j50580J25092O25490K91087m15325k72823N82548P47448l06814
35541A771134j378248j188347q7707N20640R8783m31417j20327O74124R36881
35532G95516N32843K39331L61521L13590j84409m73187n0701N16658M49351j32109
35522B368404o19454q34493q44351m72746K24819N63563J50528l13790m5621N10453
35512F87312L77227l67429p89531o02950l55357k64753Q875M37378N16781J70416
35502a82031j56403l38377n94695o74461l7607J016904J402370O91924l27771
$$ plain form
35570 969441 780455 1264861 1640052 1292949 852727 914399 1085169 1057866 1285844 1798492
35560 1798492 1675397 614151 -224657 31561 518222 103167 -705390 -668631 120753
35551 120753 545011 394431 519523 1145013 1436100 1020775 747952 1330500 2077948 1771134
35541 1771134 392886 -795461 -883168 -362528 -263745 -695162 -815489 -141365 795516
35532 795516 1328359 1567690 1929211 2242801 2058392 1585205 1534504 2051162 2500513 2368404
35522 2368404 1748950 914457 70106 -402640 -177821 385742 536270 222480 176859 687312
35512 687312 1064539 697110 -92421 -695371 -1050728 -1315481 -1306606 -869228 -352447 -182031
35502 -182031 -338434 -676811 -1271506 -1945967 -1983574 -966670 435700 1127624 799853
35493G99853p77119n83755j26466K09163L3051o11962p94089K55240J573721J313990
35483A291627m86052j495942k73907J552607J538021k20836j494853j071680R6171
35474e64844P24164O73996L38718k17219r26792j319840j050836l98512J61276
35465b579889N22551P61336P50881M00966O1294J94156O46164O89836j6708q50555
35455E80032r56244l65223Q4752q1759m51656n19710l74217j94992K76558J080872
35445i21587J411916O04211n86978q06960q1892K63922k29941m91059J12000N73406
35435a52962j3091p56105l47256P23534Q84103l7600o52352k67808K55488J99817
35425a64232R4568M77886P55018K15939o37161p84451k18929J73035J0514j94600
$$ plain form
35493 799853 22734 -561021 -687487 -478324 -445273 -1057235 -1851324 -1596084 -22363 1291627
35483 1291627 805575 -690367 -964274 588333 2126354 1905518 410665 -661015 -564844
35474 -564844 159320 833316 1172034 954815 28023 -1291817 -2342653 -2741165 -2579889
35465 -2579889 -2057338 -1296002 -545121 -144155 -82861 111295 757459 1447295 1430587 580032
35455 580032 -376212 -741435 -656683 -738442 -1190098 -1709808 -2084025 -2279017 -2002459 -921587
35445 -921587 490329 1094540 507562 -299398 -381290 -117368 -347309 -838368 -726368 -152962
35435 -152962 -166053 -922158 -1269414 -545880 338223 300623 -351729 -619537 -364049 -164232
35425 -164232 -69664 408222 1163240 1379179 742018 -42433 -261362 -88327 -77813 -272413
35415b72413k0375K70878K89722J07305M5889K23824M75563M97603L9421p74140
35405H83277j299106r07042K13787J086557R41461j2609r09673j103086o15705
35396a722139O8432N05715O67445Q14603R28084N46265m28640j085068m99845
35387b05148O54907O23237q94825j912032q18583J144976J519419J09962r18112
35378f96199l36562O22707N50119n9049n0879L81553K96895k12208k45768K72175
35368E22784M73777J1868m16701j84190L91545N29484q5483r87657j350699q09153
35358a904425O0070M02532K48735L44089O97633L63664p91178j316036k31250
35349b126166J186336J103082j38808o45316R8424P15904L29328k98698l51709
$$ plain form
35415 -272413 -292788 -21910 267812 375117 421006 644830 1120393 1617996 1657417 883277
35405 883277 -415829 -1322871 -1109084 -22527 918934 906325 -3348 -1106434 -1722139
35396 -1722139 -1653707 -1147992 -480547 334056 1262140 1808405 1379765 294697 -205148
35387 -205148 449759 1072996 178171 -1733861 -2552444 -1407468 111951 221913 -696199
35378 -696199 -1032761 -410054 140065 81016 30137 411690 708585 496377 250609 522784
35368 522784 996561 1008429 591728 407538 799083 1328567 1243084 255427 -1095272 -1904425
35358 -1904425 -1844355 -1441823 -1193088 -848999 -151366 212298 -578880 -1894916 -2126166
35349 -2126166 -939830 163252 24444 -620872 -522448 193456 522784 224086 -127623
35340a27623j31383r1009p566K56646K74471m7762o6298N17272J040970Q87004
35330B504722K95245k81954q04230j173437r94165l09776J90343J45092m0780
35321d68940o9599k00169m61091l45489K67388P79749Q64129Q54776Q26907L84336
35311B431997k71421l40048L1084l38361j508139j795764l62509J165354J050108
35302F2301k4780m27110k91854p82922j574537j262289J17965J039443Q75116
35293b268667N07677M92140L30992j72305l86676p8899J18458j37715l59067j72425
35283b126487J41877L29598N41883Q29904R60953Q01530L13305n83263j473199
35274b63899j305914K20026J680998J570455M16131j59536N692k50176j006374
$$ plain form
35340 -127623 -259006 -350015 -357581 -100935 173536 125774 59476 576748 1617718 2504722
35330 2504722 2799967 2518013 1713783 540346 -453819 -763595 -573252 -428160 -468940
35321 -468940 -538539 -738708 -1199799 -1545288 -1277900 -498151 365978 1220754 2047661 2431997
35311 2431997 2160576 1820528 1851612 1513251 5112 -1790652 -2153161 -987807 62301
35302 62301 37521 -389589 -681443 -1464365 -3038902 -4301191 -4183226 -3143783 -2268667
35293 -2268667 -1760990 -1268850 -937858 -1110163 -1496839 -1575738 -1457280 -1594995 -1954062 -2126487
35283 -2126487 -1984610 -1655012 -1113129 -283225 677728 1479258 1792563 1209300 -263899
35274 -263899 -1569813 -1349787 331211 1901666 2317797 2158261 2163953 1913777 907403
35265I07403j022456o9394N13393R6441k65317J60601N46744J72672k54924j1389
35255G73774K89341q7599n54222j79151P19581J042321L78116p76808j673443
35246f8090j632602m81358Q24935R03084k19037r30605k25499J009241J459092
35237F39161R68157K7441j035392j577692p10895J170862K205599J429274N7738
35228C174253n61481p33976r65323n35432P51875J155562m29648j995240j153812
35219a293222Q53985R49628p36776j086050P44965J895044N34350j302980j241689
35210f82745j07992J37144k45861R8437P48578L08372q59356j108708k62325K95780
35200a678676J04607J29170O43176N95530l50610q79847n0846J082367J019146
$$ plain form
35265 907403 -115053 -184447 328946 425387 160070 320671 867415 1040087 785163 773774
35255 773774 1063115 975516 421294 242143 961724 2004045 2382161 1605353 -68090
35246 -68090 -1700692 -2182050 -1357115 -454031 -673068 -1603673 -1829172 -819931 639161
35237 639161 1607318 1634759 599367 -978325 -1689220 -518358 1687241 3116515 3174253
35228 3174253 2612772 1878796 913473 378041 1129916 2285478 1855830 -139410 -1293222
35219 -1293222 -439237 510391 -226385 -1312435 -567470 1327574 1861924 558944 -682745
35210 -682745 -790737 -653593 -899454 -801017 -52439 255933 -603423 -1712131 -1974456 -1678676
35200 -1678676 -1574069 -1444899 -801723 -206193 -556803 -1436650 -1487496 -405129 614017
35191F14017M0689l92923M8553K37418m18979r34722k65286J013602J445678P09826
35181B097873r9397k18967k19895p75194j286387o85417P86257J662573J158292
35172B419738N7990n55335n98778n33849l70078J01348N11500K29825n78698r69508
35162b85845m79406K15893K55532k04967k55404M28706J059061P76797j52400
35153A357967o37226j57685O28609Q06038K82478l40907o17327n50753k75928
35144D95266Q2746L06169K32392j4455k38982m75391p28787o55290l5993O03807
35134d28518N32581o8132k95042N4455J27073n36324j062150m92948O36830R24564
35124f07611O5177p52008n08187L94797Q95171O73212K61644Q3186j1632k33648
$$ plain form
35191 614017 654706 261783 310336 547754 128775 -805947 -1071233 -57631 1388047 2097873
35181 2097873 1998476 1779509 1559614 784420 -501967 -1187384 -401127 1261446 2419738
35172 2419738 2477728 1922393 1323615 789766 419688 521036 1032536 1262361 683663 -285845
35162 -285845 -765251 -549358 -293826 -498793 -754197 -325491 733570 1510367 1357967
35153 1357967 720741 563056 1191665 1997703 2280181 1939274 1321947 771194 495266
35144 495266 578012 884181 1116573 1102118 863136 387745 -341042 -996332 -1032325 -428518
35134 -428518 104063 35931 -259111 -204656 -77583 -613907 -1676057 -2169005 -1532175 -607611
35124 -607611 -542434 -1294442 -1802629 -1407832 -512661 160551 422195 505381 493749 260101
35114B60101l83066j53420L50532P11743P18040M80671Q6905m78985r87327r86063
35104c80869m59607o8405k83084n92331j80697P68408J184759O00428k26037m84751
35094a22186m08790o14265q74650l98449P75069J481215Q39549n53434j289309
35085a165250p85130J87244N93066L11485k7891o2143m6255k04579k87769o8104
35075a555326J62820O9397n2276L16181R61022J094633N41878L3330K0952p0247
35065A522364q26567j659308j484876l51023N44790N51903L65603O95480R62180
35056C20546K19528j035768j146012L94682J942944J726485J58313q51791n37505
35047A191422k3058l24688q59367o19601J20905K90787l02320q24290p51657l99429
$$ plain form
35114 260101 -122965 -276385 74147 785890 1503930 1984601 2071506 1592521 605194 -380869
35104 -380869 -840476 -908881 -1191965 -1784296 -1964993 -1196585 -11826 588602 362565 -122186
35094 -122186 -530976 -1145241 -2019891 -2418340 -1643271 -162056 677493 124059 -1165250
35085 -1165250 -1950380 -1763136 -1170070 -858585 -886476 -948619 -994874 -1199453 -1487222 -1555326
35075 -1555326 -1392506 -1323109 -1375385 -1059204 -98182 996451 1538329 1571659 1592611 1522364
35065 1522364 695797 -963511 -2448387 -2799410 -2254620 -1702717 -1337114 -641634 320546
35056 320546 540074 -495694 -1641706 -1247024 695920 2422405 2580718 1728927 1191422
35047 1191422 1168364 843676 -15691 -635292 -514387 -223600 -525920 -1350210 -2101867 -2501296
35037b501296j26284J09868K96518K69808K35355N96325J038518O46895o33891
35028f8184j482966q43609N29399J006658K32176n53657l02237N60159R24954
35019B693M90541n3385j27899j0952k54533o70313m44587N95132J386707Q73792
35009A787196m62526j090446m35956M52720N28444J59977K62621O74422L81673
35000B258125q06441j748319j389481q7291Q58044O92740j01102n01734r0185
34991i15644N69226O36137j5909o49214n21024K76785R52002Q62646J05050o46556
34981F53499p54817j57449N65286P05256J34093n23899n41425P9496N57131K31342
34971I48513n73739q84816l87988L1327m44350j113138n24714J239525K240797
$$ plain form
35037 -2501296 -2627580 -2517712 -2221194 -1951386 -1716031 -1119706 -81188 565707 -68184
35028 -68184 -1551150 -2394759 -1865360 -858702 -626526 -1180183 -1482420 -922261 2693
35019 2693 493234 439849 311950 300998 46465 -623848 -1068435 -473303 913404 1787196
35009 1787196 1324670 234224 -201732 250988 779432 939409 1202030 1876452 2258125
35000 2258125 1451684 -296635 -1686116 -1773407 -915363 -222623 -323725 -825459 -915644
34991 -915644 -346418 289719 273810 -375404 -896428 -619643 332359 1195005 1300055 653499
34981 653499 -101318 -258767 306519 1011775 1145868 621969 80544 160040 717171 948513
34971 948513 374774 -510042 -898030 -866703 -1311053 -2424191 -2948905 -1709380 531417
34962E31417J257173m00557p04080L04000R06165L64984l87720n60444m05741
34953I05197j75828K89071O09696J5251j101536j308638m08879M3673o56940r97025
34943b785958K38042J703470J503674J88795k82770K80446L44220n21739j025149
34934c56969m59129L02120N16050O36199J079607J267247N85200o23539j537454
34925A409332j636290q23704M53811J163979O46232l79041o86379l14430l09690
34916d76180p95388p34957J79950Q98075P35106L35080K91367J52823l99803o36042
34906d49969l3308N69946J74441p76320j062641m57450J28689o69n48773o70019
34896c126073J38968J363348J722363O97314l86010R4052J479394J388729p42727
$$ plain form
34962 531417 1788590 1388033 683953 987953 1894118 2259102 1871382 1310938 905197
34953 905197 729369 1018440 1628136 1643387 541851 -766787 -1175666 -1131993 -1788933 -2785958
34943 -2785958 -2547916 -844446 659228 848023 565253 845699 1189919 668180 -356969
34934 -356969 -816098 -513978 2072 638271 1717878 2985125 3570325 2946786 1409332
34925 1409332 -226958 -1050662 -596851 567128 1213360 834319 147940 -166490 -476180
34916 -476180 -1271568 -2006525 -1826575 -928500 -193394 141686 433053 585876 186073 -449969
34906 -449969 -483277 86669 261110 -515210 -1577851 -2035301 -1906612 -1907281 -2456054 -3126073
34896 -3126073 -2987105 -1623757 98606 795920 409910 503962 1983356 3372085 2629358
34887B629358k476233j728162L31019J193237N02079j24793J24749M89848K57582
34878A198684m19294j149932j523194r88106L53612J243213P03525m90229r49908
34869b021629o70226n29243m77359R5781P06714L94228k87810Q7745J240600J371830
34859h9369J54212o50936r9565N72268L18807p2848J68646K74257l49526o74275
34849d48329O6103O76129K1500p34588o4439J009511M61744j095054j169184L82957
34839h93650Q76710q24688k248729j040391J482344K397833J250713m4984m27800
34830E27358o04587r90633q15017K55871J166855R39580Q4417k42416J70139N89322
34820A080889N22633J90248n2756k03667m32294o95405o69550j04912P04187R91357
$$ plain form
34887 2629358 153125 -1575037 -1244018 -50781 451298 326505 451254 941102 1198684
34878 1198684 779390 -370542 -1893736 -2881842 -2528230 -1285017 -581492 -1071721 -2021629
34869 -2021629 -2691855 -3221098 -3698457 -3602676 -2895962 -2501734 -2789544 -2701799 -1461199 -89369
34859 -89369 64843 -586093 -685658 -113390 205417 132569 301215 575472 225946 -448329
34849 -448329 -382226 293903 315403 -419185 -483624 525887 987631 -107423 -1276607 -893650
34839 -893650 -16940 -841628 -3090357 -4130748 -2648404 -250571 1000142 955158 527358
34830 527358 -77229 -1067862 -1882879 -1627008 -460153 479427 563844 321428 491567 1080889
34820 1080889 1603522 1793770 1741014 1537347 1105053 409648 -259902 -364814 339373 1330730
34810A330730L83959m51363n56707l0033R3965n39420r65962l49960P32468J172884
34800H20561Q35202L45256m8655m26206m74677O2618N28701J23478o86298p88537
34790B91443k81220k39769o60487l64791P28748J097507J24412o93034j66055
34781a63246O22708K46812o26464n05252L36392M97697o9280k33042R7195n3480
34771A50040o52266n35516M39551R36425K95967m15410j28534P33211J109807
34762A933275O48850l03550j184553j345814n47106M57379O65113K16948P8052
34753F18594L80323L18325k37561m48131j19035j44661q22171j134780m34287
34744b023384M36041N33316K24083L32913Q10356J061972Q26209J07905r34869
$$ plain form
34810 1330730 1714689 1263326 706619 676586 770551 231131 -734831 -1084791 -352323 820561
34800 820561 1655763 2001019 1952364 1526158 1051481 1114099 1642800 1766278 1079980 291443
34790 291443 10223 -229546 -890033 -1254824 -526076 571431 695843 2809 -163246
34781 -163246 459462 706274 79810 -425442 -89050 408647 339367 106325 203520 150040
34771 150040 -502226 -1037742 -598191 338234 634201 218791 90257 823468 1933275
34762 1933275 2582125 2278575 1094022 -251792 -798898 -341519 323594 540542 618594
34753 618594 998917 1317242 1079681 631550 512515 367854 -454317 -1589097 -2023384
34744 -2023384 -1587343 -1054027 -829944 -497031 313325 1375297 2201506 2309411 1374542
34735A374542j570117r87876K92478P19852P127k83594O97425J481104N40828
34726B271769j180999j642695o44299L04889M25412K91711L46939L42896J93155
34717G08778J32073O5995k21047l98391q9290K53744q372n01228l71887K42791
34707a86834M17059p0799n55774o67420o04137l32729L62198J039739R19510J31257
34697D52070l69781k49897j57419m57018o00346j19828N65884P78618M48204l135
34687B87352k41527k28655j06484q062J04498K89248K88907j96082p61784n69613
34677a142202K58414M44134n24847j256619l59307J319115J764338O19641n58468
34668E64199o57841j45466J82540J99330k2305m71075p06989j58712Q26056J176993
$$ plain form
34735 1374542 -195575 -1183451 -890973 -171121 -163994 -447588 249837 1730941 2271769
34726 2271769 1090770 -551925 -1196224 -891335 -465923 -174212 172727 515623 708778
34717 708778 840851 906846 685799 287408 198118 451862 443490 -57738 -429625 -186834
34707 -186834 230225 159426 -396348 -1063768 -1667905 -2000634 -1638436 -598697 320813 452070
34697 452070 82289 -167608 -325027 -782045 -1382391 -1502219 -936335 -157717 290487 287352
34687 287352 45825 -182830 -289314 -297376 -192878 96370 385277 189195 -572589 -1142202
34677 -1142202 -883788 -439654 -964501 -2221120 -2580427 -1261312 503026 1122667 564199
34668 564199 -93642 -239108 -56568 142762 120457 -350618 -1057607 -1216319 -390263 786730
34658G86730N68171j97470m14605j92403J38980L73980J07641q60013j642985
34649a331974r77591Q31752J848514R72970n55928q87240M2477P60584M31643
34640A135207j91176l3836P33136Q42242l68327j806904j763394j77168J091216
34631e39004O83425m82323o87277J71921Q14457O30878J57214j88863m74109m73544
34621c87225J25224P16865K91730q69457j245052j45973J286754J520608L03563
34612A597037j288233j837141o89722J235204J992498P40977j070454j521713
34604h41547o28018J85342K97955J40608j23427m94759k79039Q51820J516293
34595F25228M11391j125647q06696P58927Q12949r51756j784268m70699Q05365
$$ plain form
34658 786730 1354901 1157431 742826 550423 689403 1063383 1171024 311011 -1331974
34649 -1331974 -2309565 -1477813 370701 1343671 787743 -99497 -57020 703564 1135207
34640 1135207 944031 910195 1643331 2485573 2117246 310342 -1453052 -1630220 -539004
34631 -539004 144421 -337902 -1025179 -853258 -38801 592077 749291 560428 86319 -387225
34621 -387225 -262001 454864 746594 -122863 -1367915 -1513888 -227134 1293474 1597037
34612 1597037 308804 -1528337 -2218059 -982855 1009643 1750620 680166 -841547
34604 -841547 -1469565 -1284223 -986268 -845660 -969087 -1463846 -1742885 -891065 625228
34595 625228 1036619 -89028 -895724 -136797 676152 -275604 -2059872 -2530571 -1725206
34586a725206M25335q6754P14271J357425K42464j160899o42234R83943J223133
34577A331478j46269j071297n12126N24337Q92547M58621l81658r85939o84551
34568e74857K67933O74857J66878j44165L04985L70822o55660j413892o53151
34559a656250N17034M93738j35890N5385N72259J2000j088190r52465L96298J188044
34549e98037P49490J31709K4316K4912o1670K8283L6029m69794r48380n73720
34539a656862K68145O20659N84079P69159P74497o5142j031784r53012k00536
34530h90797P4999L7772N19060R99722M52459m38133k76158L86299m4135j099010
34520b77922q76615M43441P37406k85521n54193O18163J353151O38107m8806K62624
$$ plain form
34586 -1725206 -1299871 -1386625 -672354 685071 927535 -233364 -875598 108345 1331478
34577 1331478 1185209 113912 -398214 126123 1018670 1477291 1095633 109694 -574857
34568 -574857 -306924 367933 534811 390646 695631 1066453 410793 -1003099 -1656250
34559 -1656250 -1139216 -645478 -781368 -725983 -153724 -141724 -1229914 -2182379 -1786081 -598037
34549 -598037 151453 283162 307478 332390 270720 299003 335032 -134762 -1083142 -1656862
34539 -1656862 -1388717 -768058 -183979 585180 1359677 1294535 262751 -690261 -890797
34530 -890797 -815798 -778026 -258966 740756 1193215 755082 478924 865223 821088 -277922
34520 -277922 -1154537 -711096 26310 -259211 -813404 -195241 1157910 1796017 1747211 2009835
34510B009835K51998r30004j694376o80231P46937O65240m07811o53826J68434
34501e23804P95567N41180j72682p16397o39315J60055R41558O62816m72940j078761
34491e02723o11535l9371o1231j64570K1891N2960o9600L25868R32477N03181
34481C87347p51205r59610K50935P67093m65222j374078j76212J439163J022691
34472A40902n94523q09334M78504J060336K27395m63176j08770L97109L84757
34463G13200L91804O72721N36868k52830q51820o55892j38871O4368o917o6099
34453D06532q4734q9092l297J57468L08156M35447M25012M7895n56026q18573
34443B28788n13313n3753K67575N95374P51536J75775q42204j030549k9467P54978
$$ plain form
34510 2009835 2261833 1331829 -362547 -1042778 -295841 369399 -38412 -692238 -523804
34501 -523804 271763 812943 640261 -76136 -715451 -555396 386162 1048978 576038 -502723
34491 -502723 -1114258 -1153629 -1214860 -1379430 -1357539 -1304579 -1374179 -1048311 -115834 387347
34481 387347 -363858 -1323468 -1072533 -305440 -770662 -2144740 -2320952 -881789 140902
34472 140902 -453621 -1262955 -784451 275885 503280 40104 -68666 328443 713200
34463 713200 1105004 1777725 2314593 2061763 1209943 554051 415180 479548 472631 406532
34453 406532 321798 232706 229409 386877 695033 1130480 1555492 1603387 1047361 228788
34443 228788 -284525 -338278 -70703 524671 1276207 1451982 609778 -420771 -450238 304740
34433C04740K03165p61582p06772P2992L09811q8412k03443J68506M70016O20394
34423C89415Q68128P98899o9424j000328p95740L02429Q29464J94522o61631p45160
34413A10574r1430O63102R15419L71486n75698r95625o12831l09903o53653p36870
34403a915429L35233J601741J434487N3438q11337n07121j9260j0075j3875K01040
34393C48842R0768l84555l54875M70260J068508N51704n30349r94794n30387J52041
34383a12837L20883J7099n1930N72364J274922R56813l15269j077520m86565L77707
34373A475667J79837o38982p85078k73575j29350m87377o14141m44198m58713
34364b175910l42509N14652J399924J002503l13609q68003l50990j45443p34266
$$ plain form
34433 304740 507905 -253677 -960449 -887457 -577646 -666058 -869501 -700995 -230979 389415
34423 389415 1257543 2056442 1987018 986690 190950 493379 1322843 1517365 855734 110574
34413 110574 19144 682246 1597665 1969151 1393453 397828 -215003 -524906 -1178559 -1915429
34403 -1915429 -1580196 21545 1456032 1509470 698133 191012 171752 161677 147802 348842
34393 348842 439610 55055 -299820 170440 1238948 1790652 1260303 265509 -264878 -112837
34383 -112837 208046 225145 173215 745579 2020501 2977314 2662045 1584525 1097960 1475667
34373 1475667 1655504 1016522 231444 -42131 -171481 -658858 -1272999 -1717197 -2175910
34364 -2175910 -2518419 -2003767 -603843 398660 85051 -782952 -1133942 -1279385 -2013651
34355b013651r17804j52886M39236K03929O7749N22777M80137n82209j179873
34346c132595j12572J369399J425771L84433j44222J32502L01831J44125J02243
34337D70915j9380n51802p09719L19402J495074J133544k71449o28375L26606
34328A564816N93057n84419j288021k19664R12160J97696j163362q14575P29577
34319g2735Q48307q28636j772440o33523Q21147Q88069N03236R85454J387670
34310B126549L40108j075273r01859K31918J7736j563559k043016m76560J075152
34301b268804Q78425q2395k07409K94761M61277L49616L47396J29868l92416m22932
34291i12613K21031L91241l58358o14545N10290J471835O52900q37830r11960
$$ plain form
34355 -2013651 -2931455 -3084341 -2645105 -2441176 -2373427 -1850650 -1370513 -1952722 -3132595
34346 -3132595 -3245167 -1875768 -449997 -65564 -209786 -77284 224547 368672 470915
34337 470915 451535 -100267 -809986 -490584 1004490 2138034 1866585 1238210 1564816
34328 1564816 2157873 1573454 285433 65769 977929 1175625 12263 -802312 -72735
34319 -72735 775572 -53064 -1825504 -2459027 -1637880 -749811 -246575 738879 2126549
34310 2126549 2466657 1391384 489525 721443 739179 -824380 -2867396 -3343956 -2268804
34301 -2268804 -1390379 -1472774 -1680183 -1385422 -924145 -574529 -227133 -97265 -489681 -912613
34291 -912613 -691582 -300341 -658699 -1273244 -762954 708881 1361781 523951 -388009
34282c88009J24731L25334n76482j038986m97445L5254L8574R3506M08958N23940
34272i50625M46396N15185L69725l83714r31061l77368M51190K22565n12080k91004
34262a440791N03482L26364n21540k94699R12614J145569N1170n21541J41457
34253C02085N39245p1634m35055L7470R5934p17538r18908J24586P95141O3824
34243a84850p23736m42349j24638n88425n60738Q18262J877923J039006m47787
34234F62668o88038k08305m18567p61365m8656Q30743L46466o72183l21796R20932
34224c58101R20101m03385r25500J19432J030694M70171p38938j155538m41900
34215a482964P98443J614874J121099m75444j507266p90659N26440N43850n18547
$$ plain form
34282 -388009 -263278 62056 -514426 -1553412 -2050857 -2015603 -1977029 -1883523 -1474565 -950625
34272 -950625 -504229 10956 380681 -3033 -934094 -1311462 -860272 -637707 -1149787 -1440791
34262 -1440791 -937309 -610945 -1132485 -1427184 -514570 630999 682169 160628 302085
34253 302085 841330 769696 334641 372111 468045 -249493 -1168401 -1043815 -248674 -184850
34243 -184850 -908586 -1350935 -1475573 -2063998 -2624736 -1806474 71449 1110455 662668
34234 662668 -25370 -233675 -652242 -1413607 -1462263 -631520 -285054 -957237 -1279033 -358101
34224 -358101 562000 158615 -766885 -647453 383241 853412 114474 -1041064 -1482964
34215 -1482964 -684521 930353 2051452 1576008 68742 -721917 -195477 348373 -170174
34206a70174q41626l0656M21837k66711j052663r03756j21611N89170J003092
34197a373098R76786L81143k99786l55846P0470K83835K59272M27931N10338p7510
34187H03535q52017p62282N4560N14628M55329O29332R14333L78628p17449r30575
34177D88022n7926L82750k72311p22529q8955M86457o8248p35820j37003R94205
34167B68642R34335k05267o95248L1453O27442J03896o76254m63116M80548Q63097
34157A269528K37029n14459n13783K2875L07006Q0943k71459m47138m98124m51103
34147g78685k05976J33594L25786M15994N77767O00348K30161r0372K09745N91845
34137B010207M5620r08423n42583J182673J948177M55839j372857j272032n9072
$$ plain form
34206 -170174 -1011800 -1042456 -620619 -887330 -1939993 -2843749 -2965360 -2376190 -1373098
34197 -1373098 -396312 -15169 -314955 -670801 -600331 -316496 -57224 370707 881045 803535
34187 803535 -48482 -810764 -756204 -241576 213753 843085 1757418 2136046 1418597 488022
34177 488022 430096 812846 540535 -181994 -270949 215508 147260 -588560 -725563 268642
34167 268642 1202977 997710 302462 333915 961357 1065253 388999 -74117 406431 1269528
34157 1269528 1506557 992098 478315 501190 808196 889139 617680 170542 -327582 -778685
34147 -778685 -984661 -851067 -525281 -109287 468480 1068828 1298989 1208617 1418362 2010207
34137 2010207 2055827 1147404 604821 1787494 3735671 4191510 2818653 1546621 1487549
34128A487549O555r76847j009417K10827Q83253K77130k52764J45392M90156l4896
34118A226938o67474n41319m9133J05758k0889j58081l20633k85906L12330J008547
34108F10138Q16926j63362p21385m18490j20612k82339k04355M24894P24446J26989
34098G92850o02684o53147l30518k03635j59160J7010J37425K39401O37123R32438
34088H07103K75551r19767j056555J53237R16828P2462j048235p84657K78774
34079a305259N04294j48130l86365J95551P73900P85123M16828j14025o67366
$$ plain form
34128 1487549 1494104 517257 -492160 -281333 601920 879050 626286 771678 1261834 1226938
34118 1226938 559464 18145 -30988 74770 53881 -104200 -424833 -710739 -398409 610138
34108 610138 1427064 1263702 542317 123827 3215 -279124 -483479 -58585 665861 792850
34098 792850 190166 -462981 -793499 -997134 -1156294 -1139284 -1001859 -762458 -125335 807103
34088 807103 1082654 162887 -893668 -740431 176397 248859 -799376 -1584033 -1305259
34079 -1305259 -800965 -949095 -1335460 -1139909 -366009 419114 835942 721917 54551
$$ [...]
##END NTUPLES=NMR SPECTRUM
##END=
