##TITLE=31Pdec_3-2025-Bay
 CDCl3, 24 sc
 10.12.2024
##JCAMPDX= 6.0         $$ Bruker NMR JCAMP-DX V2.0
##DATA TYPE= NMR SPECTRUM
##DATA CLASS= NTUPLES
##ORIGIN= UXNMR, Bruker Analytische Messtechnik GmbH
##OWNER= root
$$ XWIN-NMR		Version 3.5
$$ Fri Jan 10 14:18:18 2025 Russian Standard Time (UT+4h)  she@DPX200
##.OBSERVE FREQUENCY= 81.013821
##.OBSERVE NUCLEUS= ^31P
##.ACQUISITION MODE= SIMULTANEOUS
##.ACQUISITION SCHEME= undefined
##.AVERAGES= 24
##.DIGITISER RES= 17
##SPECTROMETER/DATA SYSTEM= spect
##.PULSE SEQUENCE= zgpg30
##.SOLVENT NAME= D2O
##.SHIFT REFERENCE= (INTERNAL, D2O, 0, 198.062)
##AUDIT TRAIL= $$ (NUMBER, WHEN, WHO, WHERE, WHAT)
$$ ##TITLE= Audit trail, XWIN-NMR		Version 3.5
$$ ##JCAMPDX= 5.01
$$ ##ORIGIN= Bruker BioSpin GmbH
$$ ##OWNER= she
$$ F:/spectra/data/she/nmr/P31/2/pdata/1/auditp.txt
$$ ##AUDIT TRAIL=  $$ (NUMBER, WHEN, WHO, WHERE, WHAT)
(   1,<2025-01-10 14:17:25.25 +0400>,<she>,<DPX200>,
      <created by zg, POWCHK disabled, PULCHK disabled
       configuration hash MD5:
       00 E9 B6 7A A2 85 ED C7 34 08 36 98 17 FE 4E 26
       data hash MD5: 32K
       70 59 12 E0 F5 1F E2 D5 CE B7 93 F5 2C B9 04 BF>)
(   2,<2025-01-10 14:17:27.64 +0400>,<she>,<DPX200>,
      <Start of raw data processing
       efp BC_mod = 2 LB = 1.5 FT_mod = 6 PKNL = 1 PHC0 = 1938.212 PHC1 = 542.8856 SI = 64K 
       data hash MD5: 64K
       AE 02 1A 4E 6F 28 AE 80 4A 9C 75 E5 87 D9 DB 5F>)
(   3,<2025-01-10 14:17:43.90 +0400>,<she>,<DPX200>,
      <pk PHC0 = 90.63961 PHC1 = -216.8 
       data hash MD5: 64K
       4E 55 EC 84 AF B5 98 7B F7 59 E5 DB D8 FD D8 E9>)
(   4,<2025-01-10 14:17:51.53 +0400>,<she>,<DPX200>,
      <abs ABSG = 5 
       data hash MD5: 64K
       C9 8E 73 21 5C F6 83 5F 93 8E A0 89 BE A7 54 65>)
$$ ##END=
$$ 
$$ hash MD5
$$ C9 5E AF A6 1C F5 94 2F B0 B4 6D 72 B1 E7 E3 D0
##$RELAX= 
##$RELAX= 
##$RELAX= 
##$RELAX= 
##$RELAX= 
##$RELAX= 
##$RELAX= 
##$RELAX= 
$$ Bruker specific parameters
$$ --------------------------
##$DU= <F:/spectra>
##$EXPNO= 2
##$NAME= <P31>
##$PROCNO= 1
##$TYPE= <nmr>
##$USER= <she>
##$AMP= (0..31)
100 100 100 100 100 100 100 100 100 100 100 100 100 100 100 100 100 100 
100 100 100 100 100 100 100 100 100 100 100 100 100 100 
##$AQSEQ= 0
##$AQ_mod= 1
##$AUNM= <au_zg>
##$AUTOPOS= <>
##$BF1= 81.014009
##$BF2= 200.13
##$BF3= 200.13
##$BF4= 200.13
##$BF5= 200.13
##$BF6= 200.13
##$BF7= 200.13
##$BF8= 200.13
##$BYTORDA= 1
##$CFDGTYP= 0
##$CFRGTYP= 5
##$CHEMSTR= <none>
##$CNST= (0..31)
1 1 145 1 1 1 1 1 1 1 1 1 1 1 1 1 1 1 1 1 1 1 1 1 1 1 1 1 1 1 1 1 
##$CPDPRG= <waltz16>
##$CPDPRG1= <>
##$CPDPRG2= <waltz16>
##$CPDPRG3= <>
##$CPDPRG4= <mlev>
##$CPDPRG5= <mlev>
##$CPDPRG6= <mlev>
##$CPDPRG7= <mlev>
##$CPDPRG8= <mlev>
##$CPDPRGB= <>
##$CPDPRGT= <>
##$D= (0..31)
0 1 0 0 0 0 0 0 0 0.06 0 0.03 2e-05 3e-06 0 0 0.0002 0 0 0 0 0 0 0 0 0 
0 0 0 0 0 0 
##$DATE= 1736504244
##$DBL= (0..7)
120 120 120 11 120 120 24 19 
##$DBP= (0..7)
150 150 150 150 150 150 150 150 
##$DBP07= 0
##$DBPNAM0= <>
##$DBPNAM1= <>
$$ [...]
##$SUBNAM3= <"">
##$SUBNAM4= <"">
##$SUBNAM5= <"">
##$SUBNAM6= <"">
##$SUBNAM7= <"">
##$SUBNAM8= <"">
##$SUBNAM9= <"">
##$SW= 400.765351723535
##$SWIBOX= (0..15)
0 1 3 0 0 0 0 0 0 0 0 0 0 0 0 0 
##$SW_h= 32467.5324675325
##$TD= 32768
##$TD0= 1
##$TE= 0
##$TE2= 300
##$TE3= 300
##$TEG= 300
##$TL= (0..7)
0 120 53 12 22 120 120 120 
##$TP= (0..7)
150 150 150 150 150 150 150 150 
##$TP07= 0
##$TPNAME0= <>
##$TPNAME1= <>
##$TPNAME2= <>
##$TPNAME3= <>
##$TPNAME4= <>
##$TPNAME5= <>
##$TPNAME6= <>
##$TPNAME7= <>
##$TPOAL= (0..7)
0.5 0.5 0.5 0.5 0.5 0.5 0.5 0.5 
##$TPOFFS= (0..7)
0 0 0 0 0 0 0 0 
##$TUNHIN= 0
##$TUNHOUT= 0
##$TUNXOUT= 0
##$USERA1= <user>
##$USERA2= <user>
##$USERA3= <user>
##$USERA4= <user>
##$USERA5= <user>
##$V9= 5
##$VALIST= <valist>
##$VCLIST= <CCCCCCCCCCCCCCC>
##$VD= 0
##$VDLIST= <DDDDDDDDDDDDDDD>
##$VPLIST= <PPPPPPPPPPPPPPP>
##$VTLIST= <TTTTTTTTTTTTTTT>
##$WBST= 1024
##$WBSW= 4
##$XGAIN= (0..3)
0 0 0 0 
##$XL= 0
##$YL= 0
##$YMAX_a= 2548
##$YMIN_a= -2991
##$ZGOPTNS= <>
##$ZL1= 120
##$ZL2= 120
##$ZL3= 120
##$ZL4= 120
##$ABSF1= 198.0616
##$ABSF2= -202.7028
##$ABSG= 5
##$ABSL= 3
##$ALPHA= 0
##$AQORDER= 0
##$ASSFAC= 0
##$ASSFACI= 0
##$ASSFACX= 0
##$ASSWID= 0
##$AUNMP= <proc_1d>
##$AZFE= 0.1
##$AZFW= 0.5
##$BCFW= 0
##$BC_mod= 2
##$BYTORDP= 0
##$COROFFS= 0
##$CY= -3
##$DATMOD= 1
##$DC= 0
##$DFILT= <>
##$DTYPP= 0
##$F1P= 0
##$F2P= 0
##$FCOR= 1
##$FTSIZE= 65536
##$FT_mod= 6
##$GAMMA= 0
##$GB= 0
##$INTBC= 1
##$INTSCL= 9.790993e-09
##$ISEN= 30
##$LB= 1.5
##$LEV0= 0
##$LPBIN= 0
##$MAXI= 10000
##$MC2= 0
##$MEAN= 0
##$ME_mod= 0
##$MI= 50
##$NCOEF= 0
##$NC_proc= -8
##$NLEV= 6
##$NOISF1= 182.463
##$NOISF2= 159.3651
##$NSP= 0
##$NTH_PI= 0
##$NZP= 0
##$OFFSET= 198.0616
##$PC= 4
##$PHC0= 2028.852
##$PHC1= 326.0856
##$PH_mod= 1
##$PKNL= yes
##$PPARMOD= 0
##$PSCAL= 0
##$PSIGN= 0
##$REVERSE= no
##$SF= 81.0140089999434
##$SI= 65536
##$SIGF1= 159.3651
##$SIGF2= -187.1042
##$SINO= 113.3802
##$SIOLD= 16384
##$SREGLST= <1H.CDCl3>
##$SSB= 0
##$STSI= 65536
##$STSR= 0
##$SW_p= 32467.5324675325
##$SYMM= 0
##$S_DEV= 0
##$TDeff= 32768
##$TDoff= 0
##$TI= <>
##$TILT= no
##$TM1= 0
##$TM2= 0
##$TOPLEV= 0
##$USERP1= <user>
##$USERP2= <user>
##$USERP3= <user>
##$USERP4= <user>
##$USERP5= <user>
##$WDW= 1
##$XDIM= 65536
##$YMAX_p= 287699160
##$YMIN_p= -53580027
$$ End of Bruker specific parameters
$$ ---------------------------------
##NTUPLES= NMR SPECTRUM
##VAR_NAME=  FREQUENCY,     SPECTRUM/REAL,   SPECTRUM/IMAG
##SYMBOL=    X,             R,               I
##VAR_TYPE=  INDEPENDENT,   DEPENDENT,       DEPENDENT
##VAR_FORM=  AFFN,          ASDF,            ASDF
##VAR_DIM=   65536,         65536,           65536
##UNITS=     HZ,            ARBITRARY UNITS, ARBITRARY UNITS
##FACTOR=    0.49542278885378, 1,            1
##FIRST=     16045.7642231865, 0,            0
##LAST=      -16421.768244346, 0,            0
##MIN=       -16421.768244346, -53580027,    0
##MAX=       16045.7642231865, 287699160,    0
$$ Real data points
##PAGE= N=1
##DATA TABLE= (X++(R..R)), XYDATA
$$ [...]
$$ plain form
40560 1814127 1619808 2182923 2286196 947294 -391904 -88333 905107 702791 -343690
40551 -343690 -652954 -668789 -2186463 -4641716 -5154810 -2901935 -538833 32407 582952
40542 582952 3086442 5550177 4422104 204843 -2620174 -1569427 783658 848881 -1127039
40533 -1127039 -2009485 -215050 2720011 4489140 4298154 2836338 1233757 286751 -46932
40524 -46932 -469678 -1148574 -1042464 698692 2956055 3470889 1533507 -1310493 -3440377
40515 -3440377 -4757096 -5612421 -5549137 -4211669 -2545450 -1781194 -1759312 -1512055 -1144358
40506 -1144358 -1740633 -3345312 -4328967 -3260907 -622604 1756434 2417979 1224565 -772829
40497 -772829 -2117516 -2109321 -1455484 -1386024 -2071571 -2457160 -1700894 -78505 1678936 3130988
$$ packed form
40560A814127j94319N63115J03273j338902j339198L03571R93440k02316j046481
40551c43690l09264j5835j517674k455253n13094K252875K363102N71240N50545
40542E82952K503490K463735j128073m217261k825017J050747K353085O5223j975920
40533a127039q82446J794435K935061J769129j90986j461816j602581r47006l33683
40524d6932m22746o78896J06110J741156K257363N14834j937382k844000k129884
40515c440377j316719q55325O3284J337468J666219P64256K1882K47257L67697
40506a144358n96275j604679r83655J068060K638303K379038O61545j193414j997394
40497g72829j344687Q195O53837O9460o85547l85589P56266J622389J757441J452052
$$ plain form
40487 3130988 3867905 3316133 1427226 -912189 -2622268 -3162209 -2304271 -26120 2725315
40478 2725315 3960021 2448688 -572905 -2354507 -1330413 1588550 4186381 4829482
40470 4829482 3417506 1173494 -420293 -827279 -551006 40971 1366135 3597123 5624915
40461 5624915 5918755 4152866 1365917 -1026152 -1740746 -17300 3268490 5504209
40453 5504209 4865686 2610182 1343950 1445458 1175895 80829 -339464 148575 -515171
40444 -515171 -3007152 -4467714 -2313241 1636968 3431430 2143461 85551 -1258591
40436 -1258591 -2541723 -3967377 -4368372 -3479045 -2675555 -2590944 -2103017 -668459 293532
40427 293532 -422864 -1857019 -2357411 -1666763 -414529 1065177 2139368 1510271 -930515
$$ packed form
40487C130988P36917n51772j888907k339415j710079n39941Q57938K278151K751435
40478B725315J234706j511333l021593j781602J024094K918963K597831O43101
40470D829482j411976k244012j593787m06986K76273N91977J325164K230988K027792
40461E624915K93840j765889k786949k392069p14594J723446L285790K235719
40453E504209o38523k255504j266232J01508k69563j095066m20293M88039o63746
40444e15171k491981j460562K154473L950209J794462j287969k057910j344142
40436a258591j283132j425654m00995Q89327Q03490Q4611M87927J434558R61991
40427B93532p16396j434155n00392O90648J252234J479706J074191o29097k440786
$$ plain form
40418 -930515 -2934852 -2306114 195875 1895855 1542981 88647 -1293780 -2258713 -2637443
40409 -2637443 -2418890 -2385860 -3309616 -4493540 -4549833 -3664341 -3523936 -4691799 -5614026
40400 -5614026 -4889692 -3224440 -2272666 -2499819 -3066128 -3162528 -2658472 -1824403 -1031188
40391 -1031188 -524939 -203065 168840 511719 629215 739017 1153676 1522378 1221096
40382 1221096 467256 57063 -65206 -793283 -2145374 -2877902 -2426314 -1997749 -2829065
40373 -2829065 -4372227 -5221805 -4983032 -4129662 -2785112 -940993 609487 916657 308862
40364 308862 33520 529428 1101829 1239789 1089912 480711 -1306759 -4221690 -6736431
40355 -6736431 -7137278 -5124795 -1796190 1398670 3247042 3004435 1005653 -1020576
$$ packed form
40418i30515k004337O28738K501989J699980l52874j454334j382427r64933l78730
40409b637443K18553L3030r23756j183924n6293Q85492J40405j167863r22227
40400e614026P24334J665252R51774k27153n66309r6400N04056Q34069P93215
40391a031188N06249L21874L71905L42879J17496J09802M14659L68702l01282
40382A221096p53840m10193j22269p28077j352091p32528M51588M28565q31316
40373b829065j543162q49578K38773Q53370J344550J844119J550480L07170o07795
40364C08862k75342M95908N72401J37960j49877o09201j787470k914931k514741
40355f736431m00847K012483L328605L194860J848372k42607j998782k026229
$$ plain form
40347 -1020576 -1153231 735914 2663610 2762227 1567753 1333969 3023091 4929612 4884569
40338 4884569 2992525 1114331 163896 -632955 -1825422 -2694889 -2683909 -2449158 -2530305
40329 -2530305 -2092399 -197308 2433271 4147454 4341695 3574013 2193792 171654 -1919413
40320 -1919413 -3086059 -3218645 -3192837 -3554399 -4039638 -4509331 -5361473 -6662829 -7610825
40311 -7610825 -7249751 -5335141 -2456779 219774 1458950 867871 -698114 -2142306
40303 -2142306 -3284644 -4394407 -5080038 -4747030 -3878077 -3551055 -3711395 -3290214 -2186527
40294 -2186527 -1656788 -2296711 -3075027 -3047399 -2663238 -2485230 -1929225 -500104 772104
40285 772104 597190 -490814 -754415 302716 1387457 1262725 31446 -1512565 -2841182
$$ packed form
40347a020576j32655J889145J927696R8617j194474k33784J689122J906521m5043
40338D884569j892044j878194r50435p96851j192467q69467J0980K34751q1147
40329b530305M37906J895091K630579J714183J94241p67682j380221k022138k091067
40320a919413j166646j32586K5808l61562m85239m69693q52142j301356r47996
40311g610825L61074J914610K878362K676553J239176n91079j565985j444192
40303b142306j142338j109763o85631L33008Q68953L27022j60340M21181J103687
40294b186527N29739o39923p78316K7628L84161J78008N56005J429121J272208
40285G72104j74914j088004k63601J057131J084741j24732j231279j544011j328617
$$ plain form
40276 -2841182 -3725991 -4010574 -3665019 -2744063 -1298475 320391 1277053 981182 -17632
40267 -17632 -433987 338989 1601018 2159788 1427362 -268223 -2070247 -3236201 -3684090
40258 -3684090 -3935164 -4352963 -4601903 -4154578 -3157086 -2342519 -2079484 -1900268 -1128870
40249 -1128870 198528 1137130 553327 -1807217 -4819995 -6687731 -6379393 -4397511 -2105155
40240 -2105155 -439299 637245 1602096 2524198 2859541 2207063 1225287 1353936 3260650
40231 3260650 5908703 7658120 7949226 7303785 6174908 4824508 3972052 4152526 4423635
40222 4423635 3268172 1113652 282438 1706593 3367095 3159725 1787946 1266020 1806933
40213 1806933 2047406 1491409 746689 -153204 -1618204 -2835024 -2219020 214739 2607552
$$ packed form
40276b841182q84809k84583L45555R20956J445588J618866R56662k95871r98814
40267a7632m16355P72976J262029N58770p32426j695585j802024j165954m47889
40258c684090k51074m17799k48940M47325R97492Q14567K63035J79216P71398
40249a128870J327398R38602n83803k360544l012778j867736L08338J981882K292356
40240b105155J665856J076544R64851R22102L35343o52478r81776J28649J906714
40231C260650K648053J749417K91106o45441j128877j350400q52456J80474K71109
40222D423635j155463k154520q31214J424155J660502k07370j371779n21926N40913
40213A806933K40473n55997p44720q99893j465000j216820O16004K433759K392813
$$ plain form
40204 2607552 3694989 3960707 4073744 3816884 3145276 2819007 3204586 3644446 3716938
40195 3716938 3985927 4795451 5434094 5272874 4686876 4015676 2611604 -107881 -3447329
40186 -3447329 -6160522 -7676355 -7840437 -6351494 -3510626 -804846 419611 426967 306896
40177 306896 320439 113242 -24029 492335 1181252 930623 -127227 -510216 487759 1733155
40167 1733155 1896967 1221028 869261 1150754 1289102 755551 19609 -202993 101709
40158 101709 437523 625874 825041 654023 -917020 -4052068 -6838529 -6753637 -3622570
40149 -3622570 -181501 835727 -567951 -2367345 -3091365 -2758963 -1911489 -965384 -370285
40140 -370285 -284816 -12755 1251464 2935195 3340427 1845548 61347 134192 2358363
$$ packed form
40204B607552J087437K65718J13037k56860o71608l26269L85579M39860P2492
40195C716938K68989Q09524O38643j61220n85998o71200j404072k719485l339448
40186c447329k713193j515833j64082J488943K840868K705780J224457P356j20071
40177C06896J3543k07197j37271N16364O88917k50629j057850l82989R97975J245396
40167A733155J63812o75939l51767K81493J38348n33551p35942k22602L04702
40158A01709L35814J88351J99167j71018j571043l135048k786461Q4892L131067
40149c622570L441069J017228j403678j799394p24020L32402Q47474R46105N95099
40140c70285Q5469K72061J264219J683731M05232j494879j784201P2845K224171
$$ plain form
40131 2358363 5084389 6685477 6936150 6482319 5656410 4317094 2670639 1638231 1980978
40122 1980978 3222446 3942613 3294825 1888002 993953 1208450 2073569 2638417 2142242
40113 2142242 552710 -1231578 -2073019 -1805337 -1362539 -1468778 -1868716 -2283372 -3199307
40104 -3199307 -4761504 -5680613 -4646500 -2467365 -1260838 -1508237 -1523029 -255878 996315
40095 996315 657210 -622065 -905877 202847 1063474 304170 -1364000 -1922274 -202802
40086 -202802 2839011 4869822 4389280 2322064 1015959 1530661 2600655 2610278 1642698
40077 1642698 735919 -14416 -1235266 -2570476 -2808918 -1930806 -1552844 -2656072 -4040885
40068 -4040885 -4004472 -2712060 -1737855 -1710691 -1706337 -1027113 -390316 -755870 -1710698 -1864955
$$ packed form
40131B358363K726026J601088K50673m53831q25909j339316j646455j032408L42747
40122A980978J241468P20167o47788j406823q94049K14497Q65119N64848m96175
40113B142242j589532j784288q41441K67682M42798j06239l99938m14656r15935
40104c199307j562197r19109J034113K179135J206527k47399j4792J267151J252193
40095I96315l39105j279275k83812J108724Q60627p59304j668170n58274J719472
40086b02802L041813K030811m80542k067216j306105N14702J069994R623r67580
40077A642698r06779p50335j220850j335210k38442Q78112L77962j103228j384813
40068d040885L6413J292412R74205K7164M354O79224O36797l65554r54828j54257
$$ plain form
40058 -1864955 -713458 604551 679902 -424226 -1307484 -1090703 -527452 -779230 -1540665
40049 -1540665 -1392919 -129393 469492 -979141 -3196171 -3679101 -2011233 -222972 213708
40040 213708 127637 787086 1834259 2215589 1994564 1833901 1545699 742341 283667 1213527
40030 1213527 2514842 1969037 -508491 -2398552 -2050986 -639367 362243 1632560
40022 1632560 4187133 6636870 6513545 3703323 556628 -1164853 -1669366 -1631680 -1163666
40013 -1163666 -488706 5236 736033 2458883 4489773 5028662 3892655 3296074 4826509
40004 4826509 6965894 6982909 4416851 1281703 -674878 -1498603 -1896573 -1868995 -1011585
39995 -1011585 375705 1089494 190544 -1629161 -2361322 -1013403 766197 562014 -1382828
$$ packed form
40058a864955J151497J318009P5351j104128q83258K16781N63251k51778p61435
40049a540665J47746J263526N98885j448633k217030m82930J667868J788261M36680
40040B13708q6071O59449J047173L81330k21025j60663k88202q03358m58674R29860
40030A213527J301315n45805k477528j890061L47566J411619J001610J270317
40022A632560K554573K449737j23325k810222l146695j721481n04513L7686M68014
40013a163666O74960M93942P30797J722850K030890N38889j136007n96581J530435
40004D826509K139385J7015k566058l135148j956581q23725l97970K7578Q57410
39995a011585J387290P13789q98950j819705p32161J347919J779600k04183j944842
$$ plain form
39986 -1382828 -2228148 -580446 1259406 422816 -2494079 -4314183 -3422032 -1137821 689473
39977 689473 1503594 1334819 158382 -1355062 -1843517 -845428 535944 1177428 1284486
39968 1284486 1622008 2244004 2658696 2588013 1972587 854271 -221273 -406386 216288
39959 216288 318668 -1013165 -2969967 -4199396 -4608927 -4908760 -4923883 -3802638 -1814745
39950 -1814745 -451368 -330539 -270368 858818 2415684 3062668 2737470 2338027 1909989
39941 1909989 620382 -1338247 -2283842 -1300804 47147 -548919 -3102317 -5213679 -5016471
39932 -5016471 -3156151 -1493524 -814247 -541913 -80123 491148 923245 1290519 1850866
39923 1850866 2710459 3550105 3531252 1922534 -716590 -2462353 -1934669 -50522 972888
$$ packed form
39986a382828q45320J647702J839852q36590k916895j820104Q92151K284211J827294
39977F89473Q14121j68775j176437j513444m88455R98089J381372O41484J07058
39968A284486L37522O21996M14692p0683o15426j118316j075544j85113O22674
39959B16288J02380j331833j956802j229429m09531k99833j5123J121245J987893
39950a814745J363377J20829O0171J129186J556866O46984l25198l99443m28038
39941A909989j289607j958629r45595R83038J347951n96066k553398k111362J97208
39932e016471J860320J662627O79277K72334M61790N71271M32097L67274N60347
39923A850866Q59593Q39646j8853j608718k639124j745763N27684J884147J023410
$$ plain form
39914 972888 247887 -1091066 -1808474 -1991350 -2124021 -1868439 -675981 1028561 2189668
39905 2189668 2335820 1760761 843097 -73201 -431716 16202 536963 147529 -877188
39896 -877188 -1087325 227175 1939347 2417810 1421798 42383 -897884 -1612513 -2517078
39887 -2517078 -3380374 -3718913 -3589372 -3405748 -3124806 -2290547 -1074528 -623669 -1786952
39878 -1786952 -3808880 -4963212 -4433181 -2936344 -1446784 -33291 1687204 3517076
39870 3517076 4622146 4265177 2317255 -612004 -3257078 -4346380 -3661140 -2223334
39862 -2223334 -1096133 -320909 605304 1660499 2305081 2274944 1778521 1095816 479729
39853 479729 183231 52074 -535985 -1634569 -2032043 -539796 2230625 4403647 5062964
$$ packed form
39914I72888p25001j338953p17408j82876j32671K55582J192458J704542J161107
39905B189668J46152n75059r17664r16298l58515M47918N20761l89434j024717
39896h77188k10137J314500J712172M78463r96012j379415r40267p14629r04565
39887b517078q63296l38539J29541J83624K80942Q34259J216019M50859j163283
39878a786952k021928j154332N30031J496837J489560J413493J720495J829872
39870C517076J105070l56969j947922k929259k645074j089302O85240J437806
39862b223334J127201P75224R26213J055195O44582l0137m96423o82705o16087
39853D79729k96498j31157n88059j098584l97474J492247K770421K173022O59317
$$ plain form
39844 5062964 4811603 4106271 2478199 -11540 -1817953 -1453105 705231 3006627 4387621
39835 4387621 4864424 4713997 4122458 3478349 3280554 3746313 4792252 6047114 6602328
39826 6602328 5439247 2719513 28506 -1351932 -1710745 -1653723 -597325 1988573 4527738
39817 4527738 4573340 2188081 138733 168427 953141 782426 472048 1852857 4502857
39808 4502857 6068035 5510335 4141121 3293046 2716548 1872085 1290947 1580526 2056064
39799 2056064 1566190 196945 -940921 -1397816 -1787287 -2427254 -2569546 -1447318 501132
39790 501132 1951798 1997165 949311 211370 1447379 5208731 9933900 12905966 12889801
39781 12889801 11433901 10885938 11589814 12000988 11177300 9767292 8452812 6922495 5009483
$$ packed form
39844E062964k51361p05332j628072k489739j806413L64848K158336K301396J380994
39835D387621M76803j50427n91539o44109j97795M65759J045939J254862N55214
39826F602328j163081k719734k691007j380438l58813N7022J056398K585898K539165
39817D527738M5602k385259k049348K9694P84714j70715l10378J380809K650000
39808D502857J565178n57700j369214q48075n76498q44463n81138K89579M75538
39799B056064m89874j369245j137866m56895l89471o39967j42292J122228J948450
39790E01132J450666M5367j047854p37941J236009L761352M725169K972066j6165
39781A2889801j455900n47963P03876M11174q23688j410008j314480j530317j913012
$$ plain form
39772 5009483 3537353 3084831 2932018 2272042 1546481 1387656 1118970 -164185 -1631249
39763 -1631249 -1599421 -177129 753427 303732 -410094 -338430 229005 1113150 3128318
39754 3128318 6307723 8710692 8525846 6468367 4729324 4296434 4661401 5477753 6884243
39745 6884243 8390838 8900692 7987958 6180472 4051352 2002130 779431 1035288 2253157
39736 2253157 3105445 3074853 2919356 3414642 4370617 4944729 4290880 2096890 -702040
39727 -702040 -2075720 -945609 1054104 1194040 -941252 -3147920 -3915594 -4252902 -5413619
39718 -5413619 -6547014 -6085865 -4292324 -2712307 -1721359 -325870 1721700 3172503
39710 3172503 2995551 1754363 836474 1027131 2135073 3361791 3699002 2537549 373238
$$ packed form
39772E009483j472130m52522j52813o59976p25561j58825k68686j283155j467064
39763a631249L1828J422292R30556m49695p13826P1664N67435Q84145K015168
39754C128318L179405K402969j84846k057479j739043m32890L64967Q16352J406490
39745F884243J506595N09854r12734j807486k129120k049222j222699K55857J217869
39736B253157Q52288l0592j55497M95286R55975N74112o53849k193990k798930
39727g02040j373680J130111J999713J39936k135292k206668p67674l37308j160717
39718e413619j133395M61149J793541J580017R90948J395489K047570J450803
39710C172503j76952j241188r17889J90657J107942J226718L37211j161453k164311
$$ plain form
39701 373238 -1339713 -1401312 90977 1969692 3129787 3396124 3407290 3715764 4055789
39692 4055789 3691396 2514977 1397490 1140912 1449451 1476348 1190710 1496499 2865217
39683 2865217 4495423 5265906 5126611 4934692 4987204 4426036 2537056 187621 -867867
39674 -867867 -218172 529781 -92378 -1276507 -1045504 736192 1827894 555906 -1864788
39665 -1864788 -2910708 -1928581 -554479 -228406 -556415 -430214 289930 962016 1428296
39656 1428296 2147128 3144153 3749041 3770731 4196454 5852108 7657778 7354186 4299499
39647 4299499 550377 -1537299 -1926087 -2107095 -2451975 -1914340 -223103 1304967 1631012
39638 1631012 1330992 1380753 1717054 1763778 1382427 481437 -1305138 -3524404 -4417659
$$ packed form
39701C73238j712951o1599J492289J878715J160095K66337J1166L08474L40025
39692D055789l64393j176419j117487k56578L08539K6897k85638L05789J368718
39683B865217J630206P70483j39295j91919N2512n61168j888980k349435j055488
39674h67867O49695P47953o22159j184129K31003J781696J091702j271988k420694
39665a864788j045920R82127J374102L26073l28009J26201P20144O72086M66280
39656A428296P18832R97025O04888K1690M25723J655654J805670l03592l054687
39647D299499l749122k087676l88788j81008l44880N37635J691237J528070L26045
39638A631012l00020M9761L36301M6724l81351r00990j786575k219266q93255
$$ plain form
39629 -4417659 -2822965 7412 1715594 1505920 334494 -989791 -2331355 -3082447
39621 -3082447 -2260410 -161605 1496710 1741975 1588043 2424263 4021312 4909798 4188876
39612 4188876 2276714 209772 -1242768 -1920445 -2061787 -1724019 -534624 1586166 3660587
39603 3660587 4442192 4119116 4336297 6038792 8041480 8422736 6786683 4356331 2213799
39594 2213799 424197 -1118509 -2007822 -2022824 -1866130 -2388358 -3221119 -3016085 -1337027
39585 -1337027 401509 572957 -514557 -1060101 -286250 583406 229900 -918918 -1511634
39576 -1511634 -1113220 -185113 1223124 3460595 5968935 7207331 6403754 4697580 3975758
39567 3975758 4844328 6151420 6474189 5811076 5535191 6545296 7832532 7527193 5272970
$$ packed form
39629d417659J594694K830377J708182k09674j171426j324285j341564p51092
39621c082447Q22037K098805J658315K45265j53932Q36220J597049Q88486p20922
39612D188876j912162k066942j452540o77677j41342L37768J189395K120790K074421
39603C660587P81605l23076K17181J702495K002688L81256j636053k430352k142532
39594B213799j789602j542706q89313j5002J56694n22228q32761K05034J679058
39585a337027J738536J71448j087514n45544P73851Q69656l53506j148818n92716
39576a511634L98414R28107J408237K237471K508340J238396q03577j706174p21822
39567C975758Q68570J307092L22769o63113k75885J010105J287236l05339k254223
$$ plain form
39558 5272970 2658984 1092532 297938 -536413 -1243509 -1299928 -1116633 -1526968 -2454814
39549 -2454814 -3088733 -2977712 -2161258 -835879 276442 109038 -1092006 -1247882 982349
39540 982349 3949099 4931417 3549832 1571690 212173 -250174 1010304 4504638 8270029
39531 8270029 9361641 7834165 6709135 7606539 9035702 9538591 9629182 9619869 8440789
39522 8440789 6116683 4713732 4996903 4658274 2039758 -629971 -246663 2656071 4984199
39513 4984199 5356606 4775623 4034328 2995185 1986523 1768497 2252068 2679375 2605870
39504 2605870 1667981 -509526 -2964027 -3499293 -1763742 -533315 -1888443 -3856014
39496 -3856014 -3405622 -1203466 -311063 -1279954 -1894004 -1195463 -359740 293894 1767903
$$ packed form
39558E272970k613986j566452p94594q34351p07096n6419J83295m10335r27846
39549b454814o33919J11021Q16454J325379J112321j67404j201044j55876K230231
39540I82349K966750R82318j381585j978142j359517m62347J260478L494334L765391
39531H270029J091612j527476j125030Q97404J429163N02889R0591r313j179080
39522H440789k324106j402951K83171l38629k618516k669729L83308K902734K328128
39513D984199L72407n80983p41295j039143j008662k18026M83571M27307p3505
39504B605870r37889k177507k454501n35266J735551J230427j355128j967571
39496c856014M50392K202156Q92403r68891o14050O98541Q35723O53634J474009
$$ plain form
39487 1767903 3533653 3429806 1188668 -717401 -613595 493649 1354707 2251269 3305838
39478 3305838 3457230 2514520 2237593 3883370 6161503 6906190 5625610 3477552 1819659
39469 1819659 1463079 2262025 2929769 2287632 870286 131682 217917 97349 -301085
39460 -301085 -56133 641371 532929 -299200 -267617 1052081 2243557 2512334 2675174
39451 2675174 3229113 3679655 4300016 6190439 8945049 10639238 10816463 11064476 11983370
39442 11983370 12223884 11324835 10752496 11208694 11739066 12483247 15285005 20396710 25606811
39433 25606811 29798342 34200153 39074161 42817435 45535807 49437605 54449698 58257838
39425 58257838 62178610 71168587 86132081 103888337 128049921 169024079 223573735
$$ packed form
39487A767903J765750j03847k241138j906069J03806J107244Q61058Q96562J054569
39478C305838J51392r42710k76927J645777K278133P44687j280580k148058j657893
39469A819659l56580P98946O67744o42137j417346p38604Q6235j20568l98434
39460c01085K44952O97504j08442q32129L1583J319698J191476K68777J62840
39451B675174N53939M50542O20361J890423K754610J694189J77225K48013R18894
39442A1983370K40514q99049n72339M56198N30372P44181K801758N111705N210101
39433B5606811M191531M401811M874008L743274K718372L901798N012093L808140
39425E8257838L920772Q989977J4963494J7756256K4161584M0974158N4549656
$$ plain form
39418 223573735 263018099 256774708 206688877 145936610 103454223 80873363 65526322
39411 65526322 51825589 42055824 36178278 31410990 27868024 26789082 25642542 21119964
39403 21119964 14979939 11616926 11461213 11434912 10404866 9698841 9352853 8045703 6103143
39394 6103143 4993091 4452494 3248249 1997177 2182241 3174681 3231395 2669995 3062947
39385 3062947 4007966 3764898 2554524 2155318 2583629 2262679 1385926 2014860 4485324
39376 4485324 6480100 6261297 4522401 2583654 950138 124481 714659 2086606 2695396
39367 2695396 2250601 1906851 2048455 1772282 1031558 1375027 3710942 6836228 9014556
39358 9014556 9821504 9762752 9177934 8245244 7314361 6715900 6614769 6907408 6699500 4539467
$$ packed form
39418B23573735L9444364o243391n0085831o0752267m2482387k2580860j5347041
39411F5526322j3700733r769765n877546m767288l542966j078942j146540m522578
39403B1119964o140025l363013j55713k6301j030046p06025l45988j307150j942560
39394F103143j110052n40597j204245j251072J85064R92440N6714n61400L92952
39385C062947R45019k43068j210374l99206M28311l20950q76753O28934K470464
39376D485324J994776k18803j738896j938747j633516q25657N90178J371947O08790
39367B695396m44795l43750J41604k76173p40724L43469K335915L125286K178328
39358I014556Q06948n8752n84818r32690r30883n98461j01131K92639k07908k160033
$$ plain form
39348 4539467 338594 -3543706 -4672901 -3588612 -2783910 -3018963 -2777800 -1438454 -614779
39339 -614779 -1552477 -3141762 -3631084 -2909600 -2087304 -1926011 -2479413 -3247293 -3051535
39330 -3051535 -875118 2500417 4745427 4524566 2854317 1492125 1130971 1687255 2989985
39321 2989985 4279342 4183597 2294881 42871 -840051 -116781 1208443 2108429 1977193
39312 1977193 832371 -262098 105414 1894670 3387216 3344519 2365617 1419215 203784
39303 203784 -1998032 -4720208 -6585260 -6542903 -4239521 -193873 3661492 4966923 3679170
39294 3679170 2619818 3842149 5623921 4942659 2063967 373650 1788254 4496689
39286 4496689 5674733 4650596 2685892 1072187 379903 622943 1193420 1048619 -372025
$$ packed form
39348D539467m200873l882300j129195J084289Q04702k35053K41163J339346Q23675
39339f14779r37698j589285m89322P21484Q22296J61293n53402p67880J95758
39330c051535K176417L375535K245010k20861j670249j362192l61154N56284J302730
39321B989985J289357r5745j888716k252010q82922P23270J325224Q99986j31236
39312A977193j144822j094469L67512J789256J492546m2697r78902r46402j215431
39303B03784k201816k722176j865052M2357K303382M045648L855365J305431j287753
39294C679170j059352J222331J781772o81262k878692j690317J414604K708435
39286D496689J178044j024137j964704j613705o92284K43040N70477j44801j420644
$$ plain form
39277 -372025 -2491184 -4010278 -3878687 -2107039 -31025 567940 -756003 -2463457 -2794661
39268 -2794661 -1806483 -878570 -715807 -995023 -1627871 -2919565 -4444640 -5155440 -4825131
39259 -4825131 -4135053 -3231916 -1682191 -46701 344841 -195174 459438 2808141 4048850
39250 4048850 1702615 -2584294 -5115732 -4994761 -4339371 -4182420 -3138662 -656325 1211846
39241 1211846 766970 -624795 -622511 598800 914644 -350277 -1532329 -1202582 -102244
39232 -102244 39540 -1227518 -2557182 -2322339 -463132 1222395 949482 -859215 -1947889
39223 -1947889 -1072058 520471 1134120 983432 1174096 1274660 -129247 -2685270 -4140940
39214 -4140940 -3400015 -1960767 -1580373 -2042695 -2199746 -1904401 -1733261 -1754113 -1708305 -1694243
$$ packed form
39277c72025k119159j519094J31591J771648K076014N98965j323943j707454l31204
39268b794661R88178R27913J62763k79216o32848j291694j525075p10800L30309
39259d825131O90078R03137J549725J635490L91542n40015O54612K348703J240709
39250D048850k346235m286909k531438J20971O55390J56951J043758K482337J868171
39241A211846m44876j391765K284J221311L15844j264921j182052L29747J100338
39232a02244J41784j267058j329664K34843J859207J685527k72913j808697j088674
39223a947889Q75831J592529O13649j50688J90664J00564j403907k556023j455670
39214d140940P40925J439248L80394m62322j57051K95345J71140k0852M5808J4062
$$ plain form
39204 -1694243 -1706374 -1231729 -218489 380926 40772 -235005 582512 1766392 1911739
39195 1911739 1078855 354202 -169808 -1341807 -3183271 -4717953 -5319444 -4776700 -2524212
39186 -2524212 1309555 4460010 4460584 2140661 796691 1464661 1671756 -157265 -1918025
39177 -1918025 -1328291 299849 470896 -102553 1235437 4184467 5228193 2714517 -611177
39168 -611177 -1342768 321313 1539253 781374 -767346 -1284114 -456554 617378 943047
39159 943047 631829 505717 993695 1745269 2349268 2889677 3414158 3426029 2674121 2120049
39149 2120049 3110854 5446342 7122732 6477504 4150524 2445513 2853979 4517210 5264354
39140 5264354 4121348 2506125 2570639 4526025 6332337 6224289 4717164 3543636 3317881
$$ packed form
39204a694243j2131M74645J013240N99415l40154k75777Q17517J183880J45347
39195A911739q32884p24653n24010j171999j841464j534682o01491N42744K252488
39186b524212L833767L150455N74k319923j343970O67970K07095j829021j760760
39177a918025N89734J628140J71047n73449J337990K949030J043726k513676l325694
39168f11177p31591J664081J217940p57879j548720n16768Q27560J073932L25669
39159I43047l11218j26112M87978P51574O03999N40409N24481J1871p51908n54072
39149B120049R90805K335488J676390o45228k326980j705011M08466J663231P47144
39140E264354j143006j615223O4514J955386J806312j08048j507125j173528k25755
$$ plain form
39131 3317881 3138252 2152446 639289 -416391 -239368 1135221 2712937 3223639 2416156
39122 2416156 1373227 1105960 1301884 1022123 80844 -1005163 -1902629 -2444523 -2241999
39113 -2241999 -1278026 -427812 -372795 -493957 12992 506276 -132521 -1326421 -1392588 -238355
39103 -238355 409712 -269874 -1120720 -1202519 -1184479 -1653936 -1778241 -895579 1887 -207591
39093 -207591 -896006 -790005 -64359 163842 -214462 -368375 -206620 -591011 -1893421
39084 -1893421 -3386000 -4128015 -3840753 -3118781 -3195907 -4819746 -6732468 -6282023 -2670727
39075 -2670727 1342453 2478041 956177 -240643 436612 1772575 2570151 3358707 4567490
39066 4567490 5095362 4061672 2484602 1691560 1134784 -534547 -2830406 -3661713 -2269997
$$ packed form
39131C317881j79629r85806j513157j055680J77023J374589J577716N10702q07483
39122B416156j042929k67267J95924k79761r41279j086007q97466n41894K02524
39113b241999R63973Q50214N5017j21162N06949M93284o38797j193900o6167J154233
39103b38355O48067o79586q50846q1799J8040m69457j24305Q82662Q97466k09478
39093b07591o88415J06001P25646K28201l78304j53913J61755l84391j302410
39084a893421j492579p42015K87262P21972p7126j623839j912722M50445L611296
39075b670727M013180J135588j521864j196820O77255J335963P97576P88556J208783
39066D567490N27872j033690j577070p93042n56776j669331k295859q31307J391716
$$ plain form
39057 -2269997 -443269 -220737 -1372064 -1955026 -887940 904341 1938659 1992166 1892984
39048 1892984 1884643 1201273 -418167 -1751290 -1536679 -314256 357291 262301 695052
39039 695052 2095449 3053846 2456164 1338406 1368825 2273106 2158665 155661 -2440893
39030 -2440893 -3686219 -2774072 -365547 1992024 2762357 1642895 102914 -15486 1408510
39021 1408510 2784923 3006882 2679954 2750159 2868885 1998824 122421 -1609381 -2329102
39012 -2329102 -2290955 -2173281 -2142013 -1857207 -1070531 43511 1050509 1627526 1776995
39003 1776995 1688566 1507868 1465560 2129849 3970354 6392692 7714725 6652926 3602550
38994 3602550 40466 -2925681 -4784058 -4917333 -2919994 230725 2456557 2601361
$$ packed form
39057b269997J826728K22532j151327n82962J067086J792281J034318N3507r9182
39048A892984q341o83370j619440j333123K14611J222423O71547r4990M32751
39039F95052J400397R58397n97682j117758L0419R04281j14441k003004k596554
39030b440893j245326R12147K408525K357571P70333j119462j539981j18400J423996
39021A408510J376413K21959l26928P0205J18726q70061j876403j731802p19721
39012b329102L8147J17674L1268K84806P86676J114042J006998N77017J49469
39003A776995q8429j80698m2308O64289J840505K422338J322033j061799l050376
38994C602550l562084k966147j858377j33275J997339L150719K225832J44804
$$ plain form
38986 2601361 1414838 49936 -1509812 -3716582 -5945620 -6906882 -6287966 -4921579
38978 -4921579 -3437422 -1827740 -424450 -163258 -1375927 -3100013 -4119723 -4147330 -3563539
38969 -3563539 -2575257 -1203241 257440 1311241 1692874 1507907 1158028 1176858 1688867
38960 1688867 1933422 950289 -1009820 -2424348 -2202547 -765223 946036 2610454 3981917
38951 3981917 4199622 2861538 1181123 715408 1223822 1156476 167793 -355531 460325
38942 460325 1645398 1933866 1458246 1068783 888492 509387 17654 -149003 -86718 -362486
38932 -362486 -1111843 -1709602 -1364796 92263 1809270 2343325 1053607 -910349 -1826990
38923 -1826990 -1747371 -2457386 -4552042 -5918552 -4436270 -1258623 276763 -1260262 -3935156
$$ packed form
38986B601361j186523j364902j559748k206770k229038r61262O18916J366387
38978d921579J484157J609682J403290K61192j212669j724086j019710k7607N83791
38969c563539R88282J372016J460681J053801L81633j84967l49879J8830N12009
38960A688867K44555r83133j960109j414528K21801J437324J711259J664418J371463
38951C981917K17705j338084j680415m65715N08414o7346r88683n23324Q15856
38942D60325J185073K88468m75620l89463j80291l79105m91733j66657O2285k75768
38932c62486p49357n97759L44806J457059J717007N34055j289718j963956r16641
38923a826990P9619p10015k094656j366510J482282L177647J535386j537025k674894
$$ plain form
38914 -3935156 -5155615 -4430186 -3039124 -2128878 -1818559 -1547471 -742127 626596 2042811
38905 2042811 3216259 4493734 5936637 6560795 5572619 3923575 3162848 2913834 1313897
38896 1313897 -1728299 -3703621 -2868572 -697798 320227 -172237 -1013319 -1915737 -3260492
38887 -3260492 -4369610 -4131593 -3005703 -2426099 -2390145 -1667904 -452127 -609435 -2753665
38878 -2753665 -5105697 -6153454 -6592260 -7426603 -7812978 -6414058 -3779658 -1744957 -1176122
38869 -1176122 -1764295 -3382019 -6008895 -8613126 -9684664 -8958738 -7431121 -5735430
38861 -5735430 -3755994 -1839532 -975602 -1395506 -2167205 -2647504 -3270229 -4324643 -4968932
38852 -4968932 -4310516 -2816117 -1796024 -1798258 -2126165 -1725895 -169828 1891687 2915847
$$ packed form
38914c935156j220459P25429J391062R10246L10319K71088Q05344J368723J416215
38905B042811J173448J277475J442903O24158r88176j649044p60727k49014j599937
38896A313897l042196j975322Q35049K170774J018025m92464q41082r02418j344755
38887c260492j109118K38017J125890N79604L5954P22241J215777j57308k144230
38878b753665k352032j047757m38806q34343l86375J398920K634400K034701N68835
38869a176122n88173j617724k626876k604231j071538P25926J527617J695691
38861e735430J979436J916462Q63930m19904p71699m80299o22725j054414o44289
38852d968932O58416J494399J020093k234l27907M00270J556067K061515J024160
$$ plain form
38843 2915847 1631437 -1409848 -3861452 -3856224 -2056048 -816797 -1471719 -3120038 -4080670
38834 -4080670 -3773519 -2819150 -1832132 -773535 473130 1350492 917874 -988492 -3222356
38825 -3222356 -4391312 -4357908 -4118163 -4134896 -3630018 -2083405 -644937 -918902 -2594572
38816 -2594572 -3588515 -2835651 -1703588 -1852530 -2719375 -2420789 -649420 859422 842521
38807 842521 -8624 -677193 -1527014 -3171208 -4651101 -4461629 -3096079 -2764152 -4201256
38798 -4201256 -5354944 -4100638 -1006788 1715785 3035005 3518856 3613723 3122906 2334127
38789 2334127 2185006 2901639 3524404 3249697 2451977 1948592 1897148 1824620 1266536 117159
38779 117159 -1205834 -1828462 -1179670 241272 1395452 1914150 2051980 1645761 300217
$$ packed form
38843B915847j284410l041285k451604N228J800176J239251o54922j648319r60632
38834d080670L07151R54369R87018J058597J246665Q77362m32618j906366k233864
38825c222356j168956L3404K39745j6733N04878J546613J438468k73965j675670
38816b594572r93943P52864J132063j48942q66845K98586J771369J508842j6901
38807H42521q51145o68569q49821j644194j479893J89472J365550L31927j437104
38798d201256j153688J254306L093850K722573J319220M83851R4867m90817p88779
38789B334127j49121P16633O22765k74707p97720n03385n1444p2528n58084j149377
38779A17159j322993o22628O48792J420942J154180N18698J37830m06219j345544
$$ plain form
38770 300217 -1295667 -1616960 -365860 979081 1312621 1298653 1761728 2019475 1036108
38761 1036108 -873109 -2814462 -4723311 -6463523 -6574354 -3942515 -161106 1883837
38753 1883837 1578739 714985 254311 -593679 -1711594 -1136420 1950582 5348943 6493464
38744 6493464 5410957 3558169 1308452 -1523741 -3944318 -4810869 -4889548 -5645168 -6352605
38735 -6352605 -4803913 -1068878 1829350 1829142 410449 40664 744319 910355 363229
38726 363229 589016 2193258 3946735 4621702 4352493 3710809 2700227 1447255 868350
38717 868350 1536858 2429842 1963831 147907 -1318318 -1169046 126799 1353823 1864704
38708 1864704 1523379 332722 -1158880 -1888708 -1632309 -1710377 -3321185 -5652015 -6829929
$$ packed form
38770C00217j595884l21293J251100J344941L33540j3968M63075K57747r83367
38761A036108j909217j941353j908849j740212j10831K631839L781409K044943
38753A883837l05098q63754m60674q47990j117915N75174L087002L398361J144521
38744F493464j082507j852788k249717k832193k420577q66551p8679p55620p07437
38735f352605J548692L735035K898228k08j418693l69785P03655J66036n47126
38726C63229K25787J604242J753477O74967k69209o41684j010582j252972n78905
38717H68350O68508Q92984m66011j815924j466225J49272J295845J227024N10881
38708A864704l41325j190657j491602p29828K56399p8068j610808k330830j177914
$$ plain form
38699 -6829929 -6438075 -5747702 -5549785 -5303362 -4758292 -4853345 -6153501 -7596407 -7813898
38690 -7813898 -6827317 -5473606 -4004808 -2418735 -1511826 -2199663 -3924871 -4879152 -3905300
38681 -3905300 -1441557 1295428 3269004 3858913 2953210 934226 -1771761 -4797262
38673 -4797262 -7096061 -6985705 -4066619 -503631 1072056 711183 681376 1930998 2813319
38664 2813319 1779095 -411220 -2110197 -2997430 -3648746 -3904242 -2998785 -829122 1908739
38655 1908739 4443035 6052055 6078829 4692624 3120327 2297288 1831094 1089762 547334
38646 547334 925324 1660280 1595553 780692 145564 -323319 -1443452 -2870418 -3043749
38637 -3043749 -1608399 -333965 -769540 -2167216 -2645150 -1482743 601761 2601563
$$ packed form
38699f829929L91854O90373J97917K46423N45070r5053j300156j442906k17491
38690g813898R86581J353711J468798J586073R06909o87837j725208r54281R73852
38681c905300K463743K736985J973576N89909r05703k018984k705987l025501
38673d797262k298799J10356K919086L562988J575687l60873k9807J249622Q82321
38664B813319j034224k190315j698977q87233o51316k55496R05457K169663K737861
38655A908739K534296J609020K6774j386205j572297q23039m66194p41332n42428
38646E47334L77990P34956o4727q14861o35128m68883j120133j426966j73331
38637c043749J435350J274434m35575j397676m77934J162407K084504J999802
$$ plain form
38629 2601563 3709374 3376436 1914470 599367 302782 415650 -67048 -846467 -664416
38620 -664416 897751 2880168 4122087 4212288 3347601 2006400 826616 243165 184318
38611 184318 411440 865433 1295295 1099330 224867 -355609 -27345 146513 -1202410
38602 -1202410 -3309162 -3735769 -1478857 1752261 3749362 4003242 3174176 1706052 -118109
38593 -118109 -1702694 -2668162 -3243498 -3550891 -3308051 -2788242 -2996385 -4080712 -4713948
38584 -4713948 -4131306 -3612774 -4480916 -5663313 -5144072 -3227082 -2230615 -3018188 -3934171
38575 -3934171 -3573080 -2678572 -2516579 -2964518 -3191495 -2991555 -2488012 -1571823 -556609
38566 -556609 -416140 -1398925 -2256481 -1826214 -623670 97435 100208 -88186 -468831 -1360528
$$ packed form
38629B601563J107811l32938j461966j315103k96585J12868m82698p79419J82051
38620f64416J562167J982417J241919R0201q64687j341201j179784n83451n8847
38611A84318K27122M53993M29862j95965q74463n80476L28264J73858j348923
38602a202410k106752m26607K256912L231118J997101K53880q29066j468124j824161
38593a18109j584585r65468n75336l07393K42840N19809k08143j084327o33236
38584d713948N82642N18532q68142j182397N19241J916990R96467p87573r15983
38575c934171L61091Q94508J61993m47939k26977J99940N03543R16189J015214
38566e56609J40469r82785q57556M30267J202544P21105K773j88394l80645q91697
$$ plain form
38556 -1360528 -2359161 -2731087 -2533219 -2196567 -1363008 483834 2371839 2396395 309864
38547 309864 -1746677 -1755428 -123340 1180525 1003561 -206847 -1394536 -1799544 -1108768
38538 -1108768 459008 1989942 2258589 739746 -1668430 -3215934 -2992210 -1986098
38530 -1986098 -1874623 -2641936 -2309141 328696 3578060 4609103 2822735 136853 -1773683
38521 -1773683 -2934593 -3731379 -3904296 -3505057 -3258316 -3032381 -1409658 1956783 4829863
38512 4829863 4867105 2781451 1295661 1452460 1808193 1173929 261782 197715 992771
38503 992771 2144733 3449482 4468098 4310487 2806100 1029853 -103864 -954721 -2100111
38494 -2100111 -3023384 -2842197 -1724103 -606262 2829 61606 -578467 -1738657 -2394176
$$ packed form
38556a360528r98633l71926J97868L36652Q33559J846842J888005K4556k086531
38547C09864k056541q751J632088J303865j76964j210408j187689m05008O90776
38538a108768J567776J530934K68647j518843k408176j547504K23724J006112
38530a986098J11475p67313L32795K637837L249364J031043j786368k685882j910536
38521a773683j160910p96786j72917L99239K46741K25935J622723L366441K873080
38512D829863L7242k085654j485790J56799L55733o34264r12147o4067P95056
38503I92771J151962J304749J018616j57611j504387j776247j133717q50857j145390
38494b100111r23273J81187J118094J117841O09091N8777o40073j160190o55519
$$ plain form
38485 -2394176 -1726660 -317968 818670 1859281 3355586 4299543 3069164 444586
38477 444586 -565901 1215888 3246228 2733303 239112 -1914342 -3313928 -5198773
38469 -5198773 -7340681 -7757837 -5693650 -2791942 -836577 -44289 -86149 -1016420 -2277249
38460 -2277249 -2310560 -439861 1796597 2303338 747773 -1620243 -3649220 -4759531 -4452452
38451 -4452452 -2637092 -274531 1243564 1305047 163263 -1686250 -3476191 -4097380 -3125221
38442 -3125221 -1625267 -922570 -824363 -167853 1064747 1537071 655671 -440780 -556674
38433 -556674 -43584 28884 -489531 -894202 -832291 -575176 -318418 -21285 46117 -702980
38423 -702980 -2370090 -4191754 -5270888 -5456640 -5221607 -4877248 -4375189 -3892049 -3989288
$$ packed form
38485b394176O67516J408692J136638J040611J496305R43957j230379k624578
38477D44586j010487J781789K030340n12925k494191k153454j399586j884845
38469e198773k141908m17156K064187K901708J955365P92288m1860r30271j260829
38460b277249l3311J870699K236458N06741j555565k368016k028977j110311L07079
38451d452452J815360K362561J518095O1483j141784j849513j789941o21189R72159
38442c125221J499954P02697R8207O56510J232600M72324q81400j096451j15894
38433e56674N13090P2468n18415m04671O1911K57115K56758K97133O7402p49097
38423g02980j667110j821664j079134j85752K35033L44359N02059M83140r7239
$$ plain form
38414 -3989288 -4755343 -5280084 -4764548 -3940909 -4376434 -6182540 -7447559 -6490687 -3816895
38405 -3816895 -1152284 637846 1779716 2474649 2682355 2592453 2265066 1209704 -602839
38396 -602839 -1824765 -1219946 291895 736844 136404 553842 2741561 4714840 4559100
38387 4559100 2895430 1321400 15490 -1406616 -1908670 -115644 3005316 4613224
38379 4613224 3438246 1203713 141606 395048 597342 20556 -850518 -1469106 -2025116
38370 -2025116 -2929629 -3959769 -4294425 -3455096 -1962600 -717832 181256 1429310 3151264
38361 3151264 4284149 3947876 2919334 2848514 4132117 5406565 5268232 3766968 1922422
38352 1922422 414571 -718780 -1465914 -1608493 -1178987 -644059 -270520 430448 2055434
$$ packed form
38414c989288p66055n24741N15536Q23639m35525j806106j265019R56872K673792
38405c816895K664611J790130J141870O94933K07706q9902l27387j055362j812543
38396f02839j221926O04819J511841M44949o00440M17438K187719J973279j55740
38387D559100j663670j574030j305910j422106n02054J793026L120960J607908
38379D613224j174978k234533j062107K53442K02294n76786q71074o18588n56010
38370b025116r04513j030140l34656Q39329J492496J244768Q99088J248054J721954
38361C151264J132885l36273j028542p0820J283603J274448j38333j501264j844546
38352A922422j507851j133351p47134j42579M29506N34928L73539P00968J624986
$$ plain form
38343 2055434 4038748 4730657 3310257 1137720 339880 1236484 2156964 1849039 899907
38334 899907 313397 -179834 -1460344 -3410278 -5014003 -5711711 -5750899 -5401735 -4639463
38325 -4639463 -3541109 -2383021 -1436230 -1078931 -1713613 -2962993 -3442910 -2252668 -377065
38316 -377065 455333 192226 544657 2421145 4412273 4500190 2562643 416952 -322760
38307 -322760 201494 671808 321307 -166162 455690 2345451 4216887 4820719 4309421
38298 4309421 3665718 3239836 2646084 1879880 1525536 1644840 1359368 101717 -1289090
38289 -1289090 -1435198 -204760 1055209 1291094 1241027 2505851 5129268 6957648 6105055
38280 6105055 3461936 1592315 1375149 1312209 497750 422057 2556691 5565055 6713712
$$ packed form
38343B055434J983314O91909j420400k172537p97840Q96604R20480l07925r49132
38334H99907n86510m93231j280510j949934j603725o97708l9188L49164P62272
38325d639463J098354J158088R46791L57299o34682j249380m79917J190242J875603
38316c77065Q32398k63107L52431J876488J991128Q7917j937547k145691p39712
38307c22760N24254M70314l50501m87469O21852J889761J871436O03832n11298
38298D309421o43703m25882n93752p66204l54344J19304k85472j257651j390807
38289a289090j46108J230438J259969K35885n0067J264824K623417J828380q52593
38280F105055k643119j869621k17166o2940q14459p5693K134634L008364J148657
$$ plain form
38271 6713712 5327148 3112009 1548014 777647 819704 1841901 2923242 2370703 -65503
38262 -65503 -2673428 -4014385 -4354872 -4377032 -3950472 -3022715 -2447345 -2901567 -3873886 -4517367
38252 -4517367 -4628054 -4133033 -2681831 -548731 1109164 1754261 2173136 2818110 2727234
38243 2727234 1318716 -3539 310895 1464834 1525943 511970 237987 1283034 2149210
38234 2149210 1686840 492979 -641480 -1976758 -3683753 -4896806 -4966318 -4581795 -4561283
38225 -4561283 -4388777 -3119017 -1078245 622507 1900085 3627065 5682750 6451263
38217 6451263 4914786 2303119 734752 692311 825576 142946 -655418 -432398 616343
38208 616343 1242957 865561 189200 69928 408685 424150 -359518 -1615506 -2488534 -2313150
$$ packed form
38271F713712j386564k215139j563995p70367M2057J022197J081341n52539k436206
38262f5503k607925j340957l40487k2160M26560R27757N75370m54222r72319o43481
38252d517367j10687M95021J451202K133100J657895O45097M18875O44974r0876
38243B727234j408518j322255L14434J153939O1109j013973k73983J045047Q66176
38234B149210m62370j193861j134459j335278j706995j213053o9512L84523K0512
38225d561283J72506J269760K040772J700752J277578J726980K055685P68513
38217F451263j536477k611667j568367m2441J33265o82630p98364K23020J048741
38208F16343O26614l77396o76361j19272L38757J5465p83668j255988q73028J75384
$$ plain form
38198 -2313150 -1285466 -366107 -238384 -524598 -426938 134447 694749 1352915 2758158
38189 2758158 4853684 6528561 6833560 5813854 3969150 1844942 441271 792011
38181 792011 2358782 2891439 953159 -2126155 -3858016 -3568830 -2704132 -2673243 -3565808
38172 -3565808 -4686506 -5128303 -3918191 -853994 2561059 4027942 2712047 1135
38164 1135 -2124836 -2804775 -2276360 -1035426 402020 1344147 1202777 101099 -962513
38155 -962513 -831973 654575 2332665 2946428 2617402 2418632 2568530 2183535 1158173
38146 1158173 901939 2240229 3760035 3567908 1805537 -23775 -1414809 -2791807
38138 -2791807 -3661067 -2944089 -1186249 -416731 -1337327 -2395168 -2305914 -1907786 -2620534
$$ packed form
38198b313150J027684R19359J27723k86214R7660N61385N60302O58166J405243
38189B758158K095526J674877L04999j019706j844704k124208j403671L50740
38181G92011J566771N32657j938280l079314j731861K89186Q64698L0889q92565
38172c565808j120698m41797J210112L064197L415053J466883j315895k710912
38164A135k125971o79939N28415J240934J437446R42127j41370j101678j063612
38155i62513J30540J486548J678090O13763l29026j98770J49898l84995j025362
38146A158173k56234J338290J519806j92127j762371j829312j391034j376998
38138b791807q69260P16978J757840P69518r20596j057841Q9254L98128p12748
$$ plain form
38129 -2620534 -4385319 -6133613 -7243775 -7503115 -6465590 -3976220 -963306 1137103
38121 1137103 1684901 1287690 1197666 2233449 3798241 4169732 2564300 575756 288052
38112 288052 1182962 720207 -1751608 -3714831 -3017536 -819178 333666 -174485 -1146683
38103 -1146683 -1664181 -1393688 7002 1930288 2265101 -100170 -2911112 -2955214 -529065
38094 -529065 869162 -550981 -2653146 -2765104 -1149907 127148 183858 -271237 -477069
38085 -477069 -174148 813117 2395991 3879576 4564832 4418746 3641645 2105156 -100183
38076 -100183 -2058312 -2834295 -2706711 -2890399 -4073806 -5699432 -6563508 -5750892 -3278117
38067 -3278117 -339441 1352594 1119938 103670 -91164 611255 874153 72008 -637439
$$ packed form
38129b620534j764785j748294j110162k59340J037525K489370L012914K100409
38121A137103N47798l97211r0024J035783J564792L71491j605432j988544k87704
38112B88052Q94910m62755k471815j963223O97295K198358J152844n08151r72198
38103a146683n17498K70493J400690J923286L34813k365271k810942m4102K426149
38094e29065J398227j420143k102165j11958J615197J277055N6710m55095k05832
38085d77069L02921R87265J582874J483585O85256j46086p77101j536489k205339
38076a00183j958129p75983J27584j83688j183407j625626q64076Q12616K472775
38067c278117K938676J692035k32656j016268j94834P02419K62898q02145p09447
$$ plain form
38058 -637439 130025 2011599 3258554 2889843 1794999 1531702 2461494 3392688 2955199
38049 2955199 1089981 -915294 -1799731 -1551144 -1122435 -1138763 -1331474 -1271852 -1034601
38040 -1034601 -751719 -118586 922951 1463145 657413 -620448 -413556 1677209 3693891
38031 3693891 3868232 2873111 2506110 3049242 3285297 2552071 1312510 32444 -913610
38022 -913610 -368349 2680633 6871718 8983169 7619201 4944324 3683017 3773719 3438494
38013 3438494 2418452 2191428 3350593 4622191 4728738 3840852 2800524 2014527 1573708
38004 1573708 1590029 1941857 2335766 2927308 4164471 5670526 6084440 4624780 2218092
37995 2218092 384864 -556781 -1429351 -2667196 -3779950 -4357608 -4663311 -4811478 -4144885
$$ packed form
38058f37439P67464J881574J246955l68711j094844k63297R29792R31194m37489
38049B955199j865218k005275q84437K48587M28709j6328j92711N9622K37251
38040a034601K82882O33133J041537N40194q05732j277861K06892K090765K016682
38031C693891J74341r95121l67001N43132K36055p33226j239561j280066r46054
38022i13610N45261L048982M191085K111451j363968k674877j261307R0702l35225
38013C438494j020042k27024J159165J271598J06547q87886j040328p85997m40819
38004A573708J6321L51828L93909N91542J237163J506055M13914j459660k406688
37995B218092j833228r41645q72570j237845j112754n77658l05703j48167O66593
$$ plain form
37986 -4144885 -2229366 -58152 762637 174479 114637 2231558 5691598 7999049 7830322
37977 7830322 6357617 5627890 6156443 6529364 5307929 2978755 1577883 2175307 3295152
37968 3295152 2753894 877022 429374 2770075 5583931 5778582 3513610 1570830 1431439
37959 1431439 2109858 2742860 4035003 6482621 9030490 10470062 10828416 10572125 9734130
37950 9734130 8648347 8262304 8750269 8897538 7769597 5995491 4604469 3681635 3008525
37941 3008525 2886623 3365687 3688361 3398256 3008477 2886762 2733572 2853047 4375809
37932 4375809 7331872 10238621 12636750 16015772 20870761 25135446 27476039 29907110
37924 29907110 34709065 40737223 45468803 48910077 52758052 57692009 64513869 75686660
$$ packed form
37986d144885J915519K171214Q20789n88158n9842K116921L460040K307451j68727
37977G830322j472705p29727N28553L72921j221435k329174j400872N97424J119845
37968C295152n41258j876872m47648K340701K813856J94651k264972j942780j39391
37959A431439O78419O33002J292143K447618K547869J439572L58354k56291q37995
37950I734130j085783l86043M87965J47269j127941j774106j391022r22834o73110
37941C008525j21902M79064L22674k90105l89779j21715j53190J19475J522762
37932D375809K956063K906749K398129L379022M854989M264685K340593K431071
37924B9907110M801955O028158M731580L441274L847975M933957O821860J1172791
$$ plain form
37916 75686660 92295582 112475176 137424614 174601933 225810904 273074327 287699160
37909 287699160 258709497 205470915 157182304 125937817 105239028 87635103 73459495
37902 73459495 64241502 57652813 51535539 46764389 43602709 39735844 34211179 29634864
37894 29634864 28075667 27621506 25280152 21164870 17732288 16436277 16871326 17961318
37886 17961318 18473556 17354409 14879891 12754158 12087093 11968075 10847807 8623256
37878 8623256 6529853 5456366 5028779 4081349 1739471 -1568337 -4019465 -3824123 -974356
37869 -974356 2682066 5002171 4949302 3062046 1280898 1700131 4360584 6647611 6098403
37860 6098403 3548068 2165248 3519103 6077581 7665102 7815340 7227422 6317302 5141013
$$ packed form
37916G5686660J6608922K0179594K4949438L7177319N1208971M7263423J4624833
37909B87699160k8989663n3238582m8288611l1244487k0698789j7603925j4175608
37902G3459495r217993o588689o117274m771150l161680l866865n524665m576315
37894B9634864j559197m54161k341354m115282l432582j296011M35049J089992
37886A7961318N12238j119147k474518k125733o67065j19018j120268k224551
37878H623256k093403j073487m27587r47430k341878l307808k451128J95342K849767
37869i74356L656422K320105n2869j887256j781148M19233K660453K287027n49208
37860F098403k550335j382820J353855K558478J587521J50238n87918r10120j176289
$$ plain form
37851 5141013 3897591 2857723 2283206 2544251 3627231 4615746 4658747 4397697 5184500
37842 5184500 6765502 7175997 5415153 2903895 1566594 1557892 1693717 1244065 436487
37833 436487 -235803 -503432 -489366 -766171 -1841327 -3448441 -4864362 -5823892 -6319538
37824 -6319538 -5741417 -3540696 -820868 299844 -575088 -1517815 -1143777 -529201 -1081188
37815 -1081188 -1870993 -837602 1992911 4243741 4210971 2852433 2331379 3353680 4557614
37806 4557614 4424169 3312559 3035374 4305779 5512666 4928181 3341521 2922030 3831160
37797 3831160 4015923 2642687 1511930 2073521 3076417 2730386 1560562 1249289 1844518
37788 1844518 2108984 1831774 1796694 1957755 1622481 1225231 1984104 3714066 4759575
$$ packed form
37851E141013j243422j039868n74517K61045J082980R88515M3001k61050P86803
37842E184500J581002M10495j760844k511258j337301q702J35825m49652q07578
37833D36487o72290k67629J4066k76805j075156j607114j415921r59530m95646
37824f319538N78121K200721K719828J120712q74932r42727L74038O14576n51987
37815a081188p89805J033391K830513K250830l2770j358538n21054J022301J203934
37806D557614j33445j111610k77185J270405J206887n84485j586660m19491R09130
37797C831160J84763j373236j130757N61591J002896l46031j169824l11273N95229
37788A844518K64466k77210l5080J61061l35274l97250P58873J729962J045509
$$ plain form
37779 4759575 4384226 3606138 3247520 2718168 1421725 35421 -506942 -350836 -186386
37770 -186386 -103992 217736 742809 1274139 2028409 3256431 4475631 4793020 4070412
37761 4070412 3240826 3216665 3803222 4063065 3635440 3169949 3235455 3350902 2721005 1588982
37751 1588982 999277 1312835 1887031 2227924 2361402 1953409 474102 -1284017 -1411555
37742 -1411555 454390 2143177 1883095 798402 859131 1716403 1788839 1509949 2738960
37733 2738960 5111638 5788145 3483488 376654 -1006544 -811170 -577158 -765392 -1077225
37724 -1077225 -1817710 -3166988 -3925722 -2689732 35749 2237362 2772627 2261971 1669830
37715 1669830 999499 -333830 -2347529 -3949972 -3596075 -846713 2643677 4355079
$$ packed form
37779D759575l75349p78088l58618n29352j296443j386304n42363J56106J64450
37770a86386Q2394L21728N25073N31330P54270J228022J219200L17389p22608
37761D070412q29586k4161N86557K59843m27625m65491O5506J15447o29897j132023
37751A588982n89705L13558N74196L40893J33478m07993j479307j758119j27538
37742a411555J865945J688787k60082j084693O0729Q57272P2436k78890J229011
37733B738960K372678O76507k304657l106834j383198J95374K34012j88234l11833
37724a077225p40485j349278p58734J235990K725481K201613N35265n10656n92141
37715A669830o70331j333329k013699j602443L53897K749362L490390J711402
$$ plain form
37707 4355079 3485183 1686616 821301 769983 222315 -1012707 -1569868 -320604 2172632
37698 2172632 4131001 4154700 2401512 362640 -704169 -1079672 -1824439 -2848983 -2843507
37689 -2843507 -1485996 -386776 -824082 -1661655 -1004759 799738 1636154 949113 698520
37680 698520 2394891 4691740 5003907 2674254 -521074 -2581705 -3016626 -2470158 -1543345
37671 -1543345 -466734 400812 386988 -806032 -2418756 -3241114 -3145668 -3424362 -4983217
37662 -4983217 -6631222 -6122692 -2931260 914467 3087125 3327887 3108952 3572365 4508289
37653 4508289 5067528 4734171 3538801 1862490 273077 -724877 -1014493 -873219 -593802
37644 -593802 -226012 225450 515171 303155 -417790 -1263606 -1921612 -2460624 -2992211 -3231768
$$ packed form
37707D355079q69896j798567q65315n1318n47668j235022n57161J249264K493236
37698B172632J958369K3699j753188k038872j066809l75503p44767j024544N476
37689b843507J357511J099220m37306q37573O56896J804497Q36416o87041k50593
37680F98520J696371K296849L12167k329653l195328k060631m34921N46468R26813
37671a543345J076611Q67546j3824j193020j612724q22358R5446k78694j558855
37662d983217j648005N08530L191432L845727K172658K40762k18935M63413R35924
37653D508289N59239l33357j195370j676311j589413r97954k89616J41274K79417
37644e93802L67790M51462K89721k12016p20945q45816o58006n39012n31587k39557
$$ plain form
37634 -3231768 -2754818 -1653193 -604070 -267528 -882578 -2333691 -4128824 -5369977 -5425939
37625 -5425939 -4744292 -4214754 -3537382 -1363309 2236889 4666473 3602560 198385 -2217315
37616 -2217315 -2345063 -1883930 -2162951 -2115783 -756363 357384 -785941 -3179920 -3724822
37607 -3724822 -1431839 1340449 2141657 1111256 -238587 -1283444 -2203890 -2782055 -2583468
37598 -2583468 -1757959 -614580 1077902 3301947 4768810 3993298 1384684 -838102
37590 -838102 -981026 748290 3186676 5381336 6525524 6005930 4371816 3409387 4241756
37581 4241756 5803991 6118892 4806799 3437109 3497534 4886237 6522156 7657684 8202223
37572 8202223 8211848 7519621 5879993 3453468 1165579 258661 1050387 2255923 2044933
$$ packed form
37634c231768M76950J101625J049123L36542o15050j451113j795133j241153n5962
37625e425939O81647N29538O77372K174073L600198K429584j063913l404175k415700
37616b217315j27748M61133k79021M7168J359420J113747j143325k393979n44902
37607c724822K292983K772288Q01208j030401j349843j044857r20446n78165J98587
37598b583468Q25509J143379J692482K224045J466863p75512k608614k222786
37590h38102j42924J729316K438386K194660J144188n19594j634114r62429Q32369
37581D241756J562235L14901j312093j369690O0425J388703J635919J135528N44539
37572H202223R625o92227j639628k426525k287889r06918P91726J205536k10990
$$ plain form
37563 2044933 -127225 -3010503 -4808019 -4603288 -2717478 -243475 1648608 2412885
37555 2412885 2400539 2260306 2071427 1360479 -58714 -1661795 -2730117 -3043773 -3048837
37546 -3048837 -3488682 -4641650 -5653472 -5059808 -2557781 162420 1221503 889783 1016737
37537 1016737 2253119 3267675 3060734 2549978 2952401 3797426 3786407 2841015 1979947
37528 1979947 1593591 1125593 328608 -350307 -777402 -1583958 -3300055 -5559318 -7262916
37519 -7262916 -7201096 -4847925 -1236135 1256287 991069 -991199 -1993835 -800141 1036981
37510 1036981 1313948 -228488 -1944945 -2355589 -1562138 -791195 -968005 -1827369 -2407628
37501 -2407628 -2383539 -2555218 -3693067 -5295885 -6127854 -5742559 -4739338 -3710437 -2846068
$$ packed form
37563B044933k172158k883278j797516K04731J885810K474003J892083P64277
37555B412885j2346j40233j88879p10948j419193j603081j068322l13656n064
37546c048837m39845j152968j011822N93664K502027K720201J059083l31720J26954
37537A016737J236382J014556k06941n10756M02423Q45025j1019r45392q61068
37528A979947l86356m67998p96985o78915m27095q06556j716097k259263j703598
37519g262916O1820K353171L611790K492422k65218j982268j002636J193694J837122
37510A036981K76967j542436j716457m10644P93451P70943j76810q59364n80259
37501b407628K4089j71679j137849j602818q31969L85295J003221J028901Q64369
$$ plain form
37492 -2846068 -2470134 -2786596 -2893047 -1364009 1529567 3380260 2478884 233979 -476045
37483 -476045 1178230 3449893 4731524 5238883 5676804 5703727 4723216 3343889 2835452
37474 2835452 3351470 3737599 3218364 2343618 1838065 1335963 128161 -1249914 -1321455
37465 -1321455 214204 1617721 1003156 -1454895 -3858926 -4725348 -4086515 -2810601 -1726306
37456 -1726306 -1360336 -1637578 -1646727 -458965 1546855 2840242 2522459 1315408 412574
37447 412574 14508 -428865 -1054647 -1416663 -1292957 -1020533 -953246 -963229 -634462 116466
37437 116466 669638 173715 -1325804 -2473926 -1936620 -115217 1167242 778488 -696104
37428 -696104 -2157924 -3170839 -3461690 -2407253 -69728 1974799 2020344 167806 -2014903
$$ packed form
37492b846068L75934l16462j06451J529038K893576J850693r01376k244905p10024
37483d76045J654275K271663J281631N07359M37921K6923r80511j379327n08437
37474B835452N16018L86129n19235q74746n05553n02102j207802j378075p1541
37465a321455J535659J403517o14565k458051k404031q66422O38833J275914J084295
37456a726306L65970k77242r149J187762K005820J293387l17783j207051r02834
37447D12574l98066m43373o25782l62016J23706K72424O7287r983L28767P50928
37437A16466N53172m95923j499519j148122N37306J821403J282459l88754j474592
37428f96104j461820j012915k90851J054437K337525K044527M5545j852538k182709
$$ plain form
37419 -2014903 -3449400 -4271250 -4938467 -5649974 -6496603 -7211411 -6910867 -5155395 -3238600
37410 -3238600 -3234975 -5472423 -7917106 -8392325 -6576422 -3617452 -834472 735574 537409
37401 537409 -943363 -2406241 -3118238 -3541213 -4159130 -4465775 -3835359 -2723985 -2070313
37392 -2070313 -1882033 -1361910 -332694 304640 -288819 -1778017 -2863203 -2452981 -689643
37383 -689643 1148339 2004199 2202953 2639611 2888057 1362644 -2013658 -4600950 -3880549
37374 -3880549 -761276 1499620 1301006 -23448 -812424 -1049753 -1218156 -964267 -9792
37365 -9792 853187 862064 448802 181419 -527237 -2254342 -3821440 -3406915 -1215970 556901
37355 556901 542753 -519170 -1595873 -2874870 -4698049 -6285413 -6594474 -5610290 -3835922
$$ packed form
37419b014903j434497q21850o67217p11507q46629p14808L00544J755472J916795
37410c238600L625k237448k444683m75219J815903K958970K782980J570046j98165
37401E37409j480772j462878p11997m22975o17917l06645O30416J111374O53672
37392b070313J88280N20123J029216O37334n93459j489198j085186M10222J763338
37383f89643J837982Q55860J98754M36658K48446j525413l376302k587292P20401
37374c880549L119273K260896j98614j324454p88976k37329j68403K53889R54475
37365i792Q62979Q877m13262k67383p08656j727105j567098M14525K190945J772871
37355E56901j4148j061923j076703j278997j823179j587364l09061R84184J774368
$$ plain form
37346 -3835922 -1311366 1761713 4076458 4201814 2285942 -221698 -2220102 -3285736
37338 -3285736 -2878642 -841916 1307966 1336914 -864507 -2809089 -2519712 -793777 520548
37329 520548 1099998 1573170 1480688 -242361 -3040767 -4835287 -4681667 -3979829 -4501901
37320 -4501901 -6150321 -7177512 -6037465 -2781826 832673 2597450 1877990 347002
37312 347002 -41788 418629 -200870 -2441011 -4529088 -4818727 -3663382 -2210121 -809218
37303 -809218 396244 710718 99693 49416 1595764 3252498 2616089 -378285 -3447733
37294 -3447733 -4939152 -5103472 -4453930 -2744520 -134368 2122834 2921383 2293006 807205
37285 807205 -920969 -1866896 -1156282 426750 897181 -171983 -788651 469024 2079490
$$ packed form
37346c835922K524556L073079K314745J25356j915872k507640j998404j065634
37338c285736M07094K036726K149882K8948k201421j944582K89377J725935J314325
37329E20548N79450M73172r2482j723049k798406j794520J53620P01838n22072
37320d501901j648420j027191J140047L255639L614499J764777p19460j530988
37312C47002l88790M60417o19499k240141k088077k89639J155345J453261J400903
37303h09218J205462L14474o11025n0277J546348J656734o36409k994374l069448
37294c447733j491419j64320O49542J709410K610152K257202P98549o28377j485801
37285H07205j728174r45927P10614J583032M70431j069164o16668J257675J610466
$$ plain form
37276 2079490 1862581 519347 701910 2868182 4297741 2788501 -390702 -2240970
37268 -2240970 -1647342 -180069 168389 -937769 -2298459 -2708848 -2136456 -1570318 -1888288
37259 -1888288 -2979026 -3935066 -3830602 -2248944 403783 2639198 2459907 -870215 -5579336
37250 -5579336 -8646712 -8583505 -6591306 -4948819 -4760280 -5337582 -5172617 -3255401 57192
37241 57192 3083047 3981272 2227739 -1015520 -3892638 -5070800 -4311025 -2425281 -663469
37232 -663469 342954 1045382 2022457 2828183 2515451 1164208 -60574 -499150 -685822
37223 -685822 -1167353 -1628180 -1684100 -1587544 -1450027 -631242 1210407 3129418 3898091 3499978
37213 3499978 2755568 2041650 1445259 1661259 3333895 5597345 6639108 5957975 4904169
$$ packed form
37276B079490k16909j343234J82563K166272J429559j509240l179203j850268
37268b240970N93628J467273L48458j106158j360690m10389N72392N66138l17970
37259a888288j090738r56040J04464J581658K652727K235415j79291l330122m709121
37250e579336l067376O3207J992199J642487J88539n77302J64965J917216L312593
37241E7192L025855Q98225j753533l243259k877118j178162P59775J885744J761812
37232f63469J006423P02428R77075Q05726l12732j351243j224782m38576j86672
37223f85822m81531m60827n5920R6556J37517Q18785J841649J919011P68673l98113
37213C499978p44410p13918n96391K16000J672636K263450J041763o81133j053806
$$ plain form
37204 4904169 4648071 4734682 4172477 2934268 1644125 563819 -302430 -696560 -562058
37195 -562058 -610290 -1553454 -2948594 -3626978 -3281190 -2875720 -3280270 -4114592 -4329892 -3526884
37185 -3526884 -2204818 -874572 486323 1890993 2748437 2411183 1213040 255108 -64740
37176 -64740 -559619 -1709664 -2326970 -879863 2056052 3882570 2773122 -580618 -4274989
37167 -4274989 -7115800 -8650419 -8471949 -6698715 -4546567 -3208752 -2384626 -928618
37159 -928618 1249271 3033855 3812777 4148365 4484305 4318833 3261834 2014507 1486723
37150 1486723 1505291 1224759 501160 49060 305926 833560 954564 465766 -444825 -1573077
37140 -1573077 -2723253 -3573248 -3759470 -3082881 -1621988 211060 1688167 2084628 1281158
$$ packed form
37204D904169k56098Q6611n62205j238209j290143j080306q66249l94130J34502
37195e62058m8232r43164j395140o78384L45788M05470m04550q34322k15300Q03008
37185c526884J322066J330246J360895J404670Q57444l37254j198143r57932l19848
37176f4740m94879j150045o17306J447107K935915J826518j109448l353740l694371
37167d274989k840811j534619J78470J773234K152148J337815Q24126J456008
37159i28618K177889J784584P78922L35588L35940j65472j056999j247327n27784
37150A486723J8568k80532p23599m52100K56866N27634J21004m88798r10591j128252
37140a573077j150176q49995j86222O76589J460893J833048J477107L96461q03470
$$ plain form
37131 1281158 110469 -88741 1474518 4297409 6942071 8242858 8129310 7202432 5744322
37122 5744322 3612220 1174048 -291878 215734 2014293 3247853 2964516 2010875 1488524
37113 1488524 1094724 -74746 -1517685 -1517285 341966 2157151 2135749 1081364 1116830
37104 1116830 2470140 3222220 2365948 1361562 1793835 2891144 2760414 1260056 43724
37095 43724 -43227 -77173 -1236164 -3066007 -4220773 -4201399 -3695522 -3579838 -4094312 -4766091
37085 -4766091 -4782324 -3635937 -1720306 -175471 76343 -882019 -2145270 -2812677 -2681945
37076 -2681945 -2359012 -2662840 -3718137 -4762038 -5104280 -4982737 -4950019 -4723210 -3552041
37067 -3552041 -1783460 -1043552 -2313141 -4461044 -5298259 -3773288 -764675 1915302
$$ packed form
37131A281158j170689j99210J563259K822891K644662J300787j13548r26878j458110
37122E744322k132102k438172j465926N07612J798559J233560k83337r53641n22351
37113A488524l93800j169470j442939M00J859251J815185k1402j054385L5466
37104A116830J353310P52080q56272j004386M32273J097309j30730j500358j216332
37095D3724q6951l3946j158991j829843j154766J9374N05877J15684n14474o71779
37085d766091j6233J146387J915631J544835K51814r58362j263251o67407J30732
37076b681945L22933l03828j055297j043901l42242J21543L2718K26809J171169
37067c552041J768581P39908j269589k147903q37215J524971L008613K679977
$$ plain form
37059 1915302 2947558 2337139 1256268 907751 1439966 2234554 2973016 3546975 3059788
37050 3059788 417534 -3483744 -5654358 -4365474 -1569995 -511083 -1692450 -2897549
37042 -2897549 -2688498 -1879285 -1463053 -1098511 -403103 -157608 -1117278 -2617088 -3379094
37033 -3379094 -3075296 -2303737 -1584588 -1114929 -1042926 -1270525 -1281548 -720512 58549 318745
37023 318745 -472531 -2434110 -4990331 -6630880 -5886526 -3125195 -620379 -149750 -1137750
37014 -1137750 -1792695 -1336235 -271738 838267 1708090 1826794 845902 -490253 -781600
37005 -781600 389397 1834724 1952319 234222 -2313541 -3945363 -3629028 -2092963 -1111018
36996 -1111018 -1459288 -2171495 -2227474 -2063495 -2512096 -3085416 -2619335 -1146541 218381
$$ packed form
37059A915302J032256o10419j080871l48517N32215P94588P38462N73959m87187
37050C059788k642254l901278k170614J288884K795479J058912j181367j205099
37042b897549K09051Q09213M16232L64542O95408K45495r59670j499810p62006
37033c379094L03798P71559P19149M69659P2003k27599j1023N61036P79061K60196
37023C18745p91276j961579k556221j640549P44354K761331K504816M70629r88000
37014a137750o54945M56460J064497J110005Q69823J18704r80892j336155k91347
37005g81600J170997J445327J17595j718097k547763j631822L16335J536065R81945
36996a111018l48270p12207n5979J63979m48601n73320M66081J472794J364922
$$ plain form
36987 218381 954372 1312071 1050029 -423195 -2550523 -3804401 -3670006 -3057555 -2462631
36978 -2462631 -1303026 343281 958927 -437914 -2732971 -4096600 -3912920 -2547970
36970 -2547970 -442056 1488188 1730995 -129598 -2381074 -3092917 -2321562 -1231820 -7813
36961 -7813 1698131 2954616 2231391 -130804 -1876076 -1510039 356241 2395736 3730358
36952 3730358 3475567 903301 -3083520 -5978820 -6184436 -4586192 -2882480 -1453484
36944 -1453484 33050 931813 213921 -1446913 -1723573 711000 4437168 6725122 6212878
36935 6212878 3726001 923242 -1124593 -2054747 -1773969 -583125 530608 556078 -296914
36926 -296914 -564352 804071 3062647 4406103 3905850 2352186 1343551 1838679 3378965
$$ packed form
36987B18381P35991L57699k62042j473224k127328j253878J34395O12451N94924
36978b462631J159605J646307O15646j396841k295057j363629J83680J364950
36970b547970K105914J930244K42807j860593k251476p11843P71355J089742J224007
36961g813J705944J256485p23225k362195j745272L66037J866280K039495J334622
36952C730358k54791k572266l986821k895300k05616J598244J703712J428996
36944a453484J486534Q98763p17892j660834k76660K434573L726168K287954n12244
36935F212878k486877k802759k047835r30154K80778J190844J113733K5470q52992
36926b96914k67438J368423K258576J343456n00253j553664j008635M95128J540286
$$ plain form
36917 3378965 4431913 3745345 1628261 -399511 -1359949 -1642708 -1882297 -1931987 -1529108
36908 -1529108 -993758 -391632 968073 2998061 3872803 2336614 164413 149341 1974340
36899 1974340 2496852 337742 -2277680 -2959109 -2059287 -1011847 -4321 1054843 1130901
36890 1130901 -363748 -1902388 -1725407 -410224 281305 173558 297275 551057 38721
36881 38721 -617084 304437 2648288 3955077 2660437 76117 -1532731 -1512401 -774194
36872 -774194 -307659 -455750 -907103 -962464 -418580 -195955 -1191410 -2655111 -3023190 -2365126
36862 -2365126 -2334312 -3318957 -3568450 -2169272 -1077186 -2479551 -5362984 -6728993 -5658650
36853 -5658650 -4114009 -3677384 -3505276 -2290833 -696848 -475097 -1872265 -3275813 -3400538
$$ packed form
36917C378965J052948o86568k117084k027772r60438k82759k39589m9690M02879
36908a529108N35350O02126J359705K029988Q74742j536189k172201j5072J824999
36899A974340N22512k159110k615422o81429Q99822J047440J007526J059164P6058
36890A130901j494649j538640J76981J315183O91529j07747J23717K53782n12336
36881C8721o55805R21521K343851J306789j294640k584320j608848K0330P38207
36872g74194M66535j48091m51353n5361N43884K22625r95455j463701l68079O58064
36862b365126L0814r84645k49493J399178J092086j402365k883433j366009J070343
36853e658650J544641M36625J72108J214443J593985K21751j397168j403548j24725
$$ plain form
36844 -3400538 -2723883 -2395995 -2603143 -2747835 -2733816 -3067418 -3696021 -3729208 -2702093 -1326804
36834 -1326804 -425250 198897 1079158 1839146 1572202 208519 -1374240 -2473003 -3009686
36825 -3009686 -3021949 -2535159 -1849362 -1188797 -272043 914733 1300609 -23855 -1891520
36816 -1891520 -1986876 -32084 1513617 683466 -1435829 -2422614 -1725736 -882398 -1165286
36807 -1165286 -2259217 -3079332 -2942019 -1929711 -739480 -188626 -512789 -1230791 -1798242
36798 -1798242 -2031786 -1850045 -1275434 -913727 -1627290 -3300869 -4688486 -4979642 -4751023
36789 -4751023 -4820380 -5012011 -4796499 -4337623 -3969160 -3282153 -1776967 -30801 763227
36780 763227 271938 -632126 -805737 274232 2049292 2918252 1533275 -1364835 -3341098
$$ packed form
36844c400538O76655L27888k07148j44692J4019l33602o28603l3187J027115J375289
36834a326804R01554O24147Q80261P59988k66944j363683j582759j098763n36683
36825c009686j2263M86790O85797O60565R16754J186776L85876j324464j867665
36816a891520r5356J954792J545701q30151k119295r86785O96878Q43338k82888
36807a165286j093931q20115J37313J012308J190231N50854l24163p18002n67451
36798a798242k33544J81741N74611L61707p13563j673579j387617k91156K28619
36789d751023o9357j91631K15512M58876L68463O87007J505186J746166P94028
36780G63227m91289r04064j73611J079969J775060Q68960j384977k898110j976263
$$ plain form
36771 -3341098 -3220887 -2499219 -2779262 -3224124 -2316238 -972359 -1417598 -3310461 -3631120
36762 -3631120 -936892 2555218 4124467 3898633 3723233 4125343 4054218 2956017 1612133
36753 1612133 981275 1161016 1573486 1648504 1294534 929040 924143 962181 287937 -1258066
36743 -1258066 -2784358 -3042798 -1361390 1935593 5546948 7788740 7846037 6498763 5153686
36734 5153686 4349049 3777484 3317592 2978917 2093831 -56536 -2678544 -3910070 -3265403
36725 -3265403 -2375522 -2662727 -3424187 -3062467 -1337838 470317 1047930 55994 -1739715
36716 -1739715 -2834811 -2153633 -328502 879672 771014 376391 571965 811270 500270
36707 500270 309095 942184 1716716 1747713 1634213 2416191 3533229 3501799 2271364 1276132
$$ packed form
36771c341098J20211P21668k80043m44862R07886J343879m45239j892863l20659
36762c631120K694228L492110J569249k25834j75400M02110p1125j098201j343884
36753A612133o30858J79741M12470P5018l53970l65494m897L8038o74244j546003
36743a258066j526292k58440J681408L296983L611355K241792N7297j347274j345077
36734E153686q04637n71565m59892l38675q85086k150367k622008j231526O44667
36725c265403Q89881k87205p61460L61720J724629J808155N77613r91936j795709
36716a739715j095096O81178J825131J208174j08658l94623J95574K39305l11000
36707E00270j91175O33089P74532L0997j13500P81978J117038l1430j230435r95232
$$ plain form
36697 1276132 1262374 1575763 1584727 1326221 633569 -919554 -2938946 -4381349 -5034296
36688 -5034296 -5486149 -5417074 -3558854 14880 3141793 4122109 3731006 3587125 3739555
36679 3739555 3287906 2426568 2144329 2345549 1988070 1045583 715160 1367048 1755081
36670 1755081 920470 -296964 -521143 221375 762046 453601 -340561 -1106533 -1664364
36661 -1664364 -1914500 -1855505 -1825568 -2074237 -2159555 -1495616 -484464 -247705 -1059336 -1951979
36651 -1951979 -2272670 -2698153 -3973588 -5386379 -5491745 -4009032 -2074546 -765903 -204489
36642 -204489 -51544 -93892 -260435 -658224 -1561933 -2808104 -3424713 -2668219 -1292666
36633 -1292666 -843369 -1664711 -2556875 -2479386 -1560595 -281503 1112272 1963363 1235731
$$ packed form
36697A276132j3758L13389Q964k58506o92652j553123k019392j442403o52947
36688e034296m51853O9075J858220L573734L126913R80316l91103j43881J52430
36679C739555m51649q61338k82239K01220l57479r42487l30423O51888L88033
36670A755081q34611j217434k24179P42518N40671l08445p94162p65972n57831
36661a664364k50136N8995K9937k48669q5318O63939J011152K36759q11631q92643
36651a951979l20691m25483j275435j412791j05366J482713J934486J308643N61414
36642b04489J52945m2348j66543l97789r03709j246171o16609P56494J375553
36633a292666M49297q21342q92164P7489R18791J279092J393775Q51091p27632
$$ plain form
36624 1235731 -993763 -3026901 -3377406 -2375323 -1239816 -425099 231691 574562 484938
36615 484938 575759 1330867 1914262 1020641 -1197806 -3062131 -3219877 -1783863 254357
36606 254357 1908931 2544535 2171732 1557913 1515388 2030461 2443841 2288912 1544078 378800
36596 378800 -839024 -1572978 -1588798 -1020432 312860 2846808 5931405 7525922 6312397
36587 6312397 3459156 1244444 594950 1028306 2083333 3269315 3376360 1737140 -203404
36578 -203404 -472692 515613 624220 -549352 -1110389 -1598 1582044 2460789 2866649
36569 2866649 2761193 1138722 -1694190 -3381181 -2788319 -2075182 -3479831 -5717228 -5962797
36560 -5962797 -4177561 -2809128 -2862137 -3005070 -2535048 -2571188 -3647577 -4339228 -3413307
$$ packed form
36624A235731k229494k033138l50505J002083J135507Q14717O56790L42871q9624
36615D84938R0821P55108N83395q93621k218447j864325j57746J436014K038220
36606B54357J654574O35604l72803o13819m2525N15073M13380j54929p44834j165278
36596C78800j217824p33954j5820N68366J333292K533948L084597J594517j213525
36587F312397k853241k214712o49494M33356J055027J185982J07045j639220j940544
36578b03404k69288R88305J08607j173572n61037J108791J583642Q78745M05860
36569B866649j05456j622471k832912j686991N92862P13137j404649k237397k45569
36560e962797J785236J368433n3009j42933M70022l6140j076389o91651R25921
$$ plain form
36551 -3413307 -1771467 -1025303 -1227123 -1250414 -752064 -501183 -863106 -944305 376040
36542 376040 2953249 5288563 5908671 4582735 2095368 -749078 -3367201 -4965771
36534 -4965771 -4860922 -3452333 -2030312 -1267423 -709763 -57175 162793 -203206 -274483
36525 -274483 361634 658127 -74874 -399538 1493113 4863018 7065962 6908852 5671309
36516 5671309 4814195 4347143 3687848 2604034 954811 -1129787 -2511340 -1905051 142752
36507 142752 1575782 1563751 1366876 1866269 1994005 776993 -600401 -379930 1133471
36498 1133471 2168930 2116495 1953995 2312812 2607858 2175141 1089206 -321361 -1778945
36489 -1778945 -2676350 -2312625 -895806 342833 450960 -205613 -480396 254469 1565304
$$ packed form
36551c413307J641840P46164k01820k3291M98350K50881l61923q1199J320345
36542C76040K577209K335314O20108j325936k487367k844446k618123j598570
36534d965771J04849J408589J422021P62889N57660O52588K19968l65999p1277
36525b74483O36117K96493p33001l24664J892651L369905K202944j57110j237543
36516E671309q57114m67052o59295j083814j649223k084598j381553O06289K047803
36507A42752J433030j2031j96875M99393J27736j217012j377394K20471J513401
36498A133471J035459n2435j62500L58817K95046m32717j085935j410567j457584
36489a778945q97405L63725J416819J238639J08127o56573k74783P34865J310835
$$ plain form
36480 1565304 2560060 2859763 2877675 3030303 2870393 1561237 -683690 -2359884 -2338261
36471 -2338261 -1165355 -111223 435426 761612 607981 -562104 -2176308 -2759898 -1853452
36462 -1853452 -592912 141510 1078546 3211185 5947132 7742552 8141242 7954524 7490970
36453 7490970 5936624 3005771 156465 -793105 208852 1588479 2171758 2143056 1997282
36444 1997282 1616255 913060 579317 1314956 2642206 3299808 2752470 1634927 707319
36435 707319 80221 -349266 -357846 289099 1355319 2345891 3027332 3513269 3953095 4226005
36425 4226005 3864626 2451656 372950 -1130539 -1272580 -860919 -1263851 -2338848 -2588311
36416 -2588311 -1619957 -981488 -1688600 -2356360 -1349978 209892 -292953 -2915619 -4608460
$$ packed form
36480A565304R94756K99703J7912J52628j59910j309156k244927j676194K1623
36471b338261J172906J054132N46649L26186j53631j170085j614204n83590R06446
36462a853452J260540P34422R37036K132639K735947J795420L98690j86718m63554
36453G490970j554346k930853k849306r49570J001957J379627N83279k8702j45774
36444A997282l81027p03195l33743P35639J327250O57602n47338j117543r27608
36435G07319o27098m29487q580O46945J066220R90572O81441M85937M39826K72910
36425D226005l61379j412970k078706j503489j42041M11661m02932j074997k49463
36416b588311R68354O38469p07112o67760J006382J559870n02845k622666j692841
$$ plain form
36407 -4608460 -3384818 -1105102 -765927 -2400101 -3484222 -2799291 -1886466 -2335677 -3267703
36398 -3267703 -2600224 -14506 2548304 3243365 2202853 825623 28309 -148595 254446
36389 254446 1255706 2197918 1854663 -140180 -2548734 -3855091 -3930614 -3754691 -3944495
36380 -3944495 -4441977 -5302240 -6591238 -7486094 -6787731 -4769902 -3332282 -3601970 -4436838
36371 -4436838 -4233675 -3236749 -2782233 -2976754 -2688190 -1565320 -466473 212402 1088720
36362 1088720 2294913 2925219 2664716 2573552 3235458 3349609 1534983 -1315164 -3003337
36353 -3003337 -2849024 -1982162 -1102157 269517 2056532 2914177 2125242 929631 877977
36344 877977 1729522 2103018 1603047 1076867 985464 689899 -436434 -1980708 -2885339
$$ packed form
36407d608460J223642K279716L39175j634174j084121O84931R12825m49211r32026
36398c267703O67479K585718K562810O95061j040512j377230p97314j76904M03041
36389B54446J001260R42212l43255j994843k408554j306357p5523J75923j89804
36380c944495m97482q60263j288998q94856O98363K017829J437620k69688q34868
36371d436838K03163R96926M54516j94521K88564J122870J098847O78875Q76318
36362A088720J206193O30306k60503r1164O61906J14151j814626k850147j688173
36353c003337J54313Q66862Q80005J371674J787015Q57645p88935j195611n1654
36344H77977Q51545L73496m99971n26180r1403k95565j126333j544274r04631
$$ plain form
36335 -2885339 -2438370 -747670 1381822 2942764 3409516 3034014 2390803 1882296 1919912
36326 1919912 3092569 5459211 7895315 8927920 8229140 6607666 4609801 2106946
36318 2106946 -503006 -1784420 -752352 1737866 3887617 4884579 5228387 5451415 5371847
36309 5371847 4615816 3182224 1386438 -212197 -825591 -97397 1035803 882785 -1057384
36300 -1057384 -3154212 -3283680 -1200206 1277598 2284676 1475907 -370025 -2455238
36292 -2455238 -4217833 -5094348 -4824451 -3949185 -3431188 -3633586 -4018369 -3944326 -3412730
36283 -3412730 -2855664 -2479381 -2067690 -1308798 -165741 983854 1539662 1210080 429255
36274 429255 27725 386786 1106455 1521877 1234070 121292 -1631697 -3231933 -3511615
$$ packed form
36335b885339M46969J690700K129492J560942M66752l75502o43211n08507L7616
36326A919912J172657K366642K436104J032605o98780j621474j997865k502855
36318B106946k609952j281414J032068K490218K149751R96962L43808K23028p9568
36309E371847p56031j433592j795786j598635o13394P28194J133200j53018j940169
36300a057384k096828j29468K083474K477804J007078q08769j845932k085213
36292b455238j762595q76515K69897Q75266N17997k02398l84783P4043N31596
36283c412730N57066L76283M11691P58892J143057J149595N55808l29582p80825
36274D29255m01530L59061P19669M15422k87807j112778j752989j600236k79682
$$ plain form
36265 -3511615 -1983608 548005 2776342 4024651 4326538 3905603 3167710 2774958 2909196
36256 2909196 2649937 907260 -2062448 -4821916 -6367624 -6721415 -5959232 -3856164 -962951
36247 -962951 1076046 1226656 486354 668665 2067269 3201745 2832902 1467321 658954
36238 658954 1279443 2698118 3455966 2662399 873048 -383621 -10541 1769557 3849302
36229 3849302 5221005 5433178 4549006 3093038 1808288 1020453 345974 -584013 -1234929
36220 -1234929 -537027 1719648 4262219 5392564 4525881 2559888 968858 780329 2175785
36211 2175785 4507251 6562824 7381617 7279717 7659171 9116187 10065442 8328834 4183041
36202 4183041 558854 -403859 181785 -91143 -1608926 -2840003 -2968712 -2619746 -2255969
$$ packed form
36265c511615J528007K531613K228337J248309L01887m20935p37893l92752J34238
36256B909196k59259j742677k969708k759468j545708l53791P62183K103068K893213
36247i62951K038997J50610p40302J82311J398604J134476l68843j365581q08367
36238F58954O20489J418675P57848p93567j789351j256669L73080J780098K079745
36229C849302J371703K12173q84172j455968j284750p87835o74479r29987o50916
36220a234929O97902K256675K542571J130345q66683j965993j591030j88529J395456
36211B175785K331466K055573Q18793j01900L79454J457016R49255j736608m145793
36202D183041l624187r62713N85644k72928j517783j231077j28709L48966L63777
$$ plain form
36193 -2255969 -1746845 -1604061 -2697888 -4271884 -4130708 -1649534 1085491 2135946 2074688
36184 2074688 2274161 2485920 1853421 1063767 1450975 2635319 2967921 1988100 767402
36175 767402 86343 -146229 57657 633593 578702 -1028190 -3096540 -3396565 -1590854
36166 -1590854 342952 1066533 1403625 2201136 2499675 1141188 -1033458 -2004242 -983161
36157 -983161 1000730 2417069 2320154 620499 -1899537 -4049675 -5188066 -5519259 -5387015
36148 -5387015 -4896573 -4352148 -4196543 -4212828 -3696486 -2776950 -2502395 -3053148 -3018903 -1329709
36138 -1329709 1101540 2724668 3470978 4268297 5076106 4876814 3500901 2161602 1914199
36129 1914199 2447153 2681784 2035406 951271 517472 1466059 3203318 4084099 3103419
$$ packed form
36193b255969N09124J42784j093827j573996J41176K481174K735025J050455o1258
36184B074688J99473K11759o32499p89654L87208J184344L32602r79821j220698
36175G67402o81059k32572K03886N75936n4891j606892k068350l00025J805711
36166a590854J933806P23581L37092P97511K98539j358487k174646r70784J021081
36157i83161J983891J416339r6915j699655k520036k150138j138391l31193J32244
36148e387015M90442N44425J55605j6285N16342R19536K74555n50753L4245J689194
36138a329709K431249J623128P46310P97319Q07809j99292j375913j339299k47403
36129A914199N32954K34631o46378j084135m33799R48587J737259Q80781r80680
$$ plain form
36120 3103419 1053341 -486080 -981726 -1152462 -1603111 -2037065 -1905135 -1264868 -751121
36111 -751121 -855207 -1259421 -935839 753848 3019945 4262498 3905829 2930059 2291872
36102 2291872 1745273 880632 383423 1146485 2689290 3629132 3448714 2732366 1859651
36093 1859651 597335 -989042 -2249565 -2793223 -2881122 -2858824 -2805791 -2727068 -2492577 -1723019
36083 -1723019 -371695 849726 1385076 1793757 2802100 3783367 3516296 2293965 1699931
36074 1699931 2076008 1865810 125890 -1817529 -2232438 -1344394 -721204 -1171072 -2359740
36065 -2359740 -3791160 -4979362 -5133854 -3852242 -1894932 -299939 1007303 2711612
36057 2711612 4427815 4694294 2833483 -83784 -2426049 -3518800 -3799217 -4047354 -4626040
$$ packed form
36120C103419k050078j539421m95646j70736m50649m33954J31930O40267N13747
36111g51121j04086m04214L23582J689687K266097J242553l56669r75770o38187
36102B291872n46599q64641m97209P63062J542805R39842j80418p16348q72715
36093A859651j262316j586377j260523n43658q7899K2298N3033P8723K34491P69558
36083a723019J351324J221421N35350M08681J008343R81267k67071j222331n94034
36074A699931L76077k10198j739920j943419m14909Q88044O23190m49868j188668
36065b359740j431420j188202j54492J281612J957310J594993J307242J704309
36057B711612J716203K66479j860811k917267k342265j092751k80417k48137n78686
$$ plain form
36048 -4626040 -4985605 -3902169 -834681 2909418 5120824 5019062 3923681 3369770 3444567
36039 3444567 3501246 3562275 4001405 4407990 3966879 2821213 1945010 1601089 1020009 -145350
36029 -145350 -1191312 -1715786 -2461593 -3893848 -4884459 -4094012 -2116344 -850098 -932881
36020 -932881 -1199614 -747468 -99910 76812 97110 459821 1021845 1609777 2398523 3024047
36010 3024047 2519357 1012793 201681 907372 1423014 -42639 -2343847 -2916368 -1638487
36001 -1638487 -717033 -817450 -5109 2692249 5136399 5038015 3311086 2652819 3824550
35992 3824550 5092659 4849929 3292987 1670117 1013138 1562916 2629756 3116183 2719902
35983 2719902 2286969 2506520 2891947 2738117 2371381 2539233 3212947 4018424 5171266
$$ packed form
36048d626040l59565J083436L067488L744099K211406j01762j095381n53911P4797
36039C444567N6679O1029M39130M06585m41111j145666q76203l43921n81080j165359
36029a45350j045962n24474p45807j432255r90611P90447J977668J266246q2783
36020i32881k66733M52146O47558J76722K0298L62711N62024N87932P88746O25524
36010C024047n04690j506564q11112P05691N15642j465653k301208n72521J277881
36001a638487R21454j00417Q12341K697358K444150r8384j726929o58267J171731
35992C824550J268109k42730j556942j622870o56979N49778J066840M86427l96281
35983B719902m32933K19551L85427j53830l66736J67852O73714Q05477J152842
$$ plain form
35974 5171266 6707328 7397110 6067246 3758860 2778615 3430629 3494483 1550939 -866720
35965 -866720 -1491191 -356881 676923 517158 -395309 -1303794 -1753737 -1279780 213520
35956 213520 1734779 1974974 946450 -68929 -314283 -304113 -556540 -700375 -440164
35947 -440164 -447216 -1406352 -2823782 -3728172 -4104020 -4601650 -5078730 -4577257 -2856262 -928960
35937 -928960 231929 666057 759754 480431 -193671 -849112 -1305283 -2063007 -3361349
35928 -3361349 -4380999 -4266716 -3507049 -3333125 -4003584 -4663729 -4781007 -4702415 -4708037 -4463225
35918 -4463225 -3683306 -2607674 -1535884 -444414 777555 2147246 3528805 4219192
35910 4219192 3046146 -23093 -2642899 -2027783 1507878 4371676 3720178 441968
$$ packed form
35974E171266J536062O89782j329864k308386r80245O52014O3854j943544k417659
35965h66720o24471J134310J033804j59765r12467r08485m49943M73957J493300
35956B13520J521259K40195j028524j015379k45354J0170k52427j43835K60211
35947d40164p052r59136j417430r04390l75848m97630m77080N01473J720995J927302
35937i28960J160889M34128R3697k79323o74102o55441m56171p57724j298342
35928c361349j019650J14283P59667J73924o70459o60145j17278P8592n622K44812
35918d463225P79919J075632J071790J091470J221969J369691J381559O90387
35910D219192j173046l069239k619806O15116L535661K863798o51498l278210
$$ plain form
35902 441968 -2602368 -3982062 -4177704 -3774639 -2817534 -1692213 -1346135 -2415677 -4640456
35893 -4640456 -6989727 -8149407 -7576508 -6497996 -6886870 -8688380 -9165895 -6231361 -1544800
35884 -1544800 1189829 451378 -2059524 -4091694 -4796689 -4166804 -2398351 -272747 1200429
35875 1200429 1965598 2658228 3014976 1919826 -589977 -2789911 -3450582 -3386482 -4033129
35866 -4033129 -5472571 -6742534 -7317319 -7383509 -7183172 -6866816 -6635926 -6447664 -5898012
35857 -5898012 -4788996 -3419176 -2052100 -674096 398439 354296 -1153821 -3398285
35849 -3398285 -5378824 -6763298 -7639424 -7868620 -7218629 -5847702 -4308752 -3226039 -2879812
35840 -2879812 -2650836 -1165194 2049419 5147005 5474971 2774895 -400456 -1882422
$$ packed form
35902D41968l044336j379694j95642M03065R57105J125321L46078j069542k224779
35893d640456k349271j159680N72899J078512l88874j801510m77515K934534M686561
35884a544800K734629p38451k510902k032170p04995O29885J768453K125604J473176
35875A200429P65169O92630L56748j095150k509803k199934o60671O4100o46647
35866d033129j439442j269963n74785o6190K00337L16356K30890J88262N49652
35857e898012J109016J369820J367076J378004J072535m4143j508117k244464
35849c398285j980539j384474q76126k29196O49991J370927J538950J082713L46227
35840b879812K28976J485642L214613L097586L27966k700076l175351j481966
$$ plain form
35832 -1882422 -2089390 -2385110 -2840294 -2882443 -2884773 -3504848 -4192524 -3845016 -2483876 -1061836
35822 -1061836 -126862 186738 -435568 -1723529 -2180803 -839163 884799 875780 -514456
35813 -514456 -986575 130682 1051061 663156 249355 1086776 2240426 2149819 1019259
35804 1019259 110162 -391815 -1285676 -2655291 -3595600 -3451659 -2355583 -677077 1289201
35795 1289201 3212888 4853241 6085689 6485066 5476258 3452798 2053265 2458504
35787 2458504 3903520 4802238 4923940 5334937 6346114 6764234 5532583 3218651 1316604
35778 1316604 537341 272206 -385272 -1363480 -1491150 151752 2771360 4304564 3710799
35769 3710799 2241864 1741452 2226888 2237979 1310071 682981 1246472 2140224 2207330 1755555
$$ packed form
35832a882422k06968k95720m55184m2149k330o20075o87676L47508J361140J422040
35822a061836R34974L13600o22306j287961m57274J341640J723962r019j390236
35813e14456m72119J117257R20379l87905m13801Q37421J153650r0607j130560
35804A019259r09097n01977q93861j369615r40309J43941J096076J678506J966278
35795A289201J923687J640353J232448L99377j008808k023460j399533M05239
35787B458504J445016Q98718J21702M10997J011177M18120j231651k313932j902047
35778A316604p79263k65135o57478r78208j27670J642902K619608J533204n93765
35769C710799j468935n00412M85436J1091r27908o27090N63491Q93752O7106m51775
$$ plain form
35759 1755555 1688154 1582366 137728 -2503970 -4326274 -3883522 -2133988 -994237 -793228
35750 -793228 -298370 968692 1740885 806393 -1131998 -2281892 -2043225 -1551384 -1987239
35741 -1987239 -3231799 -4480994 -5414612 -6152754 -6556169 -6327628 -5629478 -4893127 -4035461
35732 -4035461 -2597254 -858476 -77892 -1044681 -2794346 -3454800 -2330142 -598446 148870
35723 148870 -447791 -1598422 -2646090 -3679491 -4871793 -5737147 -5423577 -3634900 -999499
35714 -999499 1467115 3081885 3718769 3612729 3090538 2325272 1216172 -335538 -1922824
35705 -1922824 -2707063 -2335484 -1545206 -1309575 -1453927 -830250 915765 2517296 2603385
35696 2603385 1427965 251727 -533033 -1481395 -2395001 -1974412 250544 2808263 4024279
$$ packed form
35759A755555o7401j05788j444638k641698j822304M42752J749534J139751K01009
35750g93228M94858J267062P72193r34492j938391j149894K38667M91841m35855
35741a987239j244560j249195r33618p38142m03415K28541O98150P36351Q57666
35732d035461J438207J738778P80584r66789j749665o60454J124658J731696P47316
35723A48870n96661j150631j047668j033401j192302q65354L13570J788677K635401
35714i99499K466614J614770O36884j06040n22191p65266j109100j551710j587286
35705a922824p84239L71579P90278K35631j44352O23677J746015J601531Q6089
35696B603385j175420j176238p84760r48362r13606M20589K224956K557719J216016
$$ plain form
35687 4024279 4010008 3856558 3586222 2311230 128653 -1596578 -1932149 -1144708 263960
35678 263960 1879880 2560421 1054613 -1756146 -2876997 -782362 2289087 3180810 1951781
35669 1951781 1324674 2642668 4464678 5127429 4657766 3677120 2200161 350869 -1114240
35660 -1114240 -1881796 -2568329 -3366616 -3368378 -2148806 -873487 -638160 -677098 342144
35651 342144 1921623 2279209 1103495 145613 704122 1776484 1410876 -791163 -3160307
35642 -3160307 -3711063 -2103313 60268 885632 180760 -522630 -114289 600735 208219
35633 208219 -1164268 -2137004 -2234426 -2383475 -3051457 -3240689 -2093361 -535064 -277272
35624 -277272 -1558980 -2765533 -2293535 -267910 1645646 1863762 350460 -1390950 -1887364
$$ packed form
35687D024279j4271j53450k70336j274992k182577j725231l35571P87441J408668
35678B63960J615920O80541j505808k810759j120851K094635L071449Q91723j229029
35669A951781o27107J317994J822010O62751m69663r80646j476959j849292j465109
35660a114240p67556o86533p98287j762J219572J275319K35327l8938J019242
35651C42144J579479L57586j175714r57882N58509J072362l65608k202039k369144
35642c160307n50756J607750K163581Q25364p04872p03390M08341P15024l92516
35633B08219j372487r72736r7422j49049o67982j89232J147328J558297K57792
35624b77272j281708j206553M71998K025625J913556K18116j513302j741410m96414
$$ plain form
35615 -1887364 -1260174 -909622 -1613904 -2524897 -2426624 -1468097 -935474 -1451357 -2158710 -1966802
35605 -1966802 -1072637 -648098 -1098266 -1313088 -159006 1626933 1898189 -321613 -3534801
35596 -3534801 -5667994 -6595535 -7774589 -9749623 -11299612 -11195453 -9622055 -7433677
35588 -7433677 -5060291 -2799833 -1270951 -689087 -284209 745769 2164119 3282785
35580 3282785 4054648 4699775 4726160 3396933 996792 -1309036 -2743890 -3168838 -2355085
35571 -2355085 -266537 1872724 2185350 434053 -1294448 -951903 1105955 2805538
35563 2805538 2843861 1768028 961513 1273014 2480193 3554774 3562215 2700564 2268498
35554 2268498 3192207 4763950 5303273 4007252 1765441 171870 49403 932326 1696676
$$ packed form
35615a887364O27190L50552p04282r10993R8273R58527N32623n15883p07353J91908
35605a966802Q94165M24539m50168k14822J154082J785939K71256k219802l213188
35596c534801k133193r27541j179054j975034j549989J04159J573398K188378
35588g433677K373386K260458J528882N81864M04878J029978J418350J118666
35580C282785P71863O45127K6385j329227k400141k305828j434854m24948Q13753
35571b355085K088548K139261L12626j751297j728501L42545K057858J699583
35563B805538L8323j075833q06515L11501J207179J074581P441q61651m32066
35554B268498R23709J571743N39323j296021k241811j593571j22467Q82923P64350
$$ plain form
35545 1696676 1586504 714807 -368720 -1435731 -2640966 -3898087 -4664733 -4559266 -3856577
35536 -3856577 -3140086 -2696391 -2354154 -1609961 83577 2609847 4686051 4822554 3131153
35527 3131153 1460128 1293607 2285752 3387877 4397166 5401280 5624019 4291505 2203869
35518 2203869 981204 935578 1080893 1036154 1227286 1152317 -536498 -3496850 -5088214
35509 -5088214 -3575679 -598405 982103 697342 412263 1320284 2625661 3100350 2610355
35500 2610355 1885247 1622401 1955501 2286705 1760187 312638 -1121823 -1855094 -2195704
35491 -2195704 -2363421 -1645970 272228 2042689 2165610 1116789 396399 77656 -785026
35482 -785026 -1734646 -1251346 367579 949858 -52575 -443510 1141181 2828213 2428477
$$ packed form
35545A696676j10172q71697j083527j067011j205235j257121p66646J05467P02689
35536c856577P16491M43695L42237P44193J693538K526270K076204J36503j691401
35527C131153j671025j66521R92145J102125J009289J004114K22739j332514k087636
35518B203869j222665m5626J45315m4739J91132p4969j688815k960352j591364
35509e088214J512535K977274J580508k84761k85079R08021J305377M74689m89995
35500B610355p25108k62846L33100L31204n26518j447549j434461p33271l40610
35491b195704j67717P17451J918198J770461J22921j048821p20390l18743q62682
35482g85026r49620M83300J618925N82279j002433l90935J584691J687032l99736
$$ plain form
35473 2428477 852968 466339 1465679 2283878 2663337 3793949 5714851 6965619 6958637
35464 6958637 6617627 6351398 5358834 3507991 2128727 2162673 3015020 3987869 5351264
35455 5351264 7029867 7649451 6227795 3868527 2487023 2528669 3101266 3685737 4372369
35446 4372369 4838120 4572340 4125249 4786989 6642786 7943829 6925159 3607704 -551936
35437 -551936 -4100208 -6162487 -6262299 -4551708 -2227489 -911867 -1140526 -1786525 -1467480
35428 -1467480 -409081 -329394 -2267171 -5053761 -6458252 -5579033 -3530848 -1932927 -1432993
35419 -1432993 -1763546 -2420790 -2826530 -2376349 -944299 835254 2182865 2946527 3493027
35410 3493027 3976624 3964675 2751323 49793 -3378821 -5836088 -5949786 -4070383 -2031182
$$ packed form
35473B428477j575509l86629R99340Q18199L79459J130612J920902J250768o982
35464F958637l41010k66229r92564j850843j379264L3946Q52347R72849J363395
35455E351264J678603O19584j421656k359268j381504M1646N72597N84471O86632
35446D372369M65751k65780m47091O61740J855797J301043j018670l317455m159640
35437e51936l548272k062279r9812J710591K324219J315622k28659o45999L19045
35428a467480J058399P9687j937777k786590j404491Q79219K048185J597921M99934
35419a432993l30553o57244m05740M50181J432050J779553J347611P63662N46500
35410C493027M83597j1949j213352k701530l428614k457267j13698J879403K039201
$$ plain form
35401 -2031182 -1312036 -1803574 -2473062 -2621852 -2171182 -1357729 -672484 -608777 -990978 -1095348
35391 -1095348 -934097 -1670016 -3909710 -6254433 -6723233 -5254809 -3531277 -2498405 -1539513
35382 -1539513 -308972 247141 -402675 -883686 542406 3502472 5835320 6244871 5505078
35373 5505078 4849471 4196527 2632210 91606 -2283326 -3463300 -3553358 -3199542 -2480771
35364 -2480771 -1023649 941533 2436141 2911764 2901311 3028186 3015526 2421441 1789332
35355 1789332 1941974 2340759 1470819 -870556 -2936809 -3364082 -3086327 -3900740 -5803253
35346 -5803253 -6944507 -6046912 -3852107 -2103733 -1842685 -2756074 -3537978 -2868240 -739823
35337 -739823 1123948 961913 -723524 -1403556 529074 3853088 6141376 6473447 5623781
$$ packed form
35401b031182P19146m91538o69488j48790M50670Q13453O85245O3707l82201j04370
35391a095348J61251p35919k239694k344723m68800J468424J723532J032872R58892
35382a539513J230541N56113o49816m81011J426092K960066K332848M09551p39793
35373E505078o55607o52944j564317k540604k374932j179974r0058L53816P18771
35364b480771J457122J965182J494608M75623j0453J26875j2660n94085o32109
35355A789332J52642L98785q69940k341375k066253m27273K77755q14413j902513
35346e803253j141254Q97595K194805J748374K61048r13389p81904O69738K128417
35337g39823J863771j62035j685437o80032J932630L324014K288288L32071q49666
$$ plain form
35328 5623781 4265661 2409913 499606 -482764 -510473 -837535 -2004369 -2637571 -1457329
35319 -1457329 361511 485166 -1180755 -2171676 -910448 1178796 1902145 1284698 997947
35310 997947 1699008 2542747 3051457 3881197 5413140 6797346 7022159 6200375 5207801
35301 5207801 4520049 3964525 3404034 3190437 3846438 5412173 7203556 8354368 8582156
35292 8582156 8149500 7151417 5538832 4057164 4123270 5908514 7405949 6704327 4679621
35283 4679621 3924960 5217132 6719534 6847708 6156686 5766708 5588183 5192350 5124243
35274 5124243 5987532 7013027 6788380 4989163 2506249 345294 -870205 -974571 -676556
35265 -676556 -1228412 -2812149 -3965331 -3531040 -2358200 -1939285 -2206654 -2125645 -1798290
$$ packed form
35328E623781j358120j855748j910307r82370k7709l27062j166834o33202J180242
35319a457329J818840J23655j665921r90921J261228K089244P23349o17447k86751
35310I97947P01061Q43739N08710Q29740J531943J384206K24813q21784r92574
35301E207801o87752n55524n60491k13597O56001J565735J791383J150812K27788
35292H582156m32656r98083j612585j481668O6106J785244J497435p01622k024706
35283D679621p54661J292172J502402J28174o91022l89978j78525l95833o8107
35274E124243Q63289J025495k24647j799217k482914k160955j215499j04366K98015
35265f76556n51856j583737j153182M34291J172840M18915k67369Q1009L27355
$$ plain form
35256 -1798290 -2226561 -3216281 -3244568 -1588705 779858 2548204 3063628 2037396 -247411
35247 -247411 -2241682 -2163054 -184951 1662764 2119999 1898432 1941283 2064047 1985442 2141789
35237 2141789 2493872 1934210 111713 -1328479 -724770 1250225 2613258 2740358 2523275
$$ packed form
35256a798290m28271r89720k8287J655863K368563J768346N15424j026232k284807
35247b47411j994271P8628J978103J847715M57235k21567M2851J22764p8605J56347
35237B141789L52083n59662j822497j440192O03709J974995J363033J27100k17083
$$ [...]
##END NTUPLES=NMR SPECTRUM
##END=
