##TITLE=31Pdec_27-2024
 DMSO-d6
 64 sc
 2.4.2024
##JCAMPDX= 6.0         $$ Bruker NMR JCAMP-DX V2.0
##DATA TYPE= NMR SPECTRUM
##DATA CLASS= NTUPLES
##ORIGIN= UXNMR, Bruker Analytische Messtechnik GmbH
##OWNER= root
$$ XWIN-NMR		Version 3.5
$$ Tue Apr  2 14:56:49 2024 Russian Standard Time (UT+4h)  she@DPX200
##.OBSERVE FREQUENCY= 81.013821
##.OBSERVE NUCLEUS= ^31P
##.ACQUISITION MODE= SIMULTANEOUS
##.ACQUISITION SCHEME= undefined
##.AVERAGES= 64
##.DIGITISER RES= 16
##SPECTROMETER/DATA SYSTEM= spect
##.PULSE SEQUENCE= zgpg30
##.SOLVENT NAME= D2O
##.SHIFT REFERENCE= (INTERNAL, D2O, 0, 248.564)
##AUDIT TRAIL= $$ (NUMBER, WHEN, WHO, WHERE, WHAT)
$$ ##TITLE= Audit trail, XWIN-NMR		Version 3.5
$$ ##JCAMPDX= 5.01
$$ ##ORIGIN= Bruker BioSpin GmbH
$$ ##OWNER= she
$$ F:/spectra/data/she/nmr/P31/1/pdata/1/auditp.txt
$$ ##AUDIT TRAIL=  $$ (NUMBER, WHEN, WHO, WHERE, WHAT)
(   1,<2024-04-02 14:55:59.93 +0400>,<she>,<DPX200>,
      <continue with go, POWCHK disabled, PULCHK disabled
       configuration hash MD5:
       00 E9 B6 7A A2 85 ED C7 34 08 36 98 17 FE 4E 26
       data hash MD5: 32K
       82 D5 BB F1 C2 21 23 36 EF B9 F3 6D 2B 2C 9A 7F>)
(   2,<2024-04-02 14:56:02.92 +0400>,<she>,<DPX200>,
      <Start of raw data processing
       efp BC_mod = 2 LB = 10 FT_mod = 6 PKNL = 1 PHC0 = -13238.86 PHC1 = 90.88333 SI = 64K 
       data hash MD5: 64K
       B8 F1 73 8E 37 04 2B C0 77 50 9C 41 54 7E 50 76>)
(   3,<2024-04-02 14:56:21.60 +0400>,<she>,<DPX200>,
      <pk PHC0 = -14.57198 PHC1 = 0 
       data hash MD5: 64K
       BB 7A 7B 20 80 F3 06 9C DA 1D 9D 39 6C E2 B5 C0>)
(   4,<2024-04-02 14:56:25.98 +0400>,<she>,<DPX200>,
      <abs ABSG = 5 
       data hash MD5: 64K
       C3 D4 A1 1D 6C B6 34 9F 89 3E 86 F2 24 84 7D 7C>)
$$ ##END=
$$ 
$$ hash MD5
$$ 03 D2 9E 21 60 07 73 86 4B 4A CA 41 79 41 08 56
##$RELAX= 
##$RELAX= 
##$RELAX= 
##$RELAX= 
##$RELAX= 
##$RELAX= 
##$RELAX= 
##$RELAX= 
##$RELAX= 
$$ Bruker specific parameters
$$ --------------------------
##$DU= <F:/spectra>
##$EXPNO= 1
##$NAME= <P31>
##$PROCNO= 1
##$TYPE= <nmr>
##$USER= <she>
##$AMP= (0..31)
100 100 100 100 100 100 100 100 100 100 100 100 100 100 100 100 100 100 
100 100 100 100 100 100 100 100 100 100 100 100 100 100 
##$AQSEQ= 0
##$AQ_mod= 1
##$AUNM= <au_zg>
##$AUTOPOS= <>
##$BF1= 81.014009
##$BF2= 200.13
##$BF3= 200.13
##$BF4= 200.13
##$BF5= 200.13
##$BF6= 200.13
##$BF7= 200.13
##$BF8= 200.13
##$BYTORDA= 1
##$CFDGTYP= 0
##$CFRGTYP= 5
##$CHEMSTR= <none>
##$CNST= (0..31)
1 1 145 1 1 1 1 1 1 1 1 1 1 1 1 1 1 1 1 1 1 1 1 1 1 1 1 1 1 1 1 1 
##$CPDPRG= <waltz16>
##$CPDPRG1= <>
##$CPDPRG2= <waltz16>
##$CPDPRG3= <>
##$CPDPRG4= <mlev>
##$CPDPRG5= <mlev>
##$CPDPRG6= <mlev>
##$CPDPRG7= <mlev>
##$CPDPRG8= <mlev>
##$CPDPRGB= <>
##$CPDPRGT= <>
##$D= (0..31)
0 1 0 0 0 0 0 0 0 0 0 0.03 2e-05 3e-06 0 0 0 0 0 0 0 0 0 0 0 0 0 0 0 0 
0 0 
##$DATE= 1712055281
##$DBL= (0..7)
120 120 120 11 120 120 24 19 
##$DBP= (0..7)
150 150 150 150 150 150 150 150 
##$DBP07= 0
##$DBPNAM0= <>
##$DBPNAM1= <>
$$ [...]
##$SUBNAM3= <"">
##$SUBNAM4= <"">
##$SUBNAM5= <"">
##$SUBNAM6= <"">
##$SUBNAM7= <"">
##$SUBNAM8= <"">
##$SUBNAM9= <"">
##$SW= 501.771253377433
##$SWIBOX= (0..15)
0 1 3 0 0 0 0 0 0 0 0 0 0 0 0 0 
##$SW_h= 40650.406504065
##$TD= 32768
##$TD0= 1
##$TE= 0
##$TE2= 300
##$TE3= 300
##$TEG= 300
##$TL= (0..7)
0 120 53 12 22 120 120 120 
##$TP= (0..7)
150 150 150 150 150 150 150 150 
##$TP07= 0
##$TPNAME0= <>
##$TPNAME1= <>
##$TPNAME2= <>
##$TPNAME3= <>
##$TPNAME4= <>
##$TPNAME5= <>
##$TPNAME6= <>
##$TPNAME7= <>
##$TPOAL= (0..7)
0.5 0.5 0.5 0.5 0.5 0.5 0.5 0.5 
##$TPOFFS= (0..7)
0 0 0 0 0 0 0 0 
##$TUNHIN= 0
##$TUNHOUT= 0
##$TUNXOUT= 0
##$USERA1= <user>
##$USERA2= <user>
##$USERA3= <user>
##$USERA4= <user>
##$USERA5= <user>
##$V9= 5
##$VALIST= <valist>
##$VCLIST= <CCCCCCCCCCCCCCC>
##$VD= 0
##$VDLIST= <DDDDDDDDDDDDDDD>
##$VPLIST= <PPPPPPPPPPPPPPP>
##$VTLIST= <TTTTTTTTTTTTTTT>
##$WBST= 1024
##$WBSW= 4
##$XGAIN= (0..3)
0 0 0 0 
##$XL= 0
##$YL= 0
##$YMAX_a= 2004
##$YMIN_a= -1714
##$ZGOPTNS= <>
##$ZL1= 120
##$ZL2= 120
##$ZL3= 120
##$ZL4= 120
##$ABSF1= 248.5645
##$ABSF2= -253.2056
##$ABSG= 5
##$ABSL= 3
##$ALPHA= 0
##$AQORDER= 0
##$ASSFAC= 0
##$ASSFACI= 0
##$ASSFACX= 0
##$ASSWID= 0
##$AUNMP= <proc_1d>
##$AZFE= 0.1
##$AZFW= 0.5
##$BCFW= 0
##$BC_mod= 2
##$BYTORDP= 0
##$COROFFS= 0
##$CY= -3
##$DATMOD= 1
##$DC= 0
##$DFILT= <>
##$DTYPP= 0
##$F1P= 0
##$F2P= 0
##$FCOR= 1
##$FTSIZE= 65536
##$FT_mod= 6
##$GAMMA= 0
##$GB= 0
##$INTBC= 1
##$INTSCL= 6.047779e-11
##$ISEN= 30
##$LB= 10
##$LEV0= 0
##$LPBIN= 0
##$MAXI= 10000
##$MC2= 0
##$MEAN= 0
##$ME_mod= 0
##$MI= 50
##$NCOEF= 0
##$NC_proc= -11
##$NLEV= 6
##$NOISF1= 182.463
##$NOISF2= 159.3651
##$NSP= 0
##$NTH_PI= 0
##$NZP= 0
##$OFFSET= 248.5645
##$PC= 4
##$PHC0= -13253.43
##$PHC1= 90.88333
##$PH_mod= 1
##$PKNL= yes
##$PPARMOD= 0
##$PSCAL= 0
##$PSIGN= 0
##$REVERSE= no
##$SF= 81.0140089999694
##$SI= 65536
##$SIGF1= 159.3651
##$SIGF2= -187.1042
##$SINO= 113.3802
##$SIOLD= 16384
##$SREGLST= <1H.CDCl3>
##$SSB= 0
##$STSI= 65536
##$STSR= 0
##$SW_p= 40650.406504065
##$SYMM= 0
##$S_DEV= 0
##$TDeff= 32768
##$TDoff= 0
##$TI= <>
##$TILT= no
##$TM1= 0
##$TM2= 0
##$TOPLEV= 0
##$USERP1= <user>
##$USERP2= <user>
##$USERP3= <user>
##$USERP4= <user>
##$USERP5= <user>
##$WDW= 1
##$XDIM= 65536
##$YMAX_p= 452257209
##$YMIN_p= -158424964
$$ End of Bruker specific parameters
$$ ---------------------------------
##NTUPLES= NMR SPECTRUM
##VAR_NAME=  FREQUENCY,     SPECTRUM/REAL,   SPECTRUM/IMAG
##SYMBOL=    X,             R,               I
##VAR_TYPE=  INDEPENDENT,   DEPENDENT,       DEPENDENT
##VAR_FORM=  AFFN,          ASDF,            ASDF
##VAR_DIM=   65536,         65536,           65536
##UNITS=     HZ,            ARBITRARY UNITS, ARBITRARY UNITS
##FACTOR=    0.620285442955139, 1,           1
##FIRST=     20137.2065510682, 0,            0
##LAST=      -20513.1999529968, 0,           0
##MIN=       -20513.1999529968, -158424964,  0
##MAX=       20137.2065510682, 452257209,    0
$$ Real data points
##PAGE= N=1
##DATA TABLE= (X++(R..R)), XYDATA
$$ [...]
$$ plain form
37234 -14696582 -16956846 -19162051 -21568941 -24370529 -27670643 -31471482 -35659926 -40003726
37226 -40003726 -44184829 -47881055 -50865445 -53064120 -54534815 -55386482 -55699686 -55492263
37218 -55492263 -54729583 -53352756 -51304798 -48550485 -45092189 -40984509 -36348862 -31381121
37210 -31381121 -26336470 -21483476 -17045260 -13163238 -9904370 -7297319 -5361580 -4105153
37202 -4105153 -3496642 -3438278 -3762585 -4255714 -4694175 -4879978 -4666784 -3975083 -2794677
37193 -2794677 -1174431 795296 2998962 5306610 7581897 9691742 11518022 12968498
37185 12968498 13985215 14550946 14694149 14490405 14056967 13538624 13085746 12826656 12837729
37176 12837729 13119386 13591762 14120211 14563777 14822375 14860264 14704761 14437520 14191238
$$ packed form
37234a4696582k260264k205205k406890k801588l300114l800839m188444m343800
37226d0003726m181103l696226k984390k198675j470695q51667l13204K07423
37218e5492263P62680J376827K047958K754313L458296M107680M635647M967741
37210c1381121N044651M852994M438216L882022L258868K607051J935739J256427
37202d105153O08511N8364l24307m93129m38461j85803K13194O91701J180406
37193b794677J620246J969727K203666K307648K275287K109845J826280J450476
37185A2968498J016717N65731J43203k03744m33438n18343m52878k59090J1073
37176A2837729K81657M72376N28449M43566K58598L7889j55503k67241k46282
$$ plain form
37167 14191238 14144052 14492216 15394338 16907872 18955389 21345739 23838657 26210324 28281934
37158 28281934 29911373 30981965 31417084 31213337 30458777 29312460 27953132 26525911
37150 26525911 25112718 23734563 22376352 21015890 19640235 18242805 16806574 15285859
37142 15285859 13600228 11649279 9346053 6653351 3603548 295070 -3124725 -6478602
37134 -6478602 -9581158 -12269949 -14442038 -16078570 -17242466 -18050076 -18630082 -19084775 -19466485
37125 -19466485 -19778322 -19999638 -20123169 -20182957 -20257905 -20450398 -20851461 -21506953 -22396037 -23429010
37115 -23429010 -24468472 -25372280 -26045930 -26481560 -26762424 -27029095 -27423975 -28038628 -28882204
37106 -28882204 -29878313 -30888000 -31747473 -32304811 -32446170 -32114938 -31332246 -30217051 -28989637
$$ packed form
37167A4191238m7186L48164R02122J513534K047517K390350K492918K371667K071610
37158B8281934J629439J070592M35119k03747p54560j146317j359328j427221
37150B6525911j413193j378155j358211j360462j375655j397430j436231j520715
37142A5285859j685631j950949k303226k692702l049803l308478l419795l353877
37134f478602l102556k688791k172089j636532j163896q07610n80006m54693l81710
37125a9466485l11837k21316j23531n9788p4948j92493m01063o55492q89084j032973
37115b3429010j039462r03808o73650m35630k80864k66671l94880o14653q43576
37106b8882204r96109j009687q59473n57338j41359L31232P82692J115195J227414
$$ plain form
37097 -28989637 -27940246 -27359868 -27454862 -28284589 -29754985 -31668365 -33793947 -35917514 -37857431
37088 -37857431 -39466244 -40639793 -41334654 -41578996 -41466261 -41132975 -40727424 -40375913 -40154901
37079 -40154901 -40079509 -40115061 -40206846 -40311377 -40411098 -40507962 -40608913 -40719978 -40851958 -41026473
37069 -41026473 -41272337 -41612706 -42048251 -42541064 -43007876 -43334680 -43413477 -43180402 -42628465
37060 -42628465 -41788641 -40697904 -39376686 -37823206 -36018347 -33932367 -31529005 -28768470
37052 -28768470 -25615060 -22052366 -18098894 -13810791 -9265996 -4538862 319719 5287363
37044 5287363 10359247 15524369 20735720 25885944 30803072 35277892 39122963 42243621
37036 42243621 44684339 46618538 48281270 49878743 51516590 53170251 54699820 55901352
$$ packed form
37097b8989637J049391N80378r4994q29727j470396j913380k125582k123567j939917
37088c7857431j608813j173549o94861k44342J12735L33286M05551L51511K21012
37079d0154901P5392l5552r1785j04531r9721r6864j00951j11065j31980j74515
37069d1026473k45864l40369m35545m92813m66812l26804p8797K33075N51937
37060d2628465Q39824J090737J321218J553480J804859K085980K403362K760535
37052b8768470L153410L562694L953472M288103M544795M727134M858581M967644
37044E287363N071884N165122N211351N150224M917128M474820L845071L120658
37036D2243621K440718J934199J662732J597473J637847J653661J529569J201532
$$ plain form
37028 55901352 56577676 56600501 55936792 54633993 52783123 50484164 47826231 44882490 41714103
37019 41714103 38375341 34914438 31373820 27800038 24265843 20889652 17831396 15257896
37011 15257896 13292368 11973087 11240218 10955048 10942173 11038314 11131487 11178016 11191354 11208427
37001 11208427 11253078 11318732 11376316 11392818 11343236 11214250 11008272 10748101 10471710 10214209
36991 10214209 9992666 9812469 9692226 9681064 9844781 10225724 10807562 11514079 12242690
36982 12242690 12905875 13451852 13857878 14111452 14198026 14102132 13817505 13358533 12766588 12106613
36972 12106613 11453612 10875769 10425049 10140469 10056711 10204489 10599050 11230644 12073967
36963 12073967 13113305 14355974 15809054 17425882 19059331 20458840 21321024 21375116
$$ packed form
37028E5901352O76324K2825o63709j302799j850870k298959k657933k943741l168387
37019D1714103l338762l460903l540618l573782l534195l376191l058256k573500
37011A5257896j965528j319281p32869k85170j2875R6141R3173M6529J3338J7073
37001A1208427M4651O5654N7584J6502m9582j28986k05978k60171k76391k57501
36991A0214209k21543j80197j20243j1162J63717L80943N81838P06517P28611
36982A2242690O63185N45977M06026K53574Q6574r5894k84627m58972n91945o59975
36972A2106613o53001n77843m50720k84580q3758J47778L94561O31594Q43323
36963A2073967J039338J242669J453080J616828J633449J399509Q62184N4092
$$ plain form
36955 21375116 20471232 18638331 16084915 13132557 10101574 7196145 4441752 1702925
36947 1702925 -1231408 -4537541 -8267615 -12310408 -16410716 -20238671 -23484288 -25940303
36939 -25940303 -27540934 -28349423 -28515024 -28227262 -27680453 -27044861 -26438821 -25905813 -25408595
36930 -25408595 -24849592 -24113677 -23115653 -21832911 -20315523 -18678290 -17079450 -15686443
36922 -15686443 -14635572 -14005476 -13820723 -14075500 -14745833 -15771313 -17024656 -18309232 -19406131
36913 -19406131 -20150265 -20489041 -20489760 -20300340 -20097313 -20051113 -20310256 -20984788 -22116059 -23643341
36903 -23643341 -25391046 -27091060 -28434884 -29137381 -28993716 -27917574 -25954404 -23266001
36895 -23266001 -20086065 -16654722 -13151528 -9651567 -6120636 -2448153 1497492 5809727
$$ packed form
36955B1375116r03884j832901k553416k952358l030983k905429k754393k738827
36947A702925k934333l306133l730074m042793m100308l827955l245617k456015
36939b5940303j600631q08489j65601K87762N46809O35592O06040N33008M97218
36930b5408595N59003P35915R98024J282742J517388J637233J598840J393007
36922a5686443J050871O30096J84753k54777o70333j025480j253343j284576j096899
36913a9406131p44134l38776p19J89420K03027M6200k59143o74532j131271j527282
36903b3643341j747705j700014j343824p02497J43665J076142J963170K688403
36895b3266001L179936L431343L503194L499961L530931L672483L945645M312235
$$ plain form
36887 5809727 10495857 15450760 20457839 25217364 29397167 32696554 34909580 35968499
36879 35968499 35948726 35029915 33430405 31348077 28935448 26313253 23603212 20953008
36871 20953008 18535688 16521349 15032463 14101434 13647945 13484573 13348573 12951919 12038487
36862 12038487 10431602 8052891 4906972 1052881 -3403793 -8284416 -13300851 -18051580
36854 -18051580 -22072219 -24922993 -26272954 -25949733 -23950218 -20427097 -15665843 -10053983
36846 -10053983 -4036555 1942652 7502273 12369707 16400487 19568015 21929441 23579943
36838 23579943 24612026 25095499 25085479 24652349 23914565 23050237 22273038 21779729 21694638
36829 21694638 22035819 22710738 23534763 24264918 24646731 24470099 23620866 22109480 20064498
$$ packed form
36887E809727M686130M954903N007079M759525M179803L299387K213026J058919
36879C5968499j9773r18811j599510k082328k412629k622195k710041k650204
36871B0953008k417320k014339j488886r31029m53489j63372j36000l96654r13432
36862A2038487j606885k378711l145919l854091m456674m880623n016435m750729
36854a8051580m020639k850774j349961L23221J999515L523121M761254N611860
36846a0053983O017428N979207N559621M867434M030780L167528K361426J650502
36838B3579943J032083M83473j0020m33130p37784q64328p77199m93309q5091
36829B1694638L41181O74919Q24025P30155L81813j76632q49233j511386k044982
$$ plain form
36820 20064498 17693274 15225762 12862843 10745431 8948789 7495269 6373739 5554884
36812 5554884 4996580 4641621 4417623 4248373 4074196 3866506 3622843 3344046 3009407
36803 3009407 2565580 1934190 1033751 -191702 -1746275 -3569015 -5541510 -7512691 -9326557
36794 -9326557 -10840946 -11940103 -12553465 -12683133 -12421758 -11936950 -11420318 -11029215 -10855144
36785 -10855144 -10926995 -11227105 -11694077 -12209556 -12590242 -12608685 -12047472 -10768369 -8766039
36776 -8766039 -6180750 -3262998 -305841 2425016 4735246 6508193 7682777 8226530
36768 8226530 8125473 7394114 6088276 4300967 2141052 -285246 -2872767 -5501318
36760 -5501318 -8026906 -10294404 -12165304 -13543097 -14384772 -14699148 -14539400 -13995831 -13190337
$$ packed form
36820B0064498k371224k467512k362919k117412j796642j453520j121530q18855
36812E554884n58304l54959k23998j69250j74177k07690k43663k78797l34639
36803C009407m43827o31390r00439j225453j554573j822740j972495j971181j813866
36794i326557j514389j099157o13362j29668K61375M84808N16632L91103J74071
36785a0855144p1851l00110m66972n15479l80686j8443N61213J279103K002330
36776h766039K585289K917752K957157K730857K310230J772947J174584N43753
36768H226530j01057p31359j305838j787309k159915k426298k587521k628551
36760e501318k525588k267498j870900j377793q41675l14376J59748N43569Q05494
$$ plain form
36751 -13190337 -12269863 -11392779 -10699814 -10265307 -10041580 -9832417 -9335721 -8260171 -6464418
36742 -6464418 -4039887 -1290194 1374173 3562884 4996115 5535306 5165318 3955204
36734 3955204 2023162 -484079 -3405350 -6586195 -9908091 -13310472 -16789665 -20375177
36726 -20375177 -24099085 -27974701 -31989686 -36110178 -40291759 -44494376 -48694869 -52886464
36718 -52886464 -57058524 -61163554 -65090722 -68664187 -71671257 -73910957 -75246340 -75643730
36710 -75643730 -75185811 -74051835 -72467348 -70637093 -68685447 -66631957 -64416461 -61960914
36702 -61960914 -59232313 -56273926 -53197270 -50150295 -47280368 -44701583 -42470939 -40578354
36694 -40578354 -38952628 -37478098 -36014139 -34414645 -32549810 -30331403 -27737108 -24824461
$$ packed form
36751a3190337R20474Q77084O92965M34507K23727K09163M96696J075550J795753
36742f464418K424531K749693K664367K188711J433231N39191l69988j210114
36734C955204j932042k507241k921271l180845l321896l402381l479193l585512
36726b0375177l723908l875616m014985m120492m181581m202617m200493m191595
36718e2886464m172060m105030l927168l573465l007070k239700j335383l97390
36710g5643730M57919J133976J584487J830255J951646K053490K215496K455547
36702f1960914K728601K958387L076656L046975K869927K578785K230644J892585
36694d0578354J625726J474530J463959J599494J864835K218407K594295K912647
$$ plain form
36686 -24824461 -21723775 -18604714 -15623933 -12874219 -10357628 -7992740 -5649630 -3196846
36678 -3196846 -544739 2326134 5357372 8425802 11372448 14039776 16306796 18108516
36670 18108516 19428885 20269761 20616220 20424419 19643874 18261009 16334152 13994486 11409818
36661 11409818 8733962 6075284 3503775 1086112 -1083076 -2879868 -4180245 -4898890
36653 -4898890 -5015189 -4577404 -3690002 -2495317 -1158061 148267 1262147 2066226 2518389
36644 2518389 2660287 2596537 2461494 2391975 2501664 2839800 3337872 3779312 3825993 3098336
36634 3098336 1272819 -1837911 -6236223 -11725270 -17935949 -24397833 -30637751 -36271241
36626 -36271241 -41053187 -44875064 -47723804 -49635742 -50676771 -50955147 -50642515 -49968180
$$ packed form
36686b4824461L100686L119061K980781K749714K516591K364888K343110K452784
36678c196846K652107K870873L031238L068430K946646K667328K267020J801720
36670A8108516J320369Q40876L46459j91801p80545j382865j926857k339666k584668
36661A1409818k675856k658678k571509k417663k169188j796792j300377p18645
36653d898890j16299M37785Q87402J194685J337256J306328J113880Q04079M52163
36644B518389J41898o3750j35043o9519J09689L38136M98072M41440M6681p27657
36634C098336j825517l110730m398312n489047o210679o461884o239918n633490
36626c6271241m781946l821877k848740j911938j041029k78376L12632O74335
$$ plain form
36618 -49968180 -49173723 -48450543 -47898643 -47527408 -47286424 -47096426 -46859354 -46450619 -45714418
36609 -45714418 -44481736 -42612980 -40046218 -36822682 -33071503 -28960540 -24641958 -20222530
36601 -20222530 -15768300 -11328836 -6957238 -2711718 1358915 5232189 8915612 12429667
36593 12429667 15778294 18927541 21808804 24343223 26467669 28146070 29366079 30130792
36585 30130792 30452417 30349559 29850045 29002121 27891471 26652336 25456998 24475927 23820116
36576 23820116 23495852 23402616 23379702 23274439 22994232 22523682 21913685 21256544 20652448 20169276
36566 20169276 19807584 19491681 19099660 18522189 17719782 16748073 15740644 14863114 14262562
36557 14262562 14029356 14176783 14638693 15285193 15953719 16486397 16760228 16698554 16261162
$$ packed form
36618d9968180P94457P23180N51900L71235K40984J89998K37072M08735P36201
36609d5714418J232682J868756K566762L223536L751179M110963M318582M419428
36601b0222530M454230M439464M371598M245520M070633L873274L683423L514055
36593A2429667L348627L149247K881263K534419K124446J678401J220009P64713
36585C0130792L21625j02858m99514q47924j110650j239135j195338r81071o55811
36576B3820116l24264r3236k2914j05263k80207m70550o09997o57141o04096m83172
36566B0169276l61692l15903l92021n77471q02407r71709j007429q77530o00552
36557A4262562k33206J47427M61910O46500O68526N32678K73831o1674m37392
$$ plain form
36548 16261162 15423339 14163133 12470495 10372623 7954101 5354896 2748886 319124
36540 319124 -1759478 -3334847 -4302094 -4639980 -4442279 -3915881 -3330533 -2936830 -2893089
36531 -2893089 -3235624 -3897630 -4755915 -5679229 -6560542 -7326662 -7928675 -8325988 -8479646
36522 -8479646 -8363203 -7986227 -7416470 -6786423 -6277742 -6088150 -6393359 -7315466 -8901407
36513 -8901407 -11109652 -13805638 -16772224 -19742264 -22452449 -24703941 -26404948 -27574055
36505 -27574055 -28303364 -28703223 -28856549 -28797753 -28514378 -27962378 -27086499 -25838889 -24192683
36496 -24192683 -22153740 -19775764 -17176225 -14540337 -12101592 -10100684 -8738269 -8139632
36488 -8139632 -8340340 -9288465 -10852119 -12827533 -14956888 -16969635 -18646631 -19885137
$$ packed form
36548A6261162q37823j260206j692638k097872k418522k599205k606010k429762
36540C19124k078602j575369r67247l37886J97701N26398N85348L93703M3741
36531b893089l42535o62006q58285r23314q81313p66120o02013l97313j53658
36522h479646J16443L76976N69757O30047N08681J89592l05209r22107j585941
36513h901407k208245k695986k966586k970040k710185k251492j701007j169107
36505b7574055p29309l99859j53326N8796K83375N52000Q75879J247610J646206
36496b4192683K038943K377976K599539K635888K438745K000908J362415N98637
36488h139632k00708r48125j563654j975414k129355k012747j676996j238506
$$ plain form
36480 -19885137 -20734211 -21380426 -22083856 -23084204 -24511901 -26340949 -28402112 -30444444
36472 -30444444 -32211179 -33496790 -34169304 -34161256 -33446306 -32023885 -29927230 -27250368 -24170010
36463 -24170010 -20937039 -17832582 -15108379 -12938788 -11398554 -10461797 -10010345 -9846206
36455 -9846206 -9712161 -9326106 -8428617 -6835647 -4483441 -1451850 2044568 5699764 9183990
36446 9183990 12215594 14611982 16302539 17306039 17695337 17575771 17083736 16385685 15652156
36437 15652156 15005042 14467595 13956393 13332070 12487340 11424374 10276652 9260889 8582726
36428 8582726 8343252 8490971 8840129 9144187 9187557 8852115 8133316 7113211 5920217
36419 5920217 4701097 3607186 2779606 2322158 2267403 2552779 3021227 3449920 3599726
$$ packed form
36480a9885137q49074o46215p03430j000348j427697j829048k061163k042332
36472c0444444j766735j285611o72514Q048P14950J422421K096655K676862L080358
36463b4170010L232971L104457K724203K169591J540234R36757M51452J64139
36455i846206J34045L86055Q97489J592970K352206L031591L496418L655196L484226
36446I183990L031604K396388J690557J003500L89298j19566m92035o98051p33529
36437A5652156o47114n37447n11202o24323q44730j062966j147722j015763o78163
36428H582726k39474J47719L49158L04058M3370l35442p18799j020105j192994
36419E920217j219120j093911q27580m57448n4755K85376M68448M28693J49806
$$ plain form
36410 3599726 3271041 2350601 838516 -1148422 -3396933 -5638853 -7608382 -9103088
36402 -9103088 -10033215 -10446407 -10521455 -10531086 -10780005 -11530585 -12933528 -14982994 -17513512
36393 -17513512 -20245493 -22866145 -25114316 -26838876 -28020568 -28764449 -29268167 -29764135
36385 -29764135 -30443518 -31390133 -32555000 -33779266 -34848915 -35559341 -35773591 -35459638 -34693589
36376 -34693589 -33628650 -32447077 -31316925 -30364748 -29663674 -29232607 -29042540 -29025618 -29083433
36367 -29083433 -29094534 -28924364 -28441360 -27540386 -26168497 -24341557 -22141661 -19697400 -17159244
36358 -17159244 -14678170 -12383919 -10359412 -8621863 -7128429 -5810078 -4614867 -3534635
36350 -3534635 -2603293 -1874662 -1396986 -1197712 -1282799 -1646422 -2281647 -3181310 -4322942
$$ packed form
36410C599726l28685r20440j512085j986938k248511k241920j969529j494706
36402i103088r30127m13192p5048r631k48919p50580j402943k049466k530518
36393a7513512k731981k620652k248171j724560j181692p43881n03718m95968
36385b9764135o79383r46615j164867j224266j069649p10426k14250L13953P66049
36376c4693589J064939J181573J130152R52177P01074M31067J90067J6922n7815
36367b9083433j1101J70170M83004R00974J371889J826940K199896K444261K538156
36358a7159244K481074K294251K024507J737549J493434J318351J195211J080232
36350c534635R31342P28631M77676J99274q5087l63623o35225q99663j141632
$$ plain form
36341 -4322942 -5642711 -7014667 -8251637 -9130444 -9429539 -8966767 -7635466 -5440157 -2521695
36332 -2521695 849299 4325084 7570734 10359959 12636286 14508409 16176199 17821138
36324 17821138 19518276 21213406 22764395 24006122 24796653 25032143 24645629 23607247
36316 23607247 21929625 19673178 16948401 13915873 10782726 7790315 5188396 3196931
36308 3196931 1964817 1540392 1865518 2792104 4107803 5559945 6881513 7830853 8245894
36299 8245894 8094382 7493310 6678889 5926842 5445229 5281503 5286928 5156053 4521663 3064655
36289 3064655 602775 -2864405 -7166828 -12030059 -17169671 -22368096 -27497430 -32486421
36281 -32486421 -37261891 -41702304 -45628314 -48836473 -51164702 -52561285 -53120316 -53057277
$$ packed form
36341d322942j319769j371956j236970q78807k99095M62772J331301K195309K918462
36332b521695L370994L475785L245650K789225K276327J872123J667790J644939
36324A7821138J697138J695130J550989J241727P90531K35490l86514j038382
36316B3607247j677622k256447k724777l032528l133147k992411k601919j991465
36308C196931j232114m24425L25126R26586J315699J452142J321568R49340M15041
36299H245894j51512o01072q14421p52047m81613j63726N425j30875o34390j457008
36289C064655k461880l467180m302423m863231n139612n198425n129334m988991
36281c2486421m775470m440413l926010l208159k328229j396583n59031O3039
$$ plain form
36273 -53057277 -52628886 -52032912 -51334908 -50454102 -49212288 -47422334 -44976395 -41893831 -38309045
36264 -38309045 -34412133 -30380098 -26335931 -22349855 -18470335 -14758991 -11307356 -8228281
36256 -8228281 -5630262 -3589591 -2132091 -1231223 -827299 -866967 -1347758 -2339943 -3964959
36247 -3964959 -6336029 -9490918 -13350366 -17719571 -22327754 -26884276 -31126917 -34849955
36239 -34849955 -37916543 -40265321 -41912357 -42940743 -43474134 -43641738 -43548113 -43258314 -42802602
36230 -42802602 -42196363 -41461215 -40630006 -39729217 -38750357 -37631287 -36261997 -34515857 -32296574
36221 -32296574 -29583722 -26454414 -23062294 -19575285 -16102919 -12658783 -9185229 -5625806
36213 -5625806 -1999034 1569893 4871795 7671377 9768775 11039962 11447329 11027716
$$ packed form
36273e3057277M28391N95974O98004Q80806J241814J789954K445939L082564L584786
36264c8309045L896912M032035M044167L986076L879520L711344L451635L079075
36256h228281K598019K040671J457500R00868M03924l9668m80791r92185j625016
36247c964959k371070l154889l859448m369205m608183m556522m242641l723038
36239c4849955l066588k348778j647036j028386n33391j67604R3625K89799M55712
36230d2802602O06239P35148Q31209R00789R78860J119070J369290J746140K219283
36221c2296574K712852L129308L392120L487009L472366L444136L473554L559423
36213e625806L626772L568927L301902K799582K097398J271187M07367m19613
$$ plain form
36205 11027716 9872014 8104755 5863836 3282143 480210 -2424811 -5304529 -8016691
36197 -8016691 -10418324 -12381935 -13804753 -14614300 -14775252 -14292594 -13205432 -11578574 -9504745
36188 -9504745 -7117604 -4600598 -2177729 -85446 1465643 2328611 2447504 1866821 722986
36179 722986 -776835 -2385501 -3857266 -4995488 -5691290 -5937041 -5813272 -5462194 -5059610
36170 -5059610 -4785800 -4793128 -5178198 -5972735 -7155972 -8672936 -10441786 -12353792 -14286192
36161 -14286192 -16136670 -17858771 -19466600 -21001369 -22487607 -23916017 -25265725 -26546628
36153 -26546628 -27829863 -29245512 -30948483 -33070803 -35681785 -38766004 -42214167 -45819837
36145 -45819837 -49288387 -52274537 -54453072 -55599733 -55643705 -54666989 -52856842 -50438477
$$ packed form
36205A1027716j155702j767259k240919k581693k801933k905021k879718k712162
36197h016691k401633j963611j422818q09547j60952M82658J087162J626858K073829
36188i504745K387141K517006K422869K092283J551089Q62968J18893n80683j143835
36179G22986j499821j608666j471765j138222o95802k45751J23769L51078M02584
36170e059610K73810p328l85070p94537j183237j516964j768850j912006j932400
36161a4286192j850478j722101j607829j534769j486238j428410j349708j280903
36153b6546628j283235j415649j702971k122320k610982l084219l448163l605670
36145d5819837l468550k986150k178535j146661m3972R76716J810147K418365
$$ plain form
36137 -50438477 -47614115 -44522345 -41223284 -37712564 -33962182 -29974874 -25828346 -21686175
36129 -21686175 -17766086 -14276479 -11348288 -8993269 -7107745 -5517050 -4034895 -2510247
36121 -2510247 -852425 957149 2860214 4732098 6417806 7785259 8769155 9384072
36113 9384072 9707125 9843616 9887107 9882751 9807788 9583012 9113628 8339342 7270054 5994647
36103 5994647 4661483 3435684 2447330 1754242 1338767 1135097 1061686 1034748 961256 729268
36093 729268 213684 -697639 -2064952 -3859174 -5942691 -8081287 -9987706 -11382249 -12049006
36084 -12049006 -11871030 -10837800 -9027719 -6576150 -3643161 -391544 3023018 6453917
36076 6453917 9763129 12824383 15534293 17825819 19666876 21034859 21887013 22163047
$$ packed form
36137e0438477K824362L091770L299061L510720L750382L987308M146528M142171
36129b1686175L920089L489607K928191K355019J885524J590695J482155J524648
36121b510247J657822J809574J903065J871884J685708J367453R83896O14917
36113I384072L23053J36491M3491m356p4963k24776m69384p74286j069288j275407
36103E994647j333164j225799r88354o93088m15475k03670p3411k6938p3492k31988
36093G29268n15584r11323j367313j794222k083517k138596j906419j394543o66757
36084a2049006J77976J033230J810081K451569K932989L251617L414562L430899
36076F453917L309212L061254K709910K291526J841057J367983Q52154K76034
$$ plain form
36068 22163047 21830553 20936767 19617154 18050392 16398288 14776789 13269183 11954866
36060 11954866 10919916 10238027 9938451 9988299 10303076 10776580 11311135 11836559 12317404
36051 12317404 12751607 13164645 13606028 14150642 14893517 15920749 17257877 18825393 20437409
36042 20437409 21854864 22871302 23391505 23467224 23276062 23059946 23060075 23477308 24457378 26080339
36032 26080339 28343628 31151719 34331611 37674791 40984346 44103245 46917128 49344034
36024 49344034 51326838 52831169 53838782 54329455 54260625 53563985 52169233 50044567 47229990
36015 47229990 43843937 40061031 36075655 32071189 28206941 24621790 21444689 18799397
36007 18799397 16793053 15486724 14861568 14806454 15146503 15706424 16377843 17157016 18137272
$$ packed form
36068B2163047l32494q93786j319613j566762j652104j621499j507606j314317
36060A1954866j034950o81889k99576M9848L14777M73504N34555N25424M80845
36051A2317404M34203M13038M41383N44614P42875J027232J337128J567516J612016
36042B0437409J417455J016438N20203P5719j91162k16116J29M17233R80070J622961
36032B6080339K263289K808091L179892L343180L309555L118899K813883K426906
36024D9344034J982804J504331J007613M90673o8830o96640j394752k124666k814577
36015D7229990l386053l782906l985376m004466l864248l585151l177101k645292
36007A8799397k006344j306329o25156n5114L40049N59921O71419P79173R80256
$$ plain form
35998 18137272 19462763 21263172 23592555 26392276 29489044 32625689 35510291 37865628
35990 37865628 39467329 40169504 39921456 38774589 36872622 34421524 31647940 28762828
35982 28762828 25940822 23312679 20962439 18926909 17201771 15756445 14551253 13546351
35974 13546351 12698043 11949005 11223439 10431600 9478871 8274945 6748600 4876453 2717946
35965 2717946 426987 -1787516 -3744919 -5373134 -6734514 -7983334 -9287104 -10760291
35957 -10760291 -12438681 -14289924 -16238128 -18185158 -20026342 -21666515 -23037249 -24107014
35949 -24107014 -24878138 -25377678 -25655871 -25793046 -25898031 -26083438 -26425947 -26935521 -27548581
35940 -27548581 -28141967 -28558901 -28642920 -28273729 -27391023 -25995573 -24133800 -21883426 -19350733
$$ packed form
35998A8137272J325491J800409K329383K799721L096768L136645K884602K355337
35990C7865628J601701P02175k48048j146867j901967k451098k773584k885112
35982B8762828k822006k628143k350240k035530j725138j445326j205192j004902
35974A3546351q48308p49038p25566p91839r52729j203926j526345j872147k158507
35965B717946k290959k214503j957403j628215j361380j248820j303770j473187
35957a0760291j678390j851243j948204j947030j841184j640173j370734j069765
35949b4107014p71124m99540k78193j37175j04985j85407l42509n09574o13060
35940b7548581n93386m16934q4019L69191Q82706J395450J861773K250374K532693
$$ plain form
35931 -19350733 -16675286 -14031616 -11619286 -9636106 -8235428 -7481303 -7325347 -7621606
35923 -7621606 -8172906 -8784348 -9301599 -9626847 -9717652 -9576548 -9236916 -8747862 -8157914 -7495540
35913 -7495540 -6748255 -5850757 -4696555 -3177746 -1238865 1081723 3645227 6245622
35905 6245622 8668278 10747833 12401552 13630651 14500361 15113526 15581843 15990947 16363241
35896 16363241 16634334 16657341 16235568 15174491 13342088 10722214 7438783 3734403 -89107
35887 -89107 -3739308 -6982600 -9664780 -11708473 -13097733 -13858848 -14043296 -13713184 -12924714
35878 -12924714 -11708581 -10055106 -7915376 -5222506 -1926857 1965051 6356700 11040055
35870 11040055 15694724 19916091 23275233 25401451 26064734 25231005 23073356 19941434
$$ packed form
35931a9350733K675447K643670K412330J983180J400678P54125J55956k96259
35923g621606n51300o11442n17251l25248r0805J41104L39632M89054N89948O62374
35913g495540P47285Q97498J154202J518809J938881K320588K563504K600395
35905F245622K422656K079555J653719J229099Q69710O13165M68317M09104L72294
35896A6363241K71093K3007m21773j061077j832403k619874l283431l704380l823510
35887h9107l650201l243292k682180k043693j389260p61115j84448L30112P88470
35878a2924714J216133J653475K139730K692870L295649L891908M391649M683355
35870A1040055M654669M221367L359142K126218O63283q33729k157649l131922
$$ plain form
35862 19941434 16303199 12670923 9516187 7182029 5814420 5342604 5523379 6034044
35854 6034044 6574294 6935475 7015164 6783617 6230906 5327845 4017215 2228039 -104413
35845 -104413 -3020632 -6516882 -10522923 -14889436 -19398403 -23795615 -27831385 -31295044
35837 -31295044 -34035807 -35968990 -37071989 -37379465 -36985578 -36050731 -34801004 -33510079
35829 -33510079 -32463551 -31914159 -32039156 -32909355 -34474975 -36569054 -38927936 -41228725
35821 -41228725 -43139563 -44370901 -44714593 -44066396 -42435579 -39943178 -36804867 -33297354
35813 -33297354 -29715939 -26333594 -23366784 -20949635 -19119626 -17818783 -16911883 -16220468
35805 -16220468 -15568622 -14829204 -13952084 -12960540 -11920319 -10902264 -9958769 -9119450 -8398001
$$ packed form
35862A9941434l638235l632276l154736k334158j367609m71816J80775N10665
35854F034044N40250L61181P9689k31547n52711r03061j310630j789176k332452
35845a04413k916219l496250m006041m366513m508967m397212m035770l463659
35837c1295044k740763j933183j102999l07476L93887R34847J249727J290925
35829c3510079J046528N49392j24997q70199j565620k094079k358882k300789
35821d1228725j910838j231338l43692O48197J630817K492401L138311L507513
35813c3297354L581415L382345K966810K417149J830009J300843R06900O91415
35805a6220468O51846P39418Q77120R91544J040221J018055R43495Q39319P21449
$$ plain form
35796 -8398001 -7800688 -7334483 -7018771 -6900528 -7061675 -7603303 -8605541 -10084227 -11972749
35787 -11972749 -14139126 -16421988 -18660337 -20705778 -22425044 -23707678 -24485990 -24759860
35779 -24759860 -24607162 -24161286 -23555467 -22861383 -22063280 -21089900 -19884691 -18466024 -16940634
35770 -16940634 -15472802 -14239476 -13394803 -13043491 -13213498 -13832894 -14730921 -15676938 -16446827
35761 -16446827 -16886302 -16941597 -16648014 -16090682 -15363623 -14546387 -13699890 -12869247 -12081518
35752 -12081518 -11337174 -10604555 -9827065 -8942972 -7906267 -6694738 -5301548 -3719849 -1933718
35743 -1933718 78881 2333543 4819903 7476894 10172845 12712279 14885114 16543238
35735 16543238 17659238 18327296 18708064 18958639 19189489 19458511 19785160 20165477 20580576
$$ packed form
35796h398001N97313M66205L15712J18243j61147n41628j002238j478686j888522
35787a1972749k166377k282862k238349k045441j719266j282634p78312k73870
35779b4759860J52698M45876O05819O94084P98103R73380J205209J418667J525390
35770a6940634J467832J233326Q44673L51312j70007o19396q98027r46017p69889
35761a6446827m39475n5295K93583N57332P27059Q17236Q46497Q30643P87729
35752a2081518P44344P32619P77490Q84093J036705J211529J393190J581699J786131
35743a933718K012599K254662K486360K656991K695951K539434K172835J658124
35735A6543238J116000O68058L80768K50575K30850K69022L26649L80317M15099
$$ plain form
35726 20580576 20998801 21374412 21649217 21763645 21674466 21367247 20856493 20180751 19403721
35717 19403721 18619737 17950105 17521924 17436826 17746006 18444199 19484392 20802971 22336116
35708 22336116 24012262 25727048 27330417 28652716 29562725 30017334 30066137 29812296 29364509
35699 29364509 28812856 28232562 27696894 27281047 27054550 27071978 27371356 27979032 28909165
35690 28909165 30148868 31638485 33272058 34932330 36541620 38089796 39617947 41173139
35682 41173139 42765940 44347010 45798553 46935976 47527230 47339019 46203159 44077635
35674 44077635 41071948 37419854 33407913 29291924 25239930 21324475 17558659 13949201
35666 13949201 10536585 7404810 4661995 2408170 710126 -406688 -953885 -974458
$$ packed form
35726B0580576M18225L75611K74805J14428q9179l07219n10754o75742p77030
35717A9403721p83984o69632m28181q5098L09180O98193J040193J318579J533145
35708B2336116J676146J714786J603369J322299R10009M54609M8803k53841m47787
35699B9364509n51653n80294n35668m15847k26497J7428K99378O07676R30133
35690B8909165J239703J489617J633573J660272J609290J548176J528151J555192
35682D1173139J592801J581070J451543J137423N91254j88211j135860k125524
35674D4077635l005687l652094m011941m115989m051994l915455l765816l609458
35666A3949201l412616l131775k742815k253825j698044j116814n47197k0573
$$ plain form
35658 -974458 -540385 251378 1290560 2470670 3701233 4905472 6003759 6895771 7459705
35649 7459705 7579076 7189913 6326440 5142176 3894517 2894196 2431076 2696627 3730130
35640 3730130 5411260 7501104 9709261 11756271 13414099 14527393 15026870 14940143 14396002
35631 14396002 13614854 12880724 12494145 12710067 13673791 15378386 17667433 20287545 22965204
35622 22965204 25467777 27624808 29318809 30473854 31060885 31114636 30741889 30104558 29376776
35613 29376776 28690779 28093327 27531896 26881872 26013253 24875339 23556627 22276351 21299304
35604 21299304 20817150 20863688 21306649 21909662 22425010 22675556 22601102 22266152 21842537 21581902
35594 21581902 21778837 22714064 24577204 27392369 30980287 34977041 38906470 42286786
$$ packed form
35658i74458M34073P91763J039182J180110J230563J204239J098287Q92012N63934
35649G459705J19371l89163q63473j184264j247659j000321m63120K65551J033503
35640C730130J681130K089844K208157K047010J657828J113294M99477q6727n44141
35631A4396002p81148p34130l86579K15922R63724J704595K289047K620112K677659
35622B2965204K502573K157031J694001J155045N87031N3751l72747o37331p27782
35613B9376776o85997n97452n61431o50024q68619j137914j318712j280276r77047
35604B1299304m82154M6538M42961O03013N15348K50546p4454l34950m23615k60635
35594B1581902J96935R35227J863140K815165L587918L996754L929429L380316
$$ plain form
35586 42286786 44742300 46086947 46353558 45763174 44649792 43365927 42195210 41295449
35578 41295449 40686044 40275499 39908520 39411420 38626838 37439113 35792337 33699688 31241768
35569 31241768 28552804 25795017 23124817 20660440 18463206 16538862 14854585 13360695
35561 13360695 12008688 10762951 9605339 8530974 7536922 6611221 5729284 4856605 3953508
35552 3953508 2985675 1948589 899473 -30275 -664621 -843024 -472423 457291 1887600
35543 1887600 3709505 5772583 7894910 9888392 11597856 12934636 13883598 14477928
35535 14477928 14756391 14727901 14361532 13603855 12411993 10786468 8790383 6547513 4219734
35526 4219734 1971103 -71596 -1852111 -3401372 -4828063 -6283385 -7916497 -9843998
$$ packed form
35586D2286786K455514J344647K66611n90384j113382j283865j170717q99761
35578D1295449o09405m10545l66979m97100p84582j187725j646776k092649k457920
35569C1241768k688964k757787k670200k464377k197234j924344j684277j493890
35561A3360695j352007j245737j157612j074365r94052r25701q81937q72679r03097
35552C953508r67833j037086j049116r29748o34346j78403L70601R29714J430309
35543A887600J821905K063078K122327J993482J709464J336780R48962N94330
35535A4477928K78463k8490l66369p57677j191862j625525j996085k242870k327779
35526D219734k248631k042699j780515j549261j426691j455322j633112j927501
$$ plain form
35518 -9843998 -12143903 -14863230 -18020329 -21593931 -25505270 -29604379 -33670592 -37436706
35510 -37436706 -40639947 -43084722 -44686557 -45474824 -45559914 -45088692 -44204513 -43014217 -41566855
35501 -41566855 -39857671 -37860757 -35567663 -32999159 -30181027 -27109894 -23746871 -20055332
35493 -20055332 -16063616 -11910599 -7838864 -4133836 -1043098 1280526 2791118 3526096
35485 3526096 3569573 3022083 1988209 583163 -1055898 -2776698 -4446411 -5995411 -7437398
35476 -7437398 -8848533 -10317420 -11894041 -13560792 -15233470 -16785548 -18079834 -18991543
35468 -18991543 -19418289 -19287202 -18570598 -17305189 -15593948 -13577257 -11387757 -9121773
35460 -9121773 -6846559 -4629324 -2554661 -709411 855673 2156936 3273423 4302503
$$ packed form
35518i843998k299905k719327l157099l573602l911339m099109m066213l766114
35510c7436706l203241k444775j601835p88267q5090M71222Q84179J190296J447362
35501d1566855J709184J996914K293094K568504K818132L071133L363023L691539
35493b0055332L991716M153017M071735L705028L090738K323624J510592P34978
35485C526096M3477n47490j033874j405046j639061j720800j669713j549000j441987
35476g437398j411135j468887j576621j666751j672678j552078j294286r11709
35468a8991543m26746J31087P16604J265409J711241K016691K189500K265984
35460i121773K275214K217235K074663J845250J565084J301263J116487J029080
$$ plain form
35452 4302503 5299232 6236508 7009787 7481045 7536513 7134755 6333438 5288671 4222002
35443 4222002 3359714 2865592 2795638 3092747 3620461 4220499 4771571 5225395 5603104 5955322
35433 5955322 6313558 6669440 6998239 7305244 7649765 8116793 8750387 9496648 10197969
35424 10197969 10642729 10639893 10080274 8962068 7380612 5497255 3504066 1592947 -69984
35415 -69984 -1362715 -2211484 -2577981 -2440403 -1785547 -616544 1037622 3126076 5590533
35406 5590533 8372990 11408151 14614323 17903455 21210592 24517159 27841546 31198757
35398 31198757 34559482 37838774 40918027 43679062 46027404 47898088 49251850 50071921
35390 50071921 50365362 50166597 49538242 48565665 47346588 45982183 44576067 43240227 42098641
$$ packed form
35452D302503R96729R37276P73279M71258N5468m01758q01317j044767j066669
35443D222002q62288m94122o9954K97109N27714O00038N51072M53824L77709L52218
35433E955322L58236L55882L28799L07005L44521M67028O33594P46261P01321
35424A0197969M44760k836n59619j118206j581456j883357j993189j911119j662931
35415f9984j292731q48769l66497J37578O54856J169003J654166K088454K464457
35406E590533K782457L035161L206172L289132L307137L306567L324387L357211
35398C1198757L360725L279292L079253K761035K348342J870684J353762Q20071
35390E0071921K93441j98765o28355r72577j219077j364405j406116j335840j141586
$$ plain form
35381 42098641 41279917 40899358 41037639 41720875 42903186 44458371 46195309 47905120 49424192
35372 49424192 50679108 51688217 52523819 53261860 53947079 54586782 55170116 55698361 56207470
35363 56207470 56769056 57469270 58378944 59532788 60927070 62530299 64292551 66144809
35355 66144809 67995215 69737728 71279779 72577474 73658140 74616112 75579738 76658543
35347 76658543 77891453 79226176 80550845 81766271 82854144 83896419 85037039 86415969
35339 86415969 88114320 90130059 92382417 94736522 97041640 99175109 101079515 102780326
35331 102780326 104378211 106020132 107861216 110031738 112618239 115657665 119137427 122998639
35323 122998639 127147382 131476652 135889503 140306826 144652512 148826957 152690042 156068989
$$ packed form
35381D2098641q18724l80559J38281O83236J182311J555185J736938J709811J519072
35372D9424192J254916J009109Q35602P38041O85219O39703N83334N28245N09109
35363E6207470N61586P00214R09674J153844J394282J603229J762252J852258
35355F6144809J850406J742513J542051J297695J080666R57972R63626J078805
35347G6658543J232910J334723J324669J215426J087873J042275J140620J378930
35339H6415969J698351K015739K252358K354105K305118K133469J904406J700811
35331A02780326J597885J641921J841084K170522K586501L039426L479762L861212
35323A22998639M148743M329270M412851M417323M345686M174445L863085L378947
$$ plain form
35315 156068989 158790128 160717374 161774597 161939890 161220637 159631371 157189410 153924644
35307 153924644 149889491 145160600 139835391 134031597 127894126 121603888 115373863 109418558
35299 109418558 103901562 98891445 94362020 90244251 86495340 83135858 80233452 77854549
35291 77854549 76022444 74701269 73798254 73171121 72640301 72011995 71107537 69784823 67945082
35282 67945082 65533158 62542032 59022601 55094025 50951562 46865031 43151376 40109251
35274 40109251 37932191 36645241 36104909 36063718 36262275 36503335 36682423 36776884 36812725
35265 36812725 36832364 36879553 37004278 37275920 37785003 38620834 39833009 41403180 43249535
35256 43249535 45260005 47326907 49360152 51281280 53016611 54499558 55676139 56505958
$$ packed form
35315A56068989K721139J927246J057223J65293p19253j589266k441961l264766
35307A53924644m035153m728891n325209n803794o137471o290238o230025n955305
35299A09418558n516996n010117m529425m117769l748911l359482k902406k378903
35291G7854549j832105j321175r03015o27133n30820o28306r04458j322714j839741
35282F7945082k411924k991126l519431l928576m142463m086531l713655l042125
35274D0109251k177060j286950n40332m1191J98557K41060J79088R4461L5841
35265C6812725J9639M7189J24725K71642N09083Q35831J212175J570171J846355
35256D3249535K010470K066902K033245J921128J735331J482947J176581Q29819
$$ plain form
35248 56505958 56961661 57034346 56743417 56139388 55290487 54256398 53063634 51698715 50126438
35239 50126438 48325336 46320321 44193987 42073080 40100832 38406835 37078424 36134713
35231 36134713 35509714 35054381 34562997 33822051 32672502 31066196 29088428 26926822 24796146
35222 24796146 22857020 21167682 19684471 18302908 16919954 15492293 14063034 12741807
35214 12741807 11651522 10875633 10431242 10267290 10273079 10290377 10134454 9627524 8636128 7097636
35204 7097636 5027392 2509373 -322034 -3306454 -6290230 -9163240 -11881651 -14455848
35196 -14455848 -16903255 -19194055 -21225309 -22836870 -23852929 -24123214 -23550194 -22103556
35188 -22103556 -19825279 -16821881 -13239223 -9224797 -4894765 -325211 4425176 9274057
$$ packed form
35248E6505958M55703P2685k90929o04029q48901j034089j192764j364919j572277
35239E0126438j801102k005015k126334k120907j972248j693997j328411r43711
35231C6134713o24999m55333m91384p40946j149549j606306j977768k161606k130676
35222B4796146j939126j689338j483211j381563j382954j427661j429259j321227
35214A2741807j090285p75889m44391j63952N789J7298j55923n06930r91396j538492
35204G097636k070244k518019k831407k984420k983776k873010k718411k574197
35196a4455848k447407k290800k031254j611561j016059k70285N73020J446638
35188b2103556K278277L003398L582658M014426M330032M569554M750387M848881
$$ plain form
35180 9274057 14084638 18673413 22863988 26562382 29807173 32756848 35615961 38542436
35172 38542436 41587383 44690075 47711789 50476510 52801142 54519933 55512153 55727868
35164 55727868 55195854 54006567 52282371 50154684 47755980 45218483 42666928 40199785
35156 40199785 37862846 35627042 33386810 30989303 28285373 25176141 21634134 17701304
35148 17701304 13480153 9124031 4817614 743219 -2953119 -6177828 -8887435 -11081773
35140 -11081773 -12799488 -14107105 -15075761 -15760079 -16201543 -16456291 -16616961 -16798364 -17092758
35131 -17092758 -17533684 -18099583 -18747651 -19440935 -20146157 -20815431 -21380025 -21766628 -21922156
35122 -21922156 -21828127 -21497630 -20959845 -20241617 -19356547 -18308416 -17104567 -15763971 -14308720
$$ packed form
35180I274057M810581M588775M190575L698394L244791K949675K859113K926475
35172C8542436L044947L102692L021714K764721K324632J718791R92220K15715
35164E5727868n32014j189287j724196k127687k398704k537497k551555k467143
35156D0199785k336939k235804k240232k397507k703930l109232l542007l932830
35148A7701304m221151m356122m306417m074395l696338l224709k709607k194338
35140a1081773j717715j307617r68656o84318m41464k54748j60670j81403k94394
35131a7092758m40926n65899o48068o93284p05222o69274n64594l86603j55528
35122b1922156R4029L30497N37785P18228Q85070J048131J203849J340596J455251
$$ plain form
35113 -14308720 -12746455 -11064358 -9246207 -7300972 -5279215 -3264387 -1347542 395169
35105 395169 1911306 3171940 4172823 4939204 5527371 6017654 6501861 7070713 7802026
35096 7802026 8748121 9925872 11316198 12875142 14551668 16306370 18127614 20040295
35088 20040295 22099513 24365652 26868661 29578346 32396680 35178715 37775239 40078903
35080 40078903 42052318 43725130 45162022 46416638 47493125 48335636 48853525 48968382
35072 48968382 48653571 47942921 46909356 45634694 44192610 42651298 41085057 39576722
35064 39576722 38200376 36991208 35923457 34915280 33863585 32695069 31410006 30093678
35056 30093678 28881442 27891189 27165588 26666030 26322295 26098009 26022152 26167464 26597288
$$ packed form
35113a4308720J562265J682097J818151J945235K021757K014828J916845J742711
35105C95169J516137J260634J000883P66381N88167M90283M84207N68852P31313
35096G802026R46095J177751J390326J558944J676526J754702J821244J912681
35088B0040295K059218K266139K503009K709685K818334K782035K596524K303664
35080D0078903J973415J672812J436892J254616J076487Q42511N17889J14857
35072D8968382l14811p10650j033565j274662j442084j541312j566241j508335
35064C9576722j376346j209168j067751j008177j051695j168516j285063j316328
35056C0093678j212236r90253p25601m99558l43735k24286p5857J45312M29824
$$ plain form
35047 26597288 27319962 28275572 29351458 30407340 31299902 31912136 32188493 32155934 31906503
35038 31906503 31546207 31146799 30732606 30298988 29834625 29328217 28761626 28101238 27297192
35029 27297192 26296055 25066477 23626378 22053591 20469171 18999339 17734269 16702297
35021 16702297 15869310 15161370 14500970 13846949 13229746 12769594 12660603 13114272 14282632
35012 14282632 16199755 18768301 21785643 24983508 28062412 30721751 32694760 33788505
35004 33788505 33915927 33104944 31481487 29237085 26594488 23776734 20979868 18354072
34996 18354072 16002547 13998792 12406920 11285840 10673796 10568995 10925593 11670794 12732982
34987 12732982 14064891 15651233 17500368 19627436 22037082 24708754 27583272 30551452
$$ packed form
35047B6597288P22674R55610J075886J055882Q92562O12234K76357l2559k49431
35038C1906503l60296l99408m14193m33618m64363n06408n66591o60388q04046
35029B7297192j001137j229578j440099j572787j584420j469832j265070j031972
35021A6702297q32987p07940o60400o54021o17203m60152j08991M53669J168360
35012A4282632J917123K568546L017342L197865L078904K659339J973009J093745
35004C3788505J27422q10983j623457k244402k642597k817754k796866k625796
34996A8354072k351525k003755j591872j121080o12044j04801L56598P45201J062188
34987A2732982J331909J586342J849135K127068K409646K671672K874518K968180
$$ plain form
34979 30551452 33451644 36084945 38250585 39793836 40651608 40879436 40646654 40194798 39768492
34970 39768492 39543843 39585233 39848939 40226987 40604398 40902051 41093796 41204155 41297482 41461237
34960 41461237 41779760 42301695 43017775 43866870 44768739 45658179 46493062 47233628 47819618
34951 47819618 48175871 48251328 48064306 47716949 47361471 47132058 47075507 47112196 47045367 46619645
34941 46619645 45610252 43905431 41541286 38672615 35503248 32223160 28987678 25939241
34933 25939241 23242905 21101132 19730297 19308377 19923831 21554968 24087070 27349884
34925 27349884 31151248 35295361 39590303 43855786 47937805 51727745 55175841 58288993
34917 58288993 61112812 63708684 66136367 68441928 70644176 72719126 74592290 76148857
$$ packed form
34979C0551452K900192K633301K165640J543251Q57772K27828k32782m51856m26306
34970C9768492k24649M1390K63706L78048L77411K97653J91745J10359R3327J63755
34960D1461237L18523N21935P16080Q49095R01869Q89440Q34883P40566N85990
34951D7819618L56253P5457j87022l47357l55478k29413n6551L6689o6829m25722
34941D6619645j009393j704821k364145k868671l169367l280088l235482l048437
34933B5939241k696336k141773j370835m21920O15454J631137K532102L262814
34925B7349884L801364M144113M294942M265483M082019L789940L448096L113152
34917E8288993K823819K595872K427683K305561K202248K074950J873164J556567
$$ plain form
34909 76148857 77261636 77826843 77795028 77186970 76089654 74636018 72980539 71283146 69703012
34900 69703012 68390841 67467425 66991689 66939124 67212152 67683234 68247377 68854701 69509112
34891 69509112 70239797 71063853 71959359 72862229 73687275 74358487 74828630 75081085 75124088
34882 75124088 74989098 74731009 74418707 74113140 73846070 73617397 73417847 73266486 73240623
34873 73240623 73476303 74132313 75331539 77105920 79367061 81911670 84461146 86728782
34865 86728782 88498959 89692125 90389309 90806783 91234953 91968662 93252141 95247866 98026544
34856 98026544 101570920 105786628 110514980 115545277 120629201 125503486 129922832 133695079
34848 133695079 136706339 138930644 140427466 141330138 141823263 142109039 142370301 142739747 143278655
$$ packed form
34909G6148857J112779N65207l1815o08058j097316j453636j655479j697393j580134
34900F9703012j312171r23416m75736n2565K73028M71082N64143O07324O54411
34891F9509112P30685Q24056Q95506R02870Q25046O71212M70143K52455M3003
34882G5124088j34990k58089l12302l05567k67070k28673j99550j51361k5863
34873G3240623K35680O56010J199226J774381K261141K544609K549476K267636
34865H6728782J770177J193166O97184M17474M28170P33709J283479J995725K778678
34856I8026544L544376M215708M728352N030297N083924M874285M419346L772247
34848A33695079L011260K224305J496822R02672M93125K85776K61262L69446N38908
$$ plain form
34839 143278655 143966811 144712650 145393398 145916724 146272023 146539155 146851898 147346966 148135346
34830 148135346 149306280 150941928 153114577 155862854 159170400 162968586 167157112 171617552
34822 171617552 176209436 180767617 185125863 189165990 192864079 196304950 199659647 203142716
34814 203142716 206970211 211330030 216364938 222162342 228745566 236067859 244016414 252431164
34806 252431164 261132226 269941935 278693197 287231126 295422421 303177091 310469533 317340414
34798 317340414 323874145 330166752 336306783 342380015 348486481 354744538 361265064 368104628
34790 368104628 375226934 382497257 389711341 396643213 403098585 408967292 414261730 419116385
34782 419116385 423731324 428275939 432801527 437211736 441305366 444863266 447730099 449852545
$$ packed form
34839A43278655O88156P45839O80748N23326L55299K67132L12743M95068P88380
34830A48135346J170934J635648K172649K748277L307546L798186M188526M460440
34822A71617552M591884M558181M358246M040127L698089L440871L354697L483069
34814B03142716L827495M359819N034908N797404O583224P322293P948555Q414750
34806B52431164Q701062Q809709Q751262Q537929Q191295P754670P292442O870881
34798C17340414O533731O292607O140031O073232O106466O258057O520526O839564
34790C68104628P122306P270323P214084O931872O455372N868707N294438M854655
34782D19116385M614939M544615M525588M410209M093630L557900K866833K122446
$$ plain form
34774 449852545 451265509 452045094 452257209 451924810 451024553 449511431 447358772 444593283
34766 444593283 441307133 437642363 433758192 429797036 425859059 421987271 418163504 414316576
34758 414316576 410339987 406109714 401494033 396359846 390588912 384107221 376910146 369061330
34750 369061330 360665032 351836430 342693208 333366057 324005691 314769716 305794259 297168051
34742 297168051 288921191 281027052 273409809 265956488 258541679 251069941 243522986 235982569
34734 235982569 228606445 221564505 214972196 208862890 203215514 198016345 193310522 189205334
34726 189205334 185819768 183210215 181315320 179946932 178824180 177627502 176050590 173843130
34718 173843130 170848070 167031654 162490270 157416806 152032047 146516170 140980927 135494707
$$ packed form
34774D49852545J412964P79585K12115l32399r00257j513122k152659k765489
34766D44593283l286150l664770l884171l961156l937977l871788l823767l846928
34758D14316576l976589m230273m615681n134187n770934o481691p197075p848816
34750C69061330q396298q828602r143222r327151r360366r235975q975457q626208
34742B97168051q246860p894139p617243p453321p414809p471738p546955p540417
34734B35982569p376124p041940o592309o109306n647376n199169m705823m105188
34726A89205334l385566k609553j894895j368388j122752j196678j576912k207460
34718A73843130k995060l816416m541384n073464n384759n515877n535243n486220
$$ plain form
34710 135494707 130133699 125014906 120282311 116052526 112356069 109115115 106174433 103366215
34702 103366215 100569472 97734764 94873325 92031270 89269916 86657472 84262403 82138520
34694 82138520 80306065 78745479 77414282 76276143 75318110 74542639 73943964 73489124 73115504
34685 73115504 72742634 72289526 71689435 70895486 69874168 68591185 67000892 65048502 62684838
34676 62684838 59886858 56678445 53147672 49451965 45799188 42404035 39440374 37017787
34668 37017787 35192479 33997216 33466869 33645589 34570659 36234266 38539144 41281160
34660 41281160 44183780 46970617 49429920 51436251 52935570 53923835 54436611 54544285
34652 54544285 54343138 53942989 53457240 52995221 52651237 52488049 52520068 52705746 52955858
$$ packed form
34710A35494707n361008n118793m732595m229785l696457l240954k940682k808218
34702A03366215k796743k834708k861439k842055k761354k612444k395069k123883
34694H2138520j832455j560586j331197j138139r58033p75471n98675m54840l73620
34685G3115504l72870m53108o00091p93949j021318j282983j590293j952390k363664
34676F2684838k797980l208413l530773l695707l652777l395153k963661k422587
34668C7017787j825308j195263n30347J78720R25070J663607K304878K742016
34660D1281160K902620K786837K459303K006331J499319R88265N12776J07674
34652E4544285k01147m00149m85749m62019l43984j63188L2019J85678K50112
$$ plain form
34643 52955858 53157922 53210898 53060974 52727243 52306112 51948951 51819914 52050834 52707927
34634 52707927 53774319 55147292 56654561 58095681 59299582 60167681 60671312 60802720
34626 60802720 60516734 59709327 58249711 56042360 53078585 49451031 45329254 40911629
34618 40911629 36375732 31848518 27407457 23105836 19002010 15174994 11722785 8750900
34610 8750900 6359495 4632111 3624139 3348112 3756895 4733189 6097803 7643740 9190480
34601 9190480 10640029 12011068 13434639 15113214 17262976 20060775 23602791 27871293
34593 27871293 32712425 37838820 42865450 47369076 50952541 53301781 54231132 53711369
34585 53711369 51873280 48986043 45417621 41585162 37901264 34723939 32320661 30851457
$$ packed form
34643E2955858K02064N2976j49924l33731m21131l57161j29037K30920O57093
34634E2707927J066392J372973J507269J441120J203901Q68099N03631J31408
34626F0802720k85986q07407j459616k207351k963775l627554m121777m417625
34618D0911629m535897m527214m441061m301621m103826l827016l452209k971885
34610H750900k391405j727384j007972k76027M08783R76294J364614J545937J546740
34601I190480J449549J371039J423571J678575K149762K797799L542016M268502
34593B7871293M841132N126395N026630M503626L583465K349240R29351n19763
34585E3711369j838089k887237l568422l832459l683898l177325k403278j469204
$$ plain form
34577 30851457 30364806 30795680 31964224 33588157 35324162 36835348 37857262 38230567
34569 38230567 37891905 36842136 35116157 32764766 29848889 26445201 22656238 18608797
34561 18608797 14431238 10223681 6045557 1926655 -2114326 -6057255 -9871539 -13507083
34553 -13507083 -16892981 -19950087 -22607590 -24809150 -26509704 -27676148 -28296832 -28391444
34545 -28391444 -28013988 -27251182 -26219406 -25056448 -23903614 -22881448 -22067438 -21482361 -21089260
34536 -21089260 -20808569 -20548447 -20239818 -19860267 -19437834 -19038695 -18748100 -18648703 -18796033
34527 -18796033 -19196479 -19801158 -20523922 -21273064 -21973129 -22561921 -22970488 -23108239 -22869872
34518 -22869872 -22163640 -20945705 -19240614 -17134960 -14746940 -12189538 -9548051 -6881692
$$ packed form
34577C0851457m86651M30874J168544J623933J736005J511186J021914L73305
34569C8230567l38662j049769j725979k351391k915877l403688l788963m047441
34561A8608797m177559m207557m178124m118902m040981l942929l814284l635544
34553a3507083l385898l057106k657503k201560j700554j166444o20684r4612
34545b8391444L77456P62806J031776J162958J152834J022166Q14010N85077L93101
34536b1089260K80691K60122L08629L79551M22433L99139K90595R9397j47330
34527a8796033m00446o04679p22764p49142p00065n88792m08567j37751K38367
34518b2869872P06232J217935J705091K105654K388020K557402K641487K666359
$$ plain form
34510 -6881692 -4244365 -1711410 602463 2547515 3973170 4784951 4998272 4755279 4286493
34501 4286493 3831383 3557502 3515818 3644070 3805053 3840075 3623857 3109333 2347241 1468622
34491 1468622 634213 -27364 -464908 -715498 -880839 -1085119 -1436001 -2002584 -2809382
34482 -2809382 -3836148 -5015252 -6226585 -7297546 -8018821 -8182650 -7636877 -6332974 -4344202
34473 -4344202 -1846525 924488 3720948 6321974 8560567 10333605 11591333 12312156
34465 12312156 12479512 12076257 11095853 9554554 7490909 4955171 2002117 -1306541
34457 -1306541 -4897814 -8688833 -12587197 -16477213 -20195835 -23525150 -26226960 -28113777
34449 -28113777 -29117971 -29317713 -28905533 -28118130 -27162059 -26166422 -25179042 -24202690 -23247952
$$ packed form
34510f881692K637327K532955K313873J945052J425655Q11781K13321k42993m68786
34501D286493m55110k73881m1684J28252J60983L5022k16218n14524p62092q78619
34491A468622q34409o61577m37544k50590j65341k04280l50882n66583q06798
34482b809382j026766j179104j211333j070961p21275j63829N45773J303903J988772
34473d344202K497677K771013K796460K601026K238593J773038J257728P20823
34465A2312156J67356m03255r80404j541299k063645k535738k953054l308658
34457a306541l591273l791019l898364l890016l718622l329315k701810j886817
34449b8113777j004194j99742M12180P87403R56071R95637R87380R76352R54738
$$ plain form
34440 -23247952 -22369536 -21664495 -21238864 -21171041 -21496477 -22215375 -23307139 -24737045 -26453285
34431 -26453285 -28379695 -30407407 -32386581 -34123933 -35397735 -35998225 -35784922 -34735113
34423 -34735113 -32957512 -30664785 -28120757 -25582671 -23248819 -21217150 -19467865 -17885686
34415 -17885686 -16320124 -14656769 -12864936 -11003869 -9193605 -7569688 -6241084 -5264733
34407 -5264733 -4641746 -4331327 -4272696 -4405083 -4679149 -5057332 -5505760 -5984818 -6445813 -6835515
34397 -6835515 -7103871 -7209469 -7123182 -6835768 -6371984 -5802951 -5241459 -4812741 -4611768 -4669528
34387 -4669528 -4943997 -5334954 -5710390 -5930064 -5855166 -5343444 -4246177 -2430885 166258
34378 166258 3488894 7350955 11479697 15581389 19391148 22693269 25324545 27179060
$$ packed form
34440b3247952Q78416P05041M25631O7823l25436p18898j091764j429906j716240
34431b6453285j926410k027712j979174j737352j273802o00490K13303J049809
34423c4735113J777601K292727K544028K538086K333852K031669J749285J582179
34415a7885686J565562J663355J791833J861067J810264J623917J328604R76351
34407e264733O22987L10419N8631j32387k74066l78183m48428m79058m60995l89702
34397f835515k68356j05598Q6287K87414M63784N69033N61492M28718K00973n7760
34387d669528k74469l90957l75436k19674P4898N11722J097267J815292K597143
34378A66258L322636L862061M128742M101692L809759L302121K631276J854515
$$ plain form
34370 27179060 28224017 28522656 28246601 27655719 27041074 26655504 26665875 27139039 28047756
34361 28047756 29282706 30673688 32026729 33168905 33982627 34418912 34491615 34259513 33804994
34352 33804994 33221315 32614875 32111380 31844378 31918959 32369355 33138056 34088503 35042712
34343 35042712 35825050 36293421 36346463 35910772 34927206 33352935 31176876 28433418 25207323
34334 25207323 21634355 17897111 14203128 10739089 7620662 4871865 2451135 309180
34326 309180 -1555151 -3070486 -4110731 -4543758 -4283798 -3320886 -1718644 408256 2920914
34317 2920914 5680418 8569257 11505830 14443816 17354462 20202486 22931589 25467935
34309 25467935 27736831 29679786 31260885 32460279 33261899 33645861 33590465 33079125 32103212
$$ packed form
34370B7179060J044957K98639k76055n90882o14645l85570J0371M73164R08717
34361B8047756J234950J390982J353041J142176Q13722M36285P2703k32102m54519
34352C3804994n83679o06440n03495k67002P4581M50396P68701R50447R54209
34343C5042712P82338M68371N3042m35691r83566j574271k176059k743458l226095
34334B5207323l572968l737244l693983l464039l118427k748797k420730k141955
34326C09180j864331j515335j040245m33027K59960R62912J602242K126900K512658
34317B920914K759504K888839K936573K937986K910646K848024K729103K536346
34309B5467935K268896J942955J581099J199394Q01620L83962n5396n11340r75913
$$ plain form
34300 32103212 30658551 28745007 26381478 23636320 20655399 17664760 14937784 12737278
34292 12737278 11255285 10572643 10650709 11355295 12501610 13902388 15402002 16886574 18271659
34283 18271659 19481785 20442416 21096024 21431516 21499983 21398863 21234309 21089509 21016931
34274 21016931 21048896 21209081 21513680 21961931 22521167 23114217 23619717 23893281 23806146 23286145
34264 23286145 22343664 21072806 19628013 18184437 16895916 15864730 15130069 14672542
34256 14672542 14428401 14309442 14225236 14101302 13886579 13549781 13069600 12422719 11571586
34247 11571586 10458108 9014056 7192248 5006532 2558222 31245 -2348292 -4378575
34239 -4378575 -5952030 -7096745 -7962396 -8749818 -9617033 -10611624 -11665974 -12655807 -13484578
$$ packed form
34300C2103212j444661j913544k363529k745158k980921k990639k726976k200506
34292A2737278j481993o82642P8066P04586J146315J400778J499614J484572J385085
34283A8271659J210126R60631O53608L35492O8467j01120j64554j44800p2578
34274B1016931L1965J60185L04599M48251N59236N93050N05500K73564q7135n20001
34264B3286145r42481j270858j444793j443576j288521j031186p34661m57527
34256A4672542k44141j18959q4206j23934k14723l36798m80181o46881q51133
34247A1571586j113478j444052j821808k185716k448310k526977k379537k030283
34239d378575j573455j144715q65651p87422q67215r94591j054350r89833q28771
$$ plain form
34230 -13484578 -14140495 -14693730 -15246616 -15881734 -16641647 -17534735 -18540108 -19602296 -20632996
34221 -20632996 -21534478 -22232651 -22695636 -22931060 -22975534 -22887628 -22741521 -22617074 -22591905 -22741042
34211 -22741042 -23136465 -23834368 -24853266 -26161771 -27688109 -29342629 -31036878 -32694467
34203 -32694467 -34259389 -35702117 -37014984 -38193873 -39217914 -40043671 -40619356 -40910387
34195 -40910387 -40921704 -40703959 -40337445 -39899843 -39436640 -38953720 -38434720 -37865131 -37240715
34186 -37240715 -36553706 -35771185 -34827102 -33636718 -32120941 -30218781 -27881192 -25065554
34178 -25065554 -21756554 -18012822 -14004524 -10002979 -6315103 -3191472 -748359 1066693
34170 1066693 2452740 3681895 5001199 6551031 8331880 10223196 12035506 13574165
$$ packed form
34230a3484578o55917n53235n52886o35118p59913q93088j005373j062188j030700
34221b0632996r01482o98173m62985k35424m4474Q7906J46107J24447K5169j49137
34211b2741042l95423o97903j018898j308505j526338j654520j694249j657589
34203c2694467j564922j442728j312867j178889j024041q25757n75685k91031
34195d0910387j1317K17745L66514M37602M63203M82920N19000N69589O24416
34186c7240715O87009P82521R44083J190384J515777J902160K337589K815638
34178b5065554L309000L743732M008298M001545L687876L123631K443113J815052
34170A066693J386047J229155J319304J549832J780849J891316J812310J538659
$$ plain form
34162 13574165 14698780 15363026 15620149 15591614 15415314 15197974 14988078 14772118 14489194
34153 14489194 14055569 13387971 12416368 11087210 9367929 7260081 4814062 2131267
34145 2131267 -648983 -3363858 -5830737 -7850121 -9232061 -9853235 -9716123 -8967112 -7856166
34136 -7856166 -6660716 -5612045 -4847107 -4389873 -4162224 -4023760 -3827554 -3464246 -2872081
34127 -2872081 -2015365 -854867 666663 2616107 5045145 7961233 11305507 14942917
34119 14942917 18663760 22195581 25230146 27470862 28693934 28801164 27841033 25991438
34111 25991438 23516336 20714340 17869960 15210029 12867620 10862214 9109213 7465001
34103 7465001 5795552 4039045 2232240 490327 -1044010 -2253290 -3075774 -3505296
$$ packed form
34162A3574165J124615O64246K57123k8535j76300k17340k09896k15960k82924
34153A4489194m33625o67598r71603j329158j719281k107848k446019k682795
34145B131267k780250k714875k466879k019384j381940o21174J37112P49011J110946
34136g856166J195450J048671P64938M57234K27649J38464J96206L63308N92165
34127b872081Q56716J160498J521530J949444K429038K916088L344274L637410
34119A4942917L720843L531821L034565K240716J223072J07230r60131j849595
34111B5991438k475102k801996k844380k659931k342409k005406j753001j644212
34103G465001j669449j756507j806805j741913j534337j209280q22484m29522
$$ plain form
34095 -3505296 -3567775 -3293353 -2705545 -1837182 -760692 395937 1469864 2316419 2863820
34086 2863820 3134392 3217140 3206026 3138050 2965244 2577077 1865224 802400 -500537 -1787662
34076 -1787662 -2709580 -2917359 -2164569 -380907 2306029 5604568 9134369 12517339 15452741
34067 15452741 17750714 19316449 20101926 20059684 19131462 17282088 14558046 11131184 7295527
34058 7295527 3413536 -164203 -3173041 -5478115 -7079709 -8086745 -8676556 -9060624
34050 -9060624 -9462882 -10099523 -11145826 -12690956 -14699534 -17001993 -19324213 -21350905
34042 -21350905 -22802996 -23500654 -23387877 -22514097 -20991795 -18959468 -16570900 -14012377
34034 -14012377 -11530234 -9440108 -8094122 -7804702 -8751726 -10914213 -14058488 -17788790
$$ packed form
34095c505296o2479K74422N87808Q68363J076490J156629J073927Q46555N47401
34086B863820K70572Q2748j1114o7976j72806l88167p11853j062824j302937j287125
34076a787662r21918k07779P52790J783662K686936L298539L529801L382970K935402
34067A5452741K297973J565735P85477m2242r28222j849374k724042l426862l835657
34058G295527l881991l577739l008838k305074j601594j007036n89811l84068
34050i060624m02258o36641j046303j545130k008578k302459k322220k026692
34042b1350905j452091o97658J12777Q73780J522302K032327K388568K558523
34034a4012377K482143K090126J345986K89420r47024k162487l144275l730302
$$ plain form
34026 -17788790 -21639177 -25170595 -28040787 -30033452 -31053634 -31106106 -30270663 -28680842
34018 -28680842 -26506626 -23938347 -21168860 -18374358 -15697284 -13234183 -11029473 -9077946
34010 -9077946 -7340763 -5774084 -4358526 -3113418 -2088589 -1339739 -900925 -767153 -894646
34001 -894646 -1217826 -1673195 -2217263 -2830716 -3510772 -4261501 -5093287 -6034033 -7140594
33992 -7140594 -8494133 -10177519 -12251616 -14745156 -17651483 -20916926 -24425964 -28009977
33984 -28009977 -31493926 -34758517 -37776069 -40596393 -43293166 -45903653 -48397140 -50692165
33976 -50692165 -52711968 -54437107 -55912311 -57200777 -58322486 -59222844 -59788042 -59887680 -59415515
33967 -59415515 -58315403 -56597232 -54348246 -51733559 -48973869 -46299656 -43899037 -41882522
$$ packed form
34026a7788790l850387l531418k870192j992665j020182n2472Q35443J589821
34018b8680842K174216K568279K769487K794502K677074K463101K204710J951527
34010i077946J737183J566679J415558J245108J024829P48850M38814J33772j27493
34001h94646l23180m55369n44068o13453o80056p50729q31786r40746j106561
33992g140594j353539j683386k074097k493540k906327l265443l509038l584013
33984b8009977l483949l264591l017552k820324k696773k610487k493487k295025
33976e0692165k019803j725139j475204j288466j121709r00358n65198r9638M72165
33967e9415515J100112J718171K248986K614687K759690K674213K400619K016515
$$ plain form
33959 -41882522 -40275714 -39033815 -38065127 -37255239 -36489565 -35672997 -34744052 -33680369 -32493631
33950 -32493631 -31214994 -29876665 -28498757 -27088166 -25647534 -24184594 -22713343 -21248933
33942 -21248933 -19807206 -18416194 -17132654 -16046874 -15265726 -14881722 -14947518 -15471521 -16436620
33933 -16436620 -17830755 -19670377 -21998707 -24853655 -28221682 -32008633 -36050229 -40156153
33925 -40156153 -44157115 -47926827 -51377825 -54452979 -57129515 -59427664 -61402603 -63112585
33917 -63112585 -64580570 -65773945 -66613204 -67003891 -66878252 -66230594 -65131032 -63711796 -62135218
33908 -62135218 -60558387 -59101678 -57823153 -56708672 -55692043 -54701849 -53705375 -52719107
33900 -52719107 -51785414 -50942719 -50211721 -49594142 -49067586 -48573013 -48009094 -47246135 -46154007
$$ packed form
33959d1882522J606808J241899R68688Q09888P65674Q16568R28945J063683J186738
33950c2493631J278637J338329J377908J410591J440632J462940J471251J464410
33942b1248933J441727J391012J283540J085780P81148L84004o5796n24003r65099
33933a6436620j394135j839622k328330k854948l368027l786951m041596m105924
33925d0156153m000962l769712l450998l075154k676536k298149j974939j709982
33917f3112585j467985j193375q39259l90687J25639O47658J099562J419236J576578
33908f2135218J576831J456709J278525J114481J016629R90194R96474R86268
33900e2719107R33693Q42695P30998O17579N26556M94573N63919P62959J092128
$$ plain form
33891 -46154007 -44627152 -42599362 -40057583 -37063718 -33774054 -30432361 -27325836 -24722221
33883 -24722221 -22820853 -21736573 -21509930 -22123959 -23513106 -25561571 -28095531 -30875571
33875 -30875571 -33597780 -35915401 -37490384 -38068067 -37545239 -35993557 -33621533 -30695899
33867 -30695899 -27465829 -24124278 -20811539 -17640781 -14717970 -12139414 -9971312 -8231950
33859 -8231950 -6893967 -5903998 -5201391 -4723935 -4407192 -4191564 -4039457 -3949572 -3954136 -4097948
33849 -4097948 -4411917 -4896523 -5521837 -6238318 -6986499 -7698107 -8291893 -8675846 -8766135 -8521153
33839 -8521153 -7972746 -7230862 -6452715 -5794023 -5371630 -5249673 -5435630 -5871271 -6428555
33830 -6428555 -6936139 -7240423 -7265578 -7025730 -6577053 -5946184 -5089215 -3909895 -2322306
$$ packed form
33891d6154007J526855K027790K541779K993865L289664L341693L106525K603615
33883b4722221J901368J084280K26643o14029j389147k048465k533960k780040
33875c0875571k722209k317621j574983n77683N22828J551682K372024K925634
33867c0695899L230070L341551L312739L170758K922811K578556K168102J739362
33859h231950J337983R89969P02607M77456L16743K15628J52107Q9885m564j43812
33849d097948l13969m84606o25314p16481p48181p11608n93786l83953r0289K44982
33839h521153N48407P41884P78147O58692M22393J21957j85957m35641n57284
33830f428555n07584l04284k5155K39848M48677O30869Q56969J179320J587589
$$ plain form
33821 -2322306 -316227 2012274 4476372 6844536 8890760 10430588 11339763 11560962
33813 11560962 11102400 10027692 8436873 6442923 4150752 1643333 -1024879 -3829810
33805 -3829810 -6776161 -9889621 -13198317 -16704160 -20355151 -24034898 -27577627 -30801010
33797 -30801010 -33539434 -35664135 -37087777 -37759939 -37662568 -36812359 -35271095 -33157815 -30652552
33788 -30652552 -27983100 -25391894 -23087549 -21194390 -19719449 -18551385 -17488935 -16281896
33780 -16281896 -14671010 -12429498 -9416621 -5638963 -1291105 3259820 7558219 11184811
33772 11184811 13865745 15516267 16208442 16095706 15343148 14094726 12477660 10624706
33764 10624706 8693309 6868160 5341860 4277267 3765948 3805527 4314419 5181276 6319648
$$ packed form
33821b322306K006079K328501K464098K368164K046224J539828R09175K21199
33813A1560962m58562j074708j590819j993950k292171k507419k668212k804931
33805c829810k946351l113460l308696l505843l650991l679747l542729l223383
33797c0801010k738424k124701j423642o72162R7371Q50209J541264K113280K505263
33788c0652552K669452K591206K304345J893159J474941J168064J062450J207039
33780a6281896J610886K241512L012877L777658M347858M550925M298399L626592
33772A1184811K680934J650522O92175j12736p52558j248422j617066j852954
33764A0624706j931397j825149j526300j064593n11319L9579N08892Q66857J138372
$$ plain form
33755 6319648 7689854 9273831 11027753 12855620 14625677 16212298 17526981 18517366
33747 18517366 19142040 19343891 19040139 18135004 16551411 14270617 11362056 7984935 4354881
33738 4354881 689580 -2837631 -6111581 -9054470 -11592594 -13639694 -15112252 -15969613
33730 -15969613 -16256285 -16121280 -15797446 -15539391 -15539244 -15858028 -16411975 -17028111 -17541821 -17880567
33720 -17880567 -18087339 -18279291 -18577078 -19048033 -19683239 -20402690 -21074759 -21542082 -21649915
33711 -21649915 -21271299 -20324222 -18782487 -16685225 -14143665 -11335067 -8475297 -5775093
33703 -5775093 -3398460 -1442055 58745 1108019 1729470 1958405 1840455 1425348 752156
33694 752156 -164312 -1334345 -2781151 -4526620 -6584228 -8957009 -11631522 -14563883
$$ packed form
33755F319648J370206J583977J753922J827867J770057J586621J314683R90385
33747A8517366O24674K01851l03752r05135j583593k280794k908561l377121l630054
33738D354881l665301l527211l273950k942889k538124k047100j472558q57361
33730a5969613k86672J35005L23834K58055J47l18784n53947o16136n13710l38746
33720a7880567k06772j91952k97787m70955o35206p19451o72069m67323j07833
33711b1649915L78616R47077J541735K097262K541560K808598K859770K700204
33703e775093K376633J956405J500800J049274O21451K28935j17950m15107o73192
33694G52156r16468j170033j446806j745469k057608k372781k674513k932361
$$ plain form
33686 -14563883 -17666750 -20813584 -23867872 -26722508 -29317441 -31614424 -33543716 -34967353
33678 -34967353 -35695953 -35555657 -34465111 -32477917 -29770970 -26589852 -23180651 -19737611
33670 -19737611 -16382126 -13170906 -10120640 -7236344 -4533865 -2048209 177907 2121123
33662 2121123 3804273 5304526 6734691 8204464 9778288 11447277 13126755 14681600
33654 14681600 15971526 16898924 17436605 17618812 17500586 17116527 16475345 15598142 14567127
33645 14567127 13536834 12688431 12153944 11959369 12017888 12166751 12216575 11985228 11310346
33636 11310346 10053157 8108466 5425139 2030758 -1949841 -6293049 -10701972 -14861492
33628 -14861492 -18508614 -21488567 -23770324 -25418390 -26541903 -27247299 -27607349 -27645364 -27331866
$$ packed form
33686a4563883l102867l146834l054288k854636k594933k296983j929292j423637
33678c4967353p28600J40296J090546J987194K706947L181118L409201L443040
33670a9737611L355485L211220L050266K884296K702479K485656K226116J943216
33662B121123J683150J500253J430165J469773J573824J668989J679478J554845
33654A4681600J289926R27398N37681J82207j18226l84059o41182q77203j031015
33645A4567127j030293q48403n34487j94575N8519J48863M9824k31347o74882
33636A1310346j257189j944691k683327l394381l980599m343208m408923m159520
33628a4861492l647122k979953k281757j648066j123513p05396l60050l8015L13498
$$ plain form
33619 -27331866 -26597265 -25364381 -23593129 -21316246 -18644515 -15738442 -12767972 -9890608
33611 -9890608 -7260662 -5053434 -3474466 -2736479 -3009949 -4367296 -6742111 -9922008
33603 -9922008 -13587184 -17389069 -21038321 -24359288 -27285587 -29809268 -31924202 -33600466
33595 -33600466 -34795869 -35481714 -35657039 -35346262 -34592470 -33454047 -31998580 -30290147 -28382998
33586 -28382998 -26338089 -24254885 -22285284 -20603698 -19343486 -18538022 -18099114 -17838832
33578 -17838832 -17520423 -16920491 -15888662 -14392056 -12531485 -10521901 -8643557 -7182794
33570 -7182794 -6380615 -6394287 -7268241 -8916097 -11125733 -13595216 -15988584 -17987000 -19317799
33561 -19317799 -19764153 -19171992 -17467683 -14684426 -10980725 -6632072 -1989549 2583369
$$ packed form
33619b7331866P34601J232884J771252K276883K671731K906073K970470K877364
33611i890608K629946K207228J578968P37987k73470j357347k374815l179897
33603i922008l665176l801885l649252l320967k926299k523681k114934j676264
33595c3600466j195403o85845j75325L10777P53792J138423J455467J708433J907149
33586b8382998K044909K083204J969601J681586J260212Q05464M38908K60282
33578a7838832L18409N99932J031829J496606J860571K009584J878344J460763
33570g182794Q02179j3672q73954j647856k209636k469483k393368j998416j330799
33561a9317799m46354N92161J704309K783257L703701M348653M642523M572918
$$ plain form
33553 2583369 6774143 10363255 13230729 15325006 16610904 17030321 16506200 14990156
33545 14990156 12518295 9230835 5339769 1069669 -3386909 -7878533 -12281874 -16493987
33537 -16493987 -20441631 -24095669 -27471669 -30610562 -33550124 -36306256 -38878849 -41280539
33529 -41280539 -43565113 -45824271 -48141241 -50525431 -52872088 -54977683 -56607053 -57576604
33521 -57576604 -57806513 -57313410 -56157937 -54397358 -52084411 -49303279 -46194669 -42937453
33513 -42937453 -39702846 -36622489 -33792255 -31299278 -29244867 -27743457 -26894133 -26738746
33505 -26738746 -27232717 -28249679 -29618043 -31165216 -32744608 -34239157 -35551705 -36593568
33497 -36593568 -37274902 -37498900 -37168230 -36213041 -34634418 -32536237 -30117166 -27621220 -25275579
$$ packed form
33553B583369M190774L589112K867474K094277J285898M19417n24121j516044
33545A4990156k471861l287460l891066m270100m456578m491624m403341m212113
33537a6493987l947644l654038l376000l138893k939562k756132k572593k401690
33529d1280539k284574k259158k316970k384190k346657k105595j629370r69551
33521e7576604k29909M93103J155473J760579K312947K781132L108610L257216
33513d2937453L234607L080357K830234K492977K054411J501410Q49324J55387
33505b6738746m93971j016962j368364j547173j579392j494549j312548j041863
33497c6593568o81334k23998L30670R55189J578623K098181K419071K495946K345641
$$ plain form
33488 -25275579 -23248070 -21633418 -20455764 -19674386 -19190466 -18857561 -18496469 -17916604 -16950638
33479 -16950638 -15503926 -13601179 -11397053 -9128314 -7023232 -5217294 -3719648 -2435002
33471 -2435002 -1210574 122250 1718981 3699154 6126026 8990566 12202330 15594794
33463 15594794 18957529 22094444 24878830 27266582 29258099 30840197 31949967 32480139
33455 32480139 32318982 31405398 29775799 27580117 25057219 22481097 20100439 18088289
33447 18088289 16510449 15321355 14392516 13560700 12666917 11567978 10134478 8266996
33439 8266996 5942551 3264786 474239 -2102919 -4148592 -5444250 -5920195 -5647319
33431 -5647319 -4783557 -3505752 -1961079 -257149 1516441 3261510 4863368 6207298
$$ packed form
33488b5275579K027509J614652J177654P81378M83920L32905L61092N79865R65966
33479a6950638J446712J902747K204126K268739K105082J805938J497646J284646
33471b435002J224428J332824J596731J980173K426872K864540L211764L392464
33463A5594794L362735L136915K784386K387752J991517J582098J109770N30172
33455C2480139j61157r13584j629599k195682k522898k576122k380658k012150
33447A8088289j577840j189094r28839q31816q93783j098939j433500j867482
33439H266996k324445k677765k790547k577158k045673j295658m75945K72876
33431e647319Q63762J277805J544673J703930J773590J745069J601858J343930
$$ plain form
33423 6207298 7210203 7853926 8205554 8408793 8639765 9044445 9694044 10584635 11672992
33414 11672992 12914399 14274003 15710149 17149331 18475809 19549921 20253526 20541110
33406 20541110 20462787 20137244 19686512 19172566 18573631 17810614 16805024 15534517 14052604
33397 14052604 12456686 10821470 9142548 7330158 5255401 2814138 -30346 -3239932
33389 -3239932 -6717763 -10329226 -13917722 -17316779 -20365210 -22928200 -24919624 -26317751
33381 -26317751 -27169302 -27579566 -27687332 -27629121 -27508032 -27384460 -27290442 -27249983 -27285693 -27407329
33371 -27407329 -27592190 -27769512 -27816959 -27573362 -26867343 -25556575 -23570855 -20951644 -17875725
33362 -17875725 -14646342 -11643950 -9248447 -7757552 -7322772 -7917056 -9346338 -11310191
$$ packed form
33423F207298J002905O43723L51628K03239K30972M04680O49599Q90591J088357
33414A1672992J241407J359604J436146J439182J326478J074112P03605K87584
33406B0541110p8323l25543m50732n13946n98935p63017j005590j270507j481913
33397A4052604j595918j635216j678922j812390k074757k441263k844484l209586
33389c239932l477831l611463l588496l399057l048431k562990j991424j398127
33381b6317751q51551m10264j07766N8211J21089J23572R4018M0459l5710j21636
33371b7407329j84861j77322m7447K43597P06019J310768J985720K619211L075919
33362a7875725L229383L002392K395503J490895M34780n94284j429282j963853
$$ plain form
33354 -11310191 -13494788 -15658989 -17677241 -19531222 -21269219 -22957554 -24638078 -26297228
33346 -26297228 -27850936 -29149264 -29999550 -30200443 -29577486 -28015322 -25486439 -22075095
33338 -22075095 -17987436 -13534756 -9084070 -4987099 -1513249 1186241 3070486 4168946
33330 4168946 4539850 4256100 3424148 2212701 859175 -359848 -1179901 -1394340 -878110
33321 -878110 407153 2414991 5019060 8027222 11209419 14333610 17198510 19655936
33313 19655936 21620707 23066481 24006776 24468258 24471621 24032939 23184257 21998268 20598589
33304 20598589 19144795 17794210 16654443 15746955 15000981 14287977 13490132 12575280 11637563
33295 11637563 10875362 10515725 10730152 11587905 13058552 15039694 17380610 19894830 22374536
$$ packed form
33354a1310191k184597k164201k018252j853981j737997j688335j680524j659150
33346b6297228j553708j298328q50286k00893O22957J562164K528883L411344
33338b2075095M087659M452680M450686M096971L473850K699490J884245J098460
33330D168946L70904k83750q31952j211447j353526j219023q20053k14439N16230
33321h78110J285263K007838K604069L008162L182197L124191K864900K457426
33313A9655936J964771J445774R40295M61482L363m38682q48682j185989j399679
33304B0598589j453794j350585j139767r07488p45974p13004p97845r14852r37717
33295A1637563p62201l59637K14427Q57753J470647J981142K340916K514220K479706
$$ plain form
33286 22374536 24616654 26452355 27762366 28471601 28536026 27940913 26715566 24950443 22797964
33277 22797964 20451160 18110188 15952373 14115879 12697251 11755307 11312335 11348819 11795968
33268 11795968 12534199 13404131 14232458 14869804 15229612 15310096 15185046 14966383 14759278
33259 14759278 14633581 14621620 14734894 14983729 15387046 15968637 16744853 17712339 18842920
33250 18842920 20087936 21388928 22688652 23938489 25103644 26168896 27141564 28044002
33242 28044002 28896303 29704200 30466915 31199599 31947508 32775140 33734801 34831550 36000023
33233 36000023 37105751 37980270 38483820 38565528 38285760 37790750 37260482 36856385 36680994
33224 36680994 36754145 37015002 37355757 37673562 37913007 38079544 38223950 38408667 38667866
$$ packed form
33286B2374536K242118J835701J310011P09235O4425n95113j225347j765123k152479
33277B2797964k346804k340972k157815j836494j418628r41944m42972L6484M47149
33268A1795968P38231Q69932Q28327O37346L59808Q0484j25050k18663k07105
33259A4759278j25697j1961J13274K48835M03317N81591P76216R67486J130581
33250A8842920J245016J300992J299724J249837J165155J065252R72668R02438
33242B8044002Q52301Q07897P62715P32684P47909Q27632R59661J096749J168473
33233C6000023J105728Q74519N03550Q1708k79768m95010n30268m04097j75391
33224C6680994P3151K60857L40755L17805K39445J66537J44406J84717K59199
$$ plain form
33215 38667866 38975352 39235965 39305678 39026634 38255706 36877326 34808315 32006003 28481678
33206 28481678 24312474 19643405 14675293 9641698 4785427 346236 -3439630 -6342333
33198 -6342333 -8161021 -8768114 -8155476 -6453589 -3907310 -818908 2509630 5806303
33190 5806303 8829670 11365607 13242817 14360766 14702435 14317004 13289613 11728472
33182 11728472 9778069 7635856 5542891 3741940 2423893 1690098 1543913 1907309
33174 1907309 2650612 3623477 4676903 5670654 6470929 6953068 7020997 6637617 5844096
33165 5844096 4747877 3479371 2139948 771314 -637480 -2114729 -3668730 -5268896
33157 -5268896 -6845922 -8300522 -9517040 -10385759 -10830230 -10824024 -10386069 -9562499 -8412036
$$ packed form
33215C8667866L07486K60613O9713k79044p70928j378380k069011k802312l524325
33206B8481678m169204m669069m968112n033595m856271m439191l785866k902703
33198f342333j818688o07093O12638J701887K546279L088402L328538L296673
33190E806303L023367K535937J877210J117949L41669l85431j027391j561141
33182A1728472j950403k142213k092965j800951j318047p33795j46185L63396
33174A907309P43303R72865J053426R93751Q00275M82139O7929l83380p93521
33165E844096j096219j268506j339423j368634j408794j477249j554001j600166
33157e268896j577026j454600j216518q68719m44471O206M37955Q23570J150463
$$ plain form
33148 -8412036 -7001923 -5409181 -3721564 -2037095 -459935 910444 1992675 2729127
33140 2729127 3080589 3019936 2535915 1646026 408615 -1072564 -2652003 -4154869 -5400023
33131 -5400023 -6231876 -6553122 -6347407 -5682262 -4687924 -3517843 -2307091 -1145206 -68252
33122 -68252 936539 1920556 2959401 4135309 5520182 7160570 9060822 11165647 13356567
33113 13356567 15477239 17380785 18969851 20205941 21093585 21662699 21961045 22048555 21984135
33104 21984135 21809512 21540327 21165755 20651403 19944964 18988157 17732738 16152763 14250161
33095 14250161 12057346 9636970 7072153 4445746 1820063 -769797 -3309343 -5795319
33087 -5795319 -8228933 -10606649 -12904283 -15061131 -16978456 -18542045 -19664482 -20328548
$$ packed form
33148h412036J410113J592742J687617J684469J577160J370379J082231P36452
33140B729127L51462o0653m84021q89889j237411j481179j579439j502866j245154
33131e400023q31853l21246K05715O65145R94338J170081J210752J161885J076954
33122f8252J004791R84017J038845J175908J384873J640388J900252K104825K190920
33113A3356567K120672J903546J589066J236090Q87644N69114K98346Q7510o4420
33104B1984135j74623k69185l74572n14352p06439r56807j255419j579975j902602
33095A4250161k192815k420376k564817k626407k625683k589860k539546k485976
33087e795319k433614k377716k297634k156848j917325j563589j122437o64066
$$ plain form
33079 -20328548 -20609531 -20664616 -20693870 -20886419 -21365716 -22148429 -23134436 -24139152 -24958406
33070 -24958406 -25435337 -25497967 -25155260 -24461649 -23472013 -22209382 -20658591 -18784481 -16561892
33061 -16561892 -14003786 -11179400 -8216162 -5278385 -2523362 -53105 2108545 3994866
33053 3994866 5642690 7043938 8139939 8866823 9221108 9297339 9270459 9338183 9665615
33044 9665615 10364453 11506393 13145503 15323911 18052454 21277203 24853494 28546997
33036 28546997 32068673 35134613 37531441 39166476 40086618 40458542 40514360 40479487 40507060
33027 40507060 40641688 40824264 40932793 40837645 40442832 39695140 38566560 37034355 35080875
33018 35080875 32714105 29990063 27016479 23932240 20873938 17947175 15214016 12695556
$$ packed form
33079b0328548k80983n5085k9254j92549m79297p82713r86007j004716q19254
33070b4958406m76931o2630L42707O93611R89636J262631J550791J874110K222589
33061a6561892K558106K824386K963238K937777K755023K470257K161650J886321
33053C994866J647824J401248J096001P26884L54285P6231k6880O7724L27432
33044I665615O98838J141940J639110K178408K728543L224749L576291L693503
33036B8546997L521676L065940K396828J635035R20142L71924N5818l4873K7573
33027D0507060J34628J82576J08529r5148l94813p47692j128580j532205j953480
33018C5080875k366770k724042k973584l084239l058302k926763k733159k518460
$$ plain form
33010 12695556 10379965 8228468 6181195 4169962 2139359 68890 -2012038 -4019934
33002 -4019934 -5827115 -7290117 -8292437 -8781414 -8776729 -8349418 -7593325 -6609768 -5505437
32993 -5505437 -4391408 -3377514 -2564127 -2031348 -1825589 -1954393 -2404925 -3181522 -4329842
32984 -4329842 -5917134 -7976565 -10458523 -13225108 -16084738 -18835954 -21297710 -23329570
32976 -23329570 -24855772 -25893119 -26563452 -27070285 -27639228 -28446552 -29568947 -30972791 -32535468
32967 -32535468 -34076655 -35384451 -36238327 -36437207 -35830468 -34337751 -31947601 -28703023
32959 -28703023 -24694622 -20074075 -15077591 -10031371 -5316403 -1296401 1760454 3730234
32951 3730234 4636751 4621434 3903751 2749418 1447904 289675 -466943 -640523 -170776
$$ packed form
33010A2695556k315591k151497k047273k011233k030603k070469k080928k007896
33002d019934j807181j463002j002320m88977M685M27311P56093R83557J104331
32993e505437J114029J013894Q13387N32779K05759j28804m50532p76597j148320
32984d329842j587292k059431k481958k766585k859630k751216k461756k031860
32976b3329570j526202j037347o70333n06833n68943q07324j122395j403844j562677
32967c2535468j541187j307796q53876j98880O06739J492717K390150L244578
32959b8703023M008401M620547M996484N046220M714968M020002L056855J969780
32951C730234R06517j5317p17683j154333j301514j158229p56618j73580M69747
$$ plain form
32942 -170776 858640 2235371 3671997 4880320 5640489 5844255 5505171 4741802 3745999
32933 3745999 2745164 1961622 1571694 1673097 2273342 3305624 4664211 6239628 7935682
32924 7935682 9665553 11341462 12876615 14204381 15300309 16186666 16913150 17527665 18058205
32915 18058205 18515495 18907821 19250607 19559683 19832047 20028572 20072038 19863686 19311886
32906 19311886 18363670 17031890 15411983 13682249 12083638 10880480 10308523 10518477
32898 10518477 11525853 13183936 15199421 17198228 18823183 19824990 20111869 19746714
32890 19746714 18902018 17789941 16586409 15373676 14127068 12754601 11168569 9350039
32882 9350039 7375906 5404588 3638336 2283755 1520104 1471506 2178820 3579878 5514932
$$ packed form
32942a70776J029416J376731J436626J208323P60169K03766l39084p63369r95803
32933C745999j000835p83542l89928J01403O00245J032282J358587J575417J696054
32924G935682J729871J675909J535153J327766J095928Q86357P26484O14515N30540
32915A8058205M57290L92326L42786L09076K72364J96525M3466k08352n51800
32906A9311886r48216j331780j619907j729734j598611j203158n71957K09954
32898A0518477J007376J658083K015485J998807J624955J001807K86879l65155
32890A9746714q44696j112077j203532j212733j246608j372467j586032j818530
32882I350039j974133j971318j766252j354581p63651m8598P07314J401058J935054
$$ plain form
32873 5514932 7760791 10072844 12208826 13932072 15017127 15275499 14591167 12940255
32865 12940255 10383921 7047180 3101287 -1246893 -5767814 -10232345 -14442542 -18258970
32857 -18258970 -21612571 -24496497 -26944901 -29012458 -30763287 -32265546 -33581813 -34752236
32849 -34752236 -35778722 -36620262 -37200251 -37418097 -37159839 -36311657 -34783222 -32539064 -29624123
32840 -29624123 -26168440 -22368228 -18455096 -14668217 -11234879 -8355159 -6186942 -4834580
32832 -4834580 -4346078 -4715806 -5882548 -7717883 -10014071 -12488311 -14812019 -16657957
32824 -16657957 -17749769 -17902732 -17051613 -15262352 -12722031 -9705173 -6524734 -3482771
32816 -3482771 -831915 1249642 2670226 3423358 3575126 3247408 2602127 1821875 1079807
$$ packed form
32873E514932K245859K312053K135982J723246J085055K58372o84332j650912
32865A2940255k556334l336741l945893m348180m520921m464531m210197l816428
32857a8258970l353601k883926k448404k067557j750829j502259j316267j170423
32849c4752236j026486q41540n79989k17846K58258Q48182J528435K244158K914941
32840b9624123L455683L800212L913132L786879L433338K879720K168217J352362
32832d834580M88502l69728j166742j835335k296188k474240k323708j845938
32824a6657957j091812j52963Q51119J789261K540321L016858L180439L041963
32816c482771K650856K081557J420584P53132J51768l27718o45281p80252p42068
$$ plain form
32807 1079807 505191 164291 67064 184827 454003 762274 941736 794886 151222 -1074572
32797 -1074572 -2852850 -5047829 -7456031 -9858254 -12070209 -13979549 -15559915 -16858749
32789 -16858749 -17964434 -18965921 -19919494 -20832695 -21668709 -22368414 -22881478 -23192370 -23326819
32780 -23326819 -23333345 -23248421 -23061716 -22694634 -21997609 -20768030 -18790542 -15897556 -12037231
32771 -12037231 -7325828 -2059286 3331566 8379173 12704862 16127708 18710864 20722321
32763 20722321 22526157 24453727 26710210 29346891 32291426 35403490 38525204 41515500
32755 41515500 44273795 46757772 48989210 51036893 52974618 54828875 56541423 57967160
32747 57967160 58907755 59159669 58550205 56953410 54301434 50609033 46004798 40739851
$$ packed form
32807A079807n74616l40900r7227J17763K69176L08271J79462j46850o43664j225794
32797a074572j778278k194979k408202k402223k211955j909340j580366j298834
32789a6858749j105685j001487r53573r13201q36014o99705n13064l10892j34449
32780b3326819o526Q4924J86705L67082O97025J229579J977488K892986L860325
32771a2037231M711403N266542N390852N047607M325689L422846K583156K011457
32763B0722321J803836J927570K256483K636681K944535L112064L121714K990296
32755D1515500K758295K483977K231438K047683J937725J854257J712548J425737
32747E7967160R40595K51914o09464j596795k651976l692401m604235n264947
$$ plain form
32739 40739851 35151089 29588027 24338794 19589149 15424786 11863222 8891066 6486150
32731 6486150 4617240 3232247 2259147 1637598 1370282 1552722 2343343 3878636 6184156
32722 6184156 9134038 12470398 15856363 18936291 21396253 23021540 23735872 23606353
32714 23606353 22816052 21620200 20297970 19104141 18227779 17770394 17750518 18130200 18853196
32705 18853196 19883834 21232564 22953791 25112902 27738550 30785908 34128177 37574823
32697 37574823 40900762 43869639 46246124 47806164 48357699 47773565 46024226 43193357
32689 43193357 39466797 35097643 30360554 25512410 20771557 16315726 12288097 8799124
32681 8799124 5917901 3655944 1954360 688546 -302530 -1170295 -2013035 -2852939 -3641841
$$ packed form
32739D0739851n588762n563062n249233m749645m164363l561564k972156k404916
32731F486150j868910j384993r73100o21549k67316J82440P90621J535293K305520
32722F184156K949882L336360L385965L079928K459962J625287P14332j29519
32714B3606353p90301j195852j322230j193829q76362m57385j9876L79682P22996
32705A8853196J030638J348730J721227K159111K625648L047358L342269L446646
32697C7574823L325939K968877K376485J560040N51535n84134j749339k830869
32689D3193357l726560m369154m737089m848144m740853m455831m027629l488973
32681H799124k881223k261957j701584j265814r91076q67765q42740q39904p88902
$$ plain form
32672 -3641841 -4293229 -4728748 -4920418 -4910945 -4806545 -4750152 -4887538 -5336696 -6169263 -7409522
32662 -7409522 -9046541 -11045185 -13344668 -15848261 -18418540 -20889054 -23090276 -24876389
32654 -24876389 -26138208 -26798700 -26803378 -26121401 -24757775 -22760470 -20210805 -17205702 -13848920
32645 -13848920 -10254846 -6553516 -2888857 585024 3702984 6288199 8165358 9196018
32637 9196018 9327833 8633213 7309435 5628725 3856049 2174189 652761 -728529
32629 -728529 -2023968 -3271491 -4476606 -5630331 -6735732 -7817460 -8910466 -10043623
32621 -10043623 -11233716 -12491045 -13826745 -15252344 -16771986 -18378587 -20064277 -21837395
32613 -21837395 -23720057 -25710099 -27728751 -29600954 -31094600 -31996375 -32175270 -31601712
$$ packed form
32672c641841o51388m35519j91670R473J04400N6393j37386m49158q32567j240259
32662g409522j637019j998644k299483k503593k570279k470514k201222j786113
32654b4876389j261819o60492m678O81977J363626J997305K549665L005103L356782
32645a3848920L594074L701330L664659L473881L117960K585215J877159J030660
32637I196018J31815o94620j323778j680710j772676j681860j521428j381290
32629g28529j295439j247523j205115j153725j105401j081728j093006j133157
32621a0043623j190093j257329j335700j425599j519642j606601j685690j773118
32613b1837395j882662j990042k018652j872203j493646r01775j78895N73558
$$ plain form
32605 -31601712 -30325410 -28435289 -26024567 -23174775 -19960993 -16468766 -12806589 -9101966
32597 -9101966 -5481070 -2043556 1150855 4073098 6698080 8982811 10871322 12325877
32589 12325877 13357803 14028867 14420643 14599723 14610601 14501347 14356373 14305066 14497195
32580 14497195 15060693 16063534 17492745 19255929 21205865 23178824 25026229 26624377
32572 26624377 27868712 28672568 28977939 28764873 28045624 26848875 25209999 23172964 20796691
32563 20796691 18160938 15374235 12581124 9954452 7662150 5819234 4451548 3490010
32555 3490010 2792182 2174252 1440506 410068 -1052188 -2998628 -5366946 -7973821 -10549083
32546 -10549083 -12805450 -14518340 -15584467 -16039900 -16038037 -15801467 -15563619 -15512690 -15751049
$$ packed form
32605c1601712J276302J890121K410722K849792L213782L492227L662177L704623
32597i101966L620896L437514L194411K922243K624982K284731J888511J454555
32589A2325877J031926O71064L91776J79080J0878j09254j44974n1307J92129
32580A4497195N63498J002841J429211J763184J949936J972959J847405J598148
32572B6624377J244335Q03856L05371k13066p19249j196749j638876k037035k376273
32563B0796691k635753k786703k793111k626672k292302j842916j367686r61538
32555C490010o97828o17930p33746j030438j462256j946440k368318k606875k575262
32546a0549083k256367j712890j066127m55433J863K36570K37848N0929k38359
$$ plain form
32537 -15751049 -16286426 -17062914 -18014448 -19101256 -20299688 -21556462 -22752009 -23710348 -24254261
32528 -24254261 -24272468 -23762934 -22834603 -21670812 -20472896 -19408916 -18585869 -18046987 -17782659
32519 -17782659 -17744618 -17861724 -18057638 -18264233 -18423100 -18479386 -18385008 -18122048 -17730866 -17309039
32509 -17309039 -16963168 -16737080 -16566600 -16295166 -15741337 -14777678 -13381633 -11642208 -9729942
32500 -9729942 -7848902 -6187903 -4881411 -3987300 -3489512 -3328307 -3444605 -3811160 -4430353
32491 -4430353 -5303327 -6395670 -7624885 -8878030 -10047566 -11061786 -11891620 -12535794 -13002189
32482 -13002189 -13297802 -13422294 -13356799 -13053707 -12440819 -11441107 -9996095 -8085787 -5749958
32473 -5749958 -3112754 -396909 2094351 4041428 5212013 5570855 5338363 4946420 4891611
$$ packed form
32537a5751049n35377p76488r51534j086808j198432j256774j195547r58339n43913
32528b4254261j8207N09534R28331J163791J197916J063980Q23047N38882K64328
32519a7782659L8041j17106j95914k06595j58867n6286R4378K62960L91182M21827
32509a7309039L45871K26088J70480K71434N53829R63659J396045J739425J912266
32500i729942J881040J660999J306492Q94111M97788J61205j16298l66555o19193
32491d430353q72974j092343j229215j253145j169536j014220q29834o44174m66395
32482a3002189k95613j24492O5495L03092O12888R99712J445012J910308K335829
32473e749958K637204K715845K491260J947077J170585L58842k32492l91943n4809
$$ plain form
32464 4891611 5555364 7087536 9406708 12293457 15503702 18836952 22139379 25266368
32456 25266368 28047541 30286611 31801995 32489180 32372642 31617373 30487640 29267243
32448 29267243 28176520 27322180 26696808 26220060 25796996 25365986 24918170 24488535 24134283
32439 24134283 23916937 23890578 24086131 24486461 25004222 25483672 25736038 25595338 24968323
32430 24968323 23857787 22353595 20599166 18750666 16951494 15337040 14059694 13300619
32422 13300619 13240824 13999002 15572890 17817185 20465368 23183301 25636967 27555312
32414 27555312 28770533 29228721 28977737 28141406 26880866 25344343 23621513 21728990
32406 21728990 19640264 17343598 14889602 12394576 9995154 7785488 5782575 3943398
$$ packed form
32464D891611O63753J532172K319172K886749L210245L333250L302427L126989
32456B5266368K781173K239070J515384O87185j16538p55269j129733j220397
32448B9267243j090723q54340o25372m76748m23064m31010m47816m29635l54252
32439B4134283k17346k6359J95553M00330N17761M79450K52366j40700o27015
32430B4968323j110536j504192j754429j848500j799172j614454j277346p59075
32422A3300619n9795P58178J573888K244295K648183K717933K453666J918345
32414B7555312J215221M58188k50984q36331j260540j536523j722830j892523
32406B1728990k088726k296666k453996k495026k399422k209666k002913j839177
$$ plain form
32398 3943398 2216506 587680 -907059 -2197517 -3205986 -3872822 -4179117 -4162367 -3915115
32389 -3915115 -3562056 -3227158 -3009940 -2977994 -3165017 -3564358 -4125878 -4771321 -5424674 -6032994
32379 -6032994 -6561026 -6971937 -7218801 -7253787 -7041843 -6569368 -5852865 -4951923 -3975006 -3060073
32369 -3060073 -2327169 -1823016 -1487591 -1162473 -638324 281336 1728536 3749264 6311755
32360 6311755 9330114 12683822 16220413 19745497 23020388 25787055 27819075 28972979
32352 28972979 29208846 28567491 27120460 24927603 22031597 18491124 14423739 10021218
32344 10021218 5521249 1151281 -2922021 -6610309 -9881913 -12716702 -15062931 -16815264
32336 -16815264 -17819211 -17898533 -16899799 -14742642 -11456238 -7186468 -2177849 3252081
$$ packed form
32398C943398j726892j628826j494739j290458j008469o66836l06295J6750K47252
32389c915115L53059L34898K17218L1946j87023l99341n61520o45443o53353o08320
32379f032994n28032m10911k46864l4986K11944M72475P16503R00942R76917R14933
32369c060073P32904N04153L35425L25118N24149R19660J447200K020728K562491
32360F311755L018359L353708L536591L525084L274891K766667K032020J153904
32352B8972979K35867o41355j447031k192857k896006l540473m067385m402521
32344A0021218m499969m369968m073302l688288l271604k834789k346229j752333
32336a6815264j003947p9322R98734K157157L286404M269770N008619N429930
$$ plain form
32328 3252081 8737890 13901606 18408998 22036282 24718660 26555611 27768493 28628574
32320 28628574 29385244 30216658 31204177 32319353 33422745 34290214 34674689 34382192 33325302
$$ packed form
32328C252081N485809N163716M507392L627284K682378J836951J212882Q60081
32320B8628574P56670Q31414R87519J115176J103392Q67469L84475k92497j056890
$$ [...]
##END NTUPLES=NMR SPECTRUM
##END=
