##TITLE=31Pdec_26-2024
 CDCl3
 64 sc
 2.4.2024
##JCAMPDX= 6.0         $$ Bruker NMR JCAMP-DX V2.0
##DATA TYPE= NMR SPECTRUM
##DATA CLASS= NTUPLES
##ORIGIN= UXNMR, Bruker Analytische Messtechnik GmbH
##OWNER= root
$$ XWIN-NMR		Version 3.5
$$ Tue Apr  2 14:39:53 2024 Russian Standard Time (UT+4h)  she@DPX200
##.OBSERVE FREQUENCY= 81.013821
##.OBSERVE NUCLEUS= ^31P
##.ACQUISITION MODE= SIMULTANEOUS
##.ACQUISITION SCHEME= undefined
##.AVERAGES= 64
##.DIGITISER RES= 16
##SPECTROMETER/DATA SYSTEM= spect
##.PULSE SEQUENCE= zgpg30
##.SOLVENT NAME= D2O
##.SHIFT REFERENCE= (INTERNAL, D2O, 0, 248.564)
##AUDIT TRAIL= $$ (NUMBER, WHEN, WHO, WHERE, WHAT)
$$ ##TITLE= Audit trail, XWIN-NMR		Version 3.5
$$ ##JCAMPDX= 5.01
$$ ##ORIGIN= Bruker BioSpin GmbH
$$ ##OWNER= she
$$ F:/spectra/data/she/nmr/P31/1/pdata/1/auditp.txt
$$ ##AUDIT TRAIL=  $$ (NUMBER, WHEN, WHO, WHERE, WHAT)
(   1,<2024-04-02 14:38:55.17 +0400>,<she>,<DPX200>,
      <continue with go, POWCHK disabled, PULCHK disabled
       configuration hash MD5:
       00 E9 B6 7A A2 85 ED C7 34 08 36 98 17 FE 4E 26
       data hash MD5: 32K
       4A 5C 88 CD FD 3C 1F E6 24 29 81 ED BE EF 1B 87>)
(   2,<2024-04-02 14:38:58.35 +0400>,<she>,<DPX200>,
      <Start of raw data processing
       efp BC_mod = 2 LB = 10 FT_mod = 6 PKNL = 1 PHC0 = -13226.09 PHC1 = 100.8833 SI = 64K 
       data hash MD5: 64K
       C4 BF 47 7F AE 67 9A D4 5C 45 E2 59 7A CA 60 E8>)
(   3,<2024-04-02 14:39:15.84 +0400>,<she>,<DPX200>,
      <pk PHC0 = -8.126884 PHC1 = 25.00001 
       data hash MD5: 64K
       73 60 62 00 28 71 26 C6 CF AD 35 32 9D 4C FE 5C>)
$$ ##END=
$$ 
$$ hash MD5
$$ 18 51 C0 3C 92 94 81 EE 1F 10 8C FB 9E 3D 78 87
##$RELAX= 
##$RELAX= 
##$RELAX= 
##$RELAX= 
##$RELAX= 
##$RELAX= 
##$RELAX= 
##$RELAX= 
##$RELAX= 
$$ Bruker specific parameters
$$ --------------------------
##$DU= <F:/spectra>
##$EXPNO= 1
##$NAME= <P31>
##$PROCNO= 1
##$TYPE= <nmr>
##$USER= <she>
##$AMP= (0..31)
100 100 100 100 100 100 100 100 100 100 100 100 100 100 100 100 100 100 
100 100 100 100 100 100 100 100 100 100 100 100 100 100 
##$AQSEQ= 0
##$AQ_mod= 1
##$AUNM= <au_zg>
##$AUTOPOS= <>
##$BF1= 81.014009
##$BF2= 200.13
##$BF3= 200.13
##$BF4= 200.13
##$BF5= 200.13
##$BF6= 200.13
##$BF7= 200.13
##$BF8= 200.13
##$BYTORDA= 1
##$CFDGTYP= 0
##$CFRGTYP= 5
##$CHEMSTR= <none>
##$CNST= (0..31)
1 1 145 1 1 1 1 1 1 1 1 1 1 1 1 1 1 1 1 1 1 1 1 1 1 1 1 1 1 1 1 1 
##$CPDPRG= <waltz16>
##$CPDPRG1= <>
##$CPDPRG2= <waltz16>
##$CPDPRG3= <>
##$CPDPRG4= <mlev>
##$CPDPRG5= <mlev>
##$CPDPRG6= <mlev>
##$CPDPRG7= <mlev>
##$CPDPRG8= <mlev>
##$CPDPRGB= <>
##$CPDPRGT= <>
##$D= (0..31)
0 1 0 0 0 0 0 0 0 0 0 0.03 2e-05 3e-06 0 0 0 0 0 0 0 0 0 0 0 0 0 0 0 0 
0 0 
##$DATE= 1712054230
##$DBL= (0..7)
120 120 120 11 120 120 24 19 
##$DBP= (0..7)
150 150 150 150 150 150 150 150 
##$DBP07= 0
##$DBPNAM0= <>
##$DBPNAM1= <>
##$DBPNAM2= <>
##$DBPNAM3= <>
##$DBPNAM4= <>
##$DBPNAM5= <>
##$DBPNAM6= <>
##$DBPNAM7= <>
##$DBPOAL= (0..7)
0.5 0.5 0.5 0.5 0.5 0.5 0.5 0.5 
##$DBPOFFS= (0..7)
$$ [...]
##$SUBNAM2= <"">
##$SUBNAM3= <"">
##$SUBNAM4= <"">
##$SUBNAM5= <"">
##$SUBNAM6= <"">
##$SUBNAM7= <"">
##$SUBNAM8= <"">
##$SUBNAM9= <"">
##$SW= 501.771253377433
##$SWIBOX= (0..15)
0 1 3 0 0 0 0 0 0 0 0 0 0 0 0 0 
##$SW_h= 40650.406504065
##$TD= 32768
##$TD0= 1
##$TE= 0
##$TE2= 300
##$TE3= 300
##$TEG= 300
##$TL= (0..7)
0 120 53 12 22 120 120 120 
##$TP= (0..7)
150 150 150 150 150 150 150 150 
##$TP07= 0
##$TPNAME0= <>
##$TPNAME1= <>
##$TPNAME2= <>
##$TPNAME3= <>
##$TPNAME4= <>
##$TPNAME5= <>
##$TPNAME6= <>
##$TPNAME7= <>
##$TPOAL= (0..7)
0.5 0.5 0.5 0.5 0.5 0.5 0.5 0.5 
##$TPOFFS= (0..7)
0 0 0 0 0 0 0 0 
##$TUNHIN= 0
##$TUNHOUT= 0
##$TUNXOUT= 0
##$USERA1= <user>
##$USERA2= <user>
##$USERA3= <user>
##$USERA4= <user>
##$USERA5= <user>
##$V9= 5
##$VALIST= <valist>
##$VCLIST= <CCCCCCCCCCCCCCC>
##$VD= 0
##$VDLIST= <DDDDDDDDDDDDDDD>
##$VPLIST= <PPPPPPPPPPPPPPP>
##$VTLIST= <TTTTTTTTTTTTTTT>
##$WBST= 1024
##$WBSW= 4
##$XGAIN= (0..3)
0 0 0 0 
##$XL= 0
##$YL= 0
##$YMAX_a= 8245
##$YMIN_a= -7524
##$ZGOPTNS= <>
##$ZL1= 120
##$ZL2= 120
##$ZL3= 120
##$ZL4= 120
##$ABSF1= 0
##$ABSF2= 0
##$ABSG= 0
##$ABSL= 0
##$ALPHA= 0
##$AQORDER= 0
##$ASSFAC= 0
##$ASSFACI= 0
##$ASSFACX= 0
##$ASSWID= 0
##$AUNMP= <proc_1d>
##$AZFE= 0.1
##$AZFW= 0.5
##$BCFW= 0
##$BC_mod= 2
##$BYTORDP= 0
##$COROFFS= 0
##$CY= -3
##$DATMOD= 1
##$DC= 0
##$DFILT= <>
##$DTYPP= 0
##$F1P= 0
##$F2P= 0
##$FCOR= 1
##$FTSIZE= 65536
##$FT_mod= 6
##$GAMMA= 0
##$GB= 0
##$INTBC= 1
##$INTSCL= 6.047779e-11
##$ISEN= 30
##$LB= 10
##$LEV0= 0
##$LPBIN= 0
##$MAXI= 10000
##$MC2= 0
##$MEAN= 0
##$ME_mod= 0
##$MI= 50
##$NCOEF= 0
##$NC_proc= -9
##$NLEV= 6
##$NOISF1= 182.463
##$NOISF2= 159.3651
##$NSP= 0
##$NTH_PI= 0
##$NZP= 0
##$OFFSET= 248.5645
##$PC= 4
##$PHC0= -13234.22
##$PHC1= 125.8833
##$PH_mod= 1
##$PKNL= yes
##$PPARMOD= 0
##$PSCAL= 0
##$PSIGN= 0
##$REVERSE= no
##$SF= 81.0140089999694
##$SI= 65536
##$SIGF1= 159.3651
##$SIGF2= -187.1042
##$SINO= 113.3802
##$SIOLD= 16384
##$SREGLST= <1H.CDCl3>
##$SSB= 0
##$STSI= 65536
##$STSR= 0
##$SW_p= 40650.406504065
##$SYMM= 0
##$S_DEV= 0
##$TDeff= 32768
##$TDoff= 0
##$TI= <>
##$TILT= no
##$TM1= 0
##$TM2= 0
##$TOPLEV= 0
##$USERP1= <user>
##$USERP2= <user>
##$USERP3= <user>
##$USERP4= <user>
##$USERP5= <user>
##$WDW= 1
##$XDIM= 65536
##$YMAX_p= 529693858
##$YMIN_p= -41604088
$$ End of Bruker specific parameters
$$ ---------------------------------
##NTUPLES= NMR SPECTRUM
##VAR_NAME=  FREQUENCY,     SPECTRUM/REAL,   SPECTRUM/IMAG
##SYMBOL=    X,             R,               I
##VAR_TYPE=  INDEPENDENT,   DEPENDENT,       DEPENDENT
##VAR_FORM=  AFFN,          ASDF,            ASDF
##VAR_DIM=   65536,         65536,           65536
##UNITS=     HZ,            ARBITRARY UNITS, ARBITRARY UNITS
##FACTOR=    0.620285442955139, 1,           1
##FIRST=     20137.2065510682, 0,            0
##LAST=      -20513.1999529968, 0,           0
##MIN=       -20513.1999529968, -41604088,   0
##MAX=       20137.2065510682, 529693858,    0
$$ Real data points
##PAGE= N=1
##DATA TABLE= (X++(R..R)), XYDATA
$$ [...]
42086f345240P15332O78525O12896N09420L63484J76757m0364k67364m75971o36797
42076d709322p27797p40883o84057n78917m55068l43072k67288k40634k63296
42067i010334l25097m08897m93613n58616n90193n86322n54787n05461m43544
42058a3476864l69130k82018j86512r2078r553N4067R8097J26398J44618J60378
42048a3832597J85128K31947L07361M03439M97971N63510N78930N36935M44900
42039a0082476L19792J80257M0881q8139j98025k80439l30365l48743l40937l12531
42029a1440725k67405k09930j48156r3988n9464n1002o4279q2680q2100m2082
42019a2541811M2371J57182K77897L84575M71204N43113O06949O63446P08407
$$ plain form
42086 -6345240 -5629908 -4951383 -4338487 -3829067 -3465583 -3288826 -3329190 -3596554 -4072525 -4709322
42076 -4709322 -5437119 -6178002 -6862059 -7440976 -7896044 -8239116 -8506404 -8747038 -9010334
42067 -9010334 -9335431 -9744328 -10237941 -10796557 -11386750 -11973072 -12527859 -13033320 -13476864
42058 -13476864 -13845994 -14128012 -14314524 -14406602 -14416155 -14362088 -14263991 -14137593 -13992975 -13832597
42048 -13832597 -13647469 -13415522 -13108161 -12704722 -12206751 -11643241 -11064311 -10527376 -10082476
42039 -10082476 -9762684 -9582427 -9541546 -9629685 -9827710 -10108149 -10438514 -10787257 -11128194 -11440725
42029 -11440725 -11708130 -11918060 -12066216 -12160204 -12219668 -12270670 -12334949 -12417629 -12499729 -12541811
42019 -12541811 -12499440 -12342258 -12064361 -11679786 -11208582 -10665469 -10058520 -9395074 -8686667
42010h686667P38643P55577P62809P60602P42990P00374O25186N16235L80120
42001b704131K30765Q7643k8392j01275j24546j02323m7341K1819Q4923J26969
41991b555889J44794J47666J50155J62674J86626K15887K41296K54232K47590
41982h04969K14690J48506M3925r6582k57928m13499n33594n96335n94302n34128
41972c424216m31483l05465j74195n1704N3041J33618J81781J86398J39177M3375
41962c649673q2679k10987l13982l72756l81389l48916k98665k62214k67299l24527
41952f513087m20405n21532n88373n91384n21063l87778k13828k3611J63355L34676
41942i283030M82983O01682O82455P17059P01742O39610N38893M09694K62651
$$ plain form
42010 -8686667 -7948024 -7192447 -6429638 -5669036 -4926046 -4225672 -3600486 -3084251 -2704131
42001 -2704131 -2473366 -2385723 -2414115 -2515390 -2639936 -2742259 -2789600 -2767781 -2682858 -2555889
41991 -2555889 -2411095 -2263429 -2113274 -1950600 -1763974 -1548087 -1306791 -1052559 -804969
41982 -804969 -590279 -441773 -397848 -494430 -752358 -1165857 -1699451 -2295786 -2890088 -3424216
41972 -3424216 -3855699 -4161164 -4335359 -4387063 -4334022 -4200404 -4018623 -3832225 -3693048 -3649673
41962 -3649673 -3732352 -3943339 -4257321 -4630077 -5011466 -5360382 -5659047 -5921261 -6188560 -6513087
41952 -6513087 -6933492 -7455024 -8043397 -8634781 -9155844 -9543622 -9757450 -9781061 -9617706 -9283030
41942 -9283030 -8800047 -8198365 -7515910 -6798851 -6097109 -5457499 -4918606 -4508912 -4246261
41933d246261J09666l5776j60037k51742l03758l14163k86216k27783j50669o9479
41923e936218J417N3020Q6056J10262J37567J73589K14045K48926K70702K79627
41913d361007K82170K84979K90023K93821K89084K66577K17861J40163M0531o6019
41903b321817j65227k52444l33425m15951m99380n70629o09358n98336n32077
41894f298644m19149k78263j32021j897R5204J50296J65409J53703J34616J25978
41884f304768J37477J68474K10081K49705K76216K83986K74194K53076K28534
41875d223025K07051J91857J81989J72312J55414J25905Q5463M4814J9662K1777
41865c016781N1075R4448J32074J46743J31083R0733M2884R257L944K2066L8224
$$ plain form
41933 -4246261 -4136595 -4172371 -4332408 -4584150 -4887908 -5202071 -5488287 -5716070 -5866739 -5936218
41923 -5936218 -5934801 -5881781 -5795725 -5685463 -5547896 -5374307 -5160262 -4911336 -4640634 -4361007
41913 -4361007 -4078837 -3793858 -3503835 -3210014 -2920930 -2654353 -2436492 -2296329 -2255798 -2321817
41903 -2321817 -2487044 -2739488 -3072913 -3488864 -3988244 -4558873 -5168231 -5766567 -6298644
41894 -6298644 -6717793 -6996056 -7128077 -7129974 -7034770 -6884474 -6719065 -6565362 -6430746 -6304768
41884 -6304768 -6167291 -5998817 -5788736 -5539031 -5262815 -4978829 -4704635 -4451559 -4223025
41875 -4223025 -4015974 -3824117 -3642128 -3469816 -3314402 -3188497 -3103034 -3058220 -3038558 -3016781
41865 -3016781 -2965706 -2871258 -2739184 -2592441 -2461358 -2370625 -2327741 -2318484 -2314540 -2292474 -2254250
41854b254250J8413o1317k01585l79346n58839p06299q00675q36152q17036p49980
41844g347066o39537m89454l06940j05527R5299K72604M03384M68598M57595L71324
41834f819720K22492L2699j71726l63408n17310o14807o47763o19749n42654m31140
41824a0473086k99775j64111m1545N2542J11868J43011J61379J82052K12408K51053
41814i864204K92127L30591L64952L96573M26906M54551M73714M75100M49564
41805f200126L93167L10445K12842J12243J3706q7232k00137l30727m73163o08430
41795f857412p09612p51053p17529o10375m48254k61081p8625Q0269K10843L16170
41785i826659L97063M46188M50189L97478K86720J32130l6595j80441k62224k59142
$$ plain form
41854 -2254250 -2235837 -2297154 -2498739 -2878085 -3436924 -4143223 -4943898 -5780050 -6597086 -7347066
41844 -7347066 -7986603 -8476057 -8782997 -8888524 -8793225 -8520621 -8117237 -7648639 -7191044 -6819720
41834 -6819720 -6597228 -6564529 -6736255 -7099663 -7616973 -8231780 -8879543 -9499292 -10041946 -10473086
41824 -10473086 -10772861 -10936972 -10978517 -10925975 -10814107 -10671096 -10509717 -10327665 -10115257 -9864204
41814 -9864204 -9572077 -9241486 -8876534 -8479961 -8053055 -7598504 -7124790 -6649690 -6200126
41805 -6200126 -5806959 -5496514 -5283672 -5171429 -5157723 -5244955 -5445092 -5775819 -6248982 -6857412
41795 -6857412 -7567024 -8318077 -9035606 -9645981 -10094235 -10355316 -10433941 -10353672 -10142829 -9826659
41785 -9826659 -9429596 -8983408 -8533219 -8135741 -7849021 -7716891 -7753486 -7933927 -8196151 -8455293
41775h455293j71277k1358J54875L23102M61682N64070O33109O73411O87902O79451
41765d470326O53943O20790N90182N69126N58771N54165N45977N23203M75978
41756F21809L98470K92069J67924M6260m9528j02441j09260q0533l3362J7185
41746A168593O2214R7553J20033J25274J08445O7099L755p4310j58845k45461
41736A274350l35164m30607n30171o25422p04403p57809p82664p81179p57078
41727d430147p13082o50741n71020m74002l58120k20421n8649J25369L22328N13938
41717f514547O75673P84362Q27200Q06464P37117O40186N37026M45950L79084
41708f81485L38696L15946K94632K57719J91920Q9246n1382k20729l97312n51506
$$ plain form
41775 -8455293 -8626570 -8647928 -8493053 -8169951 -7708269 -7144199 -6511090 -5837679 -5149777 -4470326
41765 -4470326 -3816383 -3195593 -2605411 -2036285 -1477514 -923349 -377372 145831 621809
41756 621809 1020279 1312348 1480272 1526532 1477004 1374563 1265303 1184770 1151408 1168593
41746 1168593 1230807 1328360 1448393 1573667 1682112 1749211 1752966 1678656 1519811 1274350
41736 1274350 939186 508579 -21592 -647014 -1351417 -2109226 -2891890 -3673069 -4430147
41727 -4430147 -5143229 -5793970 -6364990 -6838992 -7197112 -7417533 -7476182 -7350813 -7028485 -6514547
41717 -6514547 -5838874 -5054512 -4227312 -3420848 -2683731 -2043545 -1506519 -1060569 -681485
41708 -681485 -342789 -26843 267789 525508 717428 806674 755292 534563 137251 -414255
41698d14255o55439o92867o63397n80163m64594l41999k38168j74344j59429j83567
41688d568222k19854k35925k08524j31640j5223J20663K51134L50893L99794L88721
41678c868183L22367K16956R4251k5275j27522k06227k60363k89494k90837k60499
41668d694826j97859j09228p682R0622J70399K19031K27084J90328J13523J2947
41658c985661q5598j53461j68416j23895l4966O3212J26748J20688L4215j15126
41648d322260k90502m52823n76036o52772o89519o97138o83606o51432n98266
41639i614354n19087m09689k70613j09579N9050K17628L50289M47659N08809N39329
41629h800558N47843N44277N39967N46518N72032O17666O77874P43728Q06049
$$ plain form
41698 -414255 -1069694 -1762561 -2425958 -3006121 -3470715 -3812714 -4050882 -4225226 -4384655 -4568222
41688 -4568222 -4788076 -5024001 -5232525 -5364165 -5379388 -5258725 -5007591 -4656698 -4256904 -3868183
41678 -3868183 -3545816 -3328860 -3234609 -3259884 -3387406 -3593633 -3853996 -4143490 -4434327 -4694826
41668 -4694826 -4892685 -5001913 -5009595 -4918973 -4748574 -4529543 -4302459 -4112131 -3998608 -3985661
41658 -3985661 -4071259 -4224720 -4393136 -4517031 -4551997 -4488785 -4362037 -4241349 -4207134 -4322260
41648 -4322260 -4612762 -5065585 -5641621 -6294393 -6983912 -7681050 -8364656 -9016088 -9614354
41639 -9614354 -10133441 -10543130 -10813743 -10923322 -10864272 -10646644 -10296355 -9848696 -9339887 -8800558
41629 -8800558 -8252715 -7708438 -7168471 -6621953 -6049921 -5432255 -4754381 -4010653 -3204604
41620c204604Q56481Q87461Q92527Q67395Q11055P25764O15628M85410L41890
41611C279007J97039O8833k3151o5116n4394l12P8693J60931K29452K78608L13752
41600D463342L42723L64939L66636L26133K26015O5207j35682l39276n04936o04505
41590D570596o32092o03174n44436m80574m24635l75279l20369k44367j36766
41581H08904J152J54025K96240M00617M47691M30886L55647K34579Q3093q1405
41571C131429k37911l62028m31050m32453l70816k68103j55564o0592M016M1431
41561H58359O2559P5804Q2785Q1024O8441M5779J7391q445k0937j0884K4517P9126
41549A355519J38422J82333J90181J47580N3080p8916k20972l40668m11678m24074
$$ plain form
41620 -3204604 -2348123 -1460662 -568135 299260 1110315 1836079 2451707 2937117 3279007
41611 3279007 3476046 3544879 3521728 3456612 3402218 3401906 3480599 3641530 3870982 4149590 4463342
41600 4463342 4806065 5171004 5537640 5863773 6089788 6154995 6019313 5680037 5175101 4570596
41590 4570596 3938504 3335330 2790894 2310320 1885685 1510406 1190037 945670 808904
41581 808904 810056 964081 1260321 1660938 2108629 2539515 2895162 3129741 3212834 3131429
41571 3131429 2893518 2531490 2100440 1667987 1297171 1029068 873504 812912 816928 858359
41561 858359 920918 996722 1079507 1160531 1228972 1274751 1292142 1283697 1262760 1251876 1276393 1355519
41549 1355519 1493941 1676274 1866455 2014035 2067115 1988199 1767227 1426559 1014881 590807
41539E90807l88821l33269k89877k84607l30338m25947n58789p08382q50125r58443
41529d537791j009339r83169q68387o65979l92901q1631K26711M94877P01584
41520g116025Q45220R36699R87584J002848R81841R23186Q27247O94778N25672
41511F09050L21886R3589j37195l40704m90407n73558n94211n67996n14309m51366
41501b645221l94735l56608l44326l58921l94281m36498m64230m52628l81880
41492f229328k46440n8375J57925L75732N73926P39490Q65808R49671R88640R79675
41482i03276R20586Q14978O77924N36700M22697L57541L42142L56279L68903L52309
41472D246783K92434J91583O4601o8429j89577k87587l58194m01450m18985m13366
$$ plain form
41539 590807 201986 -131283 -421160 -705767 -1036105 -1462052 -2020841 -2729223 -3579348 -4537791
41529 -4537791 -5547130 -6530299 -7398686 -8064665 -8457566 -8539197 -8312486 -7817609 -7116025
41520 -7116025 -6270805 -5334106 -4346522 -3343674 -2361833 -1438647 -611400 83378 609050
41511 609050 930936 1024525 887330 546626 56219 -517339 -1111550 -1679546 -2193855 -2645221
41501 -2645221 -3039956 -3396564 -3740890 -4099811 -4494092 -4930590 -5394820 -5847448 -6229328
41492 -6229328 -6475768 -6534143 -6376218 -6000486 -5426560 -4687070 -3821262 -2871591 -1882951 -903276
41482 -903276 17310 832288 1510212 2046912 2469609 2827150 3169292 3525571 3894474 4246783
41472 4246783 4539217 4730800 4795401 4726972 4537395 4249808 3891614 3490164 3071179 2657813
41462B657813l89202l53979l17162k87760k71617k69650k77385k85995k85109
41453h0046k67179k31580j85461j39761j02104p1244l7145J2795Q5250J76017
41443h40458K72376L61097M35898M98756N54854O06539O51718O87380P13960P35888
41433D678008P57404P76851P83837P61463O92654N67522L88517J71244n9042k73498
41423I244960m46013n58676o05758n94834n43359m71475l95028l23063k60221
41414E046533k11047j82550j82847k16255k77978l53695m26210m84333n25914
41405B185704n52858n64586n57473n29971m86640m36322l86233l37266k84026
41396a949671k19212j39151m6742M9565J39194K12600K62961K86697K83067K52965
$$ plain form
41462 2657813 2268611 1914632 1597470 1309710 1038093 768443 491058 205063 -80046
41453 -80046 -347225 -578805 -764266 -904027 -1006131 -1077375 -1114520 -1101725 -1016475 -840458
41443 -840458 -568082 -206985 228913 727669 1282523 1889062 2540780 3228160 3942120 4678008
41433 4678008 5435412 6212263 6996100 7757563 8450217 9017739 9406256 9577500 9518458 9244960
41423 9244960 8798947 8240271 7634513 7039679 6496320 6024845 5629817 5306754 5046533
41414 5046533 4835486 4652936 4470089 4253834 3975856 3622161 3195951 2711618 2185704
41405 2185704 1632846 1068260 510787 -19184 -505824 -942146 -1328379 -1665645 -1949671
41396 -1949671 -2168883 -2308034 -2354776 -2305211 -2166017 -1953417 -1690456 -1403759 -1120692 -867727
41386h67727J97845J19775K2015r1153k15085l44281m70525n81432o61091o92831
41376c584490o63326n67015m09003k04383K5690K58582M73431O53398P87281Q69362
41366b360473Q97329Q70976P93915O76006N31736L73809K07007K8221j66743l74593
41356A477190n80536p61855q96739r72613r88760r52621q73188p56347o05088
41347e910557m24100k24901k6851J47728K81148L65734M04552M08716L93313L73277
41337d211941L59888L58560L67730L78805L78372L54036L02217K32695J65277
41328a314361J19168J01023R9408Q9906M8407l5603j53899k84258m00466m81723
41318b212398n18583n14594m83308m41806m04214l78334l65596l62720l64300
$$ plain form
41386 -867727 -669882 -550107 -528092 -619245 -834330 -1178611 -1649136 -2230568 -2891659 -3584490
41376 -3584490 -4247816 -4814831 -5223834 -5428217 -5402527 -5143945 -4670514 -4017116 -3229835 -2360473
41366 -2360473 -1463144 -592168 201747 877753 1409489 1783298 1990305 2018526 1851783 1477190
41356 1477190 896654 134799 -761940 -1734553 -2723313 -3675934 -4549122 -5305469 -5910557
41347 -5910557 -6334657 -6559558 -6586409 -6438681 -6157533 -5791799 -5387247 -4978531 -4585218 -4211941
41337 -4211941 -3852053 -3493493 -3125763 -2746958 -2368586 -2014550 -1712333 -1479638 -1314361
41328 -1314361 -1195193 -1094170 -994762 -904856 -856449 -892052 -1045951 -1330209 -1730675 -2212398
41318 -2212398 -2730981 -3245575 -3728883 -4170689 -4574903 -4953237 -5318833 -5681553 -6045853
41309f045853l66170l68052l73251l85332m04365m25494m40693m42546m27605
41300i679361l96844l52908k97395k31936j62926j04916p7428r4990j55795k36748
41290a1791247k99804l07674k40128j01210Q5528K88221M76656O27954P29912
41281a0531792P83343Q01416Q03324Q03853Q05211P97108P64776O98051N94668
41272c680042M57923K94608J16862n5864k00948l02648l60145l86233l97872m06604
41262d920963m15313m21324m21767m17764m15934m26269m56296n04178n55685
41253h955493n88171n79941n19736m11708k74014j32006r017Q0984J35485J60372
41243a1093245J65064J59145J51275J49487J62413K00807K77161M00768N69184
$$ plain form
41309 -6045853 -6412023 -6780075 -7153326 -7538658 -7943023 -8368517 -8809210 -9251756 -9679361
41300 -9679361 -10076205 -10429113 -10726508 -10958444 -11121370 -11226286 -11303714 -11398704 -11554499 -11791247
41290 -11791247 -12091051 -12398725 -12638853 -12740063 -12654535 -12366314 -11889658 -11261704 -10531792
41281 -10531792 -9748449 -8947033 -8143709 -7339856 -6534645 -5737537 -4972761 -4274710 -3680042
41272 -3680042 -3222119 -2927511 -2810649 -2866513 -3067461 -3370109 -3730254 -4116487 -4514359 -4920963
41262 -4920963 -5336276 -5757600 -6179367 -6597131 -7013065 -7439334 -7895630 -8399808 -8955493
41253 -8955493 -9543664 -10123605 -10643341 -11055049 -11329063 -11461069 -11470086 -11389102 -11253617 -11093245
41243 -11093245 -10928181 -10769036 -10617761 -10468274 -10305861 -10105054 -9827893 -9427125 -8857941
41234h857941P62255R45152J080240J140061J113159J001340Q14134N66579K81163
41225a153858j0144k68399m56166n49049n44360m61785l35788k04492j00222m3040
41215d127303l6323o5611j03721j22128j03064m5724L5402J17546J78571K05451
41205d066904J99744J77155J60629J70221K14707K88202L72459M43979M83471
41196a556337M83413M49685L96900L41234K95144K65026K50892K47882K50286
41187A424125K56319K69627K95469L34723L80991M22967M49748M55194M38940
41178D728103M03932L52824K86585K06713J18552L2005m0792q8128j00114p0474
41168E829206j22R9545K07066K95833L41323L28124K54810J34407j1192j60696
$$ plain form
41234 -8857941 -8095686 -7150534 -6070294 -4930233 -3817074 -2815734 -2001600 -1435021 -1153858
41225 -1153858 -1164002 -1432401 -1888567 -2437616 -2981976 -3443761 -3779549 -3984041 -4084263 -4127303
41215 -4127303 -4163626 -4229237 -4332958 -4455086 -4558150 -4603874 -4568472 -4450926 -4272355 -4066904
41205 -4066904 -3867160 -3690005 -3529376 -3359155 -3144448 -2856246 -2483787 -2039808 -1556337
41196 -1556337 -1072924 -623239 -226339 114895 410039 675065 925957 1173839 1424125
41187 1424125 1680444 1950071 2245540 2580263 2961254 3384221 3833969 4289163 4728103
41178 4728103 5132035 5484859 5771444 5978157 6096709 6128714 6087922 5999794 5899680 5829206
41168 5829206 5829084 5928629 6135695 6431528 6772851 7100975 7355785 7490192 7479000 7318304
41158G318304l00568m24982n30148o10138o59016o76437o69476o47463o14483
41149B185593n66655m96336l99238k79582j51057l3713N2068R1978Q1019K2233
41139E06310p6734k05783l52443n01873o38852p51679q35684q93666r32229r56122
41129e638755r64306r49880r03360q18138o96816n55115m18580l10955k40876
41120a1496781j96576j52795q5010J8077J50312K92742M22454N19623N70463N68973
41110i388518N20289M43310L67123L20501L20445L66814M44875N32774O09600
41101e462787O60651O78457O61426O13234N43446M66451L97212L46713L20628
41092g74569L20338L43164L81384M22786M53841M63398M44720L96009L20175K23695
$$ plain form
41158 7318304 7017736 6592754 6062606 5452468 4793452 4117015 3447539 2800076 2185593
41149 2185593 1618938 1122602 723364 443782 292725 259012 311080 403058 484077 506310
41139 506310 429576 223793 -128650 -630523 -1269375 -2021054 -2856738 -3750404 -4682633 -5638755
41129 -5638755 -6603061 -7552941 -8456301 -9274439 -9971255 -10526370 -10944950 -11255905 -11496781
41120 -11496781 -11693357 -11846152 -11931162 -11913085 -11762773 -11470031 -11047577 -10527954 -9957491 -9388518
41110 -9388518 -8868229 -8424919 -8057796 -7737295 -7416850 -7050036 -6605161 -6072387 -5462787
41101 -5462787 -4802136 -4123679 -3462253 -2849019 -2305573 -1839122 -1441910 -1095197 -774569
41092 -774569 -454231 -111067 270317 693103 1146944 1610342 2055062 2451071 2771246 2994941
41082B994941J14632Q88j10610k14699l09213l95372m75897n51728o19638o72058
41072b38754o98660o89080o36472n40881m10835k62361j16233N703Q5826J18011
41062c383736J13732J00657J10475J61825K50350L53874M48441N22840N81995
41053g39547O39416P06136P83867Q66132R46149J025521J116367J233572J381903
41044G959516J547984J704024J821413J884940J898485J879718J848431J815407
41036B2359918J775903J708688J581603J364606J047148O50579K26431j59953
41028C0554923m51131o13954o45246n66904m12968k14276J1110K56174N15348
41019B8433076P76873J023372J237545J405595J515284J551881J497439J336043
$$ plain form
41082 2994941 3109573 3110461 2999851 2785152 2475939 2080567 1604670 1052942 433304 -238754
41072 -238754 -937414 -1626494 -2262966 -2803847 -3214682 -3477043 -3593276 -3587573 -3501747 -3383736
41062 -3383736 -3270004 -3169347 -3058872 -2897047 -2646697 -2292823 -1844382 -1321542 -739547
41053 -739547 -100131 606005 1389872 2256004 3202153 4227674 5344041 6577613 7959516
41044 7959516 9507500 11211524 13032937 14917877 16816362 18696080 20544511 22359918
41036 22359918 24135821 25844509 27426112 28790718 29837866 30488445 30714876 30554923
41028 30554923 30103792 29489838 28844592 28277688 27864720 27650444 27661554 27917728 28433076
41019 28433076 29209949 30233321 31470866 32876461 34391745 35943626 37441065 38777108
41011C8777108J063062O92456K55780k08114o66265j098798j496925j856007k169412
41002C3292885k425405k606940k695097k676823k554051k348115k095102j833813
40994A4057539j593061j385345j209229j056871r20623p95561o79450n72751m78428
40985E366220l99756l36948k85918k40456j94760j43477q0694j661R2662J92534
40975C967746K81440L41816L60477L31346K56174J44671J4447j10058k00781k32158
40965E155120j89249p4270R2990K82994M69567O41412Q04941R75712J162908J357277
40955A0679402J532485J660699J731271J757350J764713J771777J776160J755758
40947B4429615J679890J521347J265035R14597M97453O3735l25489o18006p87639
$$ plain form
41011 38777108 39840170 40532626 40788406 40580292 39914027 38815229 37318304 35462297 33292885
41002 33292885 30867480 28260540 25565443 22888620 20334569 17986454 15891352 14057539
40994 14057539 12464478 11079133 9869904 8813033 7892410 7096849 6417399 5844648 5366220
40985 5366220 4966464 4629516 4343598 4103142 3908382 3764905 3684211 3682550 3775212 3967746
40975 3967746 4249186 4591002 4951479 5282825 5538999 5683670 5698117 5588059 5387278 5155120
40965 5155120 4965871 4891601 4984591 5267585 5737152 6378564 7183505 8159217 9322125 10679402
40955 10679402 12211887 13872586 15603857 17361207 19125920 20897697 22673857 24429615
40947 24429615 26109505 27630852 28895887 29810484 30307937 30371672 30046183 29428177 28640538
40938B8640538q38898p97893o97144n63000m09662k39398m7347J71258M14613
40929B5633067O70944R17428J119350J230780J201655R93291N96436M1663o04050
40920C1800564j252708j816040k224786k441731k466025k329022k083684j790418
40912A5396150j503244j260776j084346r80823r45289r62297j008833j060927
40904F589615j100928j120689j119466j098753j056782r85502q73354p14145n16246
40895a996250l04309j11402L3093J13736J34645J18854R9547J05101J46250K13693
40885a447042K86337L42568L67675L56268L11850K44673J67839R2500K4199l7270
40875G09597r3602j41243j67215j52261q0701M9574K24106M17288O01385P53419
$$ plain form
40938 28640538 27801640 27003747 26306603 25743603 25333941 25094543 25047196 25218454 25633067
40929 25633067 26304011 27221439 28340789 29571569 30773224 31766515 32362951 32404614 31800564
40920 31800564 30547856 28731816 26507030 24065299 21599274 19270252 17186568 15396150
40912 15396150 13892906 12632130 11547784 10566961 9621672 8659375 7650542 6589615
40904 6589615 5488687 4367998 3248532 2149779 1092997 107495 -765859 -1480004 -1996250
40895 -1996250 -2300559 -2411961 -2378868 -2265132 -2130487 -2011633 -1912086 -1806985 -1660735 -1447042
40885 -1447042 -1160705 -818137 -450462 -94194 217656 462329 630168 722668 746867 709597
40875 709597 615995 474752 307537 155276 74575 124149 348255 765543 1366928 2120347
40865B120347Q57462R03877Q88183Q11172O80003N08695L16986J27673l6912j59283
40855G018203k31917k61048k65178k66544k79358l02691l23195l25625l03692
40846D458955k64520k25047k03736k12672k53739l19481l96944m72341n34893
40837A575582n78335n99110n92863n53756m79154l75684k59213j46867m8284L5265
40827b022419J03867J52227J70109J48914Q8126k628j05703j99626k64395k87588
40817b219116k69585k24687j76341j48353j56410k03262k78399l61835m30737
40808d468725m65942m55037l92172k78749j26898L9087J89425L01819L70863M06980
40798d879349M27756M49312M81273N24283N69577O02194O07240N75377N04732
$$ plain form
40865 2120347 2977809 3881686 4769869 5581041 6261044 6769739 7086725 7214398 7177486 7018203
40855 7018203 6786286 6525238 6260060 5993516 5714158 5411467 5088272 4762647 4458955
40846 4458955 4194435 3969388 3765652 3552980 3299241 2979760 2582816 2110475 1575582
40837 1575582 997247 398137 -194726 -748482 -1227636 -1603320 -1862533 -2009400 -2057684 -2022419
40827 -2022419 -1918552 -1766325 -1596216 -1447302 -1359176 -1361804 -1467507 -1667133 -1931528 -2219116
40817 -2219116 -2488701 -2713388 -2889729 -3038082 -3194492 -3397754 -3676153 -4037988 -4468725
40808 -4468725 -4934667 -5389704 -5781876 -6060625 -6187523 -6148436 -5959011 -5657192 -5286329 -4879349
40798 -4879349 -4451593 -4002281 -3521008 -2996725 -2427148 -1824954 -1217714 -642337 -137605
40789a37605M00612K75531J49014M4175j9752l5208q969M2579J02443J59880K10604
40778A183304K51622K76694K77241K47539J88331J04989K821j14582k41599l65689
40768A810671m67838n30417n47482n29628m98735m75366m67462m68492m66122
40759b640871m53919m36107m21617m13074m00727l66689k95769j83850l7955J29618
40749e520960L05914M77047O26408P36587P94946P97975P51187O66533N60367
40740A96004M51270L55475K81548K29409J95725J80651J88892K24386K84884L61973
40730B950217M45142N24655N91521O38266O62997O73465O85414P14901P70500
40721H657078Q51071R48988J054816J160654J262003J358418J452697J549055
$$ plain form
40789 -137605 263007 538538 687552 731727 711975 676767 667798 710377 812820 972700 1183304
40778 1183304 1434926 1711620 1988861 2236400 2424731 2529720 2532541 2417959 2176360 1810671
40768 1810671 1342833 812416 264934 -264694 -763429 -1238795 -1706257 -2174749 -2640871
40759 -2640871 -3094790 -3530897 -3952514 -4365588 -4766315 -5133004 -5428773 -5612623 -5650578 -5520960
40749 -5520960 -5215046 -4737999 -4111591 -3375004 -2580058 -1782083 -1030896 -364363 196004
40740 196004 647274 1002749 1284297 1513706 1709431 1890082 2078974 2303360 2588244 2950217
40730 2950217 3395359 3920014 4511535 5149801 5812798 6486263 7171677 7886578 8657078
40721 8657078 9508149 10457137 11511953 12672607 13934610 15293028 16745725 18294780
40713A8294780J652177J767938J904253K069967K271999K513263K792917L108165
40705C6375459L455918L834128M243866M692061N192744N764158O421630P169702
40697G7149666P998762Q889139R820561J0781014J1769596J2791557J3846018
40690A53046313J4907782J5907214J6716230J7148393J6975035J5955613J3884892
40683B64541472J0661511O366081J309173l997552q958234j3052388j5962523
40676B40907540j7617915j8154779j7831669j6942898j5754182j4466150j3203079
40669A26936868j2021556j0931300r918707q965796q061994p208862o418056n703714
40661E7706883n073701m525401m048288l630125l261950k939348k660437k422371
$$ plain form
40713 18294780 19946957 21714895 23619148 25689115 27961114 30474377 33267294 36375459
40705 36375459 39831377 43665505 47909371 52601432 57794176 63558334 69979964 77149666
40697 77149666 85148428 94037567 103858128 114639142 126408738 139200295 153046313
40690 153046313 167954095 183861309 200577539 217725932 234700967 250656580 264541472
40683 264541472 275202983 281569064 282878237 278880685 269922451 256870063 240907540
40676 240907540 223289625 205134846 187303177 170360279 154606097 140139947 126936868
40669 126936868 114915312 103984012 94065305 85099509 77037515 69828653 63410597 57706883
40661 57706883 52633182 48107781 44059493 40429368 37167418 34228070 31567633 29145262
40653B9145262k218647k039042j871925j706649j534515j349073j147309r31515
40645A6346587p10798n01619l26546k09308j65580j93321k69390l56072m14812
40636A3199141m20391l69397k79505j79592r4631l3390J3147O0659J15322J65215
40626A2176578J86714J60872Q6174k2181j43739k63511l73380m65661n27216n41169
40616A0273481m96169l96679k65766j36239l4318L3345P9832J25151J80051K38120
40606I600809K80217K86122K44979J59884M6911o9541j63745k16305k19662j79316
40596I770353j10717l3766L2876P5833Q8668P1573K9749k9655j01896j87494k89947
40585I315577m08589n32946o44882p27896p76187p96545q02001q02073p96189
$$ plain form
40653 29145262 26926615 24887573 23015648 21308999 19774484 18425411 17278102 16346587
40645 16346587 15635789 15134170 14807624 14598316 14432736 14239415 13970025 13613953 13199141
40636 13199141 12778750 12409353 12129848 11950256 11855625 11822235 11835382 11896041 12011363 12176578
40626 12176578 12363292 12524164 12610338 12588157 12444418 12180907 11807527 11341866 10814650 10273481
40616 10273481 9777312 9380633 9114867 8978628 8944310 8977655 9057487 9182638 9362689 9600809
40606 9600809 9881026 10167148 10412127 10572011 10618922 10549381 10385636 10169331 9949669 9770353
40596 9770353 9659636 9625870 9658746 9734579 9823247 9894820 9924569 9894914 9793018 9605524 9315577
40585 9315577 8906988 8374042 7729160 7001264 6225077 5428532 4626531 3824458 3028269
40576C028269p74345p23623o35115n06918l43660j55398M3230K35019M03512N36084
40566A107055O26223O75762O96123P05995P24805P65138Q27502Q98506R53207
40557G980316R63319R09781P92447O29483M47463K70767J17270l83p2630r2578
40547A1945255n7228L0226J57990L05695M48855N66007O44108O79791O77854O48666
40537A6047219O04448N54966N05848M62142M34317M40104M98673O20563Q00067
40528B0968347J014881J233922J430496J594653J737591J885271K065938K299399
40520C4230498K592439K939343L325711L735210M158147M597428N067110N584213
40512F6230099O160855O804057P522983Q335501R266326J0337958J1562653J2940740
$$ plain form
40576 3028269 2253924 1530301 895186 388268 44608 -110790 -67560 167459 570971 1107055
40566 1107055 1733278 2409040 3105163 3811158 4535963 5301101 6128603 7027109 7980316
40557 7980316 8943635 9853416 10645863 11275346 11722809 11993576 12110846 12110463 12037833 11945255
40547 11945255 11888027 11918253 12076243 12381938 12830793 13396800 14040908 14720699 15398553 16047219
40537 16047219 16651667 17206633 17712481 18174623 18608940 19049044 19547717 20168280 20968347
40528 20968347 21983228 23217150 24647646 26242299 27979890 29865161 31931099 34230498
40520 34230498 36822937 39762280 43087991 46823201 50981348 55578776 60645886 66230099
40512 66230099 72390954 79195011 86717994 95053495 104319821 114657779 126220432 139161172
40504A39161172J4461671J6100750J7808931J9498800K1030707K2202461K2747792
40497B73012284K2352253K0697341J7541077J2828424O794001q066o799031j2779802
40489C33638481j7353169k0255814k1552600k1529753k0562746j9015072j7183510
40482A96185817j5280913j3442891j1746424j0230710q914885p811553o934636
40475A21823805o297660n901269n717410n683033n711109n714768n631964n438707
40467G5727885n146793m790268m409252m038282l700935l408092l157566k935779
40459D4140918k722664k497734k243889j948654j605861j218980q02941l81132
40451C0719063K1044L81981O87867R36951J143933J339505J560283J832448K160083
$$ plain form
40504 139161172 153622843 169723593 187532524 207031324 228062031 250264492 273012284
40497 273012284 295364537 316061878 333602955 346431379 353225380 353217314 346418283 333638481
40489 333638481 316285312 296029498 274476898 252947145 232384399 213369327 196185817
40482 196185817 180904904 167462013 155715589 145484879 136569994 128758441 121823805
40475 121823805 115526145 109624876 103907466 98224433 92513324 86798556 81166592 75727885
40467 75727885 70581092 65790824 61381572 57343290 53642355 50234263 47076697 44140918
40459 44140918 41418254 38920520 36676631 34727977 33122116 31903136 31100195 30719063
40451 30719063 30740107 31122088 31809955 32746906 33890839 35230344 36790627 38623075 40783158
40442D0783158K527473K914018L310483L725725M181798M703491N309130O005193
40434G3460469O783657P620648Q475922R293040R999720J0507368J0709439J0481993
40426A47332256R694751Q240961O084274L304932J18251l153849o155330q585641
40418A56880605j0269536j1180678j1416208j1141335j0530949r729094q834567
40411H3778238p908548o992183o120828n327631m638147m063336l597748l224823
40403D1904994k925703k685177k491061k329901k185644k044029j898050j748547
40395B3596882j599597j453409j308202j159109j000946q32045o57235m87271
40387A5099068l34553k08543j14351n4214k8687l5195o5079j03155j33106j46881
$$ plain form
40442 40783158 43310631 46224649 49535132 53260857 57442655 62146146 67455276 73460469
40434 73460469 80244126 87864774 96340696 105633736 115633456 126140824 136850263 147332256
40426 147332256 157027007 165267968 171352242 174657174 174775425 171621576 165466246 156880605
40418 156880605 146611069 135430391 124014183 112872848 102341899 92612805 83778238
40411 83778238 75869690 68877507 62756679 57429048 52790901 48727565 45129817 41904994
40403 41904994 38979291 36294114 33803053 31473152 29287508 27243479 25345429 23596882
40395 23596882 21997285 20543876 19235674 18076565 17075619 16243574 15586339 15099068
40387 15099068 14764515 14555972 14441621 14387407 14358720 14323525 14258446 14155291 14022185 13875304
40377A3875304j50738j61251j92755k45994l07367l59175l92371m12183m33328
40368A1220142m69519n25006n92698o57886p04078p18838o98738o51309n91725
40359E610345n35326m90931m59172m35286m12822l85834l49821l02502k44587
40350A994064j79773j13206m8869J1980O9897J25153J77681K29785K87928L59890
40340B914530M48478N47543O44556P27868P92094Q36775Q60322Q56526Q18481
40331I447173P46206O49256N41349M33421L32724K46837J85095J54061J52243
40322A2888365J70021J94086K11038K07869J71945R3710k8277j83214l48420m95720
40312A2881403o01824o57150o67496o47559o11269n65302n08604m36320l44605
$$ plain form
40377 13875304 13724566 13563315 13370560 13124566 12817199 12458024 12065653 11653470 11220142
40368 11220142 10750623 10225617 9632919 8975033 8270955 7552117 6853379 6202070 5610345
40359 5610345 5075019 4584088 4124916 3689630 3276808 2890974 2541153 2238651 1994064
40350 1994064 1814291 1701085 1652216 1664196 1734093 1859246 2036927 2266712 2554640 2914530
40340 2914530 3363008 3910551 4555107 5282975 6075069 6911844 7772166 8628692 9447173
40331 9447173 10193379 10842635 11383984 11817405 12150129 12396966 12582061 12736122 12888365
40322 12888365 13058386 13252472 13463510 13671379 13843324 13937034 13908757 13725543 13377123 12881403
40312 12881403 12279579 11622429 10954933 10307374 9696105 9130803 8622199 8185879 7841274
40303G841274k33683j07891K6516J63242K95268M12766N03629N58552N76846N66711
40293A0603230N38630M97974M44165L77000L03470K37907J94739J79750J86987
40284A3563852K03954K21520K42057K80982L61245N03610P16754R91769J305067
40275A8390810J629366J945528K245149K520988K754301K912192K959202K873977
40267C8231513K657811K329808J914962J436007R14761L79298j32139n76474r17838
40258D6237709j138099j239652j240771j168072j050431r16154p92403p04019
40250C7988108o69353o94469p70230q75043r81323j062090j096596j075284j002289
40241B9761431q93119p68584o49130n51734m87901m61768m69791n03046n50587
$$ plain form
40303 7841274 7607591 7499700 7526216 7689458 7984726 8397492 8901121 9459673 10036519 10603230
40293 10603230 11141860 11639834 12083999 12460999 12764469 13002376 13197115 13376865 13563852
40284 13563852 13767806 13989326 14231383 14512365 14873610 15377220 16093974 17085743 18390810
40275 18390810 20020176 21965704 24210853 26731841 29486142 32398334 35357536 38231513
40267 38231513 40889324 43219132 45134094 46570101 47484862 47864160 47732021 47155547 46237709
40258 46237709 45099610 43859958 42619187 41451115 40400684 39484530 38692127 37988108
40250 37988108 37318755 36624286 35854056 34979013 33997690 32935600 31839004 30763720 29761431
40241 29761431 28868312 28099728 27450598 26898864 26410963 25949195 25479404 24976358 24425771
40232B4425771o01923o48675o85429p08397p12354o90333o39698n70527n06843
40223A8661592m75924m91964n46418o12532o60886o74968o57178o23645n94086
40214A3323991n83562n98445o35465o83320p27364p56060p65636p60268p48135
40205G065736p35437p20733o92150o29965n14594l36347j01983J64810M28445
40196C927782O50002P97094Q52443Q17792P10835N56583L78654J95643K2739j26029
40186H783538k38981l10847l45946l57446l62381l74448l98046m27165m49691
40177E518587m53660m30896l76759k88470j64901q772J70024L53062N17190O42932
40167E478337P21481P53944P44099O92984O01205M75226L29548J82225M8560o1828
$$ plain form
40232 24425771 23823848 23175173 22489744 21781347 21068993 20378660 19738962 19168435 18661592
40223 18661592 18185668 17693704 17147286 16534754 15873868 15198900 14541722 13918077 13323991
40214 13323991 12740429 12141984 11506519 10823199 10095835 9339775 8574139 7813871 7065736
40205 7065736 6330299 5609566 4917416 4287451 3772857 3436510 3334527 3499337 3927782
40196 3927782 4577784 5374878 6227321 7045113 7755948 8312531 8691185 8886828 8909567 8783538
40186 8783538 8544557 8233710 7887764 7530318 7167937 6793489 6395443 5968278 5518587
40177 5518587 5064927 4634031 4257272 3968802 3803901 3795129 3965153 4318215 4835405 5478337
40167 5478337 6199818 6953762 7697861 8390845 8992050 9467276 9796824 9979049 10027609 9965781
40157I965781j44863k01602k37793k61339k77939k88716k92760k92255k94845
40148G673669l10676l46618m01967m67549n27225n60314n44891m63325l10417
40139C740687j00790J30878L40359M90451N63439N63045N08228M25263L41552
40130G003112K80725K58283K78313L32600M03563M71520N23493N58029N83255
40121A0692893O11330O54036P20252Q13649R31580J067585J216645J379043J560554
40112A9647567J769886K014284K293715K596769K902593L188623L438392L644964
40104D1496793L811152L949741M083559M242892M459832M762635N173998N713944
40096G7694546O402858P258536Q287100R476289J0799435J2228477J3746385J5351909
$$ plain form
40157 9965781 9820918 9619316 9381523 9120184 8842245 8553529 8260769 7968514 7673669
40148 7673669 7362993 7016375 6614408 6146859 5619634 5059320 4514429 4051104 3740687
40139 3740687 3639897 3770775 4111134 4601585 5165024 5728069 6236297 6661560 7003112
40130 7003112 7283837 7542120 7820433 8153033 8556596 9028116 9551609 10109638 10692893
40121 10692893 11304223 11958259 12678511 13492160 14423740 15491325 16707970 18087013 19647567
40112 19647567 21417453 23431737 25725452 28322221 31224814 34413437 37851829 41496793
40104 41496793 45307945 49257686 53341245 57584137 62043969 66806604 71980602 77694546
40096 77694546 84097404 91355940 99643040 109119329 119918764 132147241 145893626 161245535
40088A61245535J7055879J8869847K0787967K2766966K4711222K6464291K7802083
40081C19703790K8426002K7964901K6005399K2176420J6300819Q575141l30104
40074D48822368r364259j7392390k3550446k7465050k9245742k9312224k8188847
40067B84303410k6357496k4187998k1927342j9722850j7655150j5763258j4058472
40060A44630844j2534065j1174370r960630q872816p891297p000230o189486n452453
40052G5555497m781945m168431l602535l080410k607879k199054j869313j627937
40044E1617993j475823j407202j410256j465019j543126j613647j653230j653814
40036C9395876j622014j570295j506713j431728j343936j247609j153299j070842
$$ plain form
40088 161245535 178301414 197171261 217959228 240726194 265437416 291901707 319703790
40081 319703790 348129792 376094693 402100092 424276512 440577331 449152472 448822368
40074 448822368 439458109 422065719 398515273 371050223 341804481 312492257 284303410
40067 284303410 257945914 233757916 211830574 192107724 174452574 158689316 144630844
40060 144630844 132096779 120922409 110961779 102088963 94197666 87197436 81007950 75555497
40052 75555497 70773552 66605121 63002586 59922176 57314297 55115243 53245930 51617993
40044 51617993 50142170 48734968 47324712 45859693 44316567 42702920 41049690 39395876
40036 39395876 37773862 36203567 34696854 33265126 31921190 30673581 29520282 28449440
40028B8449440j002092r39464q69354p76518o48326m80128k80313p0523J21434
40019B3504156K72117L69100M09897L96734L33555K27562R1789n5652j95903l14288
40009B5039067m03039m60761m89015m88018m55223l89355k97593j99104j19509
40000B1737450p8104p6831r9781j23661j30279j11351o4550J1606J17684K49566
39990B1431749L96850N45822O84066Q03124Q98597R69335J017285J048364J073392
39981B8868584J107007J163494J251006J367589J502049J640129J773669J907680
39973D0581207K060210K253971K505043K816260L178854L579933M011072M474684
39965F5461234M986141N570314O253562P056062P990533R068398J0307041J1729755
$$ plain form
40028 28449440 27447348 26507884 25638530 24862012 24213686 23733558 23453245 23382722 23504156
40019 23504156 23776273 24145373 24555270 24952004 25285559 25513121 25604910 25549258 25353355 25039067
40009 25039067 24636028 24175267 23686252 23198234 22743011 22353656 22056063 21856959 21737450
40000 21737450 21659346 21582515 21482734 21359073 21228794 21117443 21052893 21064499 21182183 21431749
39990 21431749 21828599 22374421 23058487 23861611 24760208 25729543 26746828 27795192 28868584
39981 28868584 29975591 31139085 32390091 33757680 35259729 36899858 38673527 40581207
39973 40581207 42641417 44895388 47400431 50216691 53395545 56975478 60986550 65461234
39965 65461234 70447375 76017689 82271251 89327313 97317846 106386244 116693285 128423040
39957A28423040J3356100J5189262J7209081J9373139K1620455K3870884K6017937
39950B65059898K7917031K9371671L0120174K9831744K8132072K4682583J9315794
39943D54430967J2182058L822752m902191j3028535j9750947k4611375k7539785
39936C80602944k8762744k8655050k7610536k5969409k3997346k1891341j9790474
39929B03926044j7784365j5921813j4222192j2687801j1313684j0093008r017800
39922A12885381q076815p254063o530793n889769n317904m805785m346696l937485
39914F6726071l579770l278548l037698k854889k718751k610123k507235k392221
39906D3746836k255002k092813j907482j703813j489716j276318j076616r03229
$$ plain form
39957 128423040 141779140 156968402 174177483 193550622 215171077 239041961 265059898
39950 265059898 292976929 322348600 352468774 382300518 410432590 435115173 454430967
39943 454430967 466613025 470435777 465533586 452505051 432754104 408142729 380602944
39936 380602944 351840200 323185150 295574614 269605205 245607859 223716518 203926044
39929 203926044 186141679 170219866 155997674 143309873 131996189 121903181 112885381
39922 112885381 104808566 97554503 91023710 85133941 79816037 75010252 70663556 66726071
39914 66726071 63146301 59867753 56830055 53975166 51256415 48646292 46139057 43746836
39906 43746836 41491834 39399021 37491539 35787726 34298010 33021692 31945076 31041847
39898C1041847p66310o71994o21054o07760o20029o42497o62512o75924o88403
39889B5085364p10798p51409q09489q72916r21260r33757q98871q20013p14071
39880A7652780o04798n15640m64580m60743n02937n81269o81616p90328q96588
39871A2154281r92112j069534j121218j140028j122328j071026r95477r07631
39863C734927q17487p30983o50595n76984n10952m55677m17494m03025m13436
39854a241706m40285m67190m76922m59327m15097l53415k85272k17032j48847
39845d505093p9204j1755M1460O3570M0954k9010j34234k49185l40553l76264
39835e579314l35618k16870l8671J65658L58616N09491O02121O37503O30778O03578
$$ plain form
39898 31041847 30275537 29603543 28982489 28374729 27754700 27112203 26449691 25773767 25085364
39889 25085364 24374566 23623157 22813668 21940752 21019492 20085735 19186864 18366851 17652780
39880 17652780 17047982 16532342 16067762 15607019 15104082 14522813 13841197 13050869 12154281
39871 12154281 11162169 10092635 8971417 7831389 6709061 5638035 4642558 3734927
39863 3734927 2917440 2186457 1535862 958878 447926 -7751 -425245 -828270 -1241706
39854 -1241706 -1681991 -2149181 -2626103 -3085430 -3500527 -3853942 -4139214 -4356246 -4505093
39845 -4505093 -4584297 -4596052 -4554592 -4491022 -4450068 -4479078 -4613312 -4862497 -5203050 -5579314
39835 -5579314 -5914932 -6131802 -6170473 -6004815 -5646199 -5136708 -4534587 -3897084 -3266306 -2662728
39825b662728N74788N54417N43956N41793N47973N63634N86353O07303O14274
39816B471763N98196N56942M93013M08240L01593J72333K4539j32590k89438m40612
39806D163979n84394p17553q31095r11496r46307r29133q60659p46829n97389
39797b960876m25400k45631p0627R3215K45966L90231N26162O49379P53270Q33957
39787b10354Q94119R42088R86386J030780J075177J121149J174604J240845J316264
39778I571058J385138J424391J411915J333395J186517R82535P43718M96067K60652
39769A8795386M8601j38265l02927m47545n68954o57293o99133o84081o11183
39760A4734606m91142l42451j82921k1677J42019L10813M77758O21711P15581
$$ plain form
39825 -2662728 -2087940 -1533523 -989567 -447774 100199 663833 1250186 1857489 2471763
39816 2471763 3069959 3626901 4119914 4528154 4829747 5002080 5026619 4894029 4604591 4163979
39806 4163979 3579585 2862032 2030937 1119441 173134 -755999 -1616658 -2363487 -2960876
39797 -2960876 -3386276 -3631907 -3702534 -3609319 -3363353 -2973122 -2446960 -1797581 -1044311 -210354
39787 -210354 683765 1625853 2612239 3643019 4718196 5839345 7013949 8254794 9571058
39778 9571058 10956196 12380587 13792502 15125897 16312414 17294949 18038667 18534734 18795386
39769 18795386 18843987 18705722 18402795 17955250 17386296 16729003 16029870 15345789 14734606
39760 14734606 14243464 13901013 13718092 13696415 13838434 14149247 14627005 15248716 15964297
39751A5964297P42396P07228O36557N66580N28494N37871N90765O66440P35952
39742B1676580P74166P69976P29548O71710O20006N96658O19445O98171Q28122
39733B7984382R83465J117933J178047J125118R53530O93102L93906J04296j43595
39724C4390184l34711m63126n24881n17439m44690l22389j79126n1148K6925L1056
39714C1610655m7387k01500m11062o45379q67544j041755j142533j161752j109935
39705B4981808j011830q98631p99349p33460p07274p15617p47148p89127q28907
39696A7750465q53482q50543q11944p36702o30091m98960l46685j70865L6031
39687A2887224K84045N80887R24875J299055J672222K008881K282776K484864
$$ plain form
39751 15964297 16706693 17413921 18050478 18617058 19145552 19683423 20274188 20940628 21676580
39742 21676580 22450746 23220722 23950270 24621980 25241986 25838644 26458089 27156260 27984382
39733 27984382 28967847 30085780 31263827 32388945 33342475 34035577 34429483 34533779 34390184
39724 34390184 34055473 33592347 33067466 32550027 32105337 31782948 31603822 31552674 31579599 31610655
39714 31610655 31563268 31361768 30950706 30305327 29437783 28396028 27253495 26091743 24981808
39705 24981808 23969978 23071347 22271998 21538538 20831264 20115647 19368499 18579372 17750465
39696 17750465 16896983 16046440 15234496 14497794 13867703 13368743 13022058 12851193 12887224
39687 12887224 13171269 13752156 14677031 15976086 17648308 19657189 21939965 24424829
39679B4424829K620189K695505K705697K629336K439665K126674J715415J266012
39671D2623322Q54180N45323L77479L58780M74908O99361J002057J355221J736526
39662E0027157K129218K518575K885272L199046L417047L489055L368454L026498
39654G4060322K466618J732804R05184Q1146o50055j227116j623988j846078j920764
39645G1978073j886896j786266j659050j542868j472423j476195j569667j748861
39637E8835847j989356k252778k497196k685504k789143k789622k680995k472794
39629C8678459k190245j870034j552606j273008j052578q94743p87341p09911
39621B8347993o41000n62044m58985l24306j59284K6646K20768M13347O00537
$$ plain form
39679 24424829 27045018 29740523 32446220 35075556 37515221 39641895 41357310 42623322
39671 42623322 43477502 44022825 44400304 44759084 45233992 45933353 46935410 48290631 50027157
39662 50027157 52156375 54674950 57560222 60759268 64176315 67665370 71033824 74060322
39654 74060322 76526940 78259744 79164928 79246074 78596019 77368903 75744915 73898837 71978073
39645 71978073 70091177 68304911 66645861 65102993 63630570 62154375 60584708 58835847
39637 58835847 56846491 54593713 52096517 49411013 46621870 43832248 41151253 38678459
39629 38678459 36488214 34618180 33065574 31792566 30739988 29845245 29057904 28347993
39621 28347993 27706993 27144949 26685964 26361658 26202374 26229020 26449788 26863135 27463672
39612B7463672P82056R56285J117131J254345J355872J410460J410701J356876
39604C7107398J259431J137138J011146Q98921Q11707P54811P27795P23904P31675
39595D5163926P40945P50936P74613Q35620R59747J166404J464071J850077K313591
39586E6019930K840759L420490M048400M727812N469058O288383P204791Q232942
39578I8252565R374998J0618766J1946645J3351003J4845439J6463712J8246540
39571A93099668K0223118K2394506K4721139K7111770K9410711L1384052L2711519
39564C81056483L2996527L1810263K8780236K3713659J6717544Q258686q82303
39557E22451095r766624j7513504k3495486k7440950k9419407k9740139k8823130
$$ plain form
39612 27463672 28245728 29202013 30319144 31573489 32929361 34339821 35750522 37107398
39604 37107398 38366829 39503967 40515113 41414034 42225741 42980552 43708347 44432251 45163926
39595 45163926 45904871 46655807 47430420 48266040 49225787 50392191 51856262 53706339 56019930
39586 56019930 58860689 62281179 66329579 71057391 76526449 82814832 90019623 98252565
39578 98252565 107627563 118246329 130192974 143543977 158389416 174853128 193099668
39571 193099668 213322786 235717292 260438431 287550201 316960912 348344964 381056483
39564 381056483 414053010 445863273 474643509 498357168 515074712 523333398 522451095
39557 522451095 512684471 495170967 471675481 444234531 414815124 385074985 356251855
39550C56251855k7091689k4906881k2540328k0173671j7913655j5813861j3896728
39543B13915042j2171852j0647446r332235q228329p321017o573862n933924n345515
39535A48360862m766073m176540l581224k997436k440491j911837j395945q66822
39527A26224494k99935L17693R84452J687675K409431L132045L844009M545677
39519A42845541N251099N983893O771206P641489Q626436R761840J1083122J2616659
39511B10581285J4371091J6332241J8463073K0707060K2989958K5213652K7238282
39504C55896642K8855550K9765731K9581090K7880244K4321454J8788720J1511672
39497E26601103L092755n594404j3613120k0198508k4920411k7714557k8795684
$$ plain form
39550 356251855 329160166 304253285 281712957 261539286 243625631 227811770 213915042
39543 213915042 201743190 191095744 181763509 173535180 166214163 159640301 153706377 148360862
39535 148360862 143594789 139418249 135837025 132839589 130399098 128487261 127091316 126224494
39527 126224494 125924559 126242252 127226704 128914379 131323810 134455855 138299864 142845541
39519 142845541 148096640 154080533 160851739 168493228 177119664 186881504 197964626 210581285
39511 210581285 224952376 241284617 259747690 280454750 303444708 328658360 355896642
39504 355896642 384752192 414517923 444099013 471979257 496300711 515089431 526601103
39497 526601103 529693858 524099454 510486334 490287826 465367415 437652858 408857174
39490D08857174k8521832k7279583k5419483k3232291k0945816j8729809j6703747
39483B48024613j4943704j3485564j2325322j1420911j0700672j0079913r481077
39476A65587450q849366q158856p410005o622222n824129n043917m303647l619223
39468A15756085l002864k463849k008332j642365j378136j237376j246453j423882
39460A01352828j766190k239003k778685l305979l746625m049040m190888m174036
39452G5102382m014212l732833l355011k912495k445848k000429j615895j315558
39444E3710101j102916r67335q94246q73135q99340r70250j079299j211249j341237
39435D4371094j439108j479082j450693j363559j241443j109706r85795q78121
$$ plain form
39490 408857174 380335342 353055759 327636276 304403985 283458169 264728360 248024613
39483 248024613 233080909 219595345 207270023 195849112 185148440 175068527 165587450
39476 165587450 156738084 148579228 141169223 134547001 128722872 123678955 119375308 115756085
39468 115756085 112753221 110289372 108281040 106638675 105260539 104023163 102776710 101352828
39460 101352828 99586638 97347635 94568950 91262971 87516346 83467306 79276418 75102382
39452 75102382 71088170 67355337 64000326 61087831 58641983 56641554 55025659 53710101
39444 53710101 52607185 51639850 50745604 49872469 48973129 48002879 46923580 45712331 44371094
39435 44371094 42931986 41452904 40002211 38638652 37397209 36287503 35301708 34423587
39427C4423587p90186p23950o80230o57730o52352o58080o69973o87292p12276
39418B8191518p43348p68843p69181p27853o42827n30264m19111l40704l18092
39409B2931295l58629m51658n71225o82504p51345p55831o95313n90276m71143
39400A7603371l62737k74509k01171j30638n3218L2076J15496J78804K00825J64707
39390A7273006O4688q9974k75656m59889o10278p04540p38322p26620o95872o69487
39380A2367056o55310o43088o12526n45312m33752k82939j07281P5789K51442
39371I414079M09818N45761O58915P55319Q47336R48449J064804J190281J309382
39362A7144144J404899J463489J476185J436929J342985J196695J005297P78117
$$ plain form
39427 34423587 33633401 32909451 32229221 31571491 30919139 30261059 29591086 28903794 28191518
39418 28191518 27448170 26679327 25910146 25182293 24539466 24009202 23590091 23249387 22931295
39409 22931295 22572666 22121008 21549783 20867279 20115934 19360103 18664790 18074514 17603371
39400 17603371 17240634 16966125 16764954 16634316 16581098 16613174 16728670 16907474 17108299 17273006
39390 17273006 17337694 17247720 16972064 16512175 15901897 15197357 14459035 13732415 13036543 12367056
39380 12367056 11711746 11068658 10456132 9910820 9477068 9194129 9086848 9162637 9414079
39371 9414079 9823897 10369658 11028573 11783892 12631228 13579677 14644481 15834762 17144144
39362 17144144 18549043 20012532 21488717 22925646 24268631 25465326 26470623 27248740
39354B7248740N24115K51996k8294l05002n64965p93620r74853j092360j133045
39345B3132712j090779r68824p80470n47930k99344o4573J28802K58653L11528
39336B0079775K86122J94310N6516j07598k86602m76479o72246q60730j022592
39327A7190476j142541j218097j258947j278480j285557j281989j264731j229232
39319G230902j171713j089960r82745q49453o91967n18162l42637j81312m2527
39310A360426P8192J94736L19960M54792N84203O83246P29571P13628O39839N20323
39300F278916L68712J98812K5818j34589k69754l73017m44021m87360n10999n24433
39290D128085n36058n50435n66936n80578n84714n74317n48124n08041m55628
$$ plain form
39354 27248740 27772855 28024851 27996557 27691555 27126590 26332970 25358117 24265757 23132712
39345 23132712 22041933 21073109 20292639 19744709 19445365 19380792 19509594 19768247 20079775
39336 20079775 20365897 20560207 20616723 20509125 20222523 19746044 19073798 18213068 17190476
39327 17190476 16047935 14829838 13570891 12292411 11006854 9724865 8460134 7230902
39319 7230902 6059189 4969229 3986484 3137031 2445064 1926902 1584265 1402953 1360426
39310 1360426 1438618 1633354 1953314 2408106 2992309 3675555 4405126 5118754 5758593 6278916
39300 6278916 6647628 6846440 6872258 6737669 6467915 6094898 5650877 5163517 4652518 4128085
39290 4128085 3592027 3041592 2474656 1894078 1309364 735047 186923 -321118 -776746
39281g76746l87819k95670j68572k289J94756M02031N94033P48538Q50862Q94091
39271B053215Q79036Q15736P24173O30561N58850N21365N14035N19687N18227
39262G734885M97658M58915M11933L66760L26469K85905K35935J70352R1945J4403
39252A0595160m1840n8120k5525N1877J59251K76454L84480M70925N32395N72757
39242A2917814N98749O16398O30216O43976O60745O81337P02277P15087P08308
39233A8874907O72394O05103N13515M10662L09554K19718J48419J03628R4107
39224B1952007J25726J97319L00187M22168N53652O91714Q40059J005147J191317
39215B7279296J398234J622382J861291K117112K396841K709390L061781L455893
$$ plain form
39281 -776746 -1164565 -1460235 -1628807 -1631096 -1436340 -1034309 -440276 308262 1159124 2053215
39271 2053215 2932251 3747987 4472160 5102721 5661571 6182936 6696971 7216658 7734885
39262 7734885 8232543 8691458 9103391 9470151 9796620 10082525 10318460 10488812 10580757 10595160
39252 10595160 10553320 10495200 10469675 10521552 10680803 10957257 11341737 11812662 12345057 12917814
39242 12917814 13516563 14132961 14763177 15407153 16067898 16749235 17451512 18166599 18874907
39233 18874907 19547301 20152404 20665919 21076581 21386135 21605853 21754272 21857900 21952007
39224 21952007 22077733 22275052 22575239 22997407 23551059 24242773 25082832 26087979 27279296
39215 27279296 28677530 30299912 32161203 34278315 36675156 39384546 42446327 45902220
39207D5902220L885510M333656M772296N166887N484622N701294N802299N778406
39199H6827190N621357N323639M882665M306463L617431K851431K050457J250118
39191A16730751M68282k96478j053390j802484k524981l187626l755603m203592
39183A00374879m520224m708419m784285m773057m700704m585154m433629m247547
39175F3621860m029672l787311l530339l267076l001323k732256k457791k180522
39167C8635570j912807j676557j496074j387474j350803j368895j412541j449408
39159B6581011j454275j418492j354611j291202j257153j263526j295560j321173
39151A5925019j309319j244346j128086r72880p94082o06673m24542k59944j22613
$$ plain form
39207 45902220 49787730 54121386 58893682 64060569 69545191 75246485 81048784 86827190
39199 86827190 92448547 97772186 102654851 106961314 110578745 113430176 115480633 116730751
39191 116730751 117199033 116902555 115849165 114046681 111521700 108334074 104578471 100374879
39183 100374879 95854655 91146236 86361951 81588894 76888190 72303036 67869407 63621860
39175 63621860 59592188 55804877 52274538 49007462 46006139 43273883 40816092 38635570
39167 38635570 36722763 35046206 33550132 32162658 30811855 29442960 28030419 26581011
39159 26581011 25126736 23708244 22353633 21062431 19805278 18541752 17246192 15925019
39151 15925019 14615700 13371354 12243268 11270388 10476306 9869633 9445091 9185147 9062534
39142I062534j8988M8889Q4620R7104R7536R5777R9236J14393J47595K02557K76418
39131A0307671L58772M35657M95494N31565N38851N08880M29321K91229R9305
39122A3996745j23396l40697n15212o20112o46078o02607n14123m11881l24451
39113I898188k70884k59089k87929l49545m30388n12378n76386o07604n99775
39104F004210n55584m83654l95206l02466k17892j52282j11893r6722j01013j14907
39094C472591j26322j23550r9078n3002O449O5972J12244J36793J38516J21955
39084C652568R1392M4734k7230j34769k81210m59516o54739q48564j022144j157559
39074g97037j240314j263054j228048j145938j031020q95969p48960n93971m32734
$$ plain form
39142 9062534 9043546 9092435 9177055 9274159 9371695 9467472 9566708 9681101 9828696 10031253 10307671
39131 10307671 10666443 11102100 11597594 12129159 12668010 13176890 13606211 13897440 13996745
39122 13996745 13873349 13532652 13017440 12397328 11751250 11148643 10634520 10222639 9898188
39113 9898188 9627304 9368215 9080286 8730741 8300353 7787975 7211589 6603985 6004210
39104 6004210 5448626 4964972 4569766 4267300 4049408 3897126 3785233 3688511 3587498 3472591
39094 3472591 3346269 3222719 3123641 3070639 3077088 3143060 3255304 3392097 3530613 3652568
39084 3652568 3743960 3788694 3761464 3626695 3345485 2885969 2231230 1382666 360522 -797037
39074 -797037 -2037351 -3300405 -4528453 -5674391 -6705411 -7601380 -8350340 -8944311 -9377045
39065i377045k66450r7141P0282K25276L50831M27376M41053L91472K93160J68810
39055g372376L8791q5327j98729k95923l66050l95840l76906l09894k02328o4083
39045i628665R4286K60117M17708N50156O43105O88811O89681O59750O21663N98679
39035d404709O04776O37695O78058O95401O59651N53993L83165J73348l5212j98680
39025b52514k80353k60476j42754M6381K66924M78727O52352P72832Q36310Q43313
39015B960742P94036O89312N35820L49620J53460l0395j85822l03404l77757m05982
39005D179630l89174l34775k56196j68393q2772o336N4355Q9892R0840N4844r333
38994C222582q4623j51607j92348j92127j42153m3213R3540K50351M08016N48470
$$ plain form
39065 -9377045 -9643495 -9740636 -9670354 -9445078 -9094247 -8666871 -8225818 -7834346 -7541186 -7372376
39055 -7372376 -7333585 -7418912 -7617641 -7913564 -8279614 -8675454 -9052360 -9362254 -9564582 -9628665
39045 -9628665 -9534379 -9274262 -8856554 -8306398 -7663293 -6974482 -6284801 -5625051 -5003388 -4404709
39035 -4404709 -3799933 -3162238 -2484180 -1788779 -1129128 -575135 -191970 -18622 -53834 -252514
39025 -252514 -532867 -793343 -936097 -889716 -622792 -144065 508287 1281119 2117429 2960742
39015 2960742 3754778 4444090 4979910 5329530 5482990 5452595 5266773 4963369 4585612 4179630
39005 4179630 3790456 3455681 3199485 3031092 2948320 2941984 2996339 3086231 3177071 3231915 3222582
38994 3222582 3137959 2986352 2794004 2601877 2459724 2416511 2510051 2760402 3168418 3716888
38984C716888O55128P14720P22346O86473O28121N72134N35389N20175N16866
38975I268240N12197M96237M64424M16080L52157K73559J80948P6667l2387j34156
38965A1873966k14976k65430k84595k80424k66558k56949k60103k75458k94074
38956I475399l03548k94240k63421k15843j61831j14693q8113r2718j31790j98355
38946G610847k76313l45149l84797l78693l16353j97129l3149J51755L26945M60714
38936F618678N25461N03609L93731K12882p737k31465m24186n59553o22576o11798
38926E797046n38157m19845k76171j24567J8339J34699K06664K21991J81067R9798
38916E300864M679p8158j33081j57622j57020j36460r7792m2134K5887R7302J62018
$$ plain form
38984 3716888 4372016 5086736 5809082 6495555 7123676 7695810 8231199 8751374 9268240
38975 9268240 9780437 10276674 10741098 11157178 11509335 11782894 11963842 12040509 12008122 11873966
38965 11873966 11658990 11393560 11108965 10828541 10561983 10305034 10044931 9769473 9475399
38956 9475399 9171851 8877611 8614190 8398347 8236516 8121823 8033710 7940992 7809202 7610847
38946 7610847 7334534 6989385 6604588 6225895 5909542 5712413 5679264 5831019 6157964 6618678
38936 6618678 7144139 7647748 8041479 8254361 8246624 8015159 7590973 7031420 6408844 5797046
38926 5797046 5258889 4839044 4562873 4438306 4456645 4591344 4798008 5019999 5201066 5300864
38916 5300864 5305543 5227385 5094304 4936682 4779662 4643202 4545410 4503276 4529163 4626465 4788483
38905D788483K12977K48059K68874K77571K73697K53738K14526J58224R4033L4310
38895F824492j1612m0674n5026n9745o1848o9496q9452j23809j68937k17851k64019
38884E662023l03728l35663l58454l68129l57716l19972k51880j57948n0216N4773
38874C213090J40112J92225K03441J73247J08208K0856p1918j51179j99701k06750
38864C421631j71726j04187k0275O1904J25601J57273J48165R5930N489j11333
38854C608472k37286l52215m36562m75002m58703l85973k62742j03381O9834K30889
38844A197331L56832M33633M58380M38149L87176L23048K62075K15000J84590
38835D256214J65817J48331J20591P4451P830p6252j72972k77571l83790m81238
$$ plain form
38905 4788483 5001460 5249519 5518393 5795964 6069661 6323399 6537925 6696149 6790182 6824492
38895 6824492 6812880 6772206 6717180 6657435 6595587 6526091 6436639 6312830 6143893 5926042 5662023
38884 5662023 5358295 5022632 4664178 4296049 3938333 3618361 3366481 3208533 3158317 3213090
38874 3213090 3353202 3545427 3748868 3922115 4030323 4051179 3979261 3828082 3628381 3421631
38864 3421631 3249905 3145718 3125443 3187347 3312948 3470221 3618386 3714316 3719805 3608472
38854 3608472 3371186 3018971 2582409 2107407 1648704 1262731 999989 896608 966442 1197331
38844 1197331 1554163 1987796 2446176 2884325 3271501 3594549 3856624 4071624 4256214
38835 4256214 4422031 4570362 4690953 4765404 4773234 4696982 4524010 4246439 3862649 3381411
38825C381411n56013n96215n99409n76579n48572n35539n45203n67533n79569
38816a723221n57051m85689l66876k17126o3028O6245J46852J66481J27289M4911
38806b861213n6651j53036k27022k71466k87295k80094k58396k32451k10513j93336
38796e031473j71520j29270n3195N9103J96019L36716M60936N57161O23206O59970
38786b492347O65425O35257N68897M73708L62354K45718J28038Q109j15442k39178
38776B40539l52786m40347m84951m76020m16232l23466k26147j54838j34195j76652
38766b945095k77947m16195n57023o64153p11200o89721o10219m94577l62439
38757g728569k19845n9395J27578L38000N55438P60684R43765J106969J257928
$$ plain form
38825 3381411 2825398 2229183 1629774 1053195 504623 -30916 -576119 -1143652 -1723221
38816 -1723221 -2280272 -2765961 -3132837 -3349963 -3412991 -3346746 -3199894 -3033413 -2906124 -2861213
38806 -2861213 -2917864 -3070900 -3297922 -3569388 -3856683 -4136777 -4395173 -4627624 -4838137 -5031473
38796 -5031473 -5202993 -5332263 -5385458 -5326355 -5130336 -4793620 -4332684 -3775523 -3152317 -2492347
38786 -2492347 -1826922 -1191665 -622768 -149060 213294 459012 587050 595159 479717 240539
38776 240539 -112247 -552594 -1037545 -1513565 -1929797 -2253263 -2479410 -2634248 -2768443 -2945095
38766 -2945095 -3223042 -3639237 -4196260 -4860413 -5571613 -6261334 -6871553 -7366130 -7728569
38757 -7728569 -7948414 -8007809 -7880231 -7542231 -6986793 -6226109 -5282344 -4175375 -2917447
38748b917447J399790J525598J619150J660164J630632J520532J332312J083106
38740H853837Q02760N27068K88442J07657j0896p9505j22609j68069k37014l36283
38730I625388m56539n76638o72459p25997p29926o86011o01125m85714l54716
38721D336263k26681j19016m2894k310K650k7951r4922j97556l29449m75948o16727
38710B205459p33248q15476q61823q72561q43403p65613o32784m48981k32265
38701d000695j0805J86588L40139M43098M97686N06263M64733L64028J99657j7542
38691a026850k58318m82931o54698p50556p64948p09778o13209n15215m56052
38682f232555m59654n21131o08120o77040o94459o49816n52632m19571k63580
$$ plain form
38748 -2917447 -1517657 7941 1627091 3287255 4917887 6438419 7770731 8853837
38740 8853837 9656597 10183665 10472107 10579764 10568868 10489363 10366754 10198685 9961671 9625388
38730 9625388 9168849 8592211 7919752 7193755 6463829 5777818 5176693 4690979 4336263
38721 4336263 4109582 3990566 3947672 3945362 3948012 3920061 3825139 3627583 3298134 2822186 2205459
38710 2205459 1472211 656735 -205088 -1077649 -1921052 -2686665 -3319449 -3768430 -4000695
38701 -4000695 -4011500 -3824912 -3484773 -3041675 -2543989 -2037726 -1572993 -1208965 -1009308 -1026850
38691 -1026850 -1285168 -1768099 -2422797 -3173353 -3938301 -4648079 -5261288 -5776503 -6232555
38682 -6232555 -6692209 -7213340 -7821460 -8498500 -9192959 -9842775 -10395407 -10814978 -11078558
38673a1078558r2986Q2013K44161L71033M42765M50161L98519L05691J96224R5192
38663h585785K4471J191L5881J29188K69354M33949N96507P34523Q33872Q87760
38653d639089Q93303Q50718P66342O55060N37142M30815L47501K93775K75658
38644D11225K97881L57912M42372N31779O10076O70138P10958P30613P22064O75218
38634F160236N83432M49913K89659J25251k1448j36836k18014k69407k96388k99854
38624F366544k74617k12649j10086K5822J74565L07431L97398M28443M00177L27097
38614G830125K33354J44205P6530L3153N083j9519m5796o8180p3365m7810J3928
38603H081708J03730K00224K75267L03139K67680J65418O058j87933l83612n43904
$$ plain form
38673 -11078558 -11171544 -11089531 -10845370 -10474337 -10031572 -9581411 -9182892 -8877201 -8680977 -8585785
38663 -8585785 -8561314 -8560123 -8524242 -8395054 -8125700 -7691751 -7095244 -6360721 -5526849 -4639089
38653 -4639089 -3745786 -2895068 -2128726 -1473666 -936524 -505709 -158208 135567 411225
38644 411225 709106 1067018 1509390 2041169 2651245 3321383 4032341 4762954 5485018 6160236
38634 6160236 6743668 7193581 7483240 7608491 7587043 7450207 7232193 6962786 6666398 6366544
38624 6366544 6091927 5879278 5769192 5795014 5969579 6277010 6674408 7102851 7503028 7830125
38614 7830125 8063479 8207684 8284214 8317367 8322450 8302931 8257135 8188955 8115590 8067780 8081708
38603 8081708 8185438 8385662 8660929 8964068 9231748 9397166 9403224 9215291 8831679 8287775
38593H287775o38266o53705n99555n01849l89952k84106j91256j09371l4441L5070
38583D920344R7342J48391J83773J99154J88574J41960M6635j04278l00888n12418
38573E008589o96108q15364q55857q29836p67666p03493o62996o56651o77846
38564a657228p05518p11858o73730n82861m49526k98633j61129o4555k5297m4773
38554e375108j11132k05608l09539m07873m88857n43378n66708n61000n34387
38545i103590m95612m48000l87134l02380j79880o686K22413M97262P90377J064847
38535h348383J287883J440590J518764J527516J475913J375248J240354J091198
38527B609083R51804Q44837P82948P60771P52937P21841O33924M76448K63876
$$ plain form
38593 8287775 7649509 6995804 6396249 5894400 5504448 5220342 5029086 4919715 4885274 4920344
38583 4920344 5017686 5166077 5349850 5549004 5737578 5879538 5926173 5821895 5521007 5008589
38573 5008589 4312481 3497117 2641260 1811424 1043758 340265 -322731 -979382 -1657228
38564 -1657228 -2362746 -3074604 -3748334 -4331195 -4780721 -5079354 -5240483 -5305038 -5330335 -5375108
38554 -5375108 -5486240 -5691848 -6001387 -6409260 -6898117 -7441495 -8008203 -8569203 -9103590
38545 -9103590 -9599202 -10047202 -10434336 -10736716 -10916596 -10923282 -10700869 -10203607 -9413230 -8348383
38535 -8348383 -7060500 -5619910 -4101146 -2573630 -1097717 277531 1517885 2609083
38527 2609083 3560887 4405724 5188672 5949443 6702380 7424221 8058145 8534593 8798469
38518H798469K9058j93905l82316n26704o26361o86061p15120p24800p23151p11962
38508C537147o89720o57770o23034n94355n76344n66905n60374n52400n41776
38499a825531n28245n09976m84219m50433m12051l74483l41483l13683k90364
38490e530468k71880k60180k57558k65104k80721k96357k96673k62925j81878
38481g903744n3868J06200K75259M31097N59288O55830P24710P71637P98319Q02322
38471b832950P82125P41374O87480O26596N60914M90803M18907L51880K98117
38462B125246K63046K45432K37461K28898K12563J87735J60212J40026J38222
38453C938841J63329K17467K92248L66151M06905L81426K70270P8268j65510m17586
$$ plain form
38518 8798469 8827527 8633622 8251306 7724602 7098241 6412180 5697060 4972260 4249109 3537147
38508 3537147 2847427 2189657 1566623 972268 395924 -170981 -731355 -1283755 -1825531
38499 -1825531 -2353776 -2863752 -3347971 -3798404 -4210455 -4584938 -4926421 -5240104 -5530468
38490 -5530468 -5802348 -6062528 -6320086 -6585190 -6865911 -7162268 -7458941 -7721866 -7903744
38481 -7903744 -7957612 -7851412 -7576153 -7145056 -6585768 -5929938 -5205228 -4433591 -3635272 -2832950
38471 -2832950 -2050825 -1309451 -621971 4625 565539 1056342 1475249 1827129 2125246
38462 2125246 2388292 2633724 2871185 3100083 3312646 3500381 3660593 3800619 3938841
38453 3938841 4102170 4319637 4611885 4978036 5384941 5766367 6036637 6114905 5949395 5531809
38443E531809o33359p78592q37082q12879p25682o01577m64899l35018k26282
38434A16439j47243r8120o8614l8449J8159J24208K90224N07861P50150R77686
38424B432301J147289J220994J174695J005241P33437M01247O2943k28440m35469
38415G514238n44757n64284n12001m05137k57594q4080R6271K61343L91311M73773
38405F369083N06305M95829M55314L99100L38894K81852K30671J84721J41757
38396I403526J00540O4207M2403M9176R5331J78497K77572L56723L78271L18073
38386A1264319J75561k6405k51552m64748o43052p77644q67566r12213r09083
38377F587617q57282p62128o36649m99431l70716k68158k03200j79295j92578
$$ plain form
38443 5531809 4898450 4119858 3282776 2469897 1744215 1142638 677739 342721 116439
38434 116439 -30804 -128924 -197538 -235987 -217828 -93620 196604 704465 1454615 2432301
38424 2432301 3579590 4800584 5975279 6980520 7713957 8115204 8178147 7949707 7514238
38415 7514238 6969481 6405197 5893196 5488059 5230465 5146385 5242656 5503999 5895310 6369083
38405 6369083 6875388 7371217 7826531 8225631 8564525 8846377 9077048 9261769 9403526
38396 9403526 9504066 9568273 9610676 9659852 9755183 9933680 10211252 10567975 10946246 11264319
38386 11264319 11439880 11413475 11161923 10697175 10054123 9276479 8408913 7496700 6587617
38377 6587617 5730335 4968207 4331558 3832127 3461411 3193253 2990053 2810758 2618180
38368B618180k33606k88098l37335l61537l47447k95859k22878j53297j10740
38359B67383j10147j54308k33164l25293m02289m35968m06686l10391j61719R677
38349b262905J69950K94117L73217M11835M20777M12927M04320M14444M59995
38340A098677N44466O52498P55390Q25230Q48390Q30146P88380P40696O92453
38331G776326O32732N41179M01996K16377N206j99576l69322m90081n65239o09198
38321G340400o37021o56719o68328o68850o58390o42844o31375o30245o37181
38312A509447o40848o26768n85362n15796m23511l15449j97592p5224M6471J62389
38302a662243K67108L53919M13887M34928M01480K97684J16301j30675m09141
$$ plain form
38368 2618180 2384574 2096476 1759141 1397604 1050157 754298 531420 378123 267383
38359 267383 157236 2928 -230236 -555529 -957818 -1393786 -1800472 -2110863 -2272582 -2262905
38349 -2262905 -2092955 -1798838 -1425621 -1013786 -593009 -180082 224238 638682 1098677
38340 1098677 1643143 2295641 3051031 3876261 4724651 5554797 6343177 7083873 7776326
38331 7776326 8409058 8950237 9352233 9568610 9573816 9374240 9004918 8514837 7949598 7340400
38321 7340400 6703379 6046660 5378332 4709482 4051092 3408248 2776873 2146628 1509447
38312 1509447 868599 241831 -343531 -859327 -1282838 -1598287 -1795879 -1871103 -1824632 -1662243
38302 -1662243 -1395135 -1041216 -627329 -192401 209079 506763 623064 492389 83248
38293H3248o73079q82643j018636j085679j104536j099641j088592j077986j065726
38284i013270j046212j014117r65049q93990p93303o52682m63456k26449M2821
38275a5025707L18385N76419Q05852J007623J183995J328499J425355J458059
38267f921520J420286J322381J190562J059249R59173R05944Q94663R03839R06245
38258B640822Q79531Q09993O89608N12928K79522M20k98737n82840q18284r82906
38248C130057j069924j085737j044242r60468q45903p07658n52230l91792k48330
38239c776227j50777j24568j79278l02975m67553o40456p93771r06060r60575
38230h302240r45902q59813p11533n18940l03085q5145J13079K69231L65209L94992
$$ plain form
38293 83248 -589831 -1472474 -2491110 -3576789 -4681325 -5780966 -6869558 -7947544 -9013270
38284 -9013270 -10059482 -11073599 -12038648 -12932638 -13725941 -14378623 -14842079 -15068528 -15025707
38275 -15025707 -14707322 -14130903 -13325051 -12317428 -11133433 -9804934 -8379579 -6921520
38267 -6921520 -5501234 -4178853 -2988291 -1929042 -969869 -63925 830738 1734577 2640822
38258 2640822 3520353 4330346 5019954 5532882 5812404 5812824 5514087 4931247 4112963 3130057
38248 3130057 2060133 974396 -69846 -1030314 -1876217 -2583875 -3136105 -3527897 -3776227
38239 -3776227 -3927004 -4051572 -4230850 -4533825 -5001378 -5641834 -6435605 -7341665 -8302240
38230 -8302240 -9248142 -10107955 -10819488 -11338428 -11641513 -11726658 -11613579 -11344348 -10979139 -10584147
38220a0584147L69174L11475K48847K00955J74220J62127J51106J29532R5463
38211h741248N8466L4527L8085P6641J49803K50766L67881M85865N87251O54474
38201f037489O73025O35735N46747M22143K85553J60748O5676J0653q56K7580
38191c210485Q3356J44671J86120J88683J47402P1546k1076j09984j75115j98772
38181b893654j67967p6199P6409K83191N29919P94561J050893J275461J453352
38172B325966J578807J651383J671926J642204J568257J463602J347930J240154
38164A4490229J149099J066707R67401Q15503N80084K51892j47660n73132r74178
38155A7625945j314069j576085j757417j859371j881796j823412j685786j478765
$$ plain form
38220 -10584147 -10214973 -9903498 -9654651 -9453696 -9279476 -9117349 -8966243 -8836711 -8741248
38211 -8741248 -8682782 -8648255 -8610170 -8533529 -8383726 -8132960 -7765079 -7279214 -6691963 -6037489
38201 -6037489 -5364464 -4728729 -4181982 -3759839 -3474286 -3313538 -3247862 -3237209 -3238065 -3210485
38191 -3210485 -3127129 -2982458 -2796338 -2607655 -2460253 -2388707 -2409783 -2519767 -2694882 -2893654
38181 -2893654 -3061621 -3137820 -3061411 -2778220 -2248301 -1453740 -402847 872614 2325966
38172 2325966 3904773 5556156 7228082 8870286 10438543 11902145 13250075 14490229
38164 14490229 15639328 16706035 17673436 18488939 19069023 19320915 19173255 18600123 17625945
38155 17625945 16311876 14735791 12978374 11119003 9237207 7413795 5728009 4249244
38147D249244j224889r58909p19736n37257m21391l59620l23241k77732j92644
38138g66175m9459J52977L96724O48433Q68009J019060J077133J033698Q96706
38129E277106O89184M45561K04073l793j61463k67208l26460l43861l21950k65593
38119D925596j85458r6071j0560O2490J17632J49442J52425J25220P5059J6684
38109E332459l5255p4333j03870j30761j57376j77885j80577j53740r2011o17
38099D226034J04774K03683K79899L29220L61420L95421M50537N38579O60454
38090G550021Q08047R69529J135158J300762J467456J638484J816242K002419
38082A8688118K200801K419092K666837K950049L265651L597994L918156M185947
$$ plain form
38147 4249244 3024355 2065446 1345710 808453 387062 27442 -295799 -573531 -766175
38138 -766175 -815634 -662657 -265933 382500 1250509 2269569 3346702 4380400 5277106
38129 5277106 5966290 6411851 6615924 6612131 6450668 6183460 5857000 5513139 5191189 4925596
38119 4925596 4740138 4644067 4633507 4695997 4813629 4963071 5115496 5240716 5315775 5332459
38109 5332459 5297204 5222871 5119001 4988240 4830864 4652979 4472402 4318662 4226651 4226034
38099 4226034 4330808 4534491 4814390 5143610 5505030 5900451 6350988 6889567 7550021
38090 7550021 8358068 9327597 10462755 11763517 13230973 14869457 16685699 18688118
38082 18688118 20888919 23308011 25974848 28924897 32190548 35788542 39706698 43892645
38074D3892645M353867M370586M182328L735894K992055J952612O88302o57256
38066F5511033j902445k888087l528576l825412l843152l670659l391286l070482
38058C9390934k756351k484291k278835k150261k089869k071377k061363k032713
38050B1465874j971330j872926j736050j559701j347442j112605q77643o66073
38042A0322104m92514l58957k60480j95035j67931j86537k50107l44282m45408
38033G620853n31171n89611o21543o37425o52015o78490p22617p79075q33144
38024A575762q67700q71303q42730p90867p31026o78504o40950o13736n82424
38015e043478n31434m52898l50581k38316j35204n9074j9613j4239k9443m6450
$$ plain form
38074 43892645 48246512 52617098 56799426 60535320 63527375 65479987 66168289 65511033
38066 65511033 63608588 60720501 57191925 53366513 49523361 45852702 42461416 39390934
38058 39390934 36634583 34150292 31871457 29721196 27631327 25559950 23498587 21465874
38050 21465874 19494544 17621618 15885568 14325867 12978425 11865820 10988177 10322104
38042 10322104 9829590 9470633 9210153 9015118 8847187 8660650 8410543 8066261 7620853
38033 7620853 7089682 6500071 5878528 5241103 4589088 3910598 3187981 2408906 1575762
38024 1575762 708062 -163241 -1005971 -1796838 -2527864 -3206368 -3847318 -4461054 -5043478
38015 -5043478 -5574912 -6027810 -6378391 -6616707 -6751911 -6810985 -6830598 -6844837 -6874280 -6920730
38005f920730m6505j2504P1361K17699M30428O99216R98851J294719J550976J737243
37995B0754J833140J832180J744794J597243J424269J258181J120014J016249
37987A1846824R40154Q75179P98749O86268N15495K72130m2869m06624p74563
37978A4710743j092514j317241j433508j456529j419231j354238j281765j208146
37970D147571j132401j054750r81022r19917q75325q40567q00290p39380o51893
37961c847974n43127m23552k99683j69152k4106J39636L15271M85843O32377P42404
37951b992063Q12497Q44289Q38606P92941P04550N76872M23643K66016J24037
37942B391388R790p1955j18011j24017q8932k2117N5536J19819J55530J63800
$$ plain form
38005 -6920730 -6967235 -6979739 -6908378 -6690679 -6260251 -5561035 -4562184 -3267465 -1716489 20754
37995 20754 1853894 3686074 5430868 7028111 8452380 9710561 10830575 11846824
37987 11846824 12786978 13662157 14460906 15147174 15662669 15934799 15891930 15485306 14710743
37978 14710743 13618229 12300988 10867480 9410951 7991720 6637482 5355717 4147571
37970 4147571 3015170 1960420 979398 59481 -815844 -1656411 -2456701 -3196081 -3847974
37961 -3847974 -4391101 -4814653 -5114336 -5283488 -5307594 -5167958 -4852687 -4366844 -3734467 -2992063
37951 -2992063 -2179566 -1335277 -496671 296270 1000820 1577692 2001335 2267351 2391388
37942 2391388 2401178 2329223 2211212 2087195 1998263 1976146 2031682 2151501 2307031 2470831
37932B470831J59140J58737J72062J97477K25839K45927K47662K23674J71438
37923D272787R5319N690q5473j69375k41907l01309l44033l61657l41301k71003
37913B257738j48616J1126J77156L11414L81678L70682K77931J15922r5195l31728
37903C328108n68918p83132r55128j074101j139536j157662j133854j067837r57857
37894e509917q10636o45820m87834l51732k36908j33984l6061N7468J45815K31658
37884g777951L18778M04854M78082N23264N34162N21906N10751N23150N66197
37875c396807O29929O95638P43866P56566P17880O19282M66604K81236R2416p4630
37865A531980k07160l05981l79944m38019m84044n16203n29146n15589m67739
$$ plain form
37932 2470831 2629971 2788708 2960770 3158247 3384086 3630013 3877675 4101349 4272787
37923 4272787 4368106 4373796 4288323 4118948 3877041 3575732 3231699 2870042 2528741 2257738
37913 2257738 2109122 2120248 2297404 2608818 2990496 3361178 3639109 3755031 3659836 3328108
37903 3328108 2759190 1976058 1020930 -53171 -1192707 -2350369 -3484223 -4552060 -5509917
37894 -5509917 -6320553 -6966373 -7454207 -7805939 -8042847 -8176831 -8212892 -8155424 -8009609 -7777951
37884 -7777951 -7459173 -7054319 -6576237 -6052973 -5518811 -4996905 -4486154 -3963004 -3396807
37875 -3396807 -2766878 -2071240 -1327374 -570808 147072 766354 1232958 1514194 1606610 1531980
37865 1531980 1324820 1018839 638895 200876 -283168 -799371 -1328517 -1844106 -2311845
37856b311845l81611k64184j38020l7058O693k1561j11776k34153l53467m43105
37846d290087m90599m94030m55658l79598k74679j57794n1495K5676P0442R8364
37836f399458J35161K00943K97939M08713N04304N57115N53190M99097M19870
37827b823126L48450L12116L22757L74406M47110N14464N52023N44107M87216
37818A079523L89806K69007J45050L4738n3227j18759j66980k03677k31983k50826
37808H92672k54989k37333j93383j26339m9019J9336O0053O1912K4706m1289j19241
37797C7086j92102k49746k93342l33535l82521m44909n13053n69050n91365n62707
37787d095244m76613l41078j77765j6077J16545K04116K46824K59224K64643K89828
$$ plain form
37856 -2311845 -2693456 -2957640 -3095660 -3132718 -3126025 -3147586 -3259362 -3493515 -3846982 -4290087
37846 -4290087 -4780686 -5274716 -5730374 -6109972 -6384651 -6542445 -6593940 -6568264 -6497822 -6399458
37836 -6399458 -6264297 -6063354 -5765415 -5356702 -4852398 -4295283 -3742093 -3242996 -2823126
37827 -2823126 -2474676 -2162560 -1839803 -1465397 -1018287 -503823 48200 592307 1079523
37818 1079523 1469329 1738336 1883386 1918124 1864897 1746138 1579158 1375481 1143498 892672
37808 892672 637683 400350 206967 80628 31609 50945 110998 172910 197616 156327 37086
37797 37086 -155016 -404762 -698104 -1031639 -1414160 -1859069 -2372122 -2941172 -3532537 -4095244
37787 -4095244 -4571857 -4912935 -5090700 -5106777 -4990232 -4786116 -4539292 -4280068 -4015425 -3725597
37777c725597L60633M96241P01581R62639J250189J531333J781374J988345K148687
37768G495425K259417K313598K301768K216393K054746J818921J515621J157824
37760B3133713P66504L68905p057l39051o13725q26087r76139j065887j099697
37751A9341479j087912j049042j006032r78260r75734r99089j042096j092576
37743A1110738j132888j144104j113546j040238r34068q10355o84369n68207m69331
37734C213632l89921l27559k77671k36476k02578j76760j61275j59190j72448
37725A109754j97999k25175k38992k29295j98952j63813j43947j52308j87576
37716f28303k34394k71143k81739k64147k28640j87036j42988r2425l2306L2448
$$ plain form
37777 -3725597 -3364964 -2868723 -2167142 -1204503 45686 1577019 3358393 5346738 7495425
37768 7495425 9754842 12068440 14370208 16586601 18641347 20460268 21975889 23133713
37760 23133713 23900217 24269122 24262065 23923014 23309289 22483202 21507063 20441176 19341479
37751 19341479 18253567 17204525 16198493 15220233 14244499 13245410 12203314 11110738
37743 11110738 9977850 8833746 7720200 6679962 5745894 4935539 4251170 3682963 3213632
37734 3213632 2823711 2496152 2218481 1982005 1779427 1602667 1441392 1282202 1109754
37725 1109754 911755 686580 447588 218293 19341 -144472 -288419 -440727 -628303
37716 -628303 -862697 -1133840 -1415579 -1679726 -1908366 -2095402 -2238390 -2330815 -2363121 -2330673
37706b330673R0683J32709J56659J69422J83023K09238K54558L17136L86544M45990
37696A5289M76063M59325L85369K55187Q2745j07834k89232m39390n47568o14815
37686c24861o49206o59472o51135o26322n85617n29747m60165l78762k87693j90232
37676e343212r2162j422P5339J36719J86669K29900K66959K93474L03298K92176
37666c652262K59628K08887J45149P2966m899q5468j62544k26574k67934k80362
37656c993413k62216k16670j51861p9588j1332M6321R3962J38940J93141K68641
37646c974075L71419M96757O30632P56347Q60590R34617R71651R64506R06198
37637B918642P93939O35015M50465K71906J30592M4367J0505Q912J3376M221k4578
$$ plain form
37706 -2330673 -2239990 -2107281 -1950622 -1781200 -1598177 -1388939 -1134381 -817245 -430701 15289
37696 15289 491352 950677 1336046 1591233 1673978 1566144 1276912 837522 289954 -324861
37686 -324861 -974067 -1633539 -2284674 -2910996 -3496613 -4026360 -4486525 -4865287 -5152980 -5343212
37676 -5343212 -5435374 -5436796 -5361457 -5224738 -5038069 -4808169 -4541210 -4247736 -3944438 -3652262
37666 -3652262 -3392634 -3183747 -3038598 -2965632 -2970531 -3055999 -3218543 -3445117 -3713051 -3993413
37656 -3993413 -4255629 -4472299 -4624160 -4703748 -4715080 -4668759 -4574797 -4435857 -4242716 -3974075
37646 -3974075 -3602656 -3105899 -2475267 -1718920 -858330 76287 1047938 2012444 2918642
37637 2918642 3712581 4347596 4798061 5069967 5200559 5244926 5255431 5264343 5277719 5281940 5257362
37626E257362o6847j11400j48886j74230j85202j80040j56388j12916n3600Q371
37616D076224N2164N8073J8187n9101j53579k42778l10886l53247l75233l86436
37606B323388l94554m03421m15293m32819m57430m85871n08605n11305m78739
37597a764649m00188k74891j14339O0648K26263L61918M55021N04810N23545N31751
37587A09889N47817N78055O14160O39461O38815O05392N41122M52918L49521K41404
37577E318554J41138O0110J950m1557q6767j47677k25366l04258l57943l61704
37567C996480l05029j97017o2160O9504J70939K21464K06773J19765l6228k44577
37557C939914m77380p03451q97954j047283j146568j193571j185089j118835r98581
$$ plain form
37626 5257362 5190515 5079115 4930229 4755999 4570797 4390757 4234369 4121453 4067853 4076224
37616 4076224 4128388 4186461 4204648 4145547 3991968 3749190 3438304 3085057 2709824 2323388
37606 2323388 1928834 1525413 1110120 677301 219871 -266000 -774605 -1285910 -1764649
37597 -1764649 -2164837 -2439728 -2554067 -2493419 -2267156 -1905238 -1450217 -945407 -421862 109889
37587 109889 657706 1235761 1849921 2489382 3128197 3733589 4274711 4727629 5077150 5318554
37577 5318554 5459692 5519802 5521752 5480195 5393428 5245751 5020385 4716127 4358184 3996480
37567 3996480 3691451 3494434 3432274 3501778 3672717 3894181 4100954 4220719 4184491 3939914
37557 3939914 3462534 2759083 1861129 813846 -332722 -1526293 -2711382 -3830217 -4828798
37548d828798q38035o59996m90395l49858k46907j75825j19718n7605K6762J38199
37538g602176K69814M09670N48500O81571Q04498R09639R87872J033072J044006
37529i13534J023039R75144R08566Q34790P66505P15421O91405P01068P43825
37520F446229Q07926Q71499R10534R09824Q70300Q08285P46866P04055O84698
37511A3760216O81425O84343O93138P23545Q03667R62151J214966J558293J970806
37502B3052550K422718K885698L339451L774399M191255M597259M999182N395894
37494E4658406N774338O109460O364278O486631O405161O032749N285368M116216
37486A01232607K552869P16277j196367k964279m407551n430657o026962o252464
$$ plain form
37548 -4828798 -5666833 -6326829 -6817224 -7167082 -7413989 -7589814 -7709532 -7767137 -7740375 -7602176
37538 -7602176 -7332362 -6922692 -6374192 -5692621 -4888123 -3978484 -2990612 -1957540 -913534
37529 -913534 109505 1084649 1993215 2828005 3594510 4309931 5001336 5702404 6446229
37520 6446229 7254155 8125654 9036188 9946012 10816312 11624597 12371463 13075518 13760216
37511 13760216 14441641 15125984 15819122 16542667 17346334 18308485 19523451 21081744 23052550
37502 23052550 25475268 28360966 31700417 35474816 39666071 44263330 49262512 54658406
37494 54658406 60432744 66542204 72906482 79393113 85798274 91831023 97116391 101232607
37486 101232607 103785476 104501753 103305386 100341107 95933556 90502899 84475937 78223473
37478G8223473o192059n935696n565976n150659m736454m346356l982768l635171
37470C8678334l289093k934274k571184k214522j891146j631181j455165j364471
37462B1327298j341274j357350j383605j393140j359300j257044j072223q12823
37454A1350539n11191k12526M4048K40001L79857M82512N68642O51400P33142
37445A3726424Q06401Q56605Q65793Q17824P04447N30403L15534R2429j01131
37436A8614729k33100k86057k58239j56289J4072K51916N57337R23989J334119
37427B0762477J759605K168338K532198K832633L062485L225016L331570L398348
37419D3072670L443043L482399L530797L598092L686080L786011L879956L945346
$$ plain form
37478 78223473 72031414 66095718 60529742 55379083 50642629 46296273 42313505 38678334
37470 38678334 35389241 32454967 29883783 27669261 25778115 24146934 22691769 21327298
37462 21327298 19986024 18628674 17245069 15851929 14492629 13235585 12163362 11350539
37454 11350539 10839348 10626822 10670870 10910871 11290728 11773240 12341882 12993282 13726424
37445 13726424 14532825 15389430 16255223 17073047 17777494 18307897 18623431 18715860 18614729
37436 18614729 18381629 18095572 17837333 17681044 17695116 17947032 18504369 19428358 20762477
37427 20762477 22522082 24690420 27222618 30055251 33117736 36342752 39674322 43072670
37419 43072670 46515713 49998112 53528909 57127001 60813081 64599092 68479048 72424394
37411G2424394L959125L900258L752941L511897L185901K793870K353308J869036
37403I7750730J331672P28109N6434o65155j399989k101920k726235l239786l629121
37394H6104739l903208m086901m206549m276348m294771m252656m145304l978496
37386E2960506l764763l515172l235365k929429k606958k285716j987273j729747
37378C0906083j523621j372567j276673j233717j236277j266478j293529j278677
37370B0424544j187639j005245p45119m48789j73051L0101J31560J32361N8405
37361A7217128n1355j56298k22780k30732j77343p5554N2660J84937L05403M07852
37351A7253918M95131N75749O59653P55117Q67654J000951J159201J349038J578307
$$ plain form
37411 72424394 76383519 80283777 84036718 87548615 90734516 93528386 95881694 97750730
37403 97750730 99082402 99810511 99866945 99201790 97801801 95699881 92973646 89733860 86104739
37394 86104739 82201531 78114630 73908081 69631733 65336962 61084306 56939002 52960506
37386 52960506 49195743 45680571 42445206 39515777 36908819 34623103 32635830 30906083
37378 30906083 29382462 28009895 26733222 25499505 24263228 22996750 21703221 20424544
37370 20424544 19236905 18231660 17486541 17037752 16864701 16894802 17026362 17158723 17217128
37361 17217128 17165773 17009475 16786695 16555963 16378620 16303066 16355726 16540663 16846066 17253918
37351 17253918 17749049 18324798 18984451 19739568 20607222 21608173 22767374 24116412 25694719
37342B5694719J850979K161639K494289K826608L136166L404356L616558L759464
37334D8944778L817265L768830L587912L247965K732147K046885J233130L66312
37326F9745224m59909j160037j679432k002827k148274k152852k056515j889288
37318E6196090j666557j394077j078693p37800m02938j16790P5580J38931N8587
37309E1072333j55747m74162q54347j248075j605884j882979k048117k092254
37301D0710768k031227j899213j736383j578215j451282j373973j357600j405664
37293B7877211j512437j662254j829942j983170k087773k115696k053366j907822
37285A2724751j707678j495673j312864j181527j097670j037733r73194q82505
$$ plain form
37342 25694719 27545698 29707337 32201626 35028234 38164400 41568756 45185314 48944778
37334 48944778 52762043 56530873 60118785 63366750 66098897 68145782 69378912 69745224
37326 69745224 69285315 68125278 66445846 64443019 62294745 60141893 58085378 56196090
37318 56196090 54529533 53135456 52056763 51318963 50916025 50799235 50874815 51013746 51072333
37309 51072333 50916586 50442424 49588077 48340002 46734118 44851139 42803022 40710768
37301 40710768 38679541 36780328 35043945 33465730 32014448 30640475 29282875 27877211
37293 27877211 26364774 24702520 22872578 20889408 18801635 16685939 14632573 12724751
37285 12724751 11017073 9521400 8208536 7027009 5929339 4891606 3918412 3035907
37277C035907p55503n92411m01042j93853J4216K06736L66813M79930N37710N39476
37267C237979M90432L99125K77063J39884P281r9594j62504j70934j25941m0734
37257C952057O3832J67650K59167L37999M10958M83978N55114O13477O45427O43777
37247H133436O12910N65801N15858M70169M28435L86484L40849K91876K44729
37238A1990547K07841J88843J89661K04043K19557K22506K02183J52372P1167
37229A3648720l8706j68671l03578m22853n03681n25697m76333l55153j75027
37220A0679021M0716K63377M63722O15970P02305P17756O72399N87462M86089
37211A5228817L83962K85533J87643Q7096j3565j06008j80688k31471k56446k55466
$$ plain form
37277 3035907 2280404 1687993 1286951 1093098 1107314 1314050 1680863 2160793 2698503 3237979
37267 3237979 3728411 4127536 4404599 4544483 4551764 4452170 4289666 4118732 3992791 3952057
37257 3952057 4015889 4183539 4442706 4780705 5191663 5675641 6230755 6844232 7489659 8133436
37247 8133436 8746346 9312147 9828005 10298174 10726609 11113093 11453942 11745818 11990547
37238 11990547 12198388 12387231 12576892 12780935 13000492 13222998 13425181 13577553 13648720
37229 13648720 13610014 13441343 13137765 12714912 12211231 11685534 11209201 10854048 10679021
37220 10679021 10719737 10983114 11446836 12062806 12765111 13482867 14155266 14742728 15228817
37211 15228817 15612779 15898312 16085955 16173051 16159486 16053478 15872790 15641319 15384873 15129407
37201A5129407k27948j73242r2754Q038J18855K25637L13822L72630L97265L87071
37191A6458781L42167K62825J51863J5778j38262l06294m86910o75801q61269
37182A4762878j026032j154308j238260j278257j276681j230772j131846r73336
37174E453386p61047n15260k61429j7986K07478M11565N86227P16411P85798P86292
37164G391435P25763O28989N29104M52975M09946L91584L80742L61899L27290
37155A1599727K79021K27972J88908J73241J84646K20629K76312L44370M11219
37146A3906045M55864M56234M00209K93560J58939K6236p9703j46273j71492j57016
37136A5142603j03656j4042J00683K18016L09746L52958L38080K68470J53700
$$ plain form
37201 15129407 14901459 14728217 14635463 14643501 14762356 14987993 15301815 15674445 16071710 16458781
37191 16458781 16800948 17063773 17215636 17231414 17093152 16786858 16299948 15624147 14762878
37182 14762878 13736846 12582538 11344278 10066021 8789340 7558568 6426722 5453386
37174 5453386 4692339 4177079 3915650 3897664 4105142 4516707 5102934 5819345 6605143 7391435
37164 7391435 8117198 8746187 9275291 9728266 10138212 10529796 10910538 11272437 11599727
37155 11599727 11878748 12106720 12295628 12468869 12653515 12874144 13150456 13494826 13906045
37146 13906045 14361909 14818143 15218352 15511912 15670851 15697087 15617384 15471111 15299619 15142603
37136 15142603 15038947 15024905 15125588 15343604 15653350 16006308 16344388 16612858 16766558
37127A6766558L776j71068l57353n37868o95815q20338r09320r68231j006083
37118A1304258j030058j041030j033116r98317r33000q40738p29439o05878m72203
37109C620479l26454j66226O306J79946L33361M39782M76904M37068L31506J85868
37099E518540K9928j12615k29823l21749l96774m66147n38823o18627p04469p92159
37089A367282q75426r45658r92391j006204r82632r23619q35158p23568n93608
37080f510982m48912k92940j29727L4650J89974L21957M16422M65180M68359M31177
37070e054842L58776K54132J20067l7793k10128l84899n48341o85703p83253q32029
37060g804013q30796p84716o99911n78763m20843k28886j4271K02659L97005N45300
$$ plain form
37127 16766558 16770334 16599266 16241913 15704045 15008230 14187892 13278572 12310341 11304258
37118 11304258 10274200 9233170 8200054 7201737 6268737 5427999 4698560 4092682 3620479
37109 3620479 3294025 3127799 3134105 3314051 3647412 4087194 4564098 5001166 5332672 5518540
37099 5518540 5548468 5435853 5206030 4884281 4487507 4021360 3482537 2863910 2159441 1367282
37089 1367282 491856 -453802 -1446193 -2452397 -3435029 -4358648 -5193806 -5917374 -6510982
37080 -6510982 -6959894 -7252834 -7382561 -7347911 -7157937 -6835980 -6419558 -5954378 -5486019 -5054842
37070 -5054842 -4696066 -4441934 -4321867 -4359660 -4569788 -4954687 -5503028 -6188731 -6971984 -7804013
37060 -7804013 -8634809 -9419525 -10119436 -10698199 -11119042 -11347928 -11362199 -11159540 -10762535 -10217235
37050a0217235O30873O48014O03761N15683M05849K93801J91516J01883K0767
37041f805088n8335j39553k22826l05651l85554m60101n24663n70965n88337n66698
37031a0627771m99789l88581k44479q9798M7449J43231J85986J78659J34244O9122
37021a1091727k034o8676j24703j67084j93953k04227j99594j86576j74889j71489
37011a2584952j74847j75367j63282j37958j10081r3847r6083j12625j35162j60974
37001a3945178j95425k45609l12549l89438m65756n31929n80673o05908o01803
36992a7874268n63403m88568l80035k46027r8566M9592J87094L03918L90491M38824
36982a8280948M46768M22822L86749L63286L71269M14433M79393N41904N77881
$$ plain form
37050 -10217235 -9586362 -8938348 -8334587 -7818904 -7413055 -7119254 -6927738 -6825855 -6805088
37041 -6805088 -6863423 -7002976 -7225802 -7531453 -7917007 -8377108 -8901771 -9472736 -10061073 -10627771
37031 -10627771 -11127560 -11516141 -11760620 -11850418 -11802969 -11659738 -11473752 -11295093 -11160849 -11091727
37021 -11091727 -11093761 -11162437 -11287140 -11454224 -11648177 -11852404 -12051998 -12238574 -12413463 -12584952
37011 -12584952 -12759799 -12935166 -13098448 -13236406 -13346487 -13440334 -13536417 -13649042 -13784204 -13945178
37001 -13945178 -14140603 -14386212 -14698761 -15088199 -15553955 -16085884 -16666557 -17272465 -17874268
36992 -17874268 -18437671 -18926239 -19306274 -19552301 -19650867 -19601275 -19414181 -19110263 -18719772 -18280948
36982 -18280948 -17834180 -17411358 -17024609 -16661323 -16290054 -15875621 -15396228 -14854324 -14276443
36973a4276443N73611N30416M61901L86318L19510K72757K54727K73280L34152
36964a0869771M37593N75841P32877Q86242J010820J084694J095920J047716R59225
36955c038843Q60178P80249P37047P29290P39726P46091P32634O95198O38689
36946C620259N71184M99254M26094L51537K72831J86045Q8244j9904j32565k39672
36936E623307l30350l96419m33208m37415m05161l33419k24598q9911N2703J86174
36926C211703L02756M07690N15430O40566P88294R49226J101041J216240J272371
36917A0405317J259883J183925J059876R05726P35765N58405L78056J98291K3422
36908A6708666j42653k98601m45945n85837p13899q17352q77951q80024q18190
$$ plain form
36973 -14276443 -13702832 -13172416 -12710515 -12324197 -12004687 -11731930 -11477203 -11203923 -10869771
36964 -10869771 -10432178 -9856337 -9123460 -8237218 -7226398 -6141704 -5045784 -3998068 -3038843
36955 -3038843 -2178665 -1398416 -661369 67921 807647 1553738 2286372 2981570 3620259
36946 3620259 4191443 4690697 5116791 5468328 5741159 5927204 6015448 5995544 5862979 5623307
36936 5623307 5292957 4896538 4463330 4025915 3620754 3287335 3062737 2972826 3025529 3211703
36926 3211703 3514459 3922149 4437579 5078145 5866439 6815665 7916706 9132946 10405317
36917 10405317 11665200 12849125 13909001 14814727 15550492 16108897 16486953 16685244 16708666
36908 16708666 16566013 16267412 15821467 15235630 14521731 13704379 12826428 11946404 11128214
36899A1128214o99118n36796l46652j44098N2412K18515L25569L46726K64804
36890A0609576P9296j89638n02545q08497j056970j208455j239808j144790r33229
36881C604940o30867k78345P3488L72382N74798O54146O05526M46293K11340n6589
36871E577112l17661n41423p07735q06112q37110q13722p58142o93280o33976
36862e32049n83098n33397m73033l92603k91465j80261p7607k436L3343K7924
36852c004682j1748p3095j40200j95427k22477k11565j63848r0979r096O8591
36842d054526J35704J91800K38713K76662L02168L09539K95662K64135K23957
$$ plain form
36899 11128214 10429096 9892300 9545648 9401550 9453962 9672477 9998046 10344772 10609576
36890 10609576 10688872 10499234 9996689 9188192 8131222 6922767 5682959 4538169 3604940
36881 3604940 2974073 2695728 2769216 3141598 3716396 4370542 4976068 5422361 5633701 5577112
36871 5577112 5259451 4718028 4010293 3204181 2367071 1553349 795207 101927 -532049
36862 -532049 -1115147 -1648544 -2121577 -2514180 -2805645 -2985906 -3063513 -3065949 -3032606 -3004682
36852 -3004682 -3016430 -3089525 -3229725 -3425152 -3647629 -3859194 -4023042 -4114021 -4123117 -4054526
36842 -4054526 -3918822 -3727022 -3488309 -3211647 -2909479 -2599940 -2304278 -2040143 -1816186
$$ [...]
##END NTUPLES=NMR SPECTRUM
##END=
