##TITLE=31Pdec_25-2024
 CDCl3
 64 sc
 2.4.2024
##JCAMPDX= 6.0         $$ Bruker NMR JCAMP-DX V2.0
##DATA TYPE= NMR SPECTRUM
##DATA CLASS= NTUPLES
##ORIGIN= UXNMR, Bruker Analytische Messtechnik GmbH
##OWNER= root
$$ XWIN-NMR		Version 3.5
$$ Tue Apr  2 14:48:21 2024 Russian Standard Time (UT+4h)  she@DPX200
##.OBSERVE FREQUENCY= 81.013821
##.OBSERVE NUCLEUS= ^31P
##.ACQUISITION MODE= SIMULTANEOUS
##.ACQUISITION SCHEME= undefined
##.AVERAGES= 64
##.DIGITISER RES= 16
##SPECTROMETER/DATA SYSTEM= spect
##.PULSE SEQUENCE= zgpg30
##.SOLVENT NAME= D2O
##.SHIFT REFERENCE= (INTERNAL, D2O, 0, 248.564)
##AUDIT TRAIL= $$ (NUMBER, WHEN, WHO, WHERE, WHAT)
$$ ##TITLE= Audit trail, XWIN-NMR		Version 3.5
$$ ##JCAMPDX= 5.01
$$ ##ORIGIN= Bruker BioSpin GmbH
$$ ##OWNER= she
$$ F:/spectra/data/she/nmr/P31/1/pdata/1/auditp.txt
$$ ##AUDIT TRAIL=  $$ (NUMBER, WHEN, WHO, WHERE, WHAT)
(   1,<2024-04-02 14:47:31.75 +0400>,<she>,<DPX200>,
      <continue with go, POWCHK disabled, PULCHK disabled
       configuration hash MD5:
       00 E9 B6 7A A2 85 ED C7 34 08 36 98 17 FE 4E 26
       data hash MD5: 32K
       3C 51 FF 9F 9C B4 2F 2B C6 CA E8 63 99 EB D9 83>)
(   2,<2024-04-02 14:47:34.85 +0400>,<she>,<DPX200>,
      <Start of raw data processing
       efp BC_mod = 2 LB = 10 FT_mod = 6 PKNL = 1 PHC0 = -13234.22 PHC1 = 125.8833 SI = 64K 
       data hash MD5: 64K
       DC 76 94 83 08 3B E3 E6 6C 80 73 9D 29 57 FA 47>)
(   3,<2024-04-02 14:47:49.89 +0400>,<she>,<DPX200>,
      <pk PHC0 = -4.639962 PHC1 = -34.99997 
       data hash MD5: 64K
       ED 84 B0 9B DE 24 22 3F 54 3F AD 7C BA A7 1D 2E>)
(   4,<2024-04-02 14:47:55.95 +0400>,<she>,<DPX200>,
      <abs ABSG = 5 
       data hash MD5: 64K
       4B 4B 46 BA 6A CE E9 AB 90 EC 9E 00 C4 70 17 80>)
$$ ##END=
$$ 
$$ hash MD5
$$ 51 A9 FE 2D 59 1A 06 E2 94 7A 78 20 7B 44 45 25
##$RELAX= 
##$RELAX= 
##$RELAX= 
##$RELAX= 
##$RELAX= 
##$RELAX= 
##$RELAX= 
##$RELAX= 
##$RELAX= 
$$ Bruker specific parameters
$$ --------------------------
##$DU= <F:/spectra>
##$EXPNO= 1
##$NAME= <P31>
##$PROCNO= 1
##$TYPE= <nmr>
##$USER= <she>
##$AMP= (0..31)
100 100 100 100 100 100 100 100 100 100 100 100 100 100 100 100 100 100 
100 100 100 100 100 100 100 100 100 100 100 100 100 100 
##$AQSEQ= 0
##$AQ_mod= 1
##$AUNM= <au_zg>
##$AUTOPOS= <>
##$BF1= 81.014009
##$BF2= 200.13
##$BF3= 200.13
##$BF4= 200.13
##$BF5= 200.13
##$BF6= 200.13
##$BF7= 200.13
##$BF8= 200.13
##$BYTORDA= 1
##$CFDGTYP= 0
##$CFRGTYP= 5
##$CHEMSTR= <none>
##$CNST= (0..31)
1 1 145 1 1 1 1 1 1 1 1 1 1 1 1 1 1 1 1 1 1 1 1 1 1 1 1 1 1 1 1 1 
##$CPDPRG= <waltz16>
##$CPDPRG1= <>
##$CPDPRG2= <waltz16>
##$CPDPRG3= <>
##$CPDPRG4= <mlev>
##$CPDPRG5= <mlev>
##$CPDPRG6= <mlev>
##$CPDPRG7= <mlev>
##$CPDPRG8= <mlev>
##$CPDPRGB= <>
##$CPDPRGT= <>
##$D= (0..31)
0 1 0 0 0 0 0 0 0 0 0 0.03 2e-05 3e-06 0 0 0 0 0 0 0 0 0 0 0 0 0 0 0 0 
0 0 
##$DATE= 1712054769
##$DBL= (0..7)
120 120 120 11 120 120 24 19 
##$DBP= (0..7)
150 150 150 150 150 150 150 150 
##$DBP07= 0
##$DBPNAM0= <>
##$DBPNAM1= <>
$$ [...]
##$SUBNAM3= <"">
##$SUBNAM4= <"">
##$SUBNAM5= <"">
##$SUBNAM6= <"">
##$SUBNAM7= <"">
##$SUBNAM8= <"">
##$SUBNAM9= <"">
##$SW= 501.771253377433
##$SWIBOX= (0..15)
0 1 3 0 0 0 0 0 0 0 0 0 0 0 0 0 
##$SW_h= 40650.406504065
##$TD= 32768
##$TD0= 1
##$TE= 0
##$TE2= 300
##$TE3= 300
##$TEG= 300
##$TL= (0..7)
0 120 53 12 22 120 120 120 
##$TP= (0..7)
150 150 150 150 150 150 150 150 
##$TP07= 0
##$TPNAME0= <>
##$TPNAME1= <>
##$TPNAME2= <>
##$TPNAME3= <>
##$TPNAME4= <>
##$TPNAME5= <>
##$TPNAME6= <>
##$TPNAME7= <>
##$TPOAL= (0..7)
0.5 0.5 0.5 0.5 0.5 0.5 0.5 0.5 
##$TPOFFS= (0..7)
0 0 0 0 0 0 0 0 
##$TUNHIN= 0
##$TUNHOUT= 0
##$TUNXOUT= 0
##$USERA1= <user>
##$USERA2= <user>
##$USERA3= <user>
##$USERA4= <user>
##$USERA5= <user>
##$V9= 5
##$VALIST= <valist>
##$VCLIST= <CCCCCCCCCCCCCCC>
##$VD= 0
##$VDLIST= <DDDDDDDDDDDDDDD>
##$VPLIST= <PPPPPPPPPPPPPPP>
##$VTLIST= <TTTTTTTTTTTTTTT>
##$WBST= 1024
##$WBSW= 4
##$XGAIN= (0..3)
0 0 0 0 
##$XL= 0
##$YL= 0
##$YMAX_a= 1714
##$YMIN_a= -4922
##$ZGOPTNS= <>
##$ZL1= 120
##$ZL2= 120
##$ZL3= 120
##$ZL4= 120
##$ABSF1= 248.5645
##$ABSF2= -253.2056
##$ABSG= 5
##$ABSL= 3
##$ALPHA= 0
##$AQORDER= 0
##$ASSFAC= 0
##$ASSFACI= 0
##$ASSFACX= 0
##$ASSWID= 0
##$AUNMP= <proc_1d>
##$AZFE= 0.1
##$AZFW= 0.5
##$BCFW= 0
##$BC_mod= 2
##$BYTORDP= 0
##$COROFFS= 0
##$CY= -3
##$DATMOD= 1
##$DC= 0
##$DFILT= <>
##$DTYPP= 0
##$F1P= 0
##$F2P= 0
##$FCOR= 1
##$FTSIZE= 65536
##$FT_mod= 6
##$GAMMA= 0
##$GB= 0
##$INTBC= 1
##$INTSCL= 6.047779e-11
##$ISEN= 30
##$LB= 10
##$LEV0= 0
##$LPBIN= 0
##$MAXI= 10000
##$MC2= 0
##$MEAN= 0
##$ME_mod= 0
##$MI= 50
##$NCOEF= 0
##$NC_proc= -11
##$NLEV= 6
##$NOISF1= 182.463
##$NOISF2= 159.3651
##$NSP= 0
##$NTH_PI= 0
##$NZP= 0
##$OFFSET= 248.5645
##$PC= 4
##$PHC0= -13238.86
##$PHC1= 90.88333
##$PH_mod= 1
##$PKNL= yes
##$PPARMOD= 0
##$PSCAL= 0
##$PSIGN= 0
##$REVERSE= no
##$SF= 81.0140089999694
##$SI= 65536
##$SIGF1= 159.3651
##$SIGF2= -187.1042
##$SINO= 113.3802
##$SIOLD= 16384
##$SREGLST= <1H.CDCl3>
##$SSB= 0
##$STSI= 65536
##$STSR= 0
##$SW_p= 40650.406504065
##$SYMM= 0
##$S_DEV= 0
##$TDeff= 32768
##$TDoff= 0
##$TI= <>
##$TILT= no
##$TM1= 0
##$TM2= 0
##$TOPLEV= 0
##$USERP1= <user>
##$USERP2= <user>
##$USERP3= <user>
##$USERP4= <user>
##$USERP5= <user>
##$WDW= 1
##$XDIM= 65536
##$YMAX_p= 316156355
##$YMIN_p= -248714115
$$ End of Bruker specific parameters
$$ ---------------------------------
##NTUPLES= NMR SPECTRUM
##VAR_NAME=  FREQUENCY,     SPECTRUM/REAL,   SPECTRUM/IMAG
##SYMBOL=    X,             R,               I
##VAR_TYPE=  INDEPENDENT,   DEPENDENT,       DEPENDENT
##VAR_FORM=  AFFN,          ASDF,            ASDF
##VAR_DIM=   65536,         65536,           65536
##UNITS=     HZ,            ARBITRARY UNITS, ARBITRARY UNITS
##FACTOR=    0.620285442955139, 1,           1
##FIRST=     20137.2065510682, 0,            0
##LAST=      -20513.1999529968, 0,           0
##MIN=       -20513.1999529968, -248714115,  0
##MAX=       20137.2065510682, 316156355,    0
$$ Real data points
##PAGE= N=1
##DATA TABLE= (X++(R..R)), XYDATA
$$ [...]
12920a0447671m8314k48530l40887k93607j28912R3213L09020M81617O11279P25324
12910i287468Q59129J039872J278757J572654J912103K288436K692127L102257
12902E457867L477626L761497L899410L856756L624721L217637K672739K054461
12894C2022714J450991R51685O12340M32265L62905L43198L34914L32249L42755
12885C7186016L59579L49212K64760P6160k02004n03705p33278q06783o91457
12876C5298500m22064q5372K19834M27711N31773N77332O24276P04767Q03748
12867C8680505Q73166Q67065P72108O12741M28598K43283N1987j60582l89765
12858D1979106n98114p31125p44617o22574l83248q2579J86943L16339K22164
$$ plain form
12920 -10447671 -10495985 -10744515 -11085402 -11379009 -11507921 -11414708 -11105688 -10624071 -10012792 -9287468
12910 -9287468 -8428339 -7388467 -6109710 -4537056 -2624953 -336517 2355610 5457867
12902 5457867 8935493 12696990 16596400 20453156 24077877 27295514 29968253 32022714
12894 32022714 33473705 34425390 35037730 35469995 35832900 36176098 36511012 36843261 37186016
12885 37186016 37545595 37894807 38159567 38235727 38033723 37530018 36796740 35989957 35298500
12876 35298500 34876436 34791064 35010898 35438609 35970382 36547714 37171990 37876757 38680505
12867 38680505 39553671 40420736 41192844 41805585 42234183 42477466 42529453 42368871 41979106
12858 41979106 41380992 40649867 39905250 39282676 38899428 38816849 39003792 39320131 39542295
12849C9542295j11663o21726j191326j697414k053936k236799k284597k273476
12841B7071358k275160k321974k403086k492521k582321k692732k855452l088170
12833F359942l378359l679841l917182l995362l817061l309447k456612j325530
12825a9519452o8287J111413K020703K541438K662807K467437K084838J644022
12817e055081J250051R82881Q97386J010254J284361J633566J954489K165497
12809F123404K226364K130312J882213J483554R35897K59979m84364j195522j752729
12800A1609108k055182k057449j783838j315525p56433j92924L32261Q16934J270935
12791E867887J686089K030063K266697K379169K371149K247017J996133J600057
$$ plain form
12849 39542295 39430632 38808906 37617580 35920166 33866230 31629431 29344834 27071358
12841 27071358 24796198 22474224 20071138 17578617 14996296 12303564 9448112 6359942
12833 6359942 2981583 -698258 -4615440 -8610802 -12427863 -15737310 -18193922 -19519452
12825 -19519452 -19587739 -18476326 -16455623 -13914185 -11251378 -8783941 -6699103 -5055081
12817 -5055081 -3805030 -2822149 -1924763 -914509 369852 2003418 3957907 6123404
12809 6123404 8349768 10480080 12362293 13845847 14781744 15041723 14557359 13361837 11609108
12800 11609108 9553926 7496477 5712639 4397114 3640681 3447757 3780018 4596952 5867887
12791 5867887 7553976 9584039 11850736 14229905 16601054 18848071 20844204 22444261
12783B2444261J054507L83258l65612j131393j849510k459127k914561l195720
12775A1966103l307193l264296l076987k744841k268231j669371j009075l84882
12767e758773R3594L42267L35168J15690k21730n73508q70260j095531j272438
12758h905521j436044j612153j804363j981448k071414j979227j629190j008489
12750b2427849j87623O88878J438131J896075J977408J702751J171120N00175
12742a3240934k17544r18174j548564k057204k402825k568875k570782k450637
12734b7975539k260826k046073j836791j655622j522537j445335j403761j349650
12726d1496134j231635j025969p46176m23851q0292K83264O68333J054348J393794
$$ plain form
12783 22444261 23498768 23882026 23516414 22385021 20535511 18076384 15161823 11966103
12775 11966103 8658910 5394614 2317627 -427214 -2695445 -4364816 -5373891 -5758773
12767 -5758773 -5665179 -5322912 -4987744 -4872054 -5093784 -5667292 -6537552 -7633083 -8905521
12758 -8905521 -10341565 -11953718 -13758081 -15739529 -17810943 -19790170 -21419360 -22427849
12750 -22427849 -22615472 -21926594 -20488463 -18592388 -16614980 -14912229 -13741109 -13240934
12742 -13240934 -13458478 -14376652 -15925216 -17982420 -20385245 -22954120 -25524902 -27975539
12734 -27975539 -30236365 -32282438 -34119229 -35774851 -37297388 -38742723 -40146484 -41496134
12726 -41496134 -42727769 -43753738 -44499914 -44923765 -45004057 -44720793 -44052460 -42998112 -41604318
12717d1604318J634735J752043J763677J724061J700398J740766J845219J956577
12709b7486842J982379J839264J494091R80487L85982j82882o43373r65617j167680
12700b3764191j278259j296924j185932r00451m32456J64588P86635J318098J676751
12691b4912141J842386J860359J824573J847965K026044K401899K948549L580356
12683f580010M186805M667082M949552M997037M807006M409203L856202L204422
12675B8497299K492041J726696Q93464j8356r86598j948233k821835l546437m108426
12666B0179615m537008m873220n135683n304352n327587n144949m716065m047412
12658a8906661l206524k312932j505075q97524n48082m45038n13935o40458p06976
$$ plain form
12717 -41604318 -39969583 -38217540 -36453863 -34729802 -33029404 -31288638 -29443419 -27486842
12709 -27486842 -25504463 -23665199 -22171108 -21190621 -20804639 -20987521 -21630894 -22596511 -23764191
12700 -23764191 -25042450 -26339374 -27525306 -28425757 -28858213 -28693625 -27906990 -26588892 -24912141
12691 -24912141 -23069755 -21209396 -19384823 -17536858 -15510814 -13108915 -10160366 -6580010
12683 -6580010 -2393205 2273877 7223429 12220466 17027472 21436675 25292877 28497299
12675 28497299 30989340 32716036 33609500 33591144 32604546 30656313 27834478 24288041 20179615
12666 20179615 15642607 10769387 5633704 329352 -4998235 -10143184 -14859249 -18906661
12658 -18906661 -22113185 -24426117 -25931192 -26828716 -27376798 -27821836 -28335771 -28976229 -29683205
12649b9683205o34784m14118j02850K09598M52594O06356O96336P60456Q19097
12640b7290520Q69413R00552R10986R13904R29877R75070J055274J171710J333409
12631a8230325J561406J875340K270421K702830L093568L348421L387956L180305
12623C189922K760991K220967J662387J150156O94340K72127j35116n22518q71863
12614A0421393j175465j448404j717157j994101k257569k451025k502611k357485
12606e482424k009651j516154r81470n16350j91909j2335Q1462J79565L57629
12597a0091637O42353J008174J405171J795691K172455K546467K914454L229703
12589E622831L400972L327395K949281K279009J392736L97219n98914j495969
$$ plain form
12649 -29683205 -30317989 -30732107 -30834957 -30625359 -30172765 -29566409 -28870073 -28109617 -27290520
12640 -27290520 -26421107 -25520555 -24609569 -23695665 -22765788 -21790718 -20735444 -19563734 -18230325
12631 -18230325 -16668919 -14793579 -12523158 -9820328 -6726760 -3378339 9617 3189922
12623 3189922 5950913 8171880 9834267 10984423 11678763 11950890 11815774 11293256 10421393
12614 10421393 9245928 7797524 6080367 4086266 1828697 -622328 -3124939 -5482424
12606 -5482424 -7492075 -9008229 -9989699 -10506049 -10697958 -10710293 -10628831 -10449266 -10091637
12597 -10091637 -9449284 -8441110 -7035939 -5240248 -3067793 -521326 2393128 5622831
12589 5622831 9023803 12351198 15300479 17579488 18972224 19369443 18770529 17274560
12581A7274560k205864k662288k841750k782913k583740k364987k214674k149938
12573b531594k123011k061656j909446j642748j269095q22029l56237O4365L89637
12564a2261814O08813P61659R22614J162736J511324J938689K365333K689587
12556c01059K824050K729137K426141J978851J457288R12845L77990j23859n75741
12547A1705643r69310j299256j549461j683600j651390j412250r68010l84967
12539A787399K17487P13685J023793J133868J076819Q99919O45591L49510M5735
12530G893806k29720m40624n58728n73168m90409l20920o4209K91361P51178J293178
12520G551745J859069K362430K706520K803582K593947K066109J271888L23457
$$ plain form
12581 17274560 15068696 12406408 9564658 6781745 4198005 1833018 -381656 -2531594
12573 -2531594 -4654605 -6716261 -8625707 -10268455 -11537550 -12359579 -12715816 -12651451 -12261814
12564 -12261814 -11653001 -10891342 -9968728 -8805992 -7294668 -5355979 -2990646 -301059
12556 -301059 2522991 5252128 7678269 9657120 11114408 12027253 12405243 12281384 11705643
12547 11705643 10736333 9437077 7887616 6204016 4552626 3140376 2172366 1787399
12539 1787399 2004886 2718571 3742364 4876232 5953051 6852970 7498561 7848071 7893806
12530 7893806 7664086 7223462 6664734 6091566 5601157 5280237 5216028 5507389 6258567 7551745
12520 7551745 9410814 11773244 14479764 17283346 19877293 21943402 23215290 23538747
12512B3538747o34455j465829k076625k427719k529650k425636k167860j796835
12504H014138j338090q18395k82706K10417O14349R17779J145699J339128J529480
12495A1331799J721542J890455J991962J981382J833290J553123J175453P49988
12487B4228994L22909p6435m38013p66194j074770j384224j717244k089836k501463
12478A4503724k929652l331249l649947l829307l827401l625185l223304k631661
12470a2543982j862922r36916J07120J200123K243998L128197L758367M084821
12462h21194M116468L914310L570304L181862K827825K548663K337328K150716
12454B3826282J943066J703686J471059J310216J270698J357864J534389J740524
$$ plain form
12512 23538747 22904292 21438463 19361838 16934119 14404469 11978833 9810973 8014138
12504 8014138 6676048 5857653 5574947 5785364 6399713 7317492 8463191 9802319 11331799
12495 11331799 13053341 14943796 16935758 18917140 20750430 22303553 23479006 24228994
12487 24228994 24551903 24475468 24037455 23271261 22196491 20812267 19095023 17005187 14503724
12478 14503724 11574072 8242823 4592876 763569 -3063832 -6689017 -9912321 -12543982
12470 -12543982 -14406904 -15343820 -15236700 -14036577 -11792579 -8664382 -4906015 -821194
12462 -821194 3295274 7209584 10779888 13961750 16789575 19338238 21675566 23826282
12454 23826282 25769348 27473034 28944093 30254309 31525007 32882871 34417260 36157784
12446C6157784J913110J997499J958182J788102J508858J160376P88640M36917
12438D7709468J35534j12093l35690n83319q90237j253802j633273j973549k235366
12429C8827673k412517k527540k613165k695892k792076k912270l063096l244301
12421A6566816l448439l667370l898931m143673m389951m596699m687780m567213
12413a6833240m152568l411262k380843j163101J04352J286209K282011L040825
12405b1227617L554810L840835L924880L836627L609849L281486K888308K464301
12397F173479K039617J638894J277661R58878O73785M09981J63098n9129k49713
12388A3026551m25174o35513r43965j384319j924924k465460k870203l019434
$$ plain form
12446 36157784 38070894 40068393 42026575 43814677 45323535 46483911 47272551 47709468
12438 47709468 47845002 47732909 47397219 46813900 45923663 44669861 43036588 41063039 38827673
12429 38827673 36415156 33887616 31274451 28578559 25786483 22874213 19811117 16566816
12421 16566816 13118377 9451007 5552076 1408403 -2981548 -7578247 -12266027 -16833240
12413 -16833240 -20985808 -24397070 -26777913 -27941014 -27836662 -26550453 -24268442 -21227617
12405 -21227617 -17672807 -13831972 -9907092 -6070465 -2460616 820870 3709178 6173479
12397 6173479 8213096 9851990 11129651 12088529 12762314 13172295 13335393 13276264 13026551
12388 13026551 12601377 11965864 11021899 9637580 7712656 5247196 2376993 -642441
12380f42441k853028k387692j704864r19688j46696N25302J043489J388189J563871
12371d133558J591495J504141J343155J152810R74344Q39394P61279P27511P03092
12362E463663O48448N40651L80375J80673m7794k98345n56127p88492r53830j027062
12352C542160j020272r76517r38442r19462r04532q78429q52707q66443r62715
12343d777359j163377j461620j833101k250250k683019l085395l385466l498234
12335b4137821l358845k952632k320430j539640o98038J24423Q61044J454324
12327c2567615J850565K003126J887553J519160R59882L11649k96198p22330q38259
12318b5892467n64570R6426J053272K148722L199023M031927M520033M611709
$$ plain form
12380 -642441 -3495469 -5883161 -7588025 -8507713 -8654409 -8129107 -7085618 -5697429 -4133558
12371 -4133558 -2542063 -1037922 305233 1458043 2432387 3271781 4033060 4760571 5463663
12362 5463663 6112111 6652762 7033137 7213810 7166016 6867671 6311544 5523052 4569222 3542160
12352 3542160 2521888 1545371 606929 -312533 -1217065 -2095494 -2948201 -3814644 -4777359
12343 -4777359 -5940736 -7402356 -9235457 -11485707 -14168726 -17254121 -20639587 -24137821
12335 -24137821 -27496666 -30449298 -32769728 -34309368 -35007406 -34882983 -34021939 -32567615
12327 -32567615 -30717050 -28713924 -26826371 -25307211 -24347329 -24035680 -24331878 -25054208 -25892467
12318 -25892467 -26457037 -26360611 -25307339 -23158617 -19959594 -15927667 -11407634 -6795925
12310f795925M349693L856450L279535K722788K206651J681272J077342L57879
12302A2735685m55790j288419k037366k610456k959567l089666l033302k807509
12294e546390k389541j736383q36243K47528J373972K366297L072813L416402
12286c1545L413767L161139K794127K436972K160290J963955J791675J569545
12278A9259925J249192Q33574L72436o8391m43905p49754j013750j267635j520456
12269A6651236j750831j918601j982265j909661j681825j298211p86129k05183
12261E118530L64999Q53149J223801J483058J657853J766154J803241J753419
12253A6024204J612548J399541J149852R02023O89756N39865M69207M78063N44226
$$ plain form
12310 -6795925 -2446232 1410218 4689753 7412541 9619192 11300464 12377806 12735685
12302 12735685 12279895 10991476 8954110 6343654 3384087 294421 -2738881 -5546390
12294 -5546390 -7935931 -9672314 -10508557 -10261029 -8887057 -6520760 -3447947 -31545
12286 -31545 3382222 6543361 9337488 11774460 13934750 15898705 17690380 19259925
12278 19259925 20509117 21342691 21715127 21646736 21202831 20453077 19439327 18171692 16651236
12269 16651236 14900405 12981804 10999539 9089878 7408053 6109842 5323713 5118530
12261 5118530 5483529 6336678 7560479 9043537 10701390 12467544 14270785 16024204
12253 16024204 17636752 19036293 20186145 21088168 21777924 22317789 22786996 23265059 23809285
12244B3809285O22140O48590N56459K97220j34058o86252j264546j763377k099112
12235A9986349k223401k117562j785384j257584o01888P8022O61515J038619J134109
12226A4912795R24161M44195k19360r58421j682268k342151k927141l440260l875761
12217H35789m211033m413641m457487m339134m083760l735426l338967k927688
12209c0671347k522829k137990j780789j452932j153528q84648o54081m73456
12201d1731600l52275k86976k48005j78040j3664K78458O79970J133037J574172
12192c9144923J960502K273842K509781K664619K726964K678584K507032K222267
12184a9601332J861788J478779J124457Q35985O26894M74163L10706L9900m26188
$$ plain form
12244 23809285 24431425 25080015 25636474 25933694 25799636 25113384 23848838 22085461 19986349
12235 19986349 17762948 15645386 13860002 12602418 12000530 12078552 12740067 13778686 14912795
12226 14912795 15836956 16281151 16061791 15103370 13421102 11078951 8151810 4711550 835789
12217 835789 -3375244 -7788885 -12246372 -16585506 -20669266 -24404692 -27743659 -30671347
12209 -30671347 -33194176 -35332166 -37112955 -38565887 -39719415 -40604063 -41258144 -41731600
12201 -41731600 -42083875 -42370851 -42618856 -42796896 -42810560 -42532102 -41852132 -40719095 -39144923
12192 -39144923 -37184421 -34910579 -32400798 -29736179 -27009215 -24330631 -21823599 -19601332
12184 -19601332 -17739544 -16260765 -15136308 -14300323 -13673429 -13199266 -12888560 -12848660 -13274848
12175a3274848j122886k004182k940846l750361m255002m345857m016654l346032
12167c9056668k444173j404639k92409Q33314J889834K767657L364842L638561
12159c0703681L635083L473832L296095L211259L266060L441306L668313L856020
12151b855713L920476L808453L508939L049326K475869J826233J111986L26746
12143A7172315n25319j405905k244667k963063l499080l817991l910625l788577
12135d982912l481476l034374k500816j931922j367087q31299l37044J14538N32723
12126a7819669R30693J313300J669205J975770K212381K370781K456785K485176
12118b405578K470178K413793K298324K091093J761656J301779P36102J17080
$$ plain form
12175 -13274848 -14397734 -16401916 -19342762 -23093123 -27348125 -31693982 -35710636 -39056668
12167 -39056668 -41500841 -42905480 -43197889 -42364575 -40474741 -37707084 -34342242 -30703681
12159 -30703681 -27068598 -23594766 -20298671 -17087412 -13821352 -10380046 -6711733 -2855713
12151 -2855713 1064763 4873216 8382155 11431481 13907350 15733583 16845569 17172315
12143 17172315 16646996 15241091 12996424 10033361 6534281 2716290 -1194335 -4982912
12135 -4982912 -8464388 -11498762 -13999578 -15931500 -17298587 -18129886 -18466930 -18352392 -17819669
12126 -17819669 -16888976 -15575676 -13906471 -11930701 -9718320 -7347539 -4890754 -2405578
12118 -2405578 64600 2478393 4776717 6867810 8629466 9931245 10667347 10784427
12110A0784427m92897j040850j491303j821328k014179k061629j970042j759267
12102a867068j456753j099391p42769m59744l17045l43987n18133p76294j039144
12093h620328j234682j313860j257339j074781p99096m76249j48038J69280M95821
12084a4259272Q72522J322101J811712K246415K503993K494407K208470J723731
12076I24079J164040O43320K32636l6525j51676j06996R2477M18175Q08867J174327
12066E162724J415568J454925J260095Q51256K94585l08939q39740j187265j285671
12057F817538j139197q19837m37052r6026J36802K50732K89483L34672M78005
12048E815120P88013J281332J910246K572904L141446L495675L551416L279394
$$ plain form
12110 10784427 10291530 9250680 7759377 5938049 3923870 1862241 -107801 -1867068
12102 -1867068 -3323821 -4423212 -5165981 -5625725 -5942770 -6286757 -6804890 -7581184 -8620328
12093 -8620328 -9855010 -11168870 -12426209 -13500990 -14300086 -14776335 -14924373 -14755093 -14259272
12084 -14259272 -13386750 -12064649 -10252937 -8006522 -5502529 -3008122 -799652 924079
12076 924079 2088119 2731439 2964075 2927550 2775874 2668878 2761355 3179530 3988397 5162724
12066 5162724 6578292 8033217 9293312 10144568 10439153 10130214 9290474 8103209 6817538
12057 6817538 5678341 4858504 4421452 4325426 4462228 4712960 5002443 5337115 5815120
12048 5815120 6603133 7884465 9794711 12367615 15509061 19004736 22556152 25835546
12040B5835546K712916J940531J081701K53217m57426j001028j362677j555888
12032B7446892j616206j586501j495437j347576j139895q91919o57237m99058
12024A8213063m46702m67204m72709l59375n7482M30179J018482J563812J912697
12015B1334761J956718J673384J136684M90701j03997n26670p29706p38660o27242
12006B3865973m83727l83344l74982m82650p12412j051360j454996j838059k091358
11997A4993085k129222j940411j601818j238432r55700p91096p12394o53166n56383
11988D414463m02240k11684k9406J00840J52448J16008r894k24667n24303q96625
11978B484940j315753j735277k084835k280784k255013j988260j525769r63446
$$ plain form
12040 25835546 28548462 30488993 31570694 31823911 31366485 30365457 29002780 27446892
12032 27446892 25830686 24244185 22748748 21401172 20261277 19369358 18712121 18213063
12024 18213063 17766361 17299157 16826448 16467073 16409591 16839770 17858252 19422064 21334761
12015 21334761 23291479 24964863 26101547 26592248 26488251 25961581 25231875 24493215 23865973
12006 23865973 23382246 22998902 22623920 22141270 21428858 20377498 18922502 17084443 14993085
11997 14993085 12863863 10923452 9321634 8083202 7127502 6336406 5624012 4970846 4414463
11988 4414463 4012223 3800539 3771133 3871973 4024421 4140429 4130535 3905868 3381565 2484940
11978 2484940 1169187 -566090 -2650925 -4931709 -7186722 -9174982 -10700751 -11664197
11970a1664197m13598K9320L09047M14066L76488K63563J58240J32350K25590
11961a0169131M40636P52015J119815J503449J873892K219913K543573K848165
11953C132327L127563L361686L516923L551653L429205L134720K684772K121373
11945B8060222J493671Q39418J77917m81814j125227j723238k237710k633361
11937B2369878k883421k969701k888194k661129k340881j996312j691153j468767
11929C470320j344676j302996j302505j298699j269068j217167j150225j055132
11921f470148q99527o56791l29048N2987M51204Q42536J224106J598170J950875
11912b235636K243887K426994K462936K347281K112108J814642J519783J283756
$$ plain form
11970 -11664197 -12077795 -12048475 -11739428 -11325362 -10948874 -10685311 -10527071 -10394721 -10169131
11961 -10169131 -9728495 -8976480 -7856665 -6353216 -4479324 -2259411 284162 3132327
11953 3132327 6259890 9621576 13138499 16690152 20119357 23254077 25938849 28060222
11945 28060222 29553893 30393311 30571228 30089414 28964187 27240949 25003239 22369878
11937 22369878 19486457 16516756 13628562 10967433 8626552 6630240 4939087 3470320
11929 3470320 2125644 822648 -479857 -1778556 -3047624 -4264791 -5415016 -6470148
11921 -6470148 -7369675 -8026466 -8355514 -8302527 -7851323 -7008787 -5784681 -4186511 -2235636
11912 -2235636 8251 2435245 4898181 7245462 9357570 11172212 12691995 13975751
11904A3975751J140689J092675J107729J130595J103402R85385P63533M54336
11896B1754095R7779k59196n86828q86638j177701j461947j699540j818668j751835
11887A2209521j469323r88792l63138L38529J045749J696150K241985K652797
11879A7363478K910172K995744K884337K554401K011502J303779N12573k75250
11871C2260736r91016j590295k047361k351648k509783k545603k492311k380939
11863A5351780k233678k063464j873534j654001j382659j038074o20330j62787
11855D323253K77198O44070R09168J078222J175109J211810J167274R95107O58620
11846A2439831J69065l98985r23431j272959j353304j144536p10317j70610L46498
$$ plain form
11904 13975751 15116440 16209115 17316844 18447439 19550841 20536226 21299759 21754095
11896 21754095 21851874 21592678 21005850 20119212 18941511 17479564 15780024 13961356 12209521
11887 12209521 10740198 9751406 9388268 9726797 10772546 12468696 14710681 17363478
11879 17363478 20273650 23269394 26153731 28708132 30719634 32023413 32535986 32260736
11871 32260736 31269720 29679425 27632064 25280416 22770633 20225030 17732719 15351780
11863 15351780 13118102 11054638 9181104 7527103 6144444 5106370 4486040 4323253
11855 4323253 4600451 5244521 6153689 7231911 8407020 9618830 10786104 11781211 12439831
11846 12439831 12608896 12209911 11286480 10013521 8660217 7515681 6805364 6634754 6981252
11837F981252P43449R65819R99668Q71452O50236M36870L33524M07079O66049
11828A3055398J060289J501260J895416K178100K330085K365861K304242K146761
11820B8837412J878550J482271R48577K81509m92440j314183k096384k748989
11812B6776323l210701l465843l541416l491991l378821l247455l114210k972563
11804C53323k814578k646658k485451k342310k215640k097880j985696j880037
11796a8114927j776902j661716j517067j339284j149019r84846q82705q54012
11788b8280478q75010q92390q42680o76622l75894M6850N60972J128983J704618
11779b8501651K224081K608216K783791K710417K391224J861067J167319L60930
$$ plain form
11837 6981252 7724701 8690520 9690188 10561640 11211876 11648746 11982270 12389349 13055398
11828 13055398 14115687 15616947 17512363 19690463 22020548 24386409 26690651 28837412
11820 28837412 30715962 32198233 33146810 33428319 32935879 31621696 29525312 26776323
11812 26776323 23565622 20099779 16558363 13066372 9687551 6440096 3325886 353323
11804 353323 -2461255 -5107913 -7593364 -9935674 -12151314 -14249194 -16234890 -18114927
11796 -18114927 -19891829 -21553545 -23070612 -24409896 -25558915 -26543761 -27426466 -28280478
11788 -28280478 -29155488 -30047878 -30890558 -31567180 -31943074 -31896224 -31335252 -30206269 -28501651
11779 -28501651 -26277570 -23669354 -20885563 -18175146 -15783922 -13922855 -12755536 -12394606
11771a2394606n00879j351656k120420k743200l178752l423854l516078l511230
11763c2740675l442591l292499l001638k508359j786098q56634K16949J342477
11755d6069068K409038L298741L904835M155660M035889L591215K909148K086036
11747a9678506J202399L21126m97306j181491j653396j852689j768491j456946
11739b6565300j028161o05777k82377r7390m7956j20037l12431o31961j063158
11730c0754548j541020j955465k188854k161849j861168j338448o84005J0527
11722d2474830O78609J278337J773592K123873K296487K286113K121750J861720
11714b8054349J587708J394590J363696J525001J835531K194843K489852K641923
$$ plain form
11771 -12394606 -12895485 -14247141 -16367561 -19110761 -22289513 -25713367 -29229445 -32740675
11763 -32740675 -36183266 -39475765 -42477403 -44985762 -46771860 -47628494 -47411545 -46069068
11755 -46069068 -43660030 -40361289 -36456454 -32300794 -28264905 -24673690 -21764542 -19678506
11747 -19678506 -18476107 -18154981 -18652287 -19833778 -21487174 -23339863 -25108354 -26565300
11739 -26565300 -27593461 -28199238 -28481615 -28579005 -28626961 -28746998 -29059429 -29691390 -30754548
11730 -30754548 -32295568 -34251033 -36439887 -38601736 -40462904 -41801352 -42485357 -42474830
11722 -42474830 -41796221 -40517884 -38744292 -36620419 -34323932 -32037819 -29916069 -28054349
11714 -28054349 -26466641 -25072051 -23708355 -22183354 -20347823 -18152980 -15663128 -13021205
11706a3021205K632257K497418K303425K116277J982452J918036J898898J856124
11698D183682J692273J322759P20467o6898r37318j775222k486276l011908l326203
11689c684644l425278l317839l021310k564438j992921j370239p68326k52444
11681b0397439J30061L55058M28077L92034L21407K91632L38111M35769N14845
11672a7190445N00212L50344P9558k44337n28877p01010p40826o82547n83102
11663a9741030m81330l75973k37059m1576J95926M25531N96691O95575P54492
11654a8208753Q29350R63952J162061J380447J548924J610214J554917J425199
11646g733689J285608J186981J150116J172270J240557J337620J437858J502846
$$ plain form
11706 -13021205 -10388948 -7891530 -5588105 -3471828 -1489376 428660 2327558 4183682
11698 4183682 5875955 7198714 7919181 7852283 6914965 5139743 2653467 -358441 -3684644
11689 -3684644 -7109922 -10427761 -13449071 -16013509 -18006430 -19376669 -20144995 -20397439
11681 -20397439 -20267378 -19912320 -19484243 -19092209 -18770802 -18479170 -18141059 -17705290 -17190445
11672 -17190445 -16690233 -16339889 -16260331 -16504668 -17033545 -17734555 -18475381 -19157928 -19741030
11663 -19741030 -20222360 -20598333 -20835392 -20876968 -20681042 -20255511 -19658820 -18963245 -18208753
11654 -18208753 -17379403 -16415451 -15253390 -13872943 -12324019 -10713805 -9158888 -7733689
11646 -7733689 -6448081 -5261100 -4110984 -2938714 -1698157 -360537 1077321 2580167
11638B580167J486701J355592J111471P99405M85072K13860j6676k46074n09284
11629G260234p99645j068815j262652j360640j386358j384937j390217j406446
11621b799476j411924j375172j271056j090799q47268n77382l37466j83659j39533
11612a0033735j71685j98909j36927N1482L37132O44504Q89711J012036R91830
11603f614561Q57329O78167N41043N13564O13149P96046R71465J037209R25286
11594C18697O36698K44370j39694m14287n29566n01039l93135k80353k07522j75635
11584a441466j61393j48312j39076j43905j66019k01559k49398l17302m20681
11575c389111n78014q04801j105373j465222j848777k204967k479350k629049
$$ plain form
11638 2580167 4066868 5422460 6533931 7333336 7818408 8032268 8015592 7769518 7260234
11629 7260234 6460589 5391774 4129122 2768482 1382124 -2813 -1393030 -2799476
11621 -2799476 -4211400 -5586572 -6857628 -7948427 -8795695 -9373077 -9710543 -9894202 -10033735
11612 -10033735 -10205420 -10404329 -10541256 -10489774 -10152642 -9508138 -8618427 -7606391 -6614561
11603 -6614561 -5757232 -5079065 -4538022 -4024458 -3411309 -2615263 -1643798 -606589 318697
11594 318697 955395 1199765 1060071 645784 116218 -384821 -777956 -1058309 -1265831 -1441466
11584 -1441466 -1602859 -1751171 -1890247 -2034152 -2200171 -2401730 -2651128 -2968430 -3389111
11575 -3389111 -3967125 -4771926 -5877299 -7342521 -9191298 -11396265 -13875615 -16504664
11567a6504664k633580k495472k232776j871905j444464r83011n13180m8949M02773
11558b8325228Q33274J228987J576466J868741K105436K282199K371542K309365
11550a3749218K008129J401935M97889o03882j737639k731062l465944l914449
11542b2294241m133833m218982m238192m193801m033921l702795l190007k544305
11534e2550077j846615j165240n25741Q5167O88000J276316J804513K205762K427357
11525d7600558K457807K325205K070884J725790J312406Q64493M36215Q6343j47627
11516c6469042k61480k73796k02302m3287K30359O45481J190961J793834K331588
11507c1057684K677782K755639K571372K210938J802109J461065J250062J162687
$$ plain form
11567 -16504664 -19138244 -21633716 -23866492 -25738397 -27182861 -28165872 -28679052 -28728001 -28325228
11558 -28325228 -27491954 -26262967 -24686501 -22817760 -20712324 -18430125 -16058583 -13749218
11550 -13749218 -11741089 -10339154 -9841265 -10445147 -12182786 -14913848 -18379792 -22294241
11542 -22294241 -26428074 -30647056 -34885248 -39079049 -43112970 -46815765 -50005772 -52550077
11534 -52550077 -54396692 -55561932 -56087673 -56002506 -55314506 -54038190 -52233677 -50027915 -47600558
11525 -47600558 -45142751 -42817546 -40746662 -39020872 -37708466 -36843973 -36407758 -36321415 -36469042
11516 -36469042 -36730522 -37004318 -37206620 -37249907 -37019548 -36374067 -35183106 -33389272 -31057684
11507 -31057684 -28379902 -25624263 -23052891 -20841953 -19039844 -17578779 -16328717 -15166030
11499a5166030J134246J065527Q52581M19985k48497j093913j991927k790040
11491a7818068l359001l632653l613804l346442k877673k234580j425008m58254
11483c8765483O23417J719825K679063L344984L622364L517321L128945K602631
11475a7526933K073150J621467J259227R43654O11538K11324k81673q66550j523851
11466a3478647k217487k886805l435949l739904l682212l211464k377999j321557
11458c6352024k19283P70024J539258K043755K299542K370930K343432K285482
11450b2918884K214249K082881J797068J255410L98551p52026k083068l415337
11442b1421156m558337n368668n782454n808135n491736m882772m022745k956669
$$ plain form
11499 -15166030 -14031784 -12966257 -12113676 -11693691 -11942188 -13036101 -15028028 -17818068
11491 -17818068 -21177069 -24809722 -28423526 -31769968 -34647641 -36882221 -38307229 -38765483
11483 -38765483 -38142066 -36422241 -33743178 -30398194 -26775830 -23258509 -20129564 -17526933
11475 -17526933 -15453783 -13832316 -12573089 -11629435 -11017897 -10806573 -11088246 -11954796 -13478647
11466 -13478647 -15696134 -18582939 -22018888 -25758792 -29441004 -32652468 -35030467 -36352024
11458 -36352024 -36571307 -35801283 -34262025 -32218270 -29918728 -27547798 -25204366 -22918884
11450 -22918884 -20704635 -18621754 -16824686 -15569276 -15170725 -15922751 -18005819 -21421156
11442 -21421156 -25979493 -31348161 -37130615 -42938750 -48430486 -53313258 -57336003 -60292672
11434f0292672j748785m84046P45779J857551K784380L479795L924445M128804
11426d5604749M122404L936612L600030L152050K656575K196388J849056J660058
11418b2431576J625736J692675J778145J807642J748981J619047J460238J308017
11410i391095J174158J053803R47178Q77757Q89670J021876J278050J617298J969975
11401A438670K258851K408613K349765K031927J446030O39437k87377j200527
11393A1085389j962049k463488k654793k555029k238159j802246j339413r18907
11385d848695n84095l56619k40573k24065k80164l70421m52131m89010m63345
11376h309118l83587k77785j70883o1240Q0415K83270N41942Q05206R96404J047339
$$ plain form
11434 -60292672 -62041457 -62525503 -61779724 -59922173 -57137793 -53657998 -49733553 -45604749
11426 -45604749 -41482345 -37545733 -33945703 -30793653 -28137078 -25940690 -24091634 -22431576
11418 -22431576 -20805840 -19113165 -17335020 -15527378 -13778397 -12159350 -10699112 -9391095
11410 -9391095 -8216937 -7163134 -6215956 -5338199 -4448529 -3426653 -2148603 -531305 1438670
11401 1438670 3697521 6106134 8455899 10487826 11933856 12573293 12285916 11085389
11393 11085389 9123340 6659852 4005059 1450030 -788129 -2590375 -3929788 -4848695
11385 -4848695 -5432790 -5789409 -6029982 -6254047 -6534211 -6904632 -7356763 -7845773 -8309118
11376 -8309118 -8692705 -8970490 -9141373 -9202613 -9122198 -8838928 -8296986 -7491780 -6495376 -5448037
11366e448037R22798O27961K03321k87748p75294j195764j494453j621073j532555
11357a0600844j210035o77165P16P40436J469118K134817K697151L114479L345742
11348A014415L370034L209227K932184K630258K377228K201880K091326K016412
11340B1842964J955071J898787J846208J795521J741740J678709J602694J513094
11332C5874788J407795J277569J107594Q86744O14625K98265n6324m46350q66833
11323D0097873j307743j760272k223685k698306l164071l564444l818259l858065
11315A7703028l665363l272872k736380k108718j440884p99604k69708P3436K02793
11306C685728J57152K0528j24766k40182l40537m67985o53517q93918j153238
$$ plain form
11366 -5448037 -4525239 -3897278 -3693957 -3981705 -4756999 -5952763 -7447216 -9068289 -10600844
11357 -10600844 -11810879 -12488044 -12487328 -11746892 -10277774 -8142957 -5445806 -2331327 1014415
11348 1014415 4384449 7593676 10525860 13156118 15533346 17735226 19826552 21842964
11340 21842964 23798035 25696822 27543030 29338551 31080291 32759000 34361694 35874788
11332 35874788 37282583 38560152 39667746 40554490 41169115 41467380 41411056 40964706 40097873
11323 40097873 38790130 37029858 34806173 32107867 28943796 25379352 21561093 17703028
11315 17703028 14037665 10764793 8028413 5919695 4478811 3679207 3409499 3482935 3685728
11306 3685728 3842880 3863408 3738642 3498460 3157923 2689938 2036421 1142503 -10735
11297a0735j378034j514353j523830j398149j165456q82419o14846m17442l22022
11288i227286l37685m60468o84085j000876j389221j798106k146953k348793k344582
11279b1738055k124470j721283j184250n56787J25130Q18937J465480J997847
11271b2917451K367396K571247K660747K718393K812038K956592L111876L216042
11263e03120L225057L129722K946447K696995K392418K029278J600148J111894
11255A8628839N97666J13094k78792n24115n93980m99872k98735p4617R7413J78882
11245A7345783J66541O9527j09771l74836p19010j111999j503715j846125k116873
11236I799522k322823k477384k571237k566002k421626k138314j780300j461715
$$ plain form
11297 -10735 -1388769 -2903122 -4426952 -5825101 -6990557 -7872976 -8487822 -8905264 -9227286
11288 -9227286 -9564971 -10025439 -10709524 -11710400 -13099621 -14897727 -17044680 -19393473 -21738055
11279 -21738055 -23862525 -25583808 -26768058 -27324845 -27199715 -26380778 -24915298 -22917451
11271 -22917451 -20550055 -17978808 -15318061 -12599668 -9787630 -6831038 -3719162 -503120
11263 -503120 2721937 5851659 8798106 11495101 13887519 15916797 17516945 18628839
11255 18628839 19226505 19339599 19060807 18536692 17942712 17442840 17144105 17069488 17166901 17345783
11245 17345783 17512324 17581851 17472080 17097244 16378234 15266235 13762520 11916395 9799522
11236 9799522 7476699 4999315 2428078 -137924 -2559550 -4697864 -6478164 -7939879
11228g939879j301090j370459j666374k115395k606529l030571l308210l401298
11220b6739805l312801l081404k769367k440133k132906j852649j586698j334148
11212d5249911j118418r69373q94164q68256q53895q21724p50075o07288l46353
11203e2479457P1656O44068J315807K000850K613797L086545L369624L435283
11195c5941827L289495K980303K587124K192208J851290J580919J367567J189368
11187a8903553J034765R07924Q23263P97801Q43707R55619J093227J175090J102120
11178a0170037Q07324L00325l28689r51573j460835j804381j982072k022237j963628
11169a9575803j849474j722470j611984j518924j411284j237924r56203n57213
$$ plain form
11228 -7939879 -9240969 -10611428 -12277802 -14393197 -16999726 -20030297 -23338507 -26739805
11220 -26739805 -30052606 -33134010 -35903377 -38343510 -40476416 -42329065 -43915763 -45249911
11212 -45249911 -46368329 -47337702 -48231866 -49100122 -49954017 -50775741 -51525816 -52133104 -52479457
11203 -52479457 -52407801 -51763733 -50447926 -48447076 -45833279 -42746734 -39377110 -35941827
11195 -35941827 -32652332 -29672029 -27084905 -24892697 -23041407 -21460488 -20092921 -18903553
11187 -18903553 -17868788 -16960864 -16137601 -15339800 -14496093 -13540474 -12447247 -11272157 -10170037
11178 -10170037 -9362713 -9062388 -9391077 -10342650 -11803485 -13607866 -15589938 -17612175 -19575803
11169 -19575803 -21425277 -23147747 -24759731 -26278655 -27689939 -28927863 -29884066 -30441279
11161c0441279o9078M66778J025434J603135K188941K731455L138115L316852
11153a6039647L233741K946398K587527K304037K187688K241430K398611K570415
11145D430200K680961K674683K512712K177271J681034J067659M02048k37998
11137A7388570p63628j080924j113264q35393k97584L78502J031000J499568J664714
11128A7871561J481506J001483L66300k37126o43199p61038n91744k12591K57887
11119A8533039P02884J045170J260999J361941J361316J253722J021323O57432
11111B7197826J87430l29504q23169j246614j594601j888141k138716k326959
11103A7037552k415818k384381k252370k077039j926145j845413j842219j895655
$$ plain form
11161 -30441279 -30510357 -30043579 -29018145 -27415010 -25226069 -22494614 -19356499 -16039647
11153 -16039647 -12805906 -9859508 -7271981 -4967944 -2780256 -538826 1859785 4430200
11145 4430200 7111161 9785844 12298556 14475827 16156861 17224520 17626568 17388570
11137 17388570 16624942 15544018 14430754 13595361 13297777 13676279 14707279 16206847 17871561
11128 17871561 19353067 20354550 20720850 20483724 19840525 19079487 18487743 18275152 18533039
11119 18533039 19235923 20281093 21542092 22904033 24265349 25519071 26540394 27197826
11111 27197826 27385256 27055752 26232583 24985969 23391368 21503227 19364511 17037552
11103 17037552 14621734 12237353 9984983 7907944 5981799 4136386 2294167 398512
11095C98512j981580k088132k209680k331522k424915k456207k398880k239877
11087a7732281j981068j638492j238638q11756l85659J6947L77547O78977R03803
11078b1810620J039005J088517J085144J087904J159878J338882J621124J968724
11070a1421442K333570K678189K978539L210987L340083L320890L114178K702860
11062A2257854K101709J358693N45532k64272j020634j705928k318064k842156
11054H112734l236839l446340l424807l152426k636873j910225j031544r1480
11046a0817800P94806J513351J985000K186724K149634J939771J635766J311673
11038B698925J024468Q04023O47646N25064L96771K39326O2289r6808j97175k19640
$$ plain form
11095 398512 -1583068 -3671200 -5880880 -8212402 -10637317 -13093524 -15492404 -17732281
11087 -17732281 -19713349 -21351841 -22590479 -23402235 -23787894 -23770947 -23393400 -22714423 -21810620
11078 -21810620 -20771615 -19683098 -18597954 -17510050 -16350172 -15011290 -13390166 -11421442
11070 -11421442 -9087872 -6409683 -3431144 -220157 3119926 6440816 9554994 12257854
11062 12257854 14359563 15718256 16263788 15999516 14978882 13272954 10954890 8112734
11054 8112734 4875895 1429555 -1995252 -5147678 -7784551 -9694776 -10726320 -10817800
11046 -10817800 -10022994 -8509643 -6524643 -4337919 -2188285 -248514 1387252 2698925
11038 2698925 3723393 4527416 5175062 5700126 6096897 6336223 6398512 6301704 6104529 5884889
11028E884889j70346o0847J15005L81472P52445J196755J630496J948185K069750
11019A3747804J967293J658185J183121N94268m3068o52088j161306j528016j749082
11010A4017111j850022j862454j808397j700454j550155j371317j175452r67948
11002A730912p51926n35499l33806j64051l9310L3852N3814K1725n7700j70458
10992b12447k85794l54862l21059j39469K02914O73646J193588J651799J934525
10983D342841J956764J682376J128005L56373n35739j435587k239622k878970
10975B376441l331873l612732l740630l708066l477544l017007k350762j582325
10967b2444498q64189l33518o0623m2502k34077n82677j038635j543740k020229
$$ plain form
11028 5884889 5714543 5653696 5768701 6150173 6902618 8099373 9729869 11678054 13747804
11019 13747804 15715097 17373282 18556403 19150671 19107603 18455515 17294209 15766193 14017111
11010 14017111 12167089 10304635 8496238 6795784 5245629 3874312 2698860 1730912
11002 1730912 978986 443487 109681 -54370 -93680 -59828 -6014 15711 -41989 -212447
10992 -212447 -498241 -853103 -1174162 -1313631 -1110717 -437071 756517 2408316 4342841
10983 4342841 6299605 7981981 9109986 9466359 8930620 7495033 5255411 2376441
10975 2376441 -955432 -4568164 -8308794 -12016860 -15494404 -18511411 -20862173 -22444498
10967 -22444498 -23308687 -23642205 -23702828 -23745330 -23979407 -24562084 -25600719 -27144459 -29164688
10958b9164688k379301k547562k493003k231463j807747j262952o10616J59641
10950d2337691J052195K032019L013867L882027M527165M879537M925849M708547
10942a3316485M313811L854940L452857L211426L189224L377836L698318M019410
10934A5801337M192762M095751L667828K924393J943997Q42675k49074j208659
10926C2011010j951372k456538k764502k942113l048030l124972l209140l330776
10918I183567l502707l714355l936799m126150m220501m145322l837210l272020
10910b1571497k474758j506694m45391O25448J613581K414797K923512L060756
10902a5360246K805152K206855J378037M68701l64375r94296j358313j469541
$$ plain form
10958 -29164688 -31543989 -34091551 -36584554 -38816017 -40623764 -41886716 -42497332 -42337691
10950 -42337691 -41285496 -39253477 -36239610 -32357583 -27830418 -22950881 -18025032 -13316485
10942 -13316485 -9002674 -5147734 -1694877 1516549 4705773 8083609 11781927 15801337
10934 15801337 19994099 24089850 27757678 30682071 32626068 33468743 33219669 32011010
10926 32011010 30059638 27603100 24838598 21896485 18848455 15723483 12514343 9183567
10918 9183567 5680860 1966505 -1970294 -6096444 -10316945 -14462267 -18299477 -21571497
10910 -21571497 -24046255 -25552949 -25998340 -25372892 -23759311 -21344514 -18421002 -15360246
10902 -15360246 -12555094 -10348239 -8970202 -8501501 -8865876 -9860172 -11218485 -12688026
10894a2688026j393804j205704r53144o47286k74235J83178P23916J318249J915613
10885a3021243K465264K932206L295798L535505L618615L501470L146406K548076
10877A2022097J755676Q75838N0052n84203r30852r57523o99156k46414K75182
10868A1560697P30179J000253J012257P59269K98491k82326r11177j552933k185474
10859A0429236k756184l167287l309896l116987k590527j790233q07949K48168
10851f861659J260116K111375K707903L000721K999952K774467K435666K109817
10843A2538358J908331J902410K102196K444412K802978L031724L021772K737238
10835C2489419K209011J501590O84527j75676j011777j757211k360105k801340
$$ plain form
10894 -12688026 -14081830 -15287534 -16240678 -16887964 -17162199 -16979021 -16255105 -14936856 -13021243
10885 -13021243 -10555979 -7623773 -4327975 -792470 2826145 6327615 9474021 12022097
10877 12022097 13777773 14653611 14703663 14119460 13188608 12231085 11531929 11285515 11560697
10868 11560697 12290876 13291129 14303386 15062655 15361146 15078820 14167643 12614710 10429236
10859 10429236 7673052 4505765 1195869 -1921118 -4511645 -6301878 -7109827 -6861659
10851 -6861659 -5601543 -3490168 -782265 2218456 5218408 7992875 10428541 12538358
10843 12538358 14446689 16349099 18451295 20895707 23698685 26730409 29752181 32489419
10835 32489419 34698430 36200020 36884547 36708871 35697094 33939883 31579778 28778438
10827B8778438l099603l294384l417572l475460l451998l324464l078427k718286
10819B918244k272694j788109j307990q52996m23431k3866L14535N37539N97275
10810b301493M87541K60937J3621j56421j91113q6461J23229L88214O54530Q68364
10800F0948R85653R83650Q61384O29224L03342q5797m82430q11268j004453j033169
10790D07084r21603p34379n47938m23181l88996m38034n35526o39771p21045p60637
10780e704026p29925n74758k29290L46082J130593K034728K920800L643904M097003
10771F935111M237282M079000L664224L040941K264658J411815N83242j12720
10763B6103553n92617q30987q73149q13500p50286p48760q33300r97990j213758
$$ plain form
10827 28778438 25678835 22384451 18966879 15491419 12039421 8714957 5636530 2918244
10819 2918244 645550 -1142559 -2450549 -3303545 -3726976 -3750842 -3436307 -2898768 -2301493
10810 -2301493 -1813952 -1553015 -1539394 -1695815 -1886928 -1973389 -1850160 -1461946 -807416 60948
10800 60948 1046601 2030251 2891635 3520859 3824201 3738404 3255974 2444706 1440253 407084
10790 407084 -514519 -1248898 -1796836 -2220017 -2609013 -3047047 -3582573 -4222344 -4943389 -5704026
10780 -5704026 -6433951 -7008709 -7237999 -6891917 -5761324 -3726596 -805796 2838108 6935111
10771 6935111 11172393 15251393 18915617 21956558 24221216 25633031 26216273 26103553
10763 26103553 25510936 24679949 23806800 22993300 22243014 21494254 20660954 19662964 18449206
10754A8449206j429360j580422j611670j499045j257143r31297n83270k78478
10746I278521p7449k9424j63414m75174r16998j401354j822117k085003k132575
10737A75013j952692j569295j025781l74938L20286R85813J547787J954473K193611
10728B254277K293703K310687K308376K339876K435882K604134K837075L116390
10720B2500400L405474L636154L708068L513871K983626K123812J025938j62161
10712D2735182j286217k229414k930848l377115l580063l556732l320793k885813
10704A9568187k275796j537930p50892j8591N57627R18354J069047J063958R60657
10695A9554621P83269N24881J81603k17438o11729r37934j157998j263719j257746
$$ plain form
10754 18449206 17019846 15439424 13827754 12328709 11071566 10140269 9556999 9278521
10746 9278521 9201072 9171648 9008234 8533060 7616062 6214708 4392591 2307588 175013
10737 175013 -1777679 -3346974 -4372755 -4747693 -4427407 -3441594 -1893807 60666 2254277
10728 2254277 4547980 6858667 9167043 11506919 13942801 16546935 19384010 22500400
10720 22500400 25905874 29542028 33250096 36763967 39747593 41871405 42897343 42735182
10712 42735182 41448965 39219551 36288703 32911588 29331525 25774793 22454000 19568187
10704 19568187 17292391 15754461 15003569 14984978 15542605 16460959 17530006 18593964 19554621
10695 19554621 20337890 20862771 21044374 20826936 20215207 19277273 18119275 16855556 15597810
10686A5597810j132222q69435m68972K2800N14206R07949J147350J228931J176038
10677A8124455J007663P35695L86996J9884k84754m49603m23856j91710K31204
10668A9155974Q05041J470524K152748K771084L257119L569626L692910L620486
10660D0495512L342561K852217K166552J346133M96443k57650q20070j171145
10652D8450553j381991j580097j883710k341534k906923l457079l850215l995637
10644B7053367l899036l655875l399336l236272l202337l248475l259748l103371
10636D8917k691047k024865j198521l53619L78396R13002J216969J297585J196892
10627a216291R89265P64334N91903M93624M48999M31068M38037M94839O30637
$$ plain form
10686 15597810 14465588 13596153 13127181 13149981 13664187 14572136 15719486 16948417 18124455
10677 18124455 19132118 19867813 20254809 20274693 19989939 19540336 19116480 18924770 19155974
10668 19155974 19961015 21431539 23584287 26355371 29612490 33182116 36875026 40495512
10660 40495512 43838073 46690290 48856842 50202975 50699418 50441768 49621698 48450553
10652 48450553 47068562 45488465 43604755 41263221 38356298 34899219 31049004 27053367
10644 27053367 23154331 19498456 16099120 12862848 9660511 6412036 3152288 48917
10636 48917 -2642130 -4666995 -5865516 -6219135 -5840739 -4927737 -3710768 -2413183 -1216291
10627 -1216291 -227026 537308 1129211 1622835 2071834 2502902 2940939 3435778 4066415
10618D066415Q55672J150477J463825J714907J804813J644174J190881M76250
10610A4367414m01899j320563k183073k947897l618304m204344m687462n014636
10602a0010764n125184m986600m610211m040422l338255k578206j850046j242423
10594c7782111q05262n18733k98323l6098L49306Q82094J527545K211548K848853
10585c1621181L368435L726704L904087L891611L683842L289392K749753K143849
10577d863508J567618J102206P91266O33045N81970N60364M86365L11408M4005
10568A214739k59740n33388p37480q69112r38842r39855q43604o31094l29093
10559d867469j1597K38097L69993L81996L08679K07316J50021K09320M27928P86794
$$ plain form
10618 4066415 4922087 6072564 7536389 9251296 11056109 12700283 13891164 14367414
10610 14367414 13965515 12644952 10461879 7513982 3895678 -308666 -4996128 -10010764
10602 -10010764 -15135948 -20122548 -24732759 -28773181 -32111436 -34689642 -36539688 -37782111
10594 -37782111 -38587373 -39106106 -39404429 -39440527 -39091221 -38209127 -36681582 -34470034 -31621181
10585 -31621181 -28252746 -24526042 -20621955 -16730344 -13046502 -9757110 -7007357 -4863508
10577 -4863508 -3295890 -2193684 -1402418 -769373 -187403 372961 859326 1170734 1214739
10568 1214739 954999 421611 -315869 -1184981 -2123823 -3063678 -3907282 -4538376 -4867469
10559 -4867469 -4879066 -4640969 -4270976 -3888980 -3580301 -3372985 -3222964 -3013644 -2585716 -1798922
10549a798922J197828J532978J674853J561646J207555O93754J33155l79044q03015
10540E020788j153342j459965j725603j914859j977068j878852j627123j276516
10532g992540r16905o39475m96256m77153n12914m93874k98160J66721R17673
10523a0742883J874599K885003L780549M430788M771696M809010M605095M256494
10515B0670351L868654L534006L317330L249861L330415L529231L793844M063929
10507D9357621M298354M500412M719526N026202N480845O118010O950686P985505
10499I4437161R234970J0713602J2418596J4315232J6342605J8421737K0432927
10492A96316830K2160716K3242116K3156468K1292535J7139227J0596609K251854
$$ plain form
10549 -1798922 -601094 931884 2606737 4168383 5375938 6069692 6202847 5823803 5020788
10540 5020788 3867446 2407481 681878 -1232981 -3210049 -5088901 -6716024 -7992540
10532 -7992540 -8909445 -9548920 -10045176 -10522329 -11035243 -11529117 -11827277 -11660556 -10742883
10523 -10742883 -8868284 -5983281 -2202732 2228056 6999752 11808762 16413857 20670351
10515 20670351 24539005 28073011 31390341 34640202 37970617 41499848 45293692 49357621
10507 49357621 53655975 58156387 62875913 67902115 73382960 79500970 86451656 94437161
10499 94437161 103672131 114385733 126804329 141119561 157462166 175883903 196316830
10492 196316830 218477546 241719662 264876130 286168665 303307892 313904501 316156355
10485C16156355o637769j4563625k0362868k3599097k4521883k3743927k1918802
10478A80808384j9574668j7079816j4662552j2446187j0488386q814951p440431
10471I0301393o372499n597946n059165m649430m248668l781601l251688k723794
10463E4616602k272835j937773j707675j539040j383966j208241r95018p44429
10455D2827625m74830k18036l535J56694K67526L36167L59616L24005K13047J8997
10445D3807276k49354n66838r01869j230247j545733j865062k224947k664748
10437C2558478l196539l781600m333895m748909m936519m841616m453184l807112
10429a540896k980848k075067j184011l65081L75181J063982J717940K301522
$$ plain form
10485 316156355 309518586 294954961 274592093 250992996 226471113 202727186 180808384
10478 180808384 161233716 144153900 129491348 117045161 106556775 97741824 90301393
10471 90301393 83928894 78330948 73271783 68622353 64373685 60592084 57340396 54616602
10463 54616602 52343767 50405994 48698319 47159279 45775313 44567072 43572054 42827625
10455 42827625 42352795 42134759 42131224 42287918 42555444 42891611 43251227 43575232 43788279 43807276
10445 43807276 43557922 42991084 42089215 40858968 39313235 37448173 35223226 32558478
10437 32558478 29361939 25580339 21246444 16497535 11561016 6719400 2266216 -1540896
10429 -1540896 -4521744 -6596811 -7780822 -8145903 -7770722 -6706740 -4988800 -2687278
10421b687278K723490K878018K700617K202285J468788O36022j44571p44006j091278
10412G942087j193678j127982j000961q97126q41960p99537p01006m83139j15998
10403G80700L88881R86390J613367K203920K699834L054745L233673L211690K976111
10394B1149311K533908J920478J202951M73308j69028o43044r14486j013892j030127
10385B3509379j077304j250802j594168k088316k660840l206867l612976l777993
10377D240113l628598l131818k305458j221900P58J220654K299669L127024L633877
10368D234321L800124L657017L284568K795836K303452J880004J536892J237789
10360B4730003R37381O17874K99238J8648k04657l92469o00372q85385j272793
$$ plain form
10421 -2687278 36212 2914230 5614847 7817132 9285920 9921942 9777371 9033365 7942087
10412 7942087 6748409 5620427 4619466 3722340 2880380 2080843 1379837 896698 780700
10403 780700 1169581 2155971 3769338 5973258 8673092 11727837 14961510 18173200 21149311
10394 21149311 23683219 25603697 26806648 27279956 27110928 26467884 25553398 24539506 23509379
10385 23509379 22432075 21181273 19587105 17498789 14837949 11631082 8018106 4240113
10377 4240113 611515 -2520303 -4825761 -6047661 -6046903 -4826249 -2526580 600444 4234321
10368 4234321 8034445 11691462 14976030 17771866 20075318 21955322 23492214 24730003
10360 24730003 25667384 26285258 26584496 26603144 26398487 26006018 25405646 24520261 23247468
10351B3247468j742189k233990k667378k964676l078342l008663k798924k510096
10343B243210k194094j883905j603022j381498j261518j283198j458553j755757
10335a0578335k110547k457744k757427k996965l172839l271549l266142l130351
10327c3741899k857093k463490j976324j411888p71396n7798P02205J452642K125658
10318c8999383K667958L055410L286357L365821L302672L126158K900941K714462
10310a4579604K637233K685615K814544K940468K974763K851139K543270K073766
10302F941194J512213R56718M98497J81607j9512j87717m21560p89811j305577
10293G366052j924460k557430l090621l411974l444241l174428k662057k014611
$$ plain form
10351 23247468 21505279 19271289 16603911 13639235 10560893 7552230 4753306 2243210
10343 2243210 49116 -1834789 -3437811 -4819309 -6080827 -7364025 -8822578 -10578335
10335 -10578335 -12688882 -15146626 -17904053 -20901018 -24073857 -27345406 -30611548 -33741899
10327 -33741899 -36598992 -39062482 -41038806 -42450694 -43222090 -43279888 -42577683 -41125041 -38999383
10318 -38999383 -36331425 -33276015 -29989658 -26623837 -23321165 -20195007 -17294066 -14579604
10310 -14579604 -11942371 -9256756 -6442212 -3501744 -526981 2324158 4867428 6941194
10302 6941194 8453407 9410125 9908622 10090229 10070717 9883000 9461440 8671629 7366052
10293 7366052 5441592 2884162 -206459 -3618433 -7062674 -10237102 -12899159 -14913770
10285a4913770j340119p07202j40379L50577P38014R72146J008804Q43906N24905
10276a2663118J30811k61587o00019q57735j023910j097589j086916j007717q81389
10267a9349169p36485o10306n40461n46008o12256o91228p15621o17400l46962
10258b4765896J09708P22791J424758K126477K734393L165678L363456L311585
10250g807050L043789K640273K205432J827133J535083J288358J006956O26341
10242F366315J35674m19960r61203j399412j657144j685341j475420j062196n16968
10233b675655O7474N98490J006904J262130J372582J374998J321435J268544J269794
10224F866696J370785J606088J992023K512759L107785L673871M086303M231888
$$ plain form
10285 -14913770 -16253889 -16961091 -17101470 -16750893 -16012879 -15040733 -14031929 -13188023 -12663118
10276 -12663118 -12532307 -12793894 -13393913 -14251648 -15275558 -16373147 -17460063 -18467780 -19349169
10267 -19349169 -20085654 -20695960 -21236421 -21782429 -22394685 -23085913 -23801534 -24418934 -24765896
10258 -24765896 -24656188 -23933397 -22508639 -20382162 -17647769 -14482091 -11118635 -7807050
10250 -7807050 -4763261 -2122988 82444 1909577 3444660 4733018 5739974 6366315
10242 6366315 6501989 6082029 5120826 3721414 2064270 378929 -1096491 -2158687 -2675655
10233 -2675655 -2608181 -2009691 -1002787 259343 1631925 3006923 4328358 5596902 6866696
10224 6866696 8237481 9843569 11835592 14348351 17456136 21130007 25216310 29448198
10216B9448198M041228L509018K692573J686234N85435n35002j617063k606490
10208C7204131l455445m142682m686009n126928n498532n805989o032615o157452
10200c701521o164812o042382n775876n344831m721268l878703k817758j595181
10192d0042332l27520Q44005J804946K498446K921690L104876L093150K934945
10184b3167794K671246K326288J904495J395021P84932Q4016o46579j289463j713307
10175a7651145j844484j712178j427281j115557q63959p14816o89164p99585j038978
10166b7857147j364656j699768j951941k033706j875048j432172o99091K80180
10158c8633349J408894K551801L564568M328337M775885M899222M737677M355568
$$ plain form
10216 29448198 33489426 36998444 39691017 41377251 41962686 41427684 39810621 37204131
10208 37204131 33748686 29606004 24919995 19793067 14294535 8488546 2455931 -3701521
10200 -3701521 -9866333 -15908715 -21684591 -27029422 -31750690 -35629393 -38447151 -40042332
10192 -40042332 -40369852 -39525847 -37720901 -35222455 -32300765 -29195889 -26102739 -23167794
10184 -23167794 -20496548 -18170260 -16265765 -14870744 -14085812 -14001796 -14648375 -15937838 -17651145
10175 -17651145 -19495629 -21207807 -22635088 -23750645 -24614604 -25329420 -26018584 -26818169 -27857147
10166 -27857147 -29221803 -30921571 -32873512 -34907218 -36782266 -38214438 -38913529 -38633349
10158 -38633349 -37224455 -34672654 -31108086 -26779749 -22003864 -17104642 -12366965 -8011397
10150h011397L821009L191263K505712J788876J065189L77058k10888o30955q45357
10141C050510q71444p82490o80879o55259p44729r32798j172990j421770j652272
10132e864121j847800j994298k081606k103131k044827j874427j549235j044054
10124b0403499l80397L64004J072662J626361J939521J979440J763175J341686
10116a0697047P84177J66495m39650r75431j395299j659407j730842j588960j251162
10107a8787126p79585k59113K37254O64090R88761J169477J156384R16729M57444
10098a4235685j73973r03045j640413k290504k762987k985415k910206k517406
10090c0419634j819996q69523K47455J423401K545457L508597M231410M673633
$$ plain form
10150 -8011397 -4190388 -999125 1506587 3295463 4360652 4737710 4526822 3895867 3050510
10141 3050510 2179066 1396576 715697 60438 -684291 -1617089 -2790079 -4211849 -5864121
10132 -5864121 -7711921 -9706219 -11787825 -13890956 -15935783 -17810210 -19359445 -20403499
10124 -20403499 -20783896 -20419892 -19347230 -17720869 -15781348 -13801908 -12038733 -10697047
10116 -10697047 -9912870 -9746375 -10186025 -11161456 -12556755 -14216162 -15947004 -17535964 -18787126
10107 -18787126 -19566711 -19825824 -19588570 -18924480 -17935719 -16766242 -15609858 -14693129 -14235685
10098 -14235685 -14409658 -15312703 -16953116 -19243620 -22006607 -24992022 -27902228 -30419634
10090 -30419634 -32239630 -33109153 -32861698 -31438297 -28892840 -25384243 -21152833 -16479200
10082a6479200M842051M775377M518491M105127L555768K884141K106852J255962
10074A1564569L88978m16830j090967j601366j964768k224067k409415k515492
10066b69358k514085k389610k165073j896579j644987j451473j333689j296234
10058a4961088j339450j458657j637126j838857k006170k067230j955838j635987
10050b8900403j115871m42197L17436J087764J788587K336987K661025K722784
10042a9543888K535957K165787J710792J273615R29884P05654N74669M79184L62833
10033h805513J95752j9715k57868m80885o46198p13056o52972m63959j82515J15731
10023a1911198L34063L89798K51452m3092l98748o98174q40497p68376m77872
$$ plain form
10082 -16479200 -11637149 -6861772 -2343281 1761846 5317614 8201755 10308607 11564569
10074 11564569 11953547 11536717 10445750 8844384 6879616 4655549 2246134 -269358
10066 -269358 -2783443 -5173053 -7338126 -9234705 -10879692 -12331165 -13664854 -14961088
10058 -14961088 -16300538 -17759195 -19396321 -21235178 -23241348 -25308578 -27264416 -28900403
10050 -28900403 -30016274 -30458471 -30141035 -29053271 -27264684 -24927697 -22266672 -19543888
10042 -19543888 -17007931 -14842144 -13131352 -11857737 -10927853 -10222199 -9647530 -9168346 -8805513
10033 -8805513 -8609761 -8629476 -8887344 -9368229 -10014427 -10727483 -11380455 -11844414 -12026929 -11911198
10023 -11911198 -11577135 -11187337 -10935885 -10978977 -11377725 -12075899 -12916396 -13684772 -14162644
10014a4162644j1884N58593J155812J707469K146959K412962K461373K286382
10006a444978J931638J477392J010635N98870K81285P4864j5147J1552J51274
9997D077385L92987P14269J079826J442914J749021J943716J986179J862066J583885
9988A6832248J177050O67022Q3023n27770j098069j560307j872888k031557k063407
9979I605345k015794j946264j908532j934443k023458k148856k272964k356406
9971g001372k358474k240980j983594j599820j134146o37100j38990L53964Q40610
9962a5899902J306078J722411K062997K311141K455574K485131K393613K187826
9954A024869J883654J489754R96429L84535l51097j183233k051872k878229l581224
$$ plain form
10014 -14162644 -14174528 -13615935 -12460123 -10752654 -8605695 -6192733 -3731360 -1444978
10006 -1444978 486660 1964052 2974687 3573557 3854842 3929706 3914559 3926111 4077385
9997 4077385 4470372 5184641 6264467 7707381 9456402 11400118 13386297 15248363 16832248
9988 16832248 18009298 18676320 18759343 18231573 17133504 15573197 13700309 11668752 9605345
9979 9605345 7589551 5643287 3734755 1800312 -223146 -2372002 -4644966 -7001372
9971 -7001372 -9359846 -11600826 -13584420 -15184240 -16318386 -16955486 -17094476 -16740512 -15899902
9962 -15899902 -14593824 -12871413 -10808416 -8497275 -6041701 -3556570 -1162957 1024869
9954 1024869 2908523 4398277 5394706 5779241 5428144 4244911 2193039 -685190 -4266414
9945d266414m089590m350727m338960m061395l556284k880790k093223j242772
9937c0880155l77281M37738J114000J568947J774847J787226J722757J700210
9929b1151711J787999J988444K253917K513582K699726K772473K734614K621389
9921a779567K465445K263923J978472J569325J031326M00976k64915r13414j503632
9912E247939k002467k381185k617979k702105k634313k424192k091851j682520
9904a3288673j289609j061392j166905j731532k787822m277388o094487q135446
9896c9833254j0331611j2661809j5137220j7749747k0394412k2796072k4473576
9889a63377701k4782070k3083178j9039472j2896749n534945J814851Q034458
$$ plain form
9945 -4266414 -8356004 -12706731 -17045691 -21107086 -24663370 -27544160 -29637383 -30880155
9937 -30880155 -31257436 -30819698 -29705698 -28136751 -26361904 -24574678 -22851921 -21151711
9929 -21151711 -19363712 -17375268 -15121351 -12607769 -9908043 -7135570 -4400956 -1779567
9921 -1779567 685878 2949801 4928273 6497598 7528924 7929900 7664985 6751571 5247939
9912 5247939 3245472 864287 -1753692 -4455797 -7090110 -9514302 -11606153 -13288673
9904 -13288673 -14578282 -15639674 -16806579 -18538111 -21325933 -25603321 -31697808 -39833254
9896 -39833254 -50164865 -62826674 -77963894 -95713641 -116108053 -138904125 -163377701
9889 -163377701 -188159771 -211242949 -230282421 -243179170 -248714115 -246899264 -238864806
9882b38864806J2469457J4992232J5841650J5418524J4148478J2415094J0531473
9875a43047898Q734245P188229N985871N141380M599138M266888M056378L905671
9867i9170098L776767L643608L487547L303378L105451K922554K783176K704678
9859g3442939K693879K749157K851000K947673K958480K803548K441572J889542
9851e2108088J217215N27437o6698m64605n99135m51412n7786M90236J056188
9842e0456648J487095J660446J530792J147010O26475J02986l18012n76430o53258
9833d5449544n62933l48369p0660K10791M57826O58870Q17784R36318J002376
9824d2347541R91335Q81603O77493M23607J95087O2979N3841J30018K05696J92007
$$ plain form
9882 -238864806 -226395349 -211403117 -195561467 -180142943 -165994465 -153579371 -143047898
9875 -143047898 -134313653 -127125424 -121139553 -115998173 -111399035 -107132147 -103075769 -99170098
9867 -99170098 -95393331 -91749723 -88262176 -84958798 -81853347 -78930793 -76147617 -73442939
9859 -73442939 -70749060 -67999903 -65148903 -62201230 -59242750 -56439202 -53997630 -52108088
9851 -52108088 -50890873 -50363436 -50430134 -50894739 -51493874 -51945286 -52003072 -51512836 -50456648
9842 -50456648 -48969553 -47309107 -45778315 -44631305 -44004830 -43901844 -44219856 -44796286 -45449544
9833 -45449544 -46012477 -46360846 -46431506 -46220715 -45762889 -45104019 -44286235 -43349917 -42347541
9824 -42347541 -41356206 -40474603 -39797110 -39373503 -39178416 -39115437 -39061596 -38931578 -38725882 -38533875
9814c8533875M5945k06397m86565p07455q12389p84904o31730l62626J2829M73130
9804d1994037R75393J463169J888948K234913K516246K763479K993647L186938
9796b3971304L283993L209223K909411K384284J689783R15522J56590n02364r90296
9787a0915158j251620j254127j000783n39176L7439O03333J030756J231030J189535
9778a0868771R75067P12323N23260M63481M90675M87069L21889q6567p41131j569923
9768i292628k448878l234191l804051m099312m139217l997097l750536l441551
9760c8207461l072462k632428k127742j593106j081773o47466l30073j48303r6871
9751d9937685j46145k44700l27851l35473k36000m3503J86319L80897M79352M48098
$$ plain form
9814 -38533875 -38487930 -38694327 -39180892 -39888347 -40700736 -41485640 -42117370 -42479996 -42467167 -41994037
9804 -41994037 -41018644 -39555475 -37666527 -35431614 -32915368 -30151889 -27158242 -23971304
9796 -23971304 -20687311 -17478088 -14568677 -12184393 -10494610 -9579088 -9422498 -9924862 -10915158
9787 -10915158 -12166778 -13420905 -14421688 -14960864 -14923425 -14320092 -13289336 -12058306 -10868771
9778 -10868771 -9893704 -9181381 -8658121 -8194640 -7703965 -7216896 -6895007 -6981574 -7722705 -9292628
9768 -9292628 -11741506 -14975697 -18779748 -22879060 -27018277 -31015374 -34765910 -38207461
9760 -38207461 -41279923 -43912351 -46040093 -47633199 -48714972 -49362438 -49692511 -49840814 -49937685
9751 -49937685 -50083830 -50328530 -50656381 -50991854 -51227854 -51271357 -51085038 -50704141 -50224789 -49776691
9741d9776691K82164J478l52993p26282j061378j311566j447842j461139j360963
9732e7215212j169523r10360n97566k37425J53560N30043Q24908R88192J027390
9723e6605993J007630J006576J066348J187199J361240J603437J945117K396042
9715d5032404K908537L373059L652789L640736L306479K703767J938969J130268
9707b2377800L86979j90145n09122n02757j55982M70980J239418J960562K454684
9698a7223183K616554K449041K044831J535231J045118O74184M92125N27840P52712
9689e085547J076642J370372J508424J413842J085791N97790O6191l96268p17120
9680I20117q74150q81924p72353n83405l57104j39817K0459P8518o347k70697
$$ plain form
9741 -49776691 -49494527 -49493049 -49846042 -50572324 -51633702 -52945268 -54393110 -55854249 -57215212
9732 -57215212 -58384735 -59295095 -59892661 -60130086 -59976526 -59446483 -58621575 -57633383 -56605993
9723 -56605993 -55598363 -54591787 -53525439 -52338240 -50977000 -49373563 -47428446 -45032404
9715 -45032404 -42123867 -38750808 -35098019 -31457283 -28150804 -25447037 -23508068 -22377800
9707 -22377800 -21990821 -22180966 -22690088 -23192845 -23348827 -22877847 -21638429 -19677867 -17223183
9698 -17223183 -14606629 -12157588 -10112757 -8577526 -7532408 -6858224 -6366099 -5838259 -5085547
9689 -5085547 -4008905 -2638533 -1130109 283733 1369524 1967314 2033505 1637237 920117
9680 920117 45967 -835957 -1608310 -2191715 -2548819 -2688636 -2668177 -2589659 -2596006 -2866703
9670b866703p39625j404135k195592k987181l638393m058329m241118m250735
9662b6381811m175422m086402m015422l947302l826878l584865l174576k595892
9654e5788570j890373j116070l24142M50609J189407J886124K540369L143967
9646d9908679L666111M050042M229994M162122L850613L351956K755453K153280
9638b1689108J616389J183080Q57075O11183L97945J69005j02915m11285p18864
9629a8087495r72452j121260j134856j017719q12887n87222m02911k92309k51316
9620b4680427k51744k61068k57351k34278j97618j57007j16802o9343N044J27526
9610b6093068L02885N06548O88699P95073P92094O84438N19366L74301L27120
$$ plain form
9670 -2866703 -3606328 -5010463 -7206055 -10193236 -13831629 -17889958 -22131076 -26381811
9662 -26381811 -30557233 -34643635 -38659057 -42606359 -46433237 -50018102 -53192678 -55788570
9654 -55788570 -57678943 -58795013 -59119155 -58668546 -57479139 -55593015 -53052646 -49908679
9646 -49908679 -46242568 -42192526 -37962532 -33800410 -29949797 -26597841 -23842388 -21689108
9638 -21689108 -20072719 -18889639 -18032564 -17421381 -17023436 -16854431 -16957346 -17368631 -18087495
9629 -18087495 -19059947 -20181207 -21316063 -22333782 -23146669 -23733891 -24136802 -24429111 -24680427
9620 -24680427 -24932171 -25193239 -25450590 -25684868 -25882486 -26039493 -26156295 -26225638 -26220594 -26093068
9610 -26093068 -25790183 -25283635 -24594936 -23799863 -23007769 -22323331 -21803965 -21429664 -21102544
9601b1102544M21345O49151R63901J307283J625657J869361J991394J960189J781119
9592h533144J509118J240420J083828J121684J376634J799988K287397K713024
9584D598949K966358K978941K734668K263464J624822Q91754J41399n51670j125972
9575A6522713j545218j800867j899741j847426j645776j310461q91985m75123
9567E106116j49622K7158M6844o1541k53218m80389o97288q69162r84548j056372
9557F27978j105456j140328j152125j126301j055616r41374p85112n82853l29926
9548g591113l3866K74850N43423P10270P25051N67351K59746j27723m87153p00066
9538e859230o75254l79450J54840Q46606J598075K325644K976591L525283L953963
$$ plain form
9601 -21102544 -20681199 -20032048 -19068147 -17760864 -16135207 -14265846 -12274452 -10314263 -8533144
9592 -8533144 -7024026 -5783606 -4699778 -3578094 -2201460 -401472 1885925 4598949
9584 4598949 7565307 10544248 13278916 15542380 17167202 18058956 18200355 17648685 16522713
9575 16522713 14977495 13176628 11276887 9429461 7783685 6473224 5581239 5106116
9567 5106116 4956494 4983652 5030496 4968955 4715737 4235348 3538060 2668898 1684350 627978
9557 627978 -477478 -1617806 -2769931 -3896232 -4951848 -5893222 -6678334 -7261187 -7591113
9548 -7591113 -7624979 -7350129 -6806706 -6096436 -5371385 -4804034 -4544288 -4672011 -5159164 -5859230
9538 -5859230 -6534484 -6913934 -6759094 -5912488 -4314413 -1988769 987822 4513105 8467068
9529H467068M233468M318630M161825L736272L056997K189945J244316L49056
9521C1757577l78545q60879j075589j054748q69272o06357l51409j80275j54766
9512B6225737l09533o30237j039961j412323j612204j544486j185331n82423J70050
9503A8079289R62606J691255K265105K609838K675115K444384J939301J214084
9495C3880977L43062n90571j500951k306833k949107l414095l740451l992627
9487A5729404m215583m408960m541915m588741m548048m432239m247162l986523
9479a9239767l643717l224091k742054k205039j602197r14050j39737O81176J472871
9470c1556605K150013K644910K918311K957162K772765K405033J925494J427806
$$ plain form
9529 8467068 12700536 17019166 21180991 24917263 27974260 30164205 31408521 31757577
9521 31757577 31379032 30518153 29442564 28387816 27518544 26912187 26560778 26380503 26225737
9512 26225737 25916204 25285967 24246006 22833683 21221479 19676993 18491662 17909239 18079289
9503 18079289 19041895 20733150 22998255 25608093 28283208 30727592 32666893 33880977
9495 33880977 34224039 33633468 32132517 29825684 26876577 23462482 19722031 15729404
9487 15729404 11513821 7104861 2562946 -2025795 -6573843 -11006082 -15253244 -19239767
9479 -19239767 -22883484 -26107575 -28849629 -31054668 -32656865 -33570915 -33710652 -33029476 -31556605
9470 -31556605 -29406592 -26761682 -23843371 -20886209 -18113444 -15708411 -13782917 -12355111
9462a2355111J003688P15927N85377N98020P21105R13594J129259J322936J464614
9453c900591J551012J601709J641251J683557J733582J804132J928034K145568
9445A0188254K469260K854386L205831L422516L448159L293338L019471K701762
9437C4602977K395153K118846J862128J602029J316956R86816N86578Q8925n18517
9428D5041891j214793j944742k639257l240077l709228m020643m150870m085334
9420B0036947l836297l453463l015164k606486k297200k124561k082093k120093
9412a498410k163031k136633j989406j702090j290286q02636l08085J28582M67885
9403a1294110O97300Q16244Q21822P05100M53597N6033m85634j135797j811222
$$ plain form
9462 -12355111 -11351423 -10635496 -10050119 -9452099 -8730994 -7817400 -6688141 -5365205 -3900591
9453 -3900591 -2349579 -747870 893381 2576938 4310520 6114652 8042686 10188254
9445 10188254 12657514 15511900 18717731 22140247 25588406 28881744 31901215 34602977
9437 34602977 36998130 39116976 40979104 42581133 43898089 44884905 45471483 45560408 45041891
9428 45041891 43827098 41882356 39243099 36003022 32293794 28273151 24122281 20036947
9420 20036947 16200650 12747187 9732023 7125537 4828337 2703776 621683 -1498410
9412 -1498410 -3661441 -5798074 -7787480 -9489570 -10779856 -11582492 -11890577 -11761995 -11294110
9403 -11294110 -10596810 -9780566 -8958744 -8253644 -7800047 -7744014 -8229648 -9365445 -11176667
9394a1176667k392829k764902k861069k691015k334426j905818j507162j191579
9386b8825467r56061p63405n75086l73205j62048M5237K42951M41231O60272R12603
9376b9352978J185989J442402J637732J749334J791133J805331J837456J911434
9368a5992167K017589K116255K153549K084625J896484J617273J302524J005590
9360a798278P53329N41086L40791J08926k04927o38167j186050j785690k331975
9351f200955k718574k878616k805583k550900k203286j857694j585195j414852
9343b4215655j329203j267316j134924q29337k79697N15900J480901K484528L382854
9334b1191949M055424M428141M483407M258155L828667L285147K705899K142928
$$ plain form
9394 -11176667 -13569496 -16334398 -19195467 -21886482 -24220908 -26126726 -27633888 -28825467
9386 -28825467 -29781528 -30544933 -31120019 -31493224 -31655272 -31610035 -31367084 -30925853 -30265581 -29352978
9376 -29352978 -28166989 -26724587 -25086855 -23337521 -21546388 -19741057 -17903601 -15992167
9368 -15992167 -13974578 -11858323 -9704774 -7620149 -5723665 -4106392 -2803868 -1798278
9360 -1798278 -1044949 -503863 -163072 -54146 -259073 -897240 -2083290 -3868980 -6200955
9351 -6200955 -8919529 -11798145 -14603728 -17154628 -19357914 -21215608 -22800803 -24215655
9343 -24215655 -25544858 -26812174 -27947098 -28776435 -29056132 -28540232 -27059331 -24574803 -21191949
9334 -21191949 -17136525 -12708384 -8224977 -3966822 -138155 3146992 5852891 7995819
9326G995819J625763J180510Q50987P03714Q05263J178846J765815K421994K959869
9317B1488580L217082L113064K665360J965854J138075K95837m86253j182942
9309C2214657j802660k353103k812903l131986l257637l162419k856215k383832
9301A0453902j815128j227774o83210k08484K00478N54781Q47945J051962J136997
9292A0311469J097223R59678P66841N47190L00473J1814l18850o60311r61971
9283A2053556j183157j315422j381852j416543j441087j454512j441454j390568
9275A028961j310569j234815j211121j279523j449132j690319j950579k183384
9267a1280481k367780k505212k600192k643522k612702k488707k272206j979582
$$ plain form
9326 7995819 9621582 10802092 11653079 12356793 13162056 14340902 16106717 18528711 21488580
9317 21488580 24705662 27818726 30484086 32449940 33588015 33883852 33397599 32214657
9309 32214657 30411997 28058894 25245991 22114005 18856368 15693949 12837734 10453902
9301 10453902 8638774 7411000 6727790 6519306 6719784 7274565 8122510 9174472 10311469
9292 10311469 11408692 12368370 13135211 13682401 13982874 13994688 13675838 13015527 12053556
9283 12053556 10870399 9554977 8173125 6756582 5315495 3860983 2419529 1028961
9275 1028961 -281608 -1516423 -2727544 -4007067 -5456199 -7146518 -9097097 -11280481
9267 -11280481 -13648261 -16153473 -18753665 -21397187 -24009889 -26498596 -28770802 -30750384
9259c0750384j617994j165574n85987J26082R08213J640072K197534K513008K603975
9250b4131055K557961K487872K483232K581291K768206L000847L228772L403557
9242a619317L479491L416363L187706K788312K234404J557604Q00239J7622p16345
9233A5146079j311968j683220j777324j595361j188835o35623j4192O07031J164957
9224H711544J596598J847777J894653J760638J510514J221717R53196P33601N69927
9215B0800165M57799L78693K92102J42102j18219n04203r97322j556944k125945
9206A6768228k625845k960750l046356k852539k429374j897838j411615j109281
9198a565370j072266j298938j704460k151427k501107k659458k593975k319295
$$ plain form
9259 -30750384 -32368378 -33533952 -34119939 -33993857 -33085644 -31445572 -29248038 -26735030 -24131055
9250 -24131055 -21573094 -19085222 -16601990 -14020699 -11252493 -8251646 -5022874 -1619317
9242 -1619317 1860174 5276537 8464243 11252555 13486959 15044563 15844802 15862424 15146079
9233 15146079 13834111 12150891 10373567 8778206 7589371 6953748 6939556 7546587 8711544
9224 8711544 10308142 12155919 14050572 15811210 17321724 18543441 19496637 20230238 20800165
9215 20800165 21257964 21636657 21928759 22070861 21952642 21448439 20451117 18894173 16768228
9206 16768228 14142383 11181633 8135277 5282738 2853364 955526 -456089 -1565370
9198 -1565370 -2637636 -3936574 -5641034 -7792461 -10293568 -12953026 -15547001 -17866296
9190a7866296j872644j302157o69583m8630M95190R32274J278017J571293J839625
9181a5642911K080608K272065K396523K456024K467547K449067K412140K366475
9173C257538K328895K325945K384959K516316K695441K856831K909685K771769
9165B4047379K402264J813006J055963K04469o56370j434423k045954k443587
9157B2942747k637400k687104k664458k609252k508016k309542j966677j476680
9149D083618q94494l13599J69307M85122O09067N64202M12781K35525J04365N9363
9139E515257R7175J72226K11245J42017p1532m06617p87162j114979j307765j324077
9129A125788j166933q70095m78133k9898M52323R69260J542248K193167K910220
$$ plain form
9190 -17866296 -19738940 -21041097 -21710680 -21759310 -21264120 -20331846 -19053829 -17482536 -15642911
9181 -15642911 -13562303 -11290238 -8893715 -6437691 -3970144 -1521077 891063 3257538
9173 3257538 5586433 7912378 10297337 12813653 15509094 18365925 21275610 24047379
9165 24047379 26449643 28262649 29318612 29523081 28866711 27432288 25386334 22942747
9157 22942747 20305347 17618243 14953785 12344533 9836517 7526975 5560298 4083618
9149 4083618 3189124 2875525 3044832 3529954 4139021 4703223 5116004 5351529 5455894 5515257
9139 5515257 5612432 5784658 5995903 6137920 6066388 5659771 4872609 3757630 2449865 1125788
9129 1125788 -41145 -911240 -1389373 -1419271 -966948 2312 1544560 3737727 6647947
9120F647947L622961M211222M546956M541104M166702L452004K459751J273416
9112C4922063k242j238996k301505l085537l554470l744645l734998l604750l406126
9103A0248794l161171k874621k549181k192402j814607j428812j060707p57497
9095e590204n75715n48004o54703q22286r44863r13384o48190j34042N58194J285844
9085h987353J885574K233464K280562K049239J599270R88624K56316n62272j405234
9076C38190k169146k723842k947467k764198k172289j253842j59881R25645J827026
9067a1099804K407772K588032K353526J758578R19922m216q51539j501961j913241
9058e342931k125091k226355k302129k388834k459303k444138k276570j933963
$$ plain form
9120 6647947 10270908 14482130 19029086 23570190 27736892 31188896 33648647 34922063
9112 34922063 34919821 33680825 31379320 28293783 24739313 20994668 17259670 13654920 10248794
9103 10248794 7087623 4213002 1663821 -528581 -2343188 -3772000 -4832707 -5590204
9095 -5590204 -6165919 -6713923 -7368626 -8190912 -9135775 -10049159 -10697349 -10831391 -10273197 -8987353
9085 -8987353 -7101779 -4868315 -2587753 -538514 1060756 2049380 2305696 1743424 338190
9076 338190 -1830956 -4554798 -7502265 -10266463 -12438752 -13692594 -13852475 -12926830 -11099804
9067 -11099804 -8692032 -6104000 -3750474 -1991896 -1071974 -1076190 -1927729 -3429690 -5342931
9058 -5342931 -7468022 -9694377 -11996506 -14385340 -16844643 -19288781 -21565351 -23499314
9050b3499314j450697q97442l44454J67156O32410J067596J483886J866852K176908
9041a8797099K369718K419300K327098K115297J813761J449612J045137O25649
9033d631527K30042r0632k92544l61561l17369j96073k9526J61713L63679N65132
9023d598666P60160R50880J142045J328995J489733J590892J604724J524209J367302
9014G160274J173151R95444Q88601Q81129R46503R96939R15428O13009P9123o02319
9004A4047282j279717j793120k040680k020373j825580j598895j470209j507395
8996E11313j695441j947813k146206k195278k068180j819188j556644j391415
8988a4308852j386176j526434j723328j847565j782404j473464r51381l15058
$$ plain form
9050 -23499314 -24950011 -25847453 -26191907 -26024751 -25392341 -24324745 -22840859 -20974007 -18797099
9041 -18797099 -16427381 -14008081 -11680983 -9565686 -7751925 -6302313 -5257176 -4631527
9033 -4631527 -4401485 -4492117 -4784661 -5146222 -5463591 -5659664 -5689190 -5527477 -5163798 -4598666
9023 -4598666 -3838506 -2887626 -1745581 -416586 1073147 2664039 4268763 5792972 7160274
9014 7160274 8333425 9328869 10217470 11098599 12045102 13042041 13957469 14570478 14649601 14047282
9004 14047282 12767565 10974445 8933765 6913392 5087812 3488917 2018708 511313
8996 511313 -1184128 -3131941 -5278147 -7473425 -9541605 -11360793 -12917437 -14308852
8988 -14308852 -15695028 -17221462 -18944790 -20792355 -22574759 -24048223 -24999604 -25314662
8980b5314662L16370Q56630J279810J606400J861919K044481K129311K101758
8972a3117983J980562J803218J585271J293324Q60365K35478n66016j443954k236344
8963i606079k771960k929366k679408k094410j317953n06268K29600Q48257J358131
8954a9469456J774896K091734K281537K322140K221246K023183J793452J589574
8946c371694J434201J306018J153367R21162N74976J11387m44120j042355j611256
8937i68314k055917k269369k160030j685182q70997J90862J363082K486663L404513
8928b564689L987712M165144L949303L444984K827314K286750J960349J885115
8920B1941982J999718K188239K333728K353281K209547J908389J489901J012825
$$ plain form
8980 -25314662 -24998292 -24141662 -22861852 -21255452 -19393533 -17349052 -15219741 -13117983
8972 -13117983 -11137421 -9334203 -7748932 -6455608 -5595243 -5359765 -5925781 -7369735 -9606079
8963 -9606079 -12378039 -15307405 -17986813 -20081223 -21399176 -21905444 -21675844 -20827587 -19469456
8954 -19469456 -17694560 -15602826 -13321289 -10999149 -8777903 -6754720 -4961268 -3371694
8946 -3371694 -1937493 -631475 521892 1443054 2018030 2129417 1685297 642942 -968314
8937 -968314 -3024231 -5293600 -7453630 -9138812 -10009809 -9818947 -8455865 -5969202 -2564689
8928 -2564689 1423023 5588167 9537470 12982454 15809768 18096518 20056867 21941982
8920 21941982 23941700 26129939 28463667 30816948 33026495 34934884 36424785 37437610
8912C7437610N32919Q1853l42716p67474j216108j680514k112844k447531k638027
8903B6847168k680571k608715k465880k278108k047101j769175j466628j204938
8895A0326052j075317j149046j435823j876573k371757k819708l140856l284586
8887f827614l229100k980723k570617k048037j474164r18863m55073j44328j5815
8878b0664334n1207j87292l38940m33192m37728l67924k68762j86078j49530j76872
8868b3261859k86721m99805q24794j244132j715120k183580k594691k892104l013941
8859c8516747k902194k530405j932791j207416m81500J42727O25899R91023J293100
8850d4518304J585035J898886K242940K604825K954036L246202L435297L493196
$$ plain form
8912 37437610 37970529 38052382 37709666 36942192 35726084 34045570 31932726 29485195 26847168
8903 26847168 24166597 21557882 19092002 16813894 14766793 12997618 11530990 10326052
8895 10326052 9250735 8101689 6665866 4789293 2417536 -402172 -3543028 -6827614
8887 -6827614 -10056714 -13037437 -15608054 -17656091 -19130255 -20049118 -20504191 -20648519 -20664334
8878 -20664334 -20715541 -20902833 -21241773 -21674965 -22112693 -22480617 -22749379 -22935457 -23084987 -23261859
8868 -23261859 -23548580 -24048385 -24873179 -26117311 -27832431 -30016011 -32610702 -35502806 -38516747
8859 -38516747 -41418941 -43949346 -45882137 -47089553 -47571053 -47428326 -46802427 -45811404 -44518304
8850 -44518304 -42933269 -41034383 -38791443 -36186618 -33232582 -29986380 -26551083 -23057887
8842b3057887L424157L259664L034694K765095K445419K066612J636552J189083
8834c236611P78084M58243K58079J60218J07231L3479j01547l04520n63802q66342
8824c277488j199605j544469j873701k159409k381107k526621k586888k551173
8816b0100461k409147k161081j829819j463166j119865q45334o53006n23748m22538
8807c1528165l19503k00630o3164R4897K74549M58632N93226N92982L78049p9792
8797b9798919p34450j479508k186134k744605l095949l244470l243532l158660
8789d9686227l030793k865454k652482k395884k128210j899184j746706j668714
8781f8073654j614545j503256j258218q36347k37705N01186J318247K134742K864106
$$ plain form
8842 -23057887 -19633730 -16374066 -13339372 -10574277 -8128858 -6062246 -4425694 -3236611
8834 -3236611 -2458527 -2000284 -1742205 -1581987 -1474756 -1441277 -1542824 -1847344 -2411146 -3277488
8824 -3277488 -4477093 -6021562 -7895263 -10054672 -12435779 -14962400 -17549288 -20100461
8816 -20100461 -22509608 -24670689 -26500508 -27963674 -29083539 -29928873 -30581879 -31105627 -31528165
8807 -31528165 -31847668 -32048298 -32111462 -32016565 -31742016 -31283384 -30690158 -30097176 -29719127 -29798919
8797 -29798919 -30533369 -32012877 -34199011 -36943616 -40039565 -43284035 -46527567 -49686227
8789 -49686227 -52717020 -55582474 -58234956 -60630840 -62759050 -64658234 -66404940 -68073654
8781 -68073654 -69688199 -71191455 -72449673 -73286020 -73523725 -73022539 -71704292 -69569550 -66705444
8772f6705444L423712L749815L814327L639783L303477K919459K597225K394464
8764d0863182K292985K217088K085052J858808J558269J235596R34934O68415
8756b8012035M19766J65853r9706l52517n38801n92843m63907j41406L31696Q63230
8746b8420670J336785J653416J772755J727179J594759J447428J312618J175265
8738a6400465J010910Q15129O02949L83795J39939j68518n72021j053173j527285
8729a6768740j858832j912219j613460r88589j55522P25139J509587K107477K483586
8720a6471573K636910K578934K324627J897244J342141P41431K14505j12101j63304
8711e011186L0577L27640N29391M65781O2540o36069j486888k295295k875761
$$ plain form
8772 -66705444 -63281732 -59531917 -55717590 -52077807 -48774330 -45854871 -43257646 -40863182
8764 -40863182 -38570197 -36353109 -34268057 -32409249 -30850980 -29615384 -28680450 -28012035
8756 -28012035 -27592269 -27426416 -27526122 -27878639 -28417440 -29010283 -29474190 -29615596 -29283900 -28420670
8746 -28420670 -27083885 -25430469 -23657714 -21930535 -20335776 -18888348 -17575730 -16400465
8738 -16400465 -15389555 -14574426 -13971477 -13587682 -13447743 -13616261 -14188282 -15241455 -16768740
8729 -16768740 -18627572 -20539791 -22153251 -23141840 -23297362 -22572223 -21062636 -18955159 -16471573
8720 -16471573 -13834663 -11255729 -8931102 -7033858 -5691717 -4950286 -4735781 -4847882 -5011186
8711 -5011186 -4980609 -4652969 -4123578 -3657797 -3595257 -4231326 -5718214 -8013509 -10889270
8702a0889270l108147k970040k533885j934035j319870q12004m74799l12692k87574
8693b4642316l43082m20190m60381m06711k14843J25920N75220J043708J419207
8684b3323468J605726J555509J279634Q36644L10554k09961o47520r49987j102485
8675b0645354j130718j089309j038854j024309j065064j156679j277537j395671
8667b9823495j475521j484879j399579j203807q89288m60907M8866N68086R93743
8658c5126781J225222J204145R34909M78934o2707n64835q95649r45376o60620
8649c4412758o5760P41721J619214K418474L024067L378788L486021L388291L134146
8640a3287796K752344K247825J621352Q99507J52739n15027j002393j251192j268922
$$ plain form
8702 -10889270 -13997417 -16967457 -19501342 -21435377 -22755247 -23567251 -24042050 -24354742 -24642316
8693 -24642316 -24985398 -25405588 -25865969 -26272680 -26487523 -26361603 -25786383 -24742675 -23323468
8684 -23323468 -21717742 -20162233 -18882599 -18045955 -17735401 -17945362 -18592882 -19542869 -20645354
8675 -20645354 -21776072 -22865381 -23904235 -24928544 -25993608 -27150287 -28427824 -29823495
8667 -29823495 -31299016 -32783895 -34183474 -35387281 -36276569 -36737476 -36688610 -36120524 -35126781
8658 -35126781 -33901559 -32697414 -31762505 -31283571 -31346278 -31911113 -32806762 -33752138 -34412758
8649 -34412758 -34478518 -33736797 -32117583 -29699109 -26675042 -23296254 -19810233 -16421942 -13287796
8640 -13287796 -10535452 -8287627 -6666275 -5766768 -5614029 -6129056 -7131449 -8382641 -9651563
8631i651563j122346r06634p04382n53230m37885l10274j25846J25002M07758
8622a3279400O61352Q31155Q96074Q72683P97750P07296O28202N80864N80319
8613f723705O30959P23259Q39769R64278J082729J176266J219339J190543J086763
8604B190200R24992P29044N13963K81105K4991k55595n49331q30656j065212j219343
8594G44158j268200j200329j020620p50702m20790n1868L59338Q36398J398622
8585a373993K032170K675905L230004L583239L647008L381262K801638J968961
8577B1946194R71194r4791j141859k110958k980488l756649m446004n025576n431035
8568b069972n575362n391942m877623m107030l206498k302710j477058p51397
$$ plain form
8631 -9651563 -10773909 -11680543 -12384925 -12938155 -13376040 -13686314 -13812160 -13687158 -13279400
8622 -13279400 -12618048 -11786893 -10890819 -10018136 -9220386 -8513090 -7884888 -7304024 -6723705
8613 -6723705 -6092746 -5369487 -4529718 -3565440 -2482711 -1306445 -87106 1103437 2190200
8604 2190200 3115192 3844236 4358199 4639304 4664295 4408700 3859369 3028713 1963501 744158
8594 744158 -524042 -1724371 -2744991 -3495693 -3916483 -3968351 -3609013 -2772615 -1373993
8585 -1373993 658177 3334082 6564086 10147325 13794333 17175595 19977233 21946194
8577 21946194 22917388 22822597 21680738 19569780 16589292 12832643 8386639 3361063 -2069972
8568 -2069972 -7645334 -13037276 -17914899 -22021929 -25228427 -27531137 -29008195 -29759592
8560b9759592j09409M66775R76148J411899J792354K172484K614191L134483L676292
8551a3624375M130716M397569M440312M296461M039977L729253L382273K991680
8543A7783866K554921K085466J597364J085846N29542q4818p38337j380368j954454
8534B1479028k426520k789920l045594l181612l176108l021601k745805k408495
8526a316627k076568j795241j571224j372757j143461q23850l73012K16671R15391
8517i340678J660222K362329K915275L209836L160786K739626J995730J051217
8509I754343P0542p82148j384043j681558j693748j486694j131648o73558j29712
8500H61776M84876J127887J719785K163290K381994K352902K110037J717940J237901
$$ plain form
8560 -29759592 -29869001 -29402226 -28426078 -27014179 -25221825 -23049341 -20435150 -17300667 -13624375
8551 -13624375 -9493659 -5096090 -655778 3640683 7680660 11409913 14792186 17783866
8543 17783866 20338787 22424253 24021617 25107463 25637005 25552187 24813850 23433482 21479028
8534 21479028 19052508 16262588 13216994 10035382 6859274 3837673 1091868 -1316627
8526 -1316627 -3393195 -5188436 -6759660 -8132417 -9275878 -10099728 -10472740 -10256069 -9340678
8517 -9340678 -7680456 -5318127 -2402852 806984 3967770 6707396 8703126 9754343
8509 9754343 9824885 9042737 7658694 5977136 4283388 2796694 1665046 991488 861776
8500 861776 1346652 2474539 4194324 6357614 8739608 11092510 13202547 14920487 16158388
8491A6158388P12238J70904l56400q38751j252534j588295j850050k051712k215275
8482F888513k365610k514380k638985k677365k554072k226499j718891j118800
8474a0926089n39659p5819K24797L63242L76127L18599K49882K20012K55279L45892
8464i187737M45363M88099M20217K28275m9325l33871n34742n81690m47943j57258
8454i710612K24104O05068Q93010J020196R66791P67554M92537K10479l8566k40027
8444d809466l78795m22614l37548j22373J74281M73764P06509Q36253Q55598P69976
8434b254415N92709L52354R4605j32554l00952m13803n00212n99781p46195r53537
8424d861781j207236j462286j649422j689003j514608j105475n12477J46838P32083
$$ plain form
8491 16158388 16870626 17041530 16685130 15846379 14593845 13005550 11155500 9103788 6888513
8482 6888513 4522903 2008523 -630462 -3307827 -5861899 -8088398 -9807289 -10926089
8474 -10926089 -11465748 -11541567 -11316770 -10953528 -10577401 -10258802 -10008920 -9788908 -9533629 -9187737
8464 -9187737 -8742374 -8254275 -7834058 -7605783 -7655108 -7988979 -8523721 -9105411 -9553354 -9710612
8454 -9710612 -9486508 -8881440 -7988430 -6968234 -6001443 -5233889 -4741352 -4530873 -4569439 -4809466
8444 -4809466 -5188261 -5610875 -5948423 -6070796 -5896515 -5422751 -4716242 -3879989 -3024391 -2254415
8434 -2254415 -1661706 -1309352 -1214747 -1347301 -1648253 -2062056 -2562268 -3162049 -3908244 -4861781
8424 -4861781 -6069017 -7531303 -9180725 -10869728 -12384336 -13489811 -14002288 -13855450 -13123367
8415a3123367J138650J334240J357027J286820J208027J176321J198127J232326
8407c191829J213611J082910Q09737M02697r1733o06950j089410j525435j933784
8398d930186k324893k664429k878367k896268k694296k305705j798907j243993
8390b3737044o86527j40477L92465Q85307J262083J422449J309589R68967N44452
8381a7778736K10554R1828K23191N65307J048955J609981K191807K722685L099734
8372f014694L208552K973855K403842J593423O84402j89975r44321j547126j997162
8363A70796k292453k418403k362737k138768j793514j396769j022550p30039n45140
8354a4529577m51309m03202l59460l08914k68145k56446k73768k99810l12071
$$ plain form
8415 -13123367 -11984717 -10650477 -9293450 -8006630 -6798603 -5622282 -4424155 -3191829
8407 -3191829 -1978218 -895308 -85571 317126 225393 -381557 -1470967 -2996402 -4930186
8398 -4930186 -7255079 -9919508 -12797875 -15694143 -18388439 -20694144 -22493051 -23737044
8390 -23737044 -24423571 -24564048 -24171583 -23286276 -22024193 -20601744 -19292155 -18323188 -17778736
8381 -17778736 -17568182 -17476354 -17253163 -16687856 -15638901 -14028920 -11837113 -9114428 -6014694
8372 -6014694 -2806142 167713 2571555 4164978 4849380 4659405 3715084 2167958 170796
8363 170796 -2121657 -4540060 -6902797 -9041565 -10835079 -12231848 -13254398 -13984437 -14529577
8354 -14529577 -14980886 -15384088 -15743548 -16052462 -16320607 -16577053 -16850821 -17150631 -17462702
8345a7462702l07107l07864l49053m49668n95590p49109q77666r74742j052155
8336b3125656j109412j107633r73966o38600p9401O56851J467395K225814K813779
8327a9870829L146228L192693K989393K629479K229066J885641J651721J535786
8319f10822J525644J616366J820553K149462K578850L032679L406355L614596
8311A9133683L624655L450618L122768K665849K102460J466001P98829J33393
8303C6498256n21191j168692j800531k381372k856825l169471l266651l103590
8295A8229933k657624j954967j088695k04871N43600J051735J296112J330739
8287A6545962J249584J136970J031485R19247P56661N09854J90864j31012l55483
$$ plain form
8345 -17462702 -17769809 -18077673 -18426726 -18876394 -19471984 -20221093 -21098759 -22073501 -23125656
8336 -23125656 -24235068 -25342701 -26316667 -26955267 -27034668 -26377817 -24910422 -22684608 -19870829
8327 -19870829 -16724601 -13531908 -10542515 -7913036 -5683970 -3798329 -2146608 -610822
8319 -610822 914822 2531188 4351741 6501203 9080053 12112732 15519087 19133683
8311 19133683 22758338 26208956 29331724 31997573 34100033 35566034 36364863 36498256
8303 36498256 35977065 34808373 33007842 30626470 27769645 24600174 21333523 18229933
8295 18229933 15572309 13617342 12528647 12323776 12867376 13919111 15215223 16545962
8287 16545962 17795546 18932516 19964001 20883248 21639909 22149763 22340627 22209615 21854132
8278B1854132m05907k80610o7391Q8553M4255k84108q89375j675285k488252l164626
8268A2731386l573508l641485l358816k774009j980316j094479k32701N06919
8260c417009J051556J356660J411896J247010R27089N32298J30325k42361n78930
8251B418534q82471j143480j332610j414918j374596j231738j040467q71774p90919
8242g664439q36891j007921j257639j507852j679294j729785j677749j591735
8234a8953305j549469j596306j734535j944846k210101k514956k828398l097804
8226c6429720l267238l301540l191308k937962k541379k007936j371741p04682
8218e5753506r8757L71512O81190Q59777R67559J060897J167297J281396J379618
$$ plain form
8278 21854132 21448225 21167615 21100224 21188777 21233032 20948924 20059549 18384264 15896012 12731386
8268 12731386 9157878 5516393 2157577 -616432 -2596748 -3691227 -3923928 -3417009
8260 -3417009 -2365453 -1008793 403103 1650113 2577202 3109500 3239825 2997464 2418534
8251 2418534 1536063 392583 -940027 -2354945 -3729541 -4961279 -6001746 -6873520 -7664439
8242 -7664439 -8501330 -9509251 -10766890 -12274742 -13954036 -15683821 -17361570 -18953305
8234 -18953305 -20502774 -22099080 -23833615 -25778461 -27988562 -30503518 -33331916 -36429720
8226 -36429720 -39696958 -42998498 -46189806 -49127768 -51669147 -53677083 -55048824 -55753506
8218 -55753506 -55852263 -55480751 -54799561 -53939784 -52972225 -51911328 -50744031 -49462635 -48083017
8209d8083017J441974J466477J467850J463910J460889J446067J389357J253774
8201c6692719J014615O80353K99491n7570l33195n10476o16379o99722p97743
8192c7713345r09603r92219r83517q41866n78314k60587J6539J80604K22732K02781
8182d1656795K11340L14028N18985P87448J069155J328294J544102J697171J761288
8173c2424984J710761J539370J277453R91250P58283O31345O14210O62882P07088
8164b3532342O77813N31285K65581p4524m09071o49495p29835o27628l63677J7564
8154b4894329M71226R60243J445175J873067K186567K353665K393493K371508
8146a0839385K362452K407858K499588K597378K660624K668474K620507K528810
$$ plain form
8209 -48083017 -46641043 -45174566 -43706716 -42242806 -40781917 -39335850 -37946493 -36692719
8201 -36692719 -35678104 -34997751 -34698260 -34755830 -35089025 -35599501 -36215880 -36915602 -37713345
8192 -37713345 -38622948 -39615167 -40598684 -41440550 -42018864 -42279451 -42262912 -42082308 -41859576 -41656795
8182 -41656795 -41445455 -41131427 -40612442 -39824994 -38755839 -37427545 -35883443 -34186272 -32424984
8173 -32424984 -30714223 -29174853 -27897400 -26906150 -26147867 -25516522 -24902312 -24239430 -23532342
8164 -23532342 -22854529 -22323244 -22057663 -22132187 -22541258 -23190753 -23920588 -24548216 -24911893 -24894329
8154 -24894329 -24423103 -23462860 -22017685 -20144618 -17958051 -15604386 -13210893 -10839385
8146 -10839385 -8476933 -6069075 -3569487 -972109 1688515 4356989 6977496 9506306
8138I506306K411676K287226K162861K027615J859445J646138J400897J154889
8130B4457053R30711P20130M86814J93629j66002n55565r10339j168839j299266
8121B2688326j304116j203915j019881p77617n32410l87348m71136q75119j590088
8112A4526696k490328l377202m053192m385943m338467l962302l362781k653806
8104a4097325j922869j219292n61627M9334O21148J164441J690202K208839K727558
8095i339591L241630L723017M119366M372335M445605M340090M083495L705285
8087B2691232L221116K639646J982351J296851O52214J19198k53738m57336n23525
8078C1368009n12070m90797n20413o45627q85970j225462j612230j977252k263741
$$ plain form
8138 9506306 11917982 14205208 16368069 18395684 20255129 21901267 23302164 24457053
8130 24457053 25387764 26107894 26594708 26788337 26622335 26066770 25156431 23987592 22688326
8121 22688326 21384210 20180295 19160414 18382797 17850387 17463039 16991903 16116784 14526696
8112 14526696 12036368 8659166 4605974 220031 -4118436 -8080738 -11443519 -14097325
8104 -14097325 -16020194 -17239486 -17801113 -17751779 -17130631 -15966190 -14275988 -12067149 -9339591
8095 -9339591 -6097961 -2374944 1744422 6116757 10562362 14902452 18985947 22691232
8087 22691232 25912348 28551994 30534345 31831196 32483410 32602608 32348870 31891534 31368009
8078 31368009 30855939 30365142 29844729 29199102 28313132 27087670 25475440 23498188 21234447
8069B1234447k448141k543350k589907k642165k749629k935305l182512l441781
8061a298343l655763l786706l830437l809966l754331l678472l580663l458682
8053c0853363l326052l208564l124239l070891l038411l035586l104402l303954
8045e6065462l669773m172860m706349n114087n249490n031033m462567l613734
8037i2085355k583297j471991l73304O26288J447960K025535K315262K310430
8029h7788472K055369J644518J194328P95790M78166K14030l4233k61227m00312
8020h2102043l53560m5044N42011J365484K351490L421129M498911N506680O358882
8011e8456060O968577P261554P191656O753825N992492N001550L914510K888474
$$ plain form
8069 21234447 18786306 16242956 13653049 11010884 8261255 5325950 2143438 -1298343
8061 -1298343 -4954106 -8740812 -12571249 -16381215 -20135546 -23814018 -27394681 -30853363
8053 -30853363 -34179415 -37387979 -40512218 -43583109 -46621520 -49657106 -52761508 -56065462
8045 -56065462 -59735235 -63908095 -68614444 -73728531 -78978021 -84009054 -88471621 -92085355
8037 -92085355 -94668652 -96140643 -96513947 -95887659 -94439699 -92414164 -90098902 -87788472
8029 -87788472 -85733103 -84088585 -82894257 -82098467 -81620301 -81406271 -81440504 -81701731 -82102043
8020 -82102043 -82455603 -82500647 -81958636 -80593152 -78241662 -74820533 -70321622 -64814942 -58456060
8011 -58456060 -51487483 -44225929 -37034273 -30280448 -24287956 -19286406 -15371896 -12483422
8003a2483422K082988J627360J575551J870138K349314K806587L068908L043279
$$ plain form
8003 -12483422 -10400434 -8773074 -7197523 -5327385 -2978071 -171484 2897424 5940703
$$ [...]
##END NTUPLES=NMR SPECTRUM
##END=
