##TITLE=31Pdec_24-2024-Bay
 CDcl3
 24 sc
 1.4.2024
##JCAMPDX= 6.0         $$ Bruker NMR JCAMP-DX V2.0
##DATA TYPE= NMR SPECTRUM
##DATA CLASS= NTUPLES
##ORIGIN= UXNMR, Bruker Analytische Messtechnik GmbH
##OWNER= root
$$ XWIN-NMR		Version 3.5
$$ Mon Apr  1 16:38:46 2024 Russian Standard Time (UT+4h)  she@DPX200
##.OBSERVE FREQUENCY= 81.013821
##.OBSERVE NUCLEUS= ^31P
##.ACQUISITION MODE= SIMULTANEOUS
##.ACQUISITION SCHEME= undefined
##.AVERAGES= 24
##.DIGITISER RES= 16
##SPECTROMETER/DATA SYSTEM= spect
##.PULSE SEQUENCE= zgpg30
##.SOLVENT NAME= D2O
##.SHIFT REFERENCE= (INTERNAL, D2O, 0, 248.564)
##AUDIT TRAIL= $$ (NUMBER, WHEN, WHO, WHERE, WHAT)
$$ ##TITLE= Audit trail, XWIN-NMR		Version 3.5
$$ ##JCAMPDX= 5.01
$$ ##ORIGIN= Bruker BioSpin GmbH
$$ ##OWNER= she
$$ F:/spectra/data/she/nmr/P31/1/pdata/1/auditp.txt
$$ ##AUDIT TRAIL=  $$ (NUMBER, WHEN, WHO, WHERE, WHAT)
(   1,<2024-04-01 16:37:53.42 +0400>,<she>,<DPX200>,
      <created by zg, POWCHK disabled, PULCHK disabled
       configuration hash MD5:
       00 E9 B6 7A A2 85 ED C7 34 08 36 98 17 FE 4E 26
       data hash MD5: 32K
       5B 62 BD BE CA 2A 58 29 80 85 91 31 24 76 E9 17>)
(   2,<2024-04-01 16:37:56.59 +0400>,<she>,<DPX200>,
      <Start of raw data processing
       efp BC_mod = 2 LB = 10 FT_mod = 6 PKNL = 1 PHC0 = -13328.62 PHC1 = 600.4834 SI = 64K 
       data hash MD5: 64K
       2A EA 9C 27 10 15 EC 3D A9 1B 4E 40 92 CC 64 59>)
(   3,<2024-04-01 16:38:12.92 +0400>,<she>,<DPX200>,
      <pk PHC0 = 99.26357 PHC1 = -514.2001 
       data hash MD5: 64K
       47 83 E5 3C B6 AF B0 E6 78 39 F5 7D E3 21 3D 18>)
(   4,<2024-04-01 16:38:16.17 +0400>,<she>,<DPX200>,
      <abs ABSG = 5 
       data hash MD5: 64K
       EF F5 22 8E 78 11 59 80 FD 6E 56 E2 83 24 77 0A>)
$$ ##END=
$$ 
$$ hash MD5
$$ EA 33 48 30 56 E1 4B DF 18 3B 51 9B C8 10 83 6D
##$RELAX= 
##$RELAX= 
##$RELAX= 
##$RELAX= 
##$RELAX= 
##$RELAX= 
##$RELAX= 
##$RELAX= 
##$RELAX= 
$$ Bruker specific parameters
$$ --------------------------
##$DU= <F:/spectra>
##$EXPNO= 1
##$NAME= <P31>
##$PROCNO= 1
##$TYPE= <nmr>
##$USER= <she>
##$AMP= (0..31)
100 100 100 100 100 100 100 100 100 100 100 100 100 100 100 100 100 100 
100 100 100 100 100 100 100 100 100 100 100 100 100 100 
##$AQSEQ= 0
##$AQ_mod= 1
##$AUNM= <au_zg>
##$AUTOPOS= <>
##$BF1= 81.014009
##$BF2= 200.13
##$BF3= 200.13
##$BF4= 200.13
##$BF5= 200.13
##$BF6= 200.13
##$BF7= 200.13
##$BF8= 200.13
##$BYTORDA= 1
##$CFDGTYP= 0
##$CFRGTYP= 5
##$CHEMSTR= <none>
##$CNST= (0..31)
1 1 145 1 1 1 1 1 1 1 1 1 1 1 1 1 1 1 1 1 1 1 1 1 1 1 1 1 1 1 1 1 
##$CPDPRG= <waltz16>
##$CPDPRG1= <>
##$CPDPRG2= <waltz16>
##$CPDPRG3= <>
##$CPDPRG4= <mlev>
##$CPDPRG5= <mlev>
##$CPDPRG6= <mlev>
##$CPDPRG7= <mlev>
##$CPDPRG8= <mlev>
##$CPDPRGB= <>
##$CPDPRGT= <>
##$D= (0..31)
0 1 0 0 0 0 0 0 0 0 0 0.03 2e-05 3e-06 0 0 0 0 0 0 0 0 0 0 0 0 0 0 0 0 
0 0 
##$DATE= 1711975072
##$DBL= (0..7)
120 120 120 11 120 120 24 19 
##$DBP= (0..7)
150 150 150 150 150 150 150 150 
##$DBP07= 0
##$DBPNAM0= <>
##$DBPNAM1= <>
$$ [...]
##$SUBNAM3= <"">
##$SUBNAM4= <"">
##$SUBNAM5= <"">
##$SUBNAM6= <"">
##$SUBNAM7= <"">
##$SUBNAM8= <"">
##$SUBNAM9= <"">
##$SW= 501.771253377433
##$SWIBOX= (0..15)
0 1 3 0 0 0 0 0 0 0 0 0 0 0 0 0 
##$SW_h= 40650.406504065
##$TD= 32768
##$TD0= 1
##$TE= 0
##$TE2= 300
##$TE3= 300
##$TEG= 300
##$TL= (0..7)
0 120 53 12 22 120 120 120 
##$TP= (0..7)
150 150 150 150 150 150 150 150 
##$TP07= 0
##$TPNAME0= <>
##$TPNAME1= <>
##$TPNAME2= <>
##$TPNAME3= <>
##$TPNAME4= <>
##$TPNAME5= <>
##$TPNAME6= <>
##$TPNAME7= <>
##$TPOAL= (0..7)
0.5 0.5 0.5 0.5 0.5 0.5 0.5 0.5 
##$TPOFFS= (0..7)
0 0 0 0 0 0 0 0 
##$TUNHIN= 0
##$TUNHOUT= 0
##$TUNXOUT= 0
##$USERA1= <user>
##$USERA2= <user>
##$USERA3= <user>
##$USERA4= <user>
##$USERA5= <user>
##$V9= 5
##$VALIST= <valist>
##$VCLIST= <CCCCCCCCCCCCCCC>
##$VD= 0
##$VDLIST= <DDDDDDDDDDDDDDD>
##$VPLIST= <PPPPPPPPPPPPPPP>
##$VTLIST= <TTTTTTTTTTTTTTT>
##$WBST= 1024
##$WBSW= 4
##$XGAIN= (0..3)
0 0 0 0 
##$XL= 0
##$YL= 0
##$YMAX_a= 17120
##$YMIN_a= -17011
##$ZGOPTNS= <>
##$ZL1= 120
##$ZL2= 120
##$ZL3= 120
##$ZL4= 120
##$ABSF1= 248.5645
##$ABSF2= -253.2056
##$ABSG= 5
##$ABSL= 3
##$ALPHA= 0
##$AQORDER= 0
##$ASSFAC= 0
##$ASSFACI= 0
##$ASSFACX= 0
##$ASSWID= 0
##$AUNMP= <proc_1d>
##$AZFE= 0.1
##$AZFW= 0.5
##$BCFW= 0
##$BC_mod= 2
##$BYTORDP= 0
##$COROFFS= 0
##$CY= -3
##$DATMOD= 1
##$DC= 0
##$DFILT= <>
##$DTYPP= 0
##$F1P= 0
##$F2P= 0
##$FCOR= 1
##$FTSIZE= 65536
##$FT_mod= 6
##$GAMMA= 0
##$GB= 0
##$INTBC= 1
##$INTSCL= 6.047779e-11
##$ISEN= 30
##$LB= 10
##$LEV0= 0
##$LPBIN= 0
##$MAXI= 10000
##$MC2= 0
##$MEAN= 0
##$ME_mod= 0
##$MI= 50
##$NCOEF= 0
##$NC_proc= -5
##$NLEV= 6
##$NOISF1= 182.463
##$NOISF2= 159.3651
##$NSP= 0
##$NTH_PI= 0
##$NZP= 0
##$OFFSET= 248.5645
##$PC= 4
##$PHC0= -13229.36
##$PHC1= 86.28333
##$PH_mod= 1
##$PKNL= yes
##$PPARMOD= 0
##$PSCAL= 0
##$PSIGN= 0
##$REVERSE= no
##$SF= 81.0140089999694
##$SI= 65536
##$SIGF1= 159.3651
##$SIGF2= -187.1042
##$SINO= 113.3802
##$SIOLD= 16384
##$SREGLST= <1H.CDCl3>
##$SSB= 0
##$STSI= 65536
##$STSR= 0
##$SW_p= 40650.406504065
##$SYMM= 0
##$S_DEV= 0
##$TDeff= 32768
##$TDoff= 0
##$TI= <>
##$TILT= no
##$TM1= 0
##$TM2= 0
##$TOPLEV= 0
##$USERP1= <user>
##$USERP2= <user>
##$USERP3= <user>
##$USERP4= <user>
##$USERP5= <user>
##$WDW= 1
##$XDIM= 65536
##$YMAX_p= 550594957
##$YMIN_p= -696846
$$ End of Bruker specific parameters
$$ ---------------------------------
##NTUPLES= NMR SPECTRUM
##VAR_NAME=  FREQUENCY,     SPECTRUM/REAL,   SPECTRUM/IMAG
##SYMBOL=    X,             R,               I
##VAR_TYPE=  INDEPENDENT,   DEPENDENT,       DEPENDENT
##VAR_FORM=  AFFN,          ASDF,            ASDF
##VAR_DIM=   65536,         65536,           65536
##UNITS=     HZ,            ARBITRARY UNITS, ARBITRARY UNITS
##FACTOR=    0.620285442955139, 1,           1
##FIRST=     20137.2065510682, 0,            0
##LAST=      -20513.1999529968, 0,           0
##MIN=       -20513.1999529968, -696846,     0
##MAX=       20137.2065510682, 550594957,    0
$$ Real data points
##PAGE= N=1
##DATA TABLE= (X++(R..R)), XYDATA
$$ [...]
39271I7576J0575J1305J1005R498O715K835j649o009r479j1454j1636j0045o958
39258I2279k750K225P660J3247J8531K2789K5098K4622K1035J4711O612k100j0316
39245B33643j7128k1908k4399k4764k3513k1350j9031j7264j6542j6966j8154
39234A2624j9354j9799j9053j7183j4600j1789r101o680m493k397k64J909L955
39221a06225N620O689P118P059O805O709P133Q400J0700J3945J7617K0808K2419
39208C4797K1522J7757J1548L991l575j0099j5171j9050k2382k5740k9258l2543
39196f8203l4929l5776l4613l1195k5498j7815q733R60J0372J8501K4289K6851
39184a75789K5891K2020J6736J1932R212R371J2306J7261K3218K9183L4418L8522
$$ y = [97576, 108151, 119456, 130461, 139959, 146674, 149509, 147860, 141851, 132372, 120918, 109282, 99237, 92279, 89529, 91754, 99414, 112661, 131192, 153981, 179079, 203701, 224736, 239447, 246059, 243959, 233643, 216515, 194607, 170208, 145444, 121931, 100581, 81550, 64286, 47744, 30778, 12624, -6730, -26529, -45582, -62765, -77365, -89154, -98255, -104935, -109428, -111825, -112089, -110180, -106225, -100605, -93916, -86798, -79739, -72934, -66225, -59092, -50692, -39992, -26047, -8430, 12378, 34797, 56319, 74076, 85624, 89615, 86040, 75941, 60770, 41720, 19338, -6402, -35660, -68203, -103132, -138908, -173521, -204716, -230214, -248029, -256762, -255802, -245430, -226929, -202640, -175789, -149898, -127878, -111142, -99210, -89998, -80627, -68321, -51060, -27842, 1341, 35759, 74281]
39172G4281M1350M2814M2703M0731L6742L0877K3580J5446P109q19p739j3130
39160C33945j6656j8207j7898j6022j2980r231n242j463J658L727M585M472M002
39147B54690L843M363N428O518O977O225L849l32o166j3077k0128k6208l0254
39134A95728l1429k9304k4040j6409p526J565J0133J7749K4094K8876L1859L3048
39122B34344L2770L1632L0183K8546K6245K2453J6496Q299j504j1807k1449k9530
39110C66678l5543l9300m0805m0197l7804l4179l0040k6020k2353j8841j5059
39099B6537j0713n811n55M827J0127J5056J9140K1755K2334K0598J6728J1389
39087A51412N616N97k608l407j905J092M342O673P482O974N983N483O063P734
$$ y = [74281, 115631, 158445, 201148, 241879, 278621, 309498, 333078, 348524, 355633, 354814, 347075, 333945, 317289, 299082, 281184, 265162, 252182, 242951, 237709, 236246, 237904, 241631, 246216, 250688, 254690, 258533, 262896, 268324, 274842, 281819, 288044, 291893, 291561, 285395, 272318, 252190, 225982, 195728, 164299, 134995, 110955, 94546, 87020, 88585, 98718, 116467, 140561, 169437, 201296, 234344, 267114, 298746, 328929, 357475, 383720, 406173, 422669, 430968, 429464, 417657, 396208, 366678, 331135, 291835, 251030, 210833, 173029, 138850, 108810, 82790, 60437, 41596, 26537, 15824, 10013, 9458, 14285, 24412, 39468, 58608, 80363, 102697, 123295, 140023, 151412, 157028, 157625, 155017, 151610, 149705, 150797, 155139, 161812, 169294, 176268, 182251, 187734, 193797, 201531]
39073B01531J0057J2387J4093J4635J3639J0959O765J506m267j0128j5868k1359
39061B33950k6325l0269l2557l2662l0388k6056k0510j4852j0008o377l763j598
39049a415P50L682P227J1081J4767J7780J9625J9830J8038J4134Q410J569n413
39036A30065j1528j5997j8430j8836j7535j4970j1563p673l718k87J868K080P6
39023A3552l879r053j4507j9317k2694k4002k2823j9076j3101n510L021J1854
39011a25535K0230K7183L1740L3320L1997K8405K3400J7778J2099O652J518l327
38999A05460p840j1794j4799j6474j6624j5324j2833r479n596j506K504O201R371
38986A1267J1735J2948J2704J0953Q030M659J767J72L17K122N056Q364J1319J3409
$$ y = [201531, 211588, 223975, 238068, 252703, 266342, 277301, 284066, 285572, 281305, 271177, 255309, 233950, 207625, 177356, 144799, 112137, 81749, 55693, 35183, 20331, 10323, 3946, 183, -1415, -665, 3017, 10244, 21325, 36092, 53872, 73497, 93327, 111365, 125499, 133909, 135478, 130065, 118537, 102540, 84110, 65274, 47739, 32769, 21206, 13533, 9815, 9528, 11396, 13476, 13552, 9673, 620, -13887, -33204, -55898, -79900, -102723, -121799, -134900, -140410, -137389, -125535, -105305, -78122, -46382, -13062, 18935, 47340, 70740, 88518, 100617, 107269, 108787, 105460, 97620, 85826, 71027, 54553, 37929, 22605, 9772, 293, -5303, -6809, -4305, 1896, 11267, 23002, 35950, 48654, 59607, 67637, 72296, 74063, 74235, 74552, 76674, 81730, 90094, 101413, 114822]
38972A14822J4417J4365J3436J1904J0102Q428P254O730O636O397N320K901r52
38959B21760n872j1170j6113k0216k3394k5867k7874k9417l0256l0136k9062k7395
38947e5012k5577k3804k1903j9525j6473j2858r077n718l407k646l662o381j0441
38934b16484j5226j9922k3691k5923k6338k4943k2018j8077j3772r611n716j869
38922d23590K205O548J0925J4960J8322K0823K2352K2799K2104K0445J8332J6494
38910b27281J5597J6071J7983K0968K4148K6285K6201K3296J7804J0624K873m446
38898b9877j0586j5114j7915j9203j9356j8677j7337j5494j3427j1454r787q422
38886b06649p230o016m541k452O82N223J1193J8078K4827L0128L2894L2653K9760
$$ y = [114822, 129239, 143604, 157040, 168944, 179046, 187474, 194728, 201458, 208094, 214491, 219811, 222712, 221760, 215888, 204718, 188605, 168389, 144995, 119128, 91254, 61837, 31581, 1445, -27617, -55012, -80589, -104393, -126296, -145821, -162294, -175152, -184229, -189947, -193354, -196000, -199662, -206043, -216484, -231710, -251632, -275323, -301246, -327584, -352527, -374545, -392622, -406394, -416005, -421721, -423590, -421385, -414837, -403912, -388952, -370630, -349807, -327455, -304656, -282552, -262107, -243775, -227281, -211684, -195613, -177630, -156662, -132514, -106229, -80028, -56732, -38928, -28304, -25431, -29877, -40463, -55577, -73492, -92695, -112051, -130728, -148065, -163559, -176986, -188440, -198227, -206649, -213879, -219895, -224436, -226888, -226206, -220983, -209790, -191712, -166885, -136757, -103863, -71210, -41450]
38873d1450K5229K0324J6111J3176J1596J1063J1055J1015J0528R399P582N095
38861A10723J961j696n539r005j1402j2192j1232q891n872k929n63J084K179K984
38847D9610L619L898L358J459k098p116j2875j8367k2723k5473k6503k5827k3508
38834a02546j9713j4829r376l782J692O860J1407J4798J6411J5837J3154R065
38822f1022M694J115j146k324l239m847p833j2393j8128k4136k9251l2429l3091
38809b24030l1278k7529k2644j7391j2348p879m215j518K76J594L164N651R221
38796c28926J3364J7108J9488J9969J8608J5848J2243Q326M703K163J566L451
38784a92089P679J3309J8863K2903K4606K4131K2483K0987K0602K1463K2880K3771
$$ y = [-41450, -16221, 4103, 20214, 33390, 44986, 56049, 67104, 78119, 88647, 98046, 105628, 110723, 112684, 110988, 105449, 96444, 85042, 72850, 61618, 52727, 46855, 43926, 43363, 44447, 46626, 49610, 53229, 57127, 60485, 61944, 59846, 52730, 39855, 21488, -1235, -26708, -53211, -79038, -102546, -122259, -137088, -146464, -150246, -148554, -141694, -130287, -115489, -99078, -83241, -70087, -61022, -56328, -55213, -56359, -58683, -61922, -66769, -74602, -86995, -105123, -129259, -158510, -190939, -224030, -255308, -282837, -305481, -322872, -335220, -343099, -347314, -348832, -348556, -346962, -343798, -338147, -328926, -315562, -298454, -278966, -258997, -240389, -224541, -212298, -203972, -199269, -197106, -195540, -192089, -184410, -171101, -152238, -129335, -104729, -80598, -58115, -37128, -16526, 4937, 27817, 51588]
38772E1588K3262K1149J8000J4877J2826J2420J3557J5612J7736J9111J9130J7433
38760B56701J3954Q953L001l131q684j3058j5901j7087j6757j5312j3312j1311
38748A68056r760r005r296j0647j2742j4989j6701j7275j6235j3259q233j321
38736B8593O983J5815K4038L0485L4317L5241L3438K9316K3307J5872P582q32
38724B84155q646j5359k0782k4891k7599k8644k7704k4579j9336j2370m434L431
38712G3242J0114J4727J6889J6801J5063J2297Q827M642l50n996j1757j6846k0527
38699A17126k2382k2464k1211j9196j6797j3988j0412n691K43O949J3536J8918
38687B4631K2112K2506J9986J4923Q069M32o936j3108j7514k0043k0920k0434
$$ y = [51588, 74850, 95999, 113999, 128876, 141702, 154122, 167679, 183291, 201027, 220138, 239268, 256701, 270655, 279608, 282609, 279478, 270794, 257736, 241835, 224748, 207991, 192679, 179367, 168056, 158296, 149291, 139995, 129348, 116606, 101617, 84916, 67641, 51406, 38147, 29914, 28593, 35576, 51391, 75429, 105914, 140231, 175472, 208910, 238226, 261533, 277405, 284987, 284155, 275509, 260150, 239368, 214477, 186878, 158234, 130530, 105951, 86615, 74245, 69811, 73242, 83356, 98083, 114972, 131773, 146836, 159133, 167960, 172602, 172252, 166256, 154499, 137653, 117126, 94744, 72280, 51069, 31873, 15076, 1088, -9324, -15015, -14772, -7823, 5713, 24631, 46743, 69249, 89235, 104158, 112227, 112659, 105723, 92615, 75101, 55058, 34138, 13704]
38675A3704j8684j5573j0996n047J973R643J7503K5072L1867L7505M1784M4690
38663A73441M6360M7044M7071M6730M6152M5214M3621M1016L7168L2149K6394
38652F32360K0479J4689Q805K315n035j2873k0297k6330l0380l2370l2598l1455
38640D87310k9267k6207k2291j7398j1413m489K804R550J4800J7903J8640J7217
38628D57159J4111R855M924k85n334r670j2705j4007j3494j1502q644n536k585
38615D02287L7K220L756M316L616J621j381m943q734j2776j7394k2945k9463l6438
38601B83779m2907m7772n0222m9997m7387m3044l7758l2255k7021k2215j7654
38590a34453j2931p556j170O266J4360K2398K9573L5185L8729L9863L8475L4787
$$ y = [13704, -4980, -20553, -31549, -36596, -34623, -24980, -7477, 17595, 49462, 86967, 128751, 173441, 219801, 266845, 313916, 360646, 406798, 452012, 495633, 536649, 573817, 605966, 632360, 652839, 667528, 676333, 678648, 673613, 660740, 640443, 614113, 583733, 551363, 518765, 487310, 458043, 431836, 409545, 392147, 380734, 376245, 379049, 388599, 403399, 421302, 439942, 457159, 471270, 481125, 486049, 485764, 480430, 470760, 458055, 444048, 430554, 419052, 410408, 404872, 402287, 402324, 404544, 408300, 412616, 416232, 417853, 416472, 411529, 402795, 390019, 372625, 349680, 320217, 283779, 240872, 193100, 142878, 92881, 45494, 2450, -35308, -67563, -94584, -116799, -134453, -147384, -154940, -156110, -149844, -135484, -113086, -83513, -48328, -9599, 30264, 68739, 103526]
38578A03526K9486K3606J8190J3909J0899Q958P873P575Q057R215J0800J2493
38566B64587J3971J4879J4810J3358J0281N615l07o955j3693j9810k4607k7554
38554B44575k8456k7528k5285k2358j9299j6475j4151j2726j2832j5111j9656
38543C0698k5667l1619l5896l7447l6047l2123k6349j9317j1425k991N621J3925
38531b08637K1397K7605L2302L5400L6908L6839L5225L2170K7937K3037J8231
38520A18414J4430J2388J2396J4173J6950J9714K1386K0992J7824J1599K561q504
38508B74323k0366l1602m0953m7725n1951n4228n5282n5516n4819n2770m9002
38497b39891m3511l6686k9156k1537j4257p525j418M037Q828J3052J6897K0531
$$ y = [103526, 133012, 156618, 174808, 188717, 199616, 208574, 216447, 224022, 232079, 241294, 252094, 264587, 278558, 293437, 308247, 321605, 331886, 337501, 337194, 330239, 316546, 296736, 272129, 244575, 216119, 188591, 163306, 140948, 121649, 105174, 91023, 78297, 65465, 50354, 30698, 5031, -26588, -62484, -99931, -135978, -168101, -194450, -213767, -225192, -228183, -222562, -208637, -187240, -159635, -127333, -91933, -55025, -18186, 17039, 49209, 77146, 100183, 118414, 132844, 145232, 157628, 171801, 188751, 208465, 229851, 250843, 268667, 280266, 282827, 274323, 253957, 222355, 181402, 133677, 81726, 27498, -27784, -83300, -138119, -190889, -239891, -283402, -320088, -349244, -370781, -385038, -392563, -393981, -389944, -381116, -368064, -351167, -330636]
38485c30636K3924K6796K8744K9428K8678K6496K3007J8484J3400Q388M072Q03
38473i8416j452l084m720p015j0401j4773j9351k2855k3967k1848j6499q757L8
38460b53100Q495J5570K0694K3748K4961K4796K3794K2396K0819J9029J6808J3848
38448a8142R930N118j26n005q683j0592j0678r405p651o480o845r255j3539j8866
38434a10219k4028k7847k9519k8771k5816k1159j5354q889k231M094R488J3459
38422b66792J5760J6447J5732J3858J1011P370L088j703o818j1830j5998j8494
38410b38369j8787j6869j3180q306k732L200R232J5077K0434K5007K8574L0961
38398a65758L2001L1547K9547K6157K1784J7036J2539Q716N701L426J788P24J57
$$ y = [-330636, -306712, -279916, -251172, -221744, -193066, -166570, -143563, -125079, -111679, -103291, -99219, -98416, -99868, -102952, -107672, -114687, -125088, -139861, -159212, -182067, -206034, -227882, -244381, -253138, -253100, -244605, -229035, -208341, -184593, -159632, -134836, -111042, -88646, -67827, -48798, -31990, -18142, -8212, -3094, -3220, -8225, -16908, -27500, -38178, -47583, -55234, -61714, -68559, -77814, -91353, -110219, -134247, -162094, -191613, -220384, -246200, -267359, -282713, -291602, -293833, -289739, -280251, -266792, -251032, -234585, -218853, -204995, -193984, -186614, -183526, -185229, -192047, -203877, -219875, -238369, -257156, -274025, -287205, -295511, -298243, -295043, -285811, -270734, -250300, -225293, -196719, -165758, -133757, -102210, -72663, -46506, -24722, -7686, 4853, 13569, 19270, 22696, 24484, 25208, 25365]
38385B5365k8L4K61P06J572L165N716R185J3224J7356K1207K4615K7557L0057
38371A79992L2129L3735L4783L5129L4647L3321L1259K8666K5756K2609J9050
38360E11076J4586Q582O20r139j9876l0428l9758m7281n2921n6962n9804o1675
38348A57020o2440o1639n8759n3578m6392l8017k9592k2164j6246j1586p357k689
38336b53439K766Q616J3892J7533J8911J8076J5637J2406R027N797K675n65m172
38323a32840q237j2600j6816k0243k2255k2463k0836j7666j3393q476l263K016
38311b97072P237J2348J7303K2001K6262K9842L2550L4299L5067L4744L3051K9627
38299A7259K4227J6885Q019j562j0773j8522k4037k7069k7842k6796k4381k0962
$$ y = [25365, 25337, 25371, 25632, 26338, 27910, 31075, 36791, 45976, 59200, 76556, 97763, 122378, 149935, 179992, 212121, 245856, 280639, 315768, 350415, 383736, 414995, 443661, 469417, 492026, 511076, 525662, 534244, 534864, 525725, 505849, 475421, 435663, 388382, 335461, 278499, 218695, 157020, 94580, 32941, -25818, -79396, -125788, -163805, -193397, -215561, -231807, -243393, -250750, -253439, -250673, -242057, -228165, -210632, -191721, -173645, -158008, -145602, -136575, -130778, -128103, -128668, -132840, -141077, -153677, -170493, -190736, -212991, -235454, -256290, -273956, -287349, -295825, -299088, -297072, -289835, -277487, -260184, -238183, -211921, -182079, -149529, -115230, -80163, -45419, -12368, 17259, 41486, 58371, 66390, 64828, 54055, 35533, 11496, -15573, -43415, -70211, -94592, -115554]
38287a15554j6910j2703q898n946l956k582j142J023M113P652J0743J2650J3314
38274a18196J3319J3402J3898J4632J5230J5548J5789J6312J7275J8488J9511
38263E5208J9885J9397J8144J6436J4530J2397R735O192J654l649r250j4649j9465
38250A26565k3508k6770k9395l1566l3292l4188l3475l0355k4562j6749q397j243
38238a66935L417N187M606K763Q29l10k12J095L177N404P248Q503R280R796J0176
38223i5976J0384J0337J0028R526Q845P858O423M572K574Q16m08r82r63m80M16
38208b7030J869M164P472J1543J5623J8658J9710J8357J4831R841M173j573p068
38195I0570j2183j6906k1265k5113k8000k9253k8260k4875j9568j3344p356k448
$$ y = [-115554, -132464, -145167, -154065, -160011, -163967, -166549, -167691, -166668, -162555, -154903, -144160, -131510, -118196, -104877, -91475, -77577, -62945, -47715, -32167, -16378, -66, 17209, 35697, 55208, 75093, 94490, 112634, 129070, 143600, 155997, 165732, 171924, 173578, 169929, 160679, 146030, 126565, 103057, 76287, 46892, 15326, -17966, -52154, -85629, -115984, -140546, -157295, -165692, -166935, -163518, -158331, -153725, -150962, -150133, -150443, -150655, -149560, -146383, -140979, -133731, -125228, -115948, -106152, -95976, -85592, -75255, -65227, -55701, -46856, -38998, -32575, -28003, -25429, -24613, -25021, -26003, -26966, -27446, -27030, -25161, -20997, -13525, -1982, 13641, 32299, 52009, 70366, 85197, 95038, 99211, 97638, 90570, 78387, 61481, 40216, 15103, -12897, -42150, -70410, -95285, -114853, -128197, -135553, -138001]
38183a38001J110L572N475P391R758J2681J5833J8540K0086K0026J8256J4935
38171I662J0337M794j275p394j3079j7932k1666k4059k4945k4222k1834j7741
38159a49354j1933m602L643J1672J8135K1956K2859K1512J9172J7023J5583J4566
38147B32J3223J0872P323K993j298m707o653o872n361k331J734O058R680J1705
38133C6598J1584R303N388P13l855p802j1065j3845j6259j8126j9051j8685j6881
38120f1983j3682r293m156R83N217P813Q443P247M652J158k806o896j0746j3934
38106h7983j6063j6915j6551j5278j3589j1992j0822j0093r535q803p640n964
38094b31228l787j128K074N973J0673J6083K1807K7229L1624L4276L4601L2280
$$ y = [-138001, -136891, -133319, -127844, -120453, -110695, -98014, -82181, -63641, -43555, -23529, -5273, 9662, 19999, 24793, 23518, 16124, 3045, -14887, -36553, -60612, -85557, -109779, -131613, -149354, -161287, -165889, -162246, -150574, -132439, -110483, -87624, -66112, -46940, -29917, -14334, 232, 13455, 24327, 31650, 34643, 33345, 28638, 21985, 15113, 9752, 7421, 9155, 15213, 24893, 36598, 48182, 57485, 62873, 63586, 59731, 51929, 40864, 27019, 10760, -7366, -26417, -45102, -61983, -75665, -84958, -89114, -88131, -82914, -75101, -66658, -59411, -54759, -53601, -56407, -63303, -74049, -87983, -104046, -120961, -137512, -152790, -166379, -178371, -189193, -199286, -208821, -217624, -225264, -231228, -235015, -236143, -234069, -228096, -217423, -201340, -179533, -152304, -120680, -86404, -51803, -19523]
38082a9523K7381K0398J2189L818l693r581j3395j4937j4164j1213o414l63O124
38069b3373J2074J6559J8927J8940J6792J3086Q722M733J981R82J873M527Q598
38056A04421J3479J8277K1911K3384K2098J8059J1852M390l403j0732j6975k1643
38044A85118k4443k5422k5047k4092k3367k3409k4388k6171k8487l0979l3256
38033a03943l4968l5904l6016l5305l3695l1020k7176k2268j6670j0934n647j268
38021c94814J993M228N765P001Q249R712J1526J3785J6495J9557K2834K6220K9627
38008b17822L2892L5638L7306L7349L5509L1935K7116K1697J6341J1672Q160N922
37996H3715M595L443J676j176n077r541j3827j7105j8572j7594j3928p906l97
$$ y = [-19523, 7858, 28256, 40445, 44263, 40570, 30989, 17594, 2657, -11507, -22720, -29134, -29497, -23373, -11299, 5260, 24187, 43127, 59919, 73005, 81727, 86460, 88441, 89423, 91296, 95823, 104421, 117900, 136177, 158088, 181472, 203570, 221629, 233481, 237871, 234468, 223736, 206761, 185118, 160675, 135253, 110206, 86114, 62747, 39338, 14950, -11221, -39708, -70687, -103943, -138911, -174815, -210831, -246136, -279831, -310851, -338027, -360295, -376965, -387899, -393546, -394814, -392821, -388593, -382828, -375827, -367578, -357866, -346340, -332555, -316060, -296503, -273669, -247449, -217822, -184930, -149292, -111986, -74637, -39128, -7193, 19923, 41620, 57961, 69633, 77793, 83715, 88310, 91753, 93429, 92253, 87176, 77635, 63808, 46703, 28131, 10537, -3391, -11297, -11694]
37983a1694P355J4063J8709K0869K0825J9392J7519J5907J4837J4167J3480J2325
37971A77754J0466P971N099K127p47l408n795p922r894j1873j3982j6195j8335
37958A15266k0135k1303k1481k0311j7577j3417q334l022J849N756Q438R987J0866
37945B6582J1704J2977J4714J6393J7125J5979J2405O491r91q751j5361j9754
37933H9513k1635k1511k0316j8865j7526j6161j4171j0716n075K869J2325K1739
37921a9530K9321L3662L4086L0736K4460J6649Q906K607j511l472l836l339k632
37908A46107k136k033k353l159m621o872r682j2208j3172j1376o382J119R435
37895H2667J6473K0472K0549J6896J0593L168l874r415j2798j3771j2410r132
$$ y = [-11694, -4339, 9724, 28433, 49302, 70127, 89519, 107038, 122945, 137782, 151949, 165429, 177754, 188220, 196191, 201290, 203417, 202670, 199262, 193467, 185545, 175651, 163778, 149796, 133601, 115266, 95131, 73828, 52347, 32036, 14459, 1042, -7292, -10314, -8465, -2709, 5729, 15716, 26582, 38286, 51263, 65977, 82370, 99495, 115474, 127879, 134370, 133379, 124628, 109267, 89513, 67878, 46367, 26051, 7186, -10340, -26501, -40672, -51388, -56463, -53594, -41269, -19530, 9791, 43453, 77539, 108275, 132735, 149384, 158290, 160897, 159386, 155914, 152078, 148739, 146107, 143971, 141938, 139585, 136426, 131805, 124933, 115251, 103043, 89871, 78495, 72113, 73232, 82667, 99140, 119612, 140161, 157057, 167650, 170818, 166944, 157529, 144731, 130960, 118550, 109418]
37883A09418m764m73K521L409K115p05m031o963r063j0496j1863j3863j6844k0566
37869A7832k4300k7209k8730k8693k7125k3957j9071j2666n607P43N154P099O807
37856a59723M921K088j122m166o490p708p810p236o599o235n939n063k949O35
37842b13396N275R977J3542J5069J4379J2094R438P741P909J0049J3438J6886
37830g7599J9256J9892J8777J6404J3458J0429P455M380R98k773o846j1011j5032
37817b212j8715k1873k4274k5587k5460k3683k0351j5918j1090o559k733L34K788
37804a95333M707N969O301N441L361M33k564m562m414j150N688J5715K7590L9368
37790i3450M9138N5576N8157N7020N2723M6005L7681K8597J9606J1441M597p35
$$ y = [109418, 104654, 104181, 106702, 110111, 112226, 111521, 107490, 100527, 91464, 80968, 69105, 55242, 38398, 17832, -6468, -33677, -62407, -91100, -118225, -142182, -161253, -173919, -179526, -178783, -173629, -166530, -159723, -154802, -152714, -153836, -158002, -164492, -172200, -180010, -187246, -193845, -200080, -206019, -211082, -214031, -213396, -208121, -198144, -184602, -169533, -155154, -143060, -133622, -125881, -117972, -107923, -94485, -77599, -58343, -38451, -19674, -3270, 10188, 20617, 28072, 32452, 33450, 30677, 23831, 12820, -2212, -20927, -42800, -67074, -92661, -118121, -141804, -162155, -178073, -189163, -195722, -198455, -198121, -195333, -190626, -184657, -178356, -172915, -169554, -169121, -171685, -176247, -180661, -181811, -176123, -160408, -132818, -93450, -44312, 11264, 69421, 126441, 179164, 225169, 262850, 291447, 311053, 322494, 327091, 326356]
37778C26356m668p555r922j2266j4889j7787k0687k3189k4999k6114k6880k7842
37766A09558k9442l1796l4627l7392l9461m0239l9249l6193l1077k4284j6471
37755b50673q285j42P758J5217K1897K7332L1013L2459L1361K7728K1955J4706
37743b7674O692j427r027j5430j9954k2082k1714j9349j6001j2856j0828j0254
37731a79904j0884j2151j3445j4309j4424j3571j1615q574m687m12L757P564J1134
37718b61521J4738J8397K1630K3630K3646K1293J6699J0563M075j443n071o688
37706a20052o900o641o685p377q622j0103j1512j2675j3490j3830j3523j2348
37694b43758j0080o510j585M411J0754J6401K0368K2137K1898K0482J8953J8112
$$ y = [326356, 321688, 314133, 304211, 291945, 277056, 259269, 238582, 215393, 190394, 164280, 137400, 109558, 80116, 48320, 13693, -23699, -63160, -103399, -142648, -178841, -209918, -234202, -250673, -258958, -259100, -251342, -236125, -214228, -186896, -155883, -123424, -92063, -64335, -42380, -27674, -20982, -22409, -31436, -46866, -66820, -88902, -110616, -129965, -145966, -158822, -169650, -179904, -190788, -202939, -216384, -230693, -245117, -258688, -270303, -278877, -283564, -283976, -280219, -272655, -261521, -246783, -228386, -206756, -183126, -159480, -138187, -121488, -110925, -106850, -108293, -113364, -120052, -126952, -133593, -140278, -147655, -156277, -166380, -177892, -190567, -204057, -217887, -231410, -243758, -253838, -260348, -261933, -257522, -246768, -230367, -209999, -187862, -165964, -145482, -126529, -108417]
37682a08417J8137J8557J8592J7596J5337J1937P692K904k038o557r876j1242
37670b7378j0243p008k132L547R167J3970J7390J9111J9059J7331J4202J0192
37658G7208O105K855J207J505L631P134J1500J6313K1165K5449K8280K8821K6797
37645B57970K2797J8094J4131J1949J1908J3739J6761K0112K2886K4319K3927
37634D58593K1578J7387J1597M608k959j0232j6235k0135k1513k0505j7730j4049
37622C90405j0361p430n710n153n201n127m411k941r15J260K970L452K021j657
37608C51202p415j4607k2269k9414l5288l9513m1953m2569m1292l8081l2982k6238
37596b0419j8348j0110k574L163O299O681M975K463N73M21K496O582J1867J7208
$$ y = [-108417, -90280, -71723, -53131, -35535, -20198, -8261, -569, 2335, 297, -6260, -16136, -27378, -37621, -44629, -46761, -43214, -34047, -20077, -2687, 16424, 35483, 52814, 67016, 77208, 83313, 86168, 87375, 88880, 92511, 99645, 111145, 127458, 148623, 174072, 202352, 231173, 257970, 280767, 298861, 312992, 324941, 336849, 350588, 367349, 387461, 410347, 434666, 458593, 480171, 497558, 509155, 513763, 510804, 500572, 484337, 464202, 442689, 422184, 404454, 390405, 380044, 372614, 366904, 361751, 356550, 351423, 347012, 344071, 343156, 344416, 347386, 350838, 352859, 351202, 343787, 329180, 306911, 277497, 242209, 202696, 160743, 118174, 76882, 38801, 5819, -20419, -38767, -48877, -51451, -48288, -41989, -35308, -30333, -27870, -27297, -26876, -24380, -17798, -5931, 11277]
37582A1277K1517K4075K4715K3777K1938J9900J8095J6527J4817J2465R102M710
37570B22915l11n234r209j1507j1766j0143p230l878r11J024J589Q15r27l084
37556A62143n124o628p339p177o255m790k968r22J148K874L808L673K659J493
37542A36595J180K450N265Q781J1741J3086J2322R586N466P63l678p065q841q927
37528A78724p849o569o054o958r518j3590j8660k3934k8558l1908l3786l4419
37516d3079l4296l3907l3446l2626l0750k7030k0980j2698k896P310J6709K4236
37504b23453K9141L1127L0446K7806K4110K0155J6438J3104J0040P055M064J158
37492h809j490l729n449o488o593n468k946P99N240R674J3551J6604J8782K0072
$$ y = [11277, 32794, 56869, 81584, 105361, 127299, 147199, 165294, 181821, 196638, 209103, 218205, 222915, 222604, 217370, 208161, 196654, 184888, 174745, 167515, 163637, 162726, 163750, 165339, 166154, 165227, 162143, 157019, 150391, 143052, 135875, 129620, 124830, 121862, 120940, 122088, 124962, 128770, 132443, 135102, 136595, 137775, 140225, 145490, 154271, 166012, 179098, 191420, 201006, 206472, 207235, 203557, 196492, 187651, 178724, 170875, 164306, 158252, 151294, 141776, 128186, 109526, 85592, 57034, 25126, -8660, -43079, -77375, -111282, -144728, -177354, -208104, -235134, -256114, -268812, -271708, -264398, -247689, -223453, -194312, -163185, -132739, -104933, -80823, -60668, -44230, -31126, -21086, -14031, -9967, -8809, -10299, -14028, -19477, -25965, -32558, -38026, -40972, -40173, -34933, -25259, -11708, 4896, 23678, 43750]
37478D3750K0486K0123J9231J8184J7359J7028J7263J7997J9090K0349K1386K1587
37466B73833K0264J6960J1570M273m541j4268k3967l2456l8560m1497m1129l7936
37454I2546l2750k6413j9572j2743o438j229K409M308M693M055K906J624M16o49
37440A3163j597k526l499m540n613o714p892r280j1025j3106j5136j6392j6113
37427a00270j3927j0087n256n8N278J0817J6524K1969K6449K9407L0687L0547
37415D2080K9489K8132K6975K6156K5344K3983K1721J8716J5555J2944J1361J0894
37403B93350J1295J2128J2925J3289J3050J2372J1669J1349J1613J2413J3571
37392D29024J4846J6062J7192J8357J9651K0895K1585K1104J9053J5481J0884
$$ y = [43750, 64236, 84359, 103590, 121774, 139133, 156161, 173424, 191421, 210511, 230860, 252246, 273833, 294097, 311057, 322627, 326900, 322359, 308091, 284124, 251668, 213108, 171611, 130482, 92546, 59796, 33383, 13811, 1068, -5370, -6599, -4190, 118, 4811, 8866, 11772, 13396, 13812, 13163, 11566, 9040, 5541, 1001, -4612, -11326, -19218, -28498, -39523, -52629, -67765, -84157, -100270, -114197, -124284, -129540, -129598, -124320, -113503, -96979, -75010, -48561, -19154, 11533, 42080, 71569, 99701, 126676, 152832, 178176, 202159, 223880, 242596, 258151, 271095, 282456, 293350, 304645, 316773, 329698, 342987, 356037, 368409, 380078, 391427, 403040, 415453, 429024, 443870, 459932, 477124, 495481, 515132, 536027, 557612, 578716, 597769, 613250, 624134]
37381F24134N997J501k184m858o442o915o347m978l157j267L53J357J295k86l480
37366E94723p640j1336j2873j1103n993J298Q864J4716J7362J6063J0852K527
37354F17460p390j6879k3984k7488k7257k4061j9011j3054o797n83N341J0743
37342D67040J5375J8906K0874K0874J8827J5159J0669O251K655L42n51j89J074
37329E97306K776M313M990M262K045j202m762q048j0869j3441j6236j9700k4016
37316E17418k8982l4053l8529m1770m3444m3638m2763m1262l9324l6791l3313
37305I3549k8568k2463j5128o822K170J1476K0539K8618L4898L8663L9401L6887
37293B33220L1292K3310J4170N464j290n091n796m087j068K235N291Q119J1107
$$ y = [624134, 630131, 631632, 629448, 624590, 618148, 611233, 604886, 599908, 596751, 595484, 595837, 597194, 598489, 598203, 594723, 587083, 575747, 562874, 551771, 545778, 547076, 555940, 570656, 588018, 604081, 614933, 617460, 610070, 593191, 569207, 541719, 514462, 490401, 471390, 458336, 451539, 450956, 456297, 467040, 482415, 501321, 522195, 543069, 561896, 577055, 587724, 593975, 596630, 596972, 596421, 596232, 597306, 600082, 604395, 609385, 613647, 615692, 614490, 609728, 601680, 590811, 577370, 561134, 541434, 517418, 488436, 454383, 415854, 374084, 330640, 287002, 244239, 202977, 163653, 126862, 93549, 64981, 42518, 27390, 20568, 22738, 34214, 54753, 83371, 118269, 156932, 196333, 233220, 264512, 287822, 301992, 307456, 306166, 301075, 295279, 291192, 290124, 292359, 297650, 305769, 316876]
37280C16876J4676J8964K3576K7560K9645K8823K4844J8306J0357K287m778j0085
37268E01051j3431j5138j5777j5818j5466j4793j3908j3008j2267j1738j1337
37257C48370j0927j0387r610q447o705m227j023K683O458R761J2097J3185J2997
37244C54225J1684R443O390K520k179p439j2518j6377j8257j8200j7071j6124
37232B76097j6420j8404k1753k5545k8719l0501l0529k8771k5481k1341j7406
37221A1227j4766j4005j4918j6666j8225j8824j8200j6596j4619j2930j1877j1207
37209a71606j0136p793l764J648P557J2848J6518J7956J7059J4166R863M817k76
37196i1143m692p694q650p132l107K912R866J6337K1000K3081K2563K0098J6545
$$ y = [316876, 331552, 350516, 374092, 401652, 431297, 460120, 484964, 503270, 513627, 515914, 511136, 501051, 487620, 472482, 456705, 440887, 425421, 410628, 396720, 383712, 371445, 359707, 348370, 337443, 327056, 317446, 308999, 302294, 298067, 297044, 299727, 306185, 315946, 328043, 341228, 354225, 365909, 375352, 381742, 384262, 382083, 374644, 362126, 345749, 327492, 309292, 292221, 276097, 259677, 241273, 219520, 193975, 165256, 134755, 104226, 75455, 49974, 28633, 11227, -3539, -17544, -32462, -49128, -67353, -86177, -104377, -120973, -135592, -148522, -160399, -171606, -181742, -189535, -193299, -191651, -184094, -171246, -154728, -136772, -119713, -105547, -95684, -90867, -91143, -95835, -103529, -112179, -119311, -122418, -119506, -109640, -93303, -72303, -49222, -26659, -6561, 9984]
37183I984J2592Q533M372Q7m101p616r748j0025q524n740k195J854O383J1374
37169G230J6627K1705K6063K9238L0967L1153K9716K6602K1954J6289J0382M959
37157B72885L87l378o613r559j2183j4064j4522j2981r427m607K21L850N649N717
37143B01375M710L497K849L145M291N778O952P248O368M277J123k865p386j1972
37129B29390j5967j8685j9678j8902j6650j3312r076l751L125J1925K2485L3877
37117A84781M4522N2629N6707N5980N0530M1181K9278J6446M290n966j3807j9463
37105D97108k3679k7228l0497l3285l4946l4877l2956k9693k5922k2313j8998
37094A82714j5563j1394o195l05N444J0170J3316J4738J4566J3086J0698P913
$$ y = [9984, 22576, 31109, 35481, 35568, 31467, 23851, 14103, 4078, -4446, -10186, -12381, -10527, -4144, 7230, 23857, 45562, 71625, 100863, 131830, 162983, 192699, 219301, 241255, 257544, 267926, 272885, 273272, 269894, 263281, 253722, 241539, 227475, 212953, 199972, 190545, 185938, 186159, 190009, 195658, 201375, 206085, 209582, 212431, 215576, 219867, 225645, 232597, 239845, 246213, 250490, 251613, 248748, 241362, 229390, 213423, 194738, 175060, 156158, 139508, 126196, 117120, 113369, 116494, 128419, 150904, 184781, 229303, 281932, 338639, 394619, 445149, 486330, 515608, 532054, 536344, 530378, 516571, 497108, 473429, 446201, 415704, 382419, 347473, 312596, 279640, 249947, 224025, 201712, 182714, 167151, 155757, 149562, 149257, 154701, 164871, 178187, 192925, 207491, 220577, 231275, 239188]
37082B39188N297L328K262K102K691L798N129O343P100P144O320M580K031r70
37068B96343l867o104p373p723p534p312p438p987q733r343r567r348q837q310
37054A86867q028q072q291q405q201p634o805n794m554k911p45J895M757P476
37040A31555R675J1151J2031J2763J3806J5276J6826J7815J7587J5631J1723N985
37028B91824j116q875j6487k3179k8393l1892l3721l4062l3146l1288k8899k6413
37016e647k4186k2470k1418k1133k1669k3008k4910k6822k7951k7537k5060k0340
37004b92151j3523n094M119J3018K0400K5192K6740K5015K0653J4739Q541L185
36992a49166n43k298k079j30L072O710R693J0968R977O936K807j047l371l484
$$ y = [239188, 244485, 247813, 250075, 252177, 254868, 258666, 263795, 270138, 277238, 284382, 290702, 295282, 297313, 296343, 292476, 286372, 278999, 271276, 263742, 256430, 248992, 241005, 232272, 222929, 213362, 204014, 195177, 186867, 178839, 170767, 162476, 154071, 145870, 138236, 131431, 125637, 121083, 118172, 117427, 119322, 124079, 131555, 141230, 152381, 164412, 177175, 190981, 206257, 223083, 240898, 258485, 274116, 285839, 291824, 290708, 281833, 265346, 242167, 213774, 181882, 148161, 114099, 80953, 49665, 20766, -5647, -29833, -52303, -73721, -94854, -116523, -139531, -164441, -191263, -219214, -246751, -271811, -292151, -305674, -310768, -306649, -293631, -273231, -248039, -221299, -196284, -175631, -160892, -152351, -149166, -149709, -152007, -154086, -154216, -151144, -144434, -134741, -123773, -113796, -106860, -104053, -105100, -108471, -111955]
36978a11955j443K073O045R447J1546J2071J1157R154O487L560O49k213n213q530
36964e7165j2086j5544j8460k0454k1269k0755j8790j5300j0335m202K471Q836
36952b03053J4000J7317J8704J8767J8611J9365K1759K5949L1549L7742M3432
36941F4142M7444M8775M6801M1447L3264K3310J2901L230m923j1346j6327k0327
36929B68391k3674k6393k8277k8968k8048k5239k0675j5026r290m363p24J641
36917E9355L061L960M643N286N991O856P916R078J0082J0551J0105Q619O380M057
36903A55940K362J689J995K933M103N297O556Q073J0004J2323J4802J7016J8384
36890B61477J8310J6367J2457O828N5p021j3439j8397k1480k2783k2860k2573
$$ y = [-111955, -113398, -111325, -105280, -95833, -84287, -72216, -61059, -51905, -45418, -41858, -41209, -43422, -48635, -57165, -69251, -84795, -103255, -123709, -144978, -165733, -184523, -199823, -210158, -214360, -211889, -203053, -189053, -171736, -153032, -134265, -115654, -96289, -74530, -48581, -17032, 20710, 64142, 111586, 160361, 207162, 248609, 281873, 305183, 318084, 321314, 316391, 305045, 288718, 268391, 244717, 218324, 190047, 161079, 133031, 107792, 87117, 72091, 62801, 58438, 57714, 59355, 62416, 66376, 71019, 76305, 82296, 89152, 97068, 106146, 116228, 126779, 136884, 145503, 151883, 155940, 158302, 159991, 161986, 164919, 169022, 174319, 180875, 188948, 198952, 211275, 226077, 243093, 261477, 279787, 296154, 308611, 315439, 315494, 308473, 295034, 276637, 255157, 232374, 209514, 186941]
36878A86941k2764k3843k5512k6914k7052k5219k1280j5727r533l832M35K740
36866a1560L030J613r85m177p363r948j1394j1332r661o518k200K896Q265J3272
36852d6062J7214J9527K0118J9540J8786J8814K0118K2612K5767K8833L1062L1980
36840B28309L1527L0016K7913K5642K3416K1251J9071J6915J4952J3307J1868
36829D64187J0336Q427O046L240J64k920n609p474q289q208p684p184o913o850
36815D31269o979p492q747j1084j4617j9137k4096k8751l2418l4674l5392l4669
36803A73213l2732k9823k6076k1494j6131j0252m361R90N361Q581J0814J2528
36791G0618J4228J6098J7829J8777J8297J6178J2856R399P114P051R577J4190
$$ y = [186941, 164177, 140334, 114822, 87908, 60856, 35637, 14357, -1370, -10903, -14735, -14300, -11560, -8530, -6917, -7902, -12079, -19442, -29390, -40784, -52116, -61777, -68295, -70495, -67599, -59334, -46062, -28848, -9321, 10797, 30337, 49123, 67937, 88055, 110667, 136434, 165267, 196329, 228309, 259836, 289852, 317765, 343407, 366823, 388074, 407145, 424060, 439012, 452319, 464187, 474523, 482950, 488996, 492236, 492400, 489480, 483871, 476397, 468108, 459900, 452216, 445032, 438119, 431269, 424290, 416798, 408051, 396967, 382350, 363213, 339117, 310366, 277948, 243274, 207882, 173213, 140481, 110658, 84582, 63088, 46957, 36705, 32344, 33334, 38695, 47276, 58090, 70618, 84846, 100944, 118773, 137550, 155847, 172025, 184881, 194280, 201394, 208445, 218022, 232212]
36779B32212J9634K4313K6861K6649K3916J9508J4454R563N187J217k727p031
36767C93756j1875j7062k1984k5788k7736k7553k5514k2297j8738j5570j3185
36756A66454j1633j0793j0598j1028j1963j3045j3665j3085j0754o629j331M110
36744E6040Q680J1713J2981J2594J0827P918M040o00n583j0270j3916j5834j5520
36731F3070j2859q268k681K735O971R512J0403J0042Q872P199N261L329J697N84
36717A05867J31M31J492L179N267P612J0258J3296J6664J9988K2680K4212K4390
36704B55467K3360K1397J8672J5306J1538P810M669K596J887K501L945N260N300
36691C79708L097j743q843j7110k5069l1244l4469l4135l0362k4057j6649r625
$$ y = [232212, 251846, 276159, 303020, 329669, 353585, 373093, 387547, 397110, 402297, 403514, 400787, 393756, 381881, 364819, 342835, 317047, 289311, 261758, 236244, 213947, 195209, 179639, 166454, 154821, 144028, 133430, 122402, 110439, 97394, 83729, 70644, 59890, 53261, 51930, 56040, 64720, 76433, 89414, 102008, 112835, 120753, 124793, 124193, 118610, 108340, 94424, 78590, 63070, 50211, 41943, 39262, 41997, 48968, 58480, 68883, 78925, 87797, 94996, 100257, 103586, 105283, 105867, 105998, 106429, 107921, 111100, 116367, 123979, 134237, 147533, 164197, 184185, 206865, 231077, 255467, 278827, 300224, 318896, 334202, 345740, 353550, 358219, 360815, 362702, 365203, 369148, 374408, 379708, 382805, 381062, 372219, 355109, 330040, 298796, 264327, 230192, 199830, 175773, 159124, 149499]
36679A49499m072l93J716L001M169N483O718P464P473O842N963N264M916M752
36665B08795M514M174L979M228N062O425Q115R857J1391J2577J3338J3564J3102
36652C19121J1964J0553R648J0068J2234J5892K0202K4086K6549K6865K4671K0113
36640E31966J3847O805k16o749j2591j7555k1326k3477k3662k1910j8804j5313
36628C91015j2302j0096q403o613m272j423J333L111L143J104k752p626j2357
36615C33862j5787j7085j5889j2194o249J486J0309J9306K7431L3689L7384L8332
36603D34595L6836L3468K8838K3437J7600J1532N410n59o111j0959j4835j7653
36591E41599j9665k1468k3625k6251k8948l1092l2261l2354l1485k9763k7219
$$ y = [149499, 145427, 145034, 146750, 149751, 153920, 159403, 166121, 173585, 181058, 187900, 193863, 199127, 204043, 208795, 213309, 217483, 221462, 225690, 230752, 237177, 245292, 255149, 266540, 279117, 292455, 306019, 319121, 331085, 341638, 351286, 361354, 373588, 389480, 409682, 433768, 460317, 487182, 511853, 531966, 545813, 552618, 552402, 545653, 533062, 515507, 494181, 470704, 447042, 425132, 406328, 391015, 378713, 368617, 360214, 353601, 349329, 347906, 349239, 352350, 355493, 356597, 353845, 346219, 333862, 318075, 300990, 285101, 272907, 266658, 268144, 278453, 297759, 325190, 358879, 396263, 434595, 471431, 504899, 533737, 557174, 574774, 586306, 591716, 591157, 585046, 574087, 559252, 541599, 521934, 500466, 476841, 450590, 421642, 390550, 358289, 325935, 294450, 264687, 237468]
36580B37468k3888j9971j5789j1583p383l233N26L256M362L640J301k162o140
36567A60404r971j3025j4776j4963j3706j1473q841o253l987k237j181q85j335
36554E7771k491m325o699r309j1670j3192j3234j1333p405j804M815J1625J7732
36541A0481K2372K5127K6018K5412K3910K2248K1094K0777K1166K1846K2416K2718
36529B85585K2854K3071K3468K3806K3553K2155J9322J5122R997M674l7l571n794
36516D64205p027p910r213j1570j5195j9799k4781k9506l3446l6206l7499l7118
36504A94935l4933l0984k5588j9316j2840o790j771J669L072K181r69n901j1692
36491E1073j7234k1632k4331k5000k3396j9551j3983p695j951K119L807K988k3
$$ y = [237468, 213580, 193609, 177820, 166237, 158854, 155621, 156147, 159403, 163765, 167405, 168706, 166544, 160404, 150433, 137408, 122632, 107669, 93963, 82490, 73649, 67396, 63409, 61172, 59991, 59106, 57771, 55280, 50955, 44256, 34947, 23277, 10085, -3149, -14482, -21887, -23691, -18876, -7251, 10481, 32853, 57980, 83998, 109410, 133320, 155568, 176662, 197439, 218605, 240451, 262867, 285585, 308439, 331510, 354978, 378784, 402337, 424492, 443814, 458936, 468933, 473607, 473570, 469999, 464205, 457178, 449268, 440055, 428485, 413290, 393491, 368710, 339204, 305758, 269552, 232053, 194935, 160002, 129018, 103430, 84114, 71274, 64484, 62713, 64382, 67454, 69635, 68666, 62765, 51073, 33839, 12207, -12124, -37124, -60520, -80071, -94054, -101749, -103700, -101581, -97774, -94786, -94809]
36478i4809m723j0521j6636k2123k6102k8034k7797k5602k1872j7054j1444n190
36466c11907J484Q098J4016J8786K2355K5027K7261K9399L1500L3388L4792L5377
36454c0424L4684L2150K7407K0550J2174L233n130j1748j5684j6495j4388j0188
36442B6141n120l88L200N324N979N254L319M88k705n539p264p369n848l169N3
36427A2356L445O960J0806J5226K0250K5546L0482L4454L7132L8431L8346L6854
36415C10288L3898K9478K3770J7245J0558M297j200n749r290j1997j4293j6627
36403C70378j9126k1523k3322k4047k3421k1472j8447j4635j0318n846j651K012
36391A88582N261Q523J2182J6277K0373K3627K5038K3863J9949J3791O405q70
$$ y = [-94809, -99532, -110053, -126689, -148812, -174914, -202948, -230745, -256347, -278219, -295273, -306717, -311907, -310423, -302325, -288309, -269523, -247168, -222141, -194880, -165481, -133981, -100593, -65801, -30424, 4260, 36410, 63817, 84367, 96541, 99774, 94644, 82896, 67212, 50717, 36329, 26141, 21021, 20633, 23833, 29157, 35136, 40390, 43709, 44197, 41492, 35953, 28689, 21320, 15472, 12303, 12356, 15801, 22761, 33567, 48793, 69043, 94589, 125071, 159525, 196657, 235088, 273434, 310288, 344186, 373664, 397434, 414679, 425237, 429534, 428334, 422585, 413295, 401298, 387005, 370378, 351252, 329729, 306407, 282360, 258939, 237467, 219020, 204385, 194067, 188221, 186570, 188582, 193843, 202366, 214548, 230825, 251198, 274825, 299863, 323726, 343675, 357466, 363871, 363001]
36379C63001o606r701r735p136l055R40L356L332R07l154p815j2150j5562j7870
36365B78752j9201j9760j9639j8868j7555j5942j4363j3093j2199j1392j0096
36354A06644p735l982J194P676J5204K3302L1262L8252M3516M6639M7673M7006
36342C96651M5034M1943L7867L3050K7768K2169J6335J0539N341J435o62q30O63
36329F37303L406P131J1741J7045K2560K7625L1600L3983L4418L2775K9216K4163
36317I12966J8200J2004O256J411k427n430p784r478j0199r369o520j800L814
36304I01644Q985J2674J4477J4526J3316J1520R762Q420P625P389P639Q228Q948
36291A035153R558R696Q840O509K564k668q496j4023j8346k0777k1012j9090j5328
$$ y = [363001, 356395, 346694, 336959, 329823, 326768, 327708, 331064, 334396, 335303, 332149, 324334, 312184, 296622, 278752, 259551, 239791, 220152, 201284, 183729, 167787, 153424, 140331, 128132, 116740, 106644, 98909, 94927, 96121, 103797, 119001, 142303, 173565, 211817, 255333, 301972, 349645, 396651, 441685, 483628, 521495, 554545, 582313, 604482, 620817, 631356, 636697, 638132, 637470, 636640, 637303, 640709, 647840, 659581, 676626, 699186, 726811, 758411, 792394, 826812, 859587, 888803, 912966, 931166, 943170, 949426, 950837, 948410, 942980, 935196, 925718, 915519, 906150, 899630, 897830, 901644, 910629, 923303, 937780, 952306, 965622, 977142, 986904, 995324, 1002949, 1010338, 1017977, 1026205, 1035153, 1044711, 1054407, 1063247, 1069756, 1072320, 1069652, 1061156, 1047133, 1028787, 1008010, 986998, 967908, 952580]
36278I52580j0381n236r92J483J667n79m877j0246j5326j8846j9954j8309j4138
36265H36846q187j556M598R262J1714J1719R628O221K355j202l742m644l606r11
36251H68495K559N565O994O409M346K117J254L001P933J5709K5021L3935M0494
36238A023832M3216M1383L5152K5468J3791J744r079j7285k1924k2736k0211j5347
36226A078004r320l131K660P904J2519J6160J8267J8470J6909J4233J1425R432
36214A193532Q804R485J1017J2859J4520J5537J5574J4624J3068J1526J0659J0961
36202A342166J2538J5058J7912K0415K1868K1605J9283J5181J0062M700n10n479
36190A494799j0145j4268j7398j9051j9029j7620j5428j3100j1219j0238j0311
$$ y = [952580, 942199, 936963, 935971, 937454, 939121, 938542, 933665, 923419, 908093, 889247, 869293, 850984, 836846, 828659, 827103, 831701, 840963, 852677, 864396, 874024, 880245, 882600, 881398, 877656, 873012, 869406, 868495, 871054, 876619, 883613, 890022, 894368, 896485, 897739, 900740, 908673, 924382, 949403, 983338, 1023832, 1067048, 1108431, 1143583, 1169051, 1182842, 1184586, 1175507, 1158222, 1136298, 1113562, 1093351, 1078004, 1068684, 1065553, 1068213, 1076117, 1088636, 1104796, 1123063, 1141533, 1158442, 1172675, 1184100, 1193532, 1202336, 1211821, 1222838, 1235697, 1250217, 1265754, 1281328, 1295952, 1309020, 1320546, 1331205, 1342166, 1354704, 1369762, 1387674, 1408089, 1429957, 1451562, 1470845, 1486026, 1496088, 1500788, 1500278, 1494799, 1484654, 1470386, 1452988, 1433937, 1414908, 1397288, 1381860, 1368760, 1357541, 1347303, 1336992]
36179A336992j1153j2274j3371j4387j5239j5666j5287j3716j0592n664R81Q839
36167A219463J7125K5031L1994L7864M2844M7176N0919N4067N6696N8752N9717
36156A701648N8751N5291M9407M1658L2696K3039J3082L278n598j2439j6195j6432
36144A928186j3476q170j537N426J1953J7700K2649K6839L0228L2756L4409L5170
36132B122133L5099L4340L2953L0659K7016K1801J5195P709K0p134j3219j8095
36120B288477k1847k4399k5457k4858k2800j9725j6106j2312q501m508l3N032
36108B112963J0524J6205K1861K7156L1616L4806L6483L6692L5883L4977L5058
36097B434224L6838M0391M5309N0901N6265O0490O2926O3233O1192N6679M9871
$$ y = [1336992, 1325839, 1313565, 1300194, 1285807, 1270568, 1254902, 1239615, 1225899, 1215307, 1209643, 1210624, 1219463, 1236588, 1261619, 1293613, 1331477, 1374321, 1421497, 1472416, 1526483, 1583179, 1641931, 1701648, 1760399, 1815690, 1865097, 1906755, 1939451, 1962490, 1975572, 1978850, 1973252, 1960813, 1944618, 1928186, 1914710, 1906540, 1905003, 1910429, 1922382, 1940082, 1962731, 1989570, 2019798, 2052554, 2086963, 2122133, 2157232, 2191572, 2224525, 2255184, 2282200, 2304001, 2319196, 2326905, 2326925, 2319791, 2306572, 2288477, 2266630, 2242231, 2216774, 2191916, 2169116, 2149391, 2133285, 2120973, 2112472, 2107964, 2107931, 2112963, 2123487, 2139692, 2161553, 2188709, 2220325, 2255131, 2291614, 2328306, 2364189, 2399166, 2434224, 2471062, 2511453, 2556762, 2607663, 2663928, 2724418, 2787344, 2850577, 2911769, 2968448, 3018319]
36086C018319M1316L1736K1957J2946N626N36k213k593m51M333J1517K0437L0013
36073C193479L8947M6106N0888N3207N3156N0964M7252M3129L9927L8903M1120
36062C697078M7205N7062O9941Q4891J01117J17993J35114J52422J70059J87937
36052D820819K05482K21707K35180K43844K45033K35848K13615J76528J24968
36043F723024O2928k040o1041j06939j36384j49971j51025j43823j32113j18421
36033E784195j04185r0101p6505o3809n2713m3829l6971l1009k4540j6604o890
36022E237039M355J6454K8599M0183N0770N9803O6665P1186P3831P5343P6378
36011E800606P7437P8787Q0329Q1876Q3806Q7224R3360J02877J15653J30719J46189
$$ y = [3018319, 3059635, 3091371, 3113328, 3126274, 3131900, 3132436, 3130223, 3127630, 3127179, 3131512, 3143029, 3163466, 3193479, 3232426, 3278532, 3329420, 3382627, 3435783, 3486747, 3533999, 3577128, 3617055, 3655958, 3697078, 3744283, 3801345, 3871286, 3956177, 4057294, 4175287, 4310401, 4462823, 4632882, 4820819, 5026301, 5248008, 5483188, 5727032, 5972065, 6207913, 6421528, 6598056, 6723024, 6785952, 6783912, 6722871, 6615932, 6479548, 6329577, 6178552, 6034729, 5902616, 5784195, 5680010, 5589909, 5513404, 5449595, 5396882, 5353053, 5316082, 5285073, 5260533, 5243929, 5237039, 5241394, 5257848, 5286447, 5326630, 5377400, 5437203, 5503868, 5575054, 5648885, 5724228, 5800606, 5878043, 5956830, 6037159, 6119035, 6202841, 6290065, 6383425, 6486302, 6601955, 6732674, 6878863]
36000F878863J59608J68852J72757J71210J64979J55606J44973J34663J25795
35991H277306J19391J16363J16921J20306J25259J30534J35020J37945J39363
35982I418408J40249J41893J45366J51489J60739J72780J86521K00910K15533
35973A0933888K30423K45749K61933K79554K98743L18948L39479L60001L80425
35964A3649143M00830M21764M44235M68992M96135N25481N56972N90523O26090
35955A8180165O64233P06172P52929Q04696Q61198R22015R86259J052368J118488
35946B6048523J182465J241141J290164J325055J342640J342323J327921J309205
35938C6409437J300469J315789J364531J450331J572536J727984J912821K124528
$$ y = [6878863, 7038471, 7207323, 7380080, 7551290, 7716269, 7871875, 8016848, 8151511, 8277306, 8396697, 8513060, 8629981, 8750287, 8875546, 9006080, 9141100, 9279045, 9418408, 9558657, 9700550, 9845916, 9997405, 10158144, 10330924, 10517445, 10718355, 10933888, 11164311, 11410060, 11671993, 11951547, 12250290, 12569238, 12908717, 13268718, 13649143, 14049973, 14471737, 14915972, 15384964, 15881099, 16406580, 16963552, 17554075, 18180165, 18844398, 19550570, 20303499, 21108195, 21969393, 22891408, 23877667, 24930035, 26048523, 27230988, 28472129, 29762293, 31087348, 32429988, 33772311, 35100232, 36409437, 37709906, 39025695, 40390226, 41840557, 43413093, 45141077, 47053898, 49178426]
35930D9178426K362807K628730K924211L252754L619893M032146M496358N020675
35922G7516000N615135O290747P058966P932810Q927315J0057957J1339441J2786180
35914A47524551J4411510J6224199J8225785K0410499K2763356K5252396K7816280
35907B92628576L0347711L2669515L4505870L5460754L5018636L2589611K7639916
35900E20860589J9932479R801889j729867j3164348k3013059l0282294l4680263
35893D47725126l6496489l6320975l4796199l2478663k9788192k7006347k4301460
35886B26536801k1762921j9430237j7313432j5407950j3703899j2188614j0846574
35879A15883174r661225q617222p700119o895280o188755n568620n024230m544956
$$ y = [49178426, 51541233, 54169963, 57094174, 60346928, 63966821, 67998967, 72495325, 77516000, 83131135, 89421882, 96480848, 104413658, 113340973, 123398930, 134738371, 147524551, 161936061, 178160260, 196386045, 216796544, 239559900, 264812296, 292628576, 322976287, 355645802, 390151672, 425612426, 460631062, 493220673, 520860589, 540793068, 550594957, 548865090, 535700742, 512687683, 482405389, 447725126, 411228637, 374907662, 340111463, 307632800, 277844608, 250838261, 226536801, 204773880, 185343643, 168030211, 152622261, 138918362, 126729748, 115883174, 106221949, 97604727, 89904608, 83009328, 76820573, 71251953, 66227723, 61682767]
35871F1682767m120895l744133l408331l107673k837358k594484k377421k184604
35863C7307868k014418j865380j735303j620635j517440j422813j334910j252213
35855B4544756j173603j098742j027635r60105q96175q36607p82285p33352o89315
35846A6346937o49720o14131n81935n52661n26276n02659m81089m60636m40811
35837A1537019m21405m02006l82193l62011l41839l22040l03086k85646k70021
35828H446772k55690k41855k28266k15241k03184j92455j83371j75832j69068
35819F581810j62152j54685j46810j38811j31148j24614j19946j17289j16236
35810E370119j16247j16706j16842j16015j14057j11103j07250j02603r7501r2408
$$ y = [61682767, 57561872, 53817739, 50409408, 47301735, 44464377, 41869893, 39492472, 37307868, 35293450, 33428070, 31692767, 30072132, 28554692, 27131879, 25796969, 24544756, 23371153, 22272411, 21244776, 20284671, 19388496, 18551889, 17769604, 17036252, 16346937, 15697217, 15083086, 14501151, 13948490, 13422214, 12919555, 12438466, 11977830, 11537019, 11115614, 10713608, 10331415, 9969404, 9627565, 9305525, 9002439, 8716793, 8446772, 8191082, 7949227, 7720961, 7505720, 7302536, 7110081, 6926710, 6750878, 6581810, 6419658, 6264973, 6118163, 5979352, 5848204, 5723590, 5603644, 5486355, 5370119, 5253872, 5137166, 5020324, 4904309, 4790252, 4679149, 4571899, 4469296, 4371795, 4279387]
35800D279387q7656q3533q0314p7948p5881p3543p0912o8320o5886o3482o1044
35789C470868n8611n6108n3372n0299m6779m2649l7989l3388k9590k6886k5026
35778C010171k3602k2173k0261j7447j3544q423j788O629J6761K8281M0931N4607
35766C050142O9271Q4944J01707J19370J37172J53864J67894J77195J78923J69724
35756D410206J46547J07649N3867j0268p6832j36895j83701k14500k30160k33704
35746C632209k28830k18910k06501j93400j80908j69753j60021j51364j43354
35737A979168j35491j27099j17540j06735r5269q4026p3780o4986n7600n1096
35727A065546m4867l8716l2871k7642k3232j9775j7299j5646j4581j4010j3938
$$ y = [4279387, 4191731, 4108198, 4027884, 3949936, 3874055, 3800512, 3729600, 3661280, 3595394, 3531912, 3470868, 3412257, 3356149, 3302777, 3252478, 3205699, 3163050, 3125061, 3091673, 3062083, 3035197, 3010171, 2986569, 2964396, 2944135, 2926688, 2913144, 2904721, 2902933, 2909562, 2926323, 2954604, 2995535, 3050142, 3119413, 3204357, 3306064, 3425434, 3562606, 3716470, 3884364, 4061559, 4240482, 4410206, 4556753, 4664402, 4718269, 4708001, 4631169, 4494274, 4310573, 4096073, 3865913, 3632209, 3403379, 3184469, 2977968, 2784568, 2603660, 2433907, 2273886, 2122522, 1979168, 1843677, 1716578, 1599038, 1492303, 1397034, 1313008, 1239228, 1174242, 1116642, 1065546, 1020679, 981963, 949092, 921450, 898218, 878443, 861144, 845498, 830917, 816907, 802969]
35716H02969j4285j4972j6139j8052k0742k3938k7324l0708l3890l6544l8223
35705E28152l8342l6248l1550k4512j6057p346O72P418J2720J6752J9810K2072
35693D53541K3636K4546K4649K3541K0907J6956J2367P774L385r69n670j1097
35681E93566j7313k3770k9438l3307l4745l3564l0098k5292k0470j6824j4902
35670C13843j4571j5177j5741j5249j2968q666k640M367J1361J7512K2395K5863
35658C10329K7771K7993K6615K3996K0554J6667J2739R197O340M335L300L347
35646D93183M505O744R968J3809J7405J9626J9590J7113J2681P199J629l448q144
35633F11860j3086j8875k5670l3110m0355m6242m9638m9883m7000m1546l4436
$$ y = [802969, 788684, 773712, 757573, 739521, 718779, 694841, 667517, 636809, 602919, 566375, 528152, 489810, 453562, 422012, 397500, 381443, 374097, 374769, 382187, 394907, 411659, 431469, 453541, 477177, 501723, 526372, 549913, 570820, 587776, 600143, 607917, 611302, 610333, 604663, 593566, 576253, 552483, 523045, 489738, 454993, 421429, 391331, 366039, 345569, 328745, 313843, 299272, 284095, 268354, 253105, 240137, 231471, 228831, 233198, 244559, 262071, 284466, 310329, 338100, 366093, 392708, 416704, 437258, 453925, 466664, 475861, 482201, 486536, 489836, 493183, 497688, 504432, 514400, 528209, 545614, 565240, 584830, 601943, 614624, 621823, 623452, 620004, 611860, 598774, 579899, 554229, 521119, 480764, 434522, 384884, 335001, 288001, 246455, 212019]
35622B12019k6771j9565j3439q629n309l786m343o993j1328j6474k1176k4201
35610E0005k4851k3209j9881j5606j0972o284j525L454Q579J3435J7470K0233
35598A0848K1515K1388K0304J9018J8344J8883K0916K4342K8691L3315L7696M1538
35586C16798M4606M6508M6705M4629L9891L2521K3115J2724K461o789j4444k0179
35574E68546k3975k6063k6808k6630k5964k5234k4818k5058k6262k8498l1328
35563B77908l3923l5523l5816l5018l3743l2767l2677l3469l4503l4892l3983
35552i8406l1598k8021k3839j9712j6096j3175j0973r405q159o708m554j551K006
35539b70191N554Q610J1092J3446J6327K0042K4264K8197L0987L2113L1714L0612
$$ y = [212019, 185248, 165683, 152244, 143615, 138306, 134520, 130177, 123184, 111856, 95382, 74206, 50005, 25154, 1945, -17936, -33542, -44514, -50798, -52323, -48869, -40290, -26855, -9385, 10848, 32363, 53751, 74055, 93073, 111417, 130300, 151216, 175558, 204249, 237564, 275260, 316798, 361404, 407912, 454617, 499246, 539137, 571658, 594773, 607497, 609958, 603169, 588725, 568546, 544571, 518508, 491700, 465070, 439106, 413872, 389054, 363996, 337734, 309236, 277908, 243985, 208462, 172646, 137628, 103885, 71118, 38441, 4972, -29531, -64423, -98406, -130004, -158025, -181864, -201576, -217672, -230847, -241820, -251225, -259384, -266092, -270646, -272197, -270191, -264637, -256027, -244935, -231489, -215162, -195120, -170856, -142659, -111672, -79559, -47845, -17233]
35527a7233K9918L0360L1892L3833L5339L5698L4397L1214K6280K0066J3311O861
35515C11936J410k698n378o583o212m303j222K373N712Q043Q806P823N281J558
35501C26546k954p865j2728j7071k0425k2309k2329k0413j6933j2559p978l734
35489A59248j57K668M842O563Q088R737J1791J4248J6714J8658J9739J9925J9442
35476C11506J8640J7813J7031J6111J4805J2975J0574P516L703q69o035j1462
35464D12308j6713k1376k5212k8193l0374l1725l2059l1097k8513k4036j7494
35453A25516q827J858J4025K6475L7470M5374M9268M9157M5712L9830L2260K3478
35441D81596J3868M099m783j1718j6166j8385j9304k0097k1629k4083k6963k9547
$$ y = [-17233, 12685, 43045, 74937, 108770, 144109, 179807, 214204, 245418, 271698, 291764, 305075, 311936, 313346, 310648, 305270, 298687, 292475, 288172, 286950, 289323, 295035, 303078, 311884, 319707, 324988, 326546, 323592, 315727, 302999, 285928, 265503, 243194, 220865, 200452, 183519, 170960, 162982, 159248, 159091, 161759, 166601, 173164, 181252, 190989, 202780, 217028, 233742, 252400, 272139, 292064, 311506, 330146, 347959, 364990, 381101, 395906, 408881, 419455, 426971, 430674, 429805, 423770, 412308, 395595, 374219, 349007, 320814, 290440, 258715, 226656, 195559, 167046, 143010, 125516, 116689, 118547, 132572, 159047, 196517, 241891, 291159, 340316, 386028, 425858, 458118, 481596, 495464, 499563, 494780, 483062, 466896, 448511, 429207, 409110, 387481, 363398, 336435, 306888]
35429C06888l1360l2257l2277l1501l0009k7884k5215k2126j8812j5517j2490
35418B7440r935p912o196m327j916J109M414P373R236R437P937N310K372l76k946
35403D1020n654q701j1938j4925j7217j8650j9347j9521j9260j8565j7484j6099
35391a46341j4441j2420r816o367k050K580O315P724N857P34o627j4516k1082
35378b10450k4936k5489k2908j7797j0913l043N013J2504J8804K3486K6400K7609
35366b01720K7270K5607K3007K0004J7015J4085J0895P113K674k149o846j0828
35354g3873j3576j4754j4285j2398r602o555l840j779m40K84N77O25N10K04k88
35339a49190q57j281j341q53K98K160M764Q214J2624J7904K3634K9202L4085L7998
$$ y = [306888, 275528, 243271, 210994, 179493, 149484, 121600, 96385, 74259, 55447, 39930, 27440, 17505, 9593, 3397, -930, -2846, -1737, 2677, 10050, 19286, 28723, 36660, 41970, 44342, 43966, 41020, 35366, 26665, 14727, -198, -17415, -36065, -55412, -74933, -94193, -112758, -130242, -146341, -160782, -173202, -183018, -189385, -191435, -188855, -182540, -174816, -168959, -168225, -174852, -189368, -210450, -235386, -260875, -283783, -301580, -312493, -315536, -310523, -298019, -279215, -255729, -229329, -201720, -174450, -148843, -125836, -105832, -88817, -74732, -63837, -56724, -54050, -56199, -63045, -73873, -87449, -102203, -116488, -128886, -138488, -145043, -148883, -150662, -151102, -150818, -150241, -149616, -149106, -148902, -149190, -150047, -151328, -152669, -153522, -153224, -151064, -146300, -138086, -125462, -107558, -83924, -54722, -20637, 17361]
35325A7361M0919M2974M4373M5249M5557M5114M3700M1117L7247L2100K5815J8592
35313D80118J0645K294n972j3587k0109k5335k9314l2351l4924l7542m0594m4254
35301B09075m8383n2490n5783n7427n6770n3377m7058l7973k6787j4633k942O777
35289b37771J3206J5560J3872Q935J954n795j3164j9211k3224k4716k3487j9758
35277c13599j4253q014k024L110P213J0450J3093J5225J6588J6661J4975J1360
35265b29215O064k87o805j2559j6811j9078j9095j6786j2330o183R70Q319J5010
35252c08786K0238K3328K3838K1745J7639J2691Q317N663N190O574Q868J0942
35240a43753J2011J1941J1104R995Q949Q013O978N372K609j757p698j4546k1015
$$ y = [17361, 58280, 101254, 145627, 190876, 236433, 281547, 325247, 366364, 403611, 435711, 461526, 480118, 490763, 493057, 487085, 473498, 453389, 428054, 398740, 366389, 331465, 293923, 253329, 209075, 160692, 108202, 52419, -5008, -61778, -115155, -162213, -200186, -226973, -241606, -244548, -237771, -224565, -209005, -195133, -186198, -184244, -190039, -203203, -222414, -245638, -270354, -293841, -313599, -327852, -335866, -337890, -334780, -327567, -317117, -304024, -288799, -272211, -255550, -240575, -229215, -223151, -223438, -230243, -242802, -259613, -278691, -297786, -314572, -326902, -333085, -332115, -323796, -308786, -288548, -265220, -241382, -219637, -201998, -189307, -180990, -175327, -170137, -163563, -154695, -143753, -131742, -119801, -108697, -98702, -89753, -81740, -74762, -69390, -66781, -68538, -76236, -90782, -111797]
35227a11797k5666k7555k6642k3637j9479j4929j0506o587l455j251J03R97K051
35214b68353L880O855J1021J6174K1930K7743L2990L7064L9403L9512L7086L2165
35202C7470K5207J7016Q636J216m233p155p627o321m289k645k169l121n344q552
35188C8089j2487j6844k1205k5101k8051k9576k9250k6854k2491j6563r567j976
35176b01876N800J3348K0195K5840K9916L2320L3212L2824L1281K8614K4840K0138
35164I6452J4961R984N814K676L02j922m683q505j3607j9877k6962l4396m1548
35151b1311m7578n1545n2730n0985m6809m1141l4947k8750k2390j5258o824K825
35139d17443J2884K2127K9351L3670L4619L2149K6683J9235J1339M679O44MK744
$$ y = [-111797, -137463, -165018, -191660, -215297, -234776, -249705, -260211, -266798, -270253, -271504, -271401, -270404, -268353, -264473, -257618, -246597, -230423, -208493, -180750, -147760, -110696, -71293, -31781, 5305, 37470, 62677, 79693, 88329, 89545, 85312, 78157, 70530, 64209, 59920, 57275, 55106, 51985, 46641, 38089, 25602, 8758, -12447, -37548, -65599, -95175, -124425, -151279, -173770, -190333, -199900, -201876, -196076, -182728, -162533, -136693, -106777, -74457, -41245, -8421, 22860, 51474, 76314, 96452, 111413, 121397, 127211, 129887, 130189, 128267, 123584, 115079, 101472, 81595, 54633, 20237, -21311, -68889, -120434, -173164, -224149, -270958, -312099, -347046, -375796, -398186, -413444, -420268, -417443, -404559, -382432, -353081, -319411, -284792, -252643, -225960, -206725, -195386, -190707, -190063, -190059, -187315]
35126a87315Q019J4281J9745K3005K3415K1089J6688J1097N169m61n331q994j1008
35113g0601j1151r604o930l851r55J546L890O542R782J3391J6707J9009J9928
35100a2297J9614J8561J7233J5786J4109J2059R594O732L432m18m937j0118j5676
35087G3674k1013k5390k8296k9716l0071k9955k9793k9561k8788k6782k3074j7726
35075b46491j1320m665J615P344J2736J7981K2923K7059K9840L0895L0118K7664
35063e4301K3999J9807J5757J2318R669P702O048M245K079j87j938k520j540R82
35049D2120M568Q389J1466J2956J2312R372M388k020q992j5623k1146k5074k7302
35036E414k8048k7674k6485k4654k2307j9716j7451j6233j6467j7797j9065j8877
$$ y = [-187315, -179296, -165015, -145270, -122265, -98850, -77761, -61073, -49976, -44807, -45268, -50599, -59593, -70601, -81752, -91356, -98286, -102137, -103092, -101546, -97656, -91114, -81332, -67941, -51234, -32225, -12297, 7317, 25878, 43111, 58897, 73006, 85065, 94659, 101391, 104823, 104405, 99468, 89350, 73674, 52661, 27271, -1025, -30741, -60812, -90767, -120560, -150121, -178909, -205691, -228765, -246491, -257811, -262476, -260861, -253517, -240781, -222800, -199877, -172818, -142978, -112083, -81965, -54301, -30302, -10495, 5262, 17580, 27249, 34951, 40999, 45244, 47323, 47136, 45198, 42678, 41138, 42120, 46688, 55077, 66543, 79499, 91811, 101183, 105571, 103551, 94559, 78936, 57790, 32716, 5414, -22634, -50308, -76793, -101447, -123754, -143470, -160921, -177154, -193621, -211418, -230483, -249360]
35024b49360j6261j1043l873M017J1123J6038J7839J6298J1936N882m89n939r678
35011b13510j1448j1477j0325q682p163o188n988o570p673q889r905j0652j1225
34998c29695j1607j1578j0756q751n355o95M729J0138J4713J7856J9325J9277
34986b92399J8098J6199J3877J1318Q678O128L893K284J572J794K664L712M562
34973a97620N079N343N444N325M726L358J185j450l918n592o105n419l697j110
34959a94451K311O512J1164J5609J9084K1056K1367K0159J7767J4628J1150P611
34947b6033M124O95k662n781q294r716r737q405o162l650j446J48J113J556J587
34932g2663J417J610L035O398J1693J8014K3919K7964K9156K7142K2230J5242
$$ y = [-249360, -265621, -276664, -280537, -276520, -265397, -249359, -231520, -215222, -203286, -197404, -197893, -203832, -213510, -224958, -236435, -246760, -255442, -262605, -268793, -274781, -281351, -289024, -297913, -307818, -318470, -329695, -341302, -352880, -363636, -372387, -377742, -378437, -373708, -363570, -348857, -331001, -311676, -292399, -274301, -258102, -244225, -232907, -224229, -218101, -214208, -211924, -210352, -208558, -205894, -202182, -197620, -192541, -187198, -181754, -176429, -171703, -168345, -167160, -168610, -172528, -178120, -184225, -189644, -193341, -194451, -192140, -185628, -174464, -158855, -139771, -118715, -97348, -77189, -59422, -44794, -33644, -26033, -21909, -21214, -23876, -29657, -37951, -47667, -57404, -65809, -71971, -75621, -77067, -76919, -75806, -74250, -72663, -71246, -69636, -66601, -60203, -48510, -30496, -6577, 21387, 50543, 77685, 99915, 115157]
34920A15157P409J57n225q030q422p333o018n481o008p031p499o522l927l20L256
34905E4163N745O419N106K265j129l927n189m400j566K899Q271J3540J7493J8985
34891A18675J7408J3095P297J720k134l538k785r58N54N79j597o164j2782k0628
34877A08742k8570l5401l9999m1537l9630l4453k6730j7512p928J119R140J6044
34865a36715K1942K6921L0928L3749L4968L4097L0841K5346J8213J0290K472m373
34853A28679r453j2135j2148r755n769j287K717N680P389P789O942N047K454m33
34839A15717l186n367o585o641n525l315j36L707P540J0338J1027Q981M434j532
34825A29457p389j1682j3362j1927p563j240N584J1528J5810J8290J9179J8666
$$ y = [115157, 122566, 122723, 117498, 109468, 101046, 93713, 87695, 82214, 76206, 69175, 61676, 55154, 51227, 50907, 54163, 59908, 66327, 71433, 73698, 72569, 68642, 63453, 59053, 57487, 60386, 68657, 82197, 99690, 118675, 136083, 149178, 156475, 158195, 156061, 152523, 149738, 148780, 149334, 149913, 148316, 142152, 129370, 108742, 80172, 44771, 4772, -36765, -76395, -110848, -137578, -155090, -163018, -161899, -152759, -136715, -114773, -87852, -56924, -23175, 11793, 45890, 76731, 102077, 120290, 130580, 133052, 128679, 119226, 107091, 94943, 85188, 79419, 78132, 80849, 86529, 93918, 101707, 108649, 113696, 116150, 115717, 112531, 107164, 100579, 93938, 88413, 85098, 84962, 88669, 96209, 106547, 117574, 126555, 130989, 129457, 122068, 110386, 97024, 85097, 77534, 76294, 81878, 93406, 109216, 127506, 146685, 165351]
34813A65351J6781J3396Q324J417p316j7515k8336l8564m6928n2546n5091n4661
34801i5688n1541m6072l8644k9720j9790r304J339J1706K1215K9133L4702L7362
34789a55302L6953L3873K9062K3729J8946J5391J3339J2778J3399J4558J5370
34778G2096J5026J3066R542N046N54k895m660m708l463j428J067L888O872R676
34764A19679J1768J2627J2034J0193P579M659J658j508n040r018j3238j7252k0574
34751A13567k2847k3990k4156k3528k2052j9383j5226r835m145N77L383M094L307
34738d0234K017J017M82Lj034k969n632q420j0557j1466j1026r548p529n370l316
34723a13582j581m04K7k13o75o70L97K693N870R233J2005J3537J3498J1976R436
$$ y = [165351, 182132, 195528, 203852, 205269, 197953, 180438, 152102, 113538, 66610, 14064, -41027, -95688, -147229, -193301, -231945, -261665, -281455, -290759, -289420, -277714, -256499, -227366, -192664, -155302, -118349, -84476, -55414, -31685, -12739, 2652, 15991, 28769, 42168, 56726, 72096, 87122, 100188, 109730, 114776, 115330, 112435, 107775, 103067, 99604, 98176, 99243, 103131, 110003, 119679, 131447, 144074, 156108, 166301, 173880, 178539, 180197, 178689, 173649, 164631, 151393, 134141, 113567, 90720, 66730, 42574, 19046, -3006, -22389, -37615, -47450, -51595, -51018, -47635, -43541, -40234, -38217, -37200, -36718, -36715, -37749, -40718, -46350, -54770, -65327, -76793, -87819, -97367, -104896, -110266, -113582, -115163, -115567, -115540, -115753, -116428, -117098, -116701, -114008, -108138, -98905, -86900, -73363, -59865, -47889, -38453]
34708c8453O533L838J693J75q23j492k076k900m281o339q758j0790j1568j0505
34694h5746p608l512O86L841N185M544K243j200n317r744j4067j7697j9939k0279
34680a68610j8696j5713j2180q908o344m394k489O7L583P741J1667J4381J5150
34667a84745J3728J0352N611L16m657q509j0667j0930r507o933l995j591n55j382
34653b13464m007p785j1759j5043j7178j8224j8616j8854j9205j9541j9384j8124
34641d01184j5339j1005n448Q81P595J4432K1104K7121L1695L3907L3136K9444
34629b33661K3658J7066J0920O027K573K25j521k967m059m517m128k917j118J028
34615a93391L419O043Q829J1545J3914J5769J7068J7832J8087J7896J7353J6503
$$ y = [-38453, -31920, -28082, -26389, -26214, -27037, -28529, -30605, -33505, -37786, -44125, -52883, -63673, -75241, -85746, -93354, -96866, -96180, -92339, -87154, -82610, -80367, -81567, -86884, -96628, -110695, -128392, -148331, -168610, -187306, -203019, -215199, -224107, -230451, -234845, -237334, -237267, -233684, -225943, -214276, -199895, -184745, -171017, -160665, -155054, -154738, -159395, -167904, -178571, -189501, -199008, -205941, -209936, -211527, -212082, -213464, -217471, -225256, -237015, -252058, -269236, -287460, -306076, -324930, -344135, -363676, -383060, -401184, -416523, -427528, -432976, -432095, -424500, -410068, -388964, -361843, -330148, -296241, -263105, -233661, -210003, -192937, -182017, -175990, -173417, -173192, -174713, -177680, -181739, -186256, -190384, -193301, -194419, -193391, -189972, -183929, -175100, -163555, -149641, -133872, -116804, -98972, -80885, -62989, -45636, -29133]
34603b9133J5364J4043J2852J2212J2416J3446J4964J6463J7483J7709J6965J5206
34591A49990J2600R637P020N404N038N566O105N606L363n94n580j0702j5323j9187
34577A58943k2133k3874k4003k2275j8920j4645j0410p111n328n215o450q348
34565i769j0124j1141j1035r702p309m364j614K54Q80L74q76k497m385o739r770
34550h7817j3359j6950j9756k1105k0658j8448j4839j0392n724j402K129M616
34538b23705O058O616O512N993N424N308O115Q044J0937J4358J7747K0521K2141
34525h7931K2202K0500J7118J2414O912J113m647j0149j5095j8998k1217k1240
34513i9018j8944j4727r373l710J691O624J1216J5702K0153K4265K7307K8341
$$ y = [-29133, -13769, 274, 13126, 25338, 37754, 51200, 66164, 82627, 100110, 117819, 134784, 149990, 162590, 172227, 179247, 184651, 189689, 195255, 201360, 206966, 210329, 209735, 204155, 193453, 178130, 158943, 136810, 112936, 88933, 66658, 47738, 33093, 22683, 15572, 10244, 5029, -1421, -9769, -19893, -31034, -42069, -51771, -59080, -63444, -65058, -64804, -63924, -63550, -64426, -66923, -71308, -78047, -87817, -101176, -118126, -137882, -158987, -179645, -198093, -212932, -223324, -229048, -230450, -228321, -223705, -217647, -211031, -204519, -198526, -193102, -187794, -181679, -173635, -162698, -148340, -130593, -110072, -87931, -65729, -45229, -28111, -15697, -8785, -7672, -12319, -22468, -37563, -56561, -77778, -99018, -117962, -132689, -142062, -145772, -144081, -137457, -126241, -110539, -90386, -66121, -38814, -10473]
34501a0473K6538K1550J3677L839o702j6619k4709l0008l1993l0720k6813k1187
34489a33620j4813q635l512q1J458J473P65K51N37J725L578N895Q752J2385J6914
34474a06928K2168K7622L2495L5905L7134L5858L2228K6814K0463J4085Q436L919
34462A90199N82j756l299m114m129l305j860l61M92K16j285l712o552r237j1296
34447A40583j2447j2617j1968j0870r780r120r148r988j1622j3836j6181j8033
34435e027j8747j7778j4809r888l495L517J0157J5556J9205K1029K1261K0206
34423D1187J8054J4876J0792O051J018l871q101j1055j2113j0938p758l411R96
34410C5727M623P227R129J0931J3199J6206J9759K3241K5839K6836K5740K2281
$$ y = [-10473, 16065, 37615, 51292, 55131, 48429, 31810, 7101, -22907, -54900, -85620, -112433, -133620, -148433, -157068, -160580, -160661, -159203, -157730, -156965, -156714, -156177, -154452, -150874, -144979, -136227, -123842, -106928, -84760, -57138, -24643, 11262, 48396, 84254, 116482, 143296, 163759, 177844, 186280, 190199, 190781, 189025, 185726, 181612, 177483, 174178, 172318, 171957, 172449, 172665, 171380, 167668, 161116, 151879, 140583, 128136, 115519, 103551, 92681, 82901, 73781, 64633, 54645, 43023, 29187, 13006, -5027, -23774, -41552, -56361, -66249, -69744, -66227, -56070, -40514, -21309, -280, 20981, 41187, 59241, 74117, 84909, 90960, 91978, 88107, 80006, 68951, 56838, 45900, 38142, 34731, 35727, 40350, 47577, 56706, 67637, 80836, 97042, 116801, 140042, 165881, 192717, 218457, 240738]
34398B40738J6519Q937M33p951j5390k1506k6348l0183l3219l5432l6523l6116
34386B3959l4047l0589k6465k2603j9796j8411j8289j8837j9258j8885j7423j4940
34374b35584j1652p691l120J927P140J2004J5927J8431J9363J8974J7729J6019
34362a30533J4003J1739R431P529O639P195R182J2055J4988J7268J8574J8974
34350A7044J8708J7948J6766J5207J3392J1477R575P757O185N128M852N461O941
34337A56441R256J2416J6397K1045K6072L1051L5543L9246M2157M4491M6400M7740
34325E28255M8076M6902M3904L9163L3243K7065K1644J7786J5909J6043J7914
34314H55904K1115K5336L0563L7143M5528N5911O8041Q1433R5783J11214J28119
$$ y = [240738, 257257, 266194, 266627, 258676, 243286, 221780, 195432, 165249, 132030, 96598, 60075, 23959, -10088, -40677, -67142, -89745, -109541, -127952, -146241, -165078, -184336, -203221, -220644, -235584, -247236, -254927, -258047, -256120, -248980, -236976, -221049, -202618, -183255, -164281, -146552, -130533, -116530, -104791, -95360, -87831, -81192, -73997, -64815, -52760, -37772, -20504, -1930, 17044, 35752, 53700, 70466, 85673, 99065, 110542, 120117, 127874, 134059, 139187, 144039, 149500, 156441, 165697, 178113, 194510, 215555, 241627, 272678, 308221, 347467, 389624, 434115, 480515, 528255, 576331, 623233, 667137, 706300, 739543, 766608, 788252, 806038, 821947, 837990, 855904, 877019, 902355, 932918, 970061, 1015589, 1071500, 1139541, 1220974, 1316757, 1427971, 1556090]
34303A556090J46771J66982J87998K08513K26734K40374K46678K42572K25069
34294C447781J92058J43339Q1563J2522n5775j15150j59620j86840j98054j96857
34284B964967j87583j74080j59031j43869j29114j14868j01287q8835p8288p0534
34274A717478o6200o5416o7792p2532p8564q4595q9222r1122q9310q3430p3946
34263H55349o2083m9464l7588k7483j9560j3728r544o439l898j612M37J932K320
34250F28639J093j897o344j1562j6672k0748k3003k3053k1085j7805j4191j1134
34238D62238r150q272q190q527r052r711j0495j1399j2439j3830j6055j9689k5045
34225C00384l1769l8814m4728m8184m8321m4921l8378k9616j9978j1010m161m55
$$ y = [1556090, 1702861, 1869843, 2057841, 2266354, 2493088, 2733462, 2980140, 3222712, 3447781, 3639839, 3783178, 3864741, 3877263, 3821488, 3706338, 3546718, 3359878, 3161824, 2964967, 2777384, 2603304, 2444273, 2300404, 2171290, 2056422, 1955135, 1866300, 1788012, 1717478, 1651278, 1585862, 1518070, 1445538, 1366974, 1282379, 1193157, 1102035, 1012725, 929295, 855349, 793266, 743802, 706214, 678731, 659171, 645443, 635899, 629460, 625562, 623950, 624387, 626319, 628639, 629732, 627835, 621491, 609929, 593257, 572509, 549506, 526453, 505368, 487563, 473372, 462238, 453088, 444816, 436626, 428099, 419047, 409336, 398841, 387442, 375003, 361173, 345118, 325429, 300384, 268615, 229801, 185073, 136889, 88568, 43647, 5269, -24347, -44325, -55335, -59496, -59951]
34213e9951j95k989p969j4085k0371k5996l0325l2967l3843l3191l1448k9078
34201c22408k6401k3580k0620j7409j3838r959o145k951q24J70L64K63K69N18
34187d42551R65J604K588M202O639R848J3544J7312K0766K3699K6181K8569L1368
34174b55266L4959L9262M3586M6807M7930M6641M3412L9143L4659L0409K6462
34163A78004K2742J9237J6178J4057J3561J5429K0167K7732L7362M7674N7011
34152D69154O3782O6731O5108N8741M7970L3509J6407j930j9821l5665m8426n7883
34140F57677o4492o8918p1480p1873o9300o3067n3228m0929k8149j7011r125n215
34128I4890n154q068j2463j6496j8465j7394j3272o937L17P093J2139J4520J3730
$$ y = [-59951, -60146, -63135, -71104, -85189, -105560, -131556, -161881, -194848, -228691, -261882, -293330, -322408, -348809, -372389, -393009, -410418, -424256, -434215, -440360, -443311, -444135, -443965, -443601, -443338, -443069, -442551, -441586, -439982, -437394, -433192, -426553, -416705, -403161, -385849, -365083, -341384, -315203, -286634, -255266, -220307, -181045, -137459, -90652, -42722, 3919, 47331, 86474, 121133, 151542, 178004, 200746, 219983, 236161, 250218, 263779, 279208, 299375, 327107, 364469, 412143, 469154, 532936, 599667, 664775, 723516, 771486, 804995, 821402, 819472, 799651, 763986, 715560, 657677, 593185, 524267, 452787, 380914, 311614, 248547, 195319, 154390, 126241, 109230, 100105, 94890, 89736, 81668, 69205, 52709, 34244, 16850, 3578, -3359, -3042, 4051, 16190, 30710, 44440]
34115D4440R743L065n305j3973k1387k6150k7402k5109k0123j3822p529k094K182
34102a03464N311P401Q539Q802Q344P397O202M899L538K238J192N32J29l83j408
34087d0731l214n833r089j2611j5927j8528j9977k0042j8830j6843j4812j3355
34075b09792j2660j2352j1724j0151p429l827J71M082P550J0304J2184J3198J3596
34062b06850J3796J4162J4780J5341J5283J4075J1496P805L688R3k100k365o44
34049a01440K757P404J2860J8667K4220K8747L1485L1970L0247K6773K2228J7268
34037A53186J2436Q051M119M19l294p000j0335j2697j3529j2575r953o079j499
34024A01250L178P353J0605J2890J4587J6206J8058K0054K1778K2696K2397K0763
$$ y = [44440, 54183, 57248, 51943, 37970, 16583, -9567, -36969, -62078, -82201, -96023, -103552, -105646, -103464, -98153, -90752, -82213, -73411, -65067, -57670, -51468, -46569, -43031, -40793, -39601, -39069, -38940, -39323, -40731, -43945, -49778, -58867, -71478, -87405, -105933, -125910, -145952, -164782, -181625, -196437, -209792, -222452, -234804, -246528, -256679, -264108, -267935, -267764, -263682, -256132, -245828, -233644, -220446, -206850, -193054, -178892, -164112, -148771, -133488, -119413, -107917, -100112, -96424, -96331, -98431, -100796, -101440, -98683, -91279, -78419, -59752, -35532, -6785, 24700, 56670, 86917, 113690, 135918, 153186, 165622, 173673, 177792, 178211, 174917, 167917, 157582, 144885, 131356, 118781, 108828, 102749, 101250, 104428, 111781, 122386, 135276, 149863, 166069, 184127, 204181, 225959, 248655, 271052, 291815]
34012B91815J7925J4145R629M545q60o115j0505j3211j3568j1355o940j246M413
33999B78672Q665J0472R534O386K110k257o233r965j3930j8476k3635k9201l4806
33986A77336l9893m3649m5301m4560m1872l8058l3708k8880k3289j6831r890l319
33974a91914J949N259O397N464K685j653p135j3175j9145k4570k9245l3162l6256
33961c34501l8262l8792l7635l4938l1131k6732k2162j7734j3625r902o541l462
33949f15417n40K422N664R414J3804J8813K4239K9760L5057L9857M3903M6908
33937c46116M8596M8730M7056M3222L6826K7761J6592M694o123j4259j8893k0178
33925a32092j9013j6622j4079j1924r994p633m169N89O124J1424J5411J7415J7324
$$ y = [291815, 309740, 323885, 333514, 338059, 337199, 331084, 320579, 307368, 293800, 282445, 275505, 274259, 278672, 287337, 297809, 307343, 313729, 315839, 313582, 307349, 297384, 283454, 264978, 241343, 212142, 177336, 137443, 93794, 48493, 3933, -37939, -75997, -109705, -138585, -161874, -178705, -188595, -191914, -189965, -184706, -178309, -172845, -170160, -171813, -178948, -192123, -211268, -235838, -265083, -298245, -334501, -372763, -411555, -449190, -484128, -515259, -541991, -564153, -581887, -595512, -605414, -611955, -615417, -615957, -613535, -607871, -598457, -584653, -565840, -541601, -511841, -476784, -436927, -393024, -346116, -297520, -248790, -201734, -158512, -121686, -93925, -77333, -72639, -78762, -93021, -111914, -132092, -151105, -167727, -181806, -193730, -203724, -211357, -215526, -214937, -208813, -197389, -181978, -164563, -147239]
33912a47239J5388J1890P018R84n816j2749j9010k3692k5985k5506k2499j7755
33900b64971j2212o647j509L018O872R968J2126J3159J3033J1923J0135P903N264
33887a91938K152j317m626o897p293n434j649L137P744J1233J3288J4218J4575
33874a52807J4705J4650J4307J3644J2709J1510R966P946N440K643q6k457m470
33861e2300o323q186j0024j1639j2762j3145j2593j1047q595n386j607K466O389
33848a44752R611J1663J2324J1608R625O448K085l400r762j6495k2865k8033l1276
33835a93219l2281l1256k8809k5597k2060j8333j4324r819m604J375P921J4600
33823c56406K0895K6365L0736L3833L5474L5388L3272K8937K2390J3853L697p486
$$ y = [-147239, -131851, -119961, -112943, -111959, -117775, -130524, -149534, -173226, -199211, -224717, -247216, -264971, -277183, -283830, -285339, -282321, -275449, -265481, -253355, -240196, -227163, -215240, -205105, -197202, -191938, -189786, -191103, -195729, -202626, -209919, -215353, -217002, -213865, -206121, -194888, -181600, -167382, -152807, -138102, -123452, -109145, -95501, -82792, -71282, -61316, -53370, -47930, -45287, -45373, -47830, -52300, -58623, -66809, -76833, -88472, -101234, -114379, -126972, -138019, -146614, -152000, -153607, -151141, -144752, -135141, -123478, -111154, -99546, -89921, -83473, -81388, -84788, -94550, -111045, -133910, -161943, -193219, -225500, -256756, -285565, -311162, -333222, -351555, -365879, -375698, -380302, -378927, -371006, -356406, -335511, -309146, -278410, -244577, -209103, -173715, -140443, -111506, -89116, -75263, -71566, -79052]
33811g9052j8835k9175l7185m1717m2128l8495l1623k2902j4018o598j873n06
33799c64107k561p547j4454k1903k8442l2865l4432l2926k8625k2268j4830p270
33787f12230k41N982J1515J6657K1688K6606L1048L4435L6308L6569L5464L3345
33775c22854L0333K6212K0606J3325M666m576j3350k0809k6594l0790l3535l4702
33763c92068l3881l0672k5005j7256q221J021R274J5528J9232K0477J9888J8262
33751d03421J6145J3588J0350O294J726k700o364r049j0944j2264j2860j2125
33739d21624r345m162L159J1774K0484K8032L3411L6053L5904L3334K9022K3821
33727a80137J8637J4251J1176R514Q943Q880Q745Q166P010N315L257J158o51j995
$$ y = [-79052, -97887, -127062, -164247, -205964, -248092, -286587, -318210, -341112, -355130, -361728, -363601, -364107, -366668, -374215, -388669, -410572, -439014, -471879, -506311, -539237, -567862, -590130, -604960, -612230, -612471, -606489, -594974, -578317, -556629, -530023, -498975, -464540, -428232, -391663, -356199, -322854, -292521, -266309, -245703, -232378, -227712, -232288, -245638, -266447, -293041, -323831, -357366, -392068, -425949, -456621, -481626, -498882, -507103, -506082, -496808, -481280, -462048, -441571, -421683, -403421, -387276, -373688, -363338, -357044, -355318, -358018, -364382, -373431, -384375, -396639, -409499, -421624, -430969, -435131, -431972, -420198, -399714, -371682, -338271, -302218, -266314, -232980, -203958, -180137, -161500, -147249, -136073, -126559, -117616, -108736, -99991, -91825, -84815, -79500, -76243, -75085, -75736, -77731]
33713g7731k954l765m693n960p659r704j1788j3510j4538j4718j4007j2319r392
33700b02738m845J594R856J9400K9279L8339M5510N0073N1799N0801M7365M1872
33688A78305L4865K7061J9197J1874N497L54l351n585o613p035p599q841j0787
33675B27342j2970j4717j5479j4952j3067r945n918j501K698O069Q132Q650P761
33662A72103N997M184L142L366M810O956R031J0266J0071Q151M652J90m179p225
33648B31515p941n984j814L504Q805J3181J6104J7439J7388J6489J5438J4835
33636C38959J4970J5777J6918J7895J8118J6928J3710Q089J94r308j9366k8837
33624D04047l6661m1930m3881m2050l6505k8107j8517r832m007k202m399r407
$$ y = [-77731, -80685, -84450, -89143, -95103, -102762, -112466, -124254, -137764, -152302, -167020, -181027, -193346, -202738, -207583, -205989, -196133, -176733, -147454, -109115, -63605, -13532, 38267, 89068, 136433, 178305, 213170, 240231, 259428, 271302, 276799, 277153, 273802, 268217, 261604, 254569, 246970, 238129, 227342, 214372, 199655, 184176, 169224, 156157, 146212, 140294, 138793, 141491, 147560, 155692, 164342, 172103, 178100, 182284, 185426, 188792, 193602, 200558, 209589, 219855, 229926, 238077, 242729, 242919, 238740, 231515, 223574, 217590, 215776, 219280, 228085, 241266, 257370, 274809, 292197, 308686, 324124, 338959, 353929, 369706, 386624, 404519, 422637, 439565, 453275, 461364, 461558, 452250, 432884, 404047, 367386, 325456, 281575, 239525, 203020, 174913, 156396, 146564, 142557, 140355, 135956, 126549]
33612A26549j5296k0078k2318k1422j7652j1915n495L04M457O325N662K591k380
33599B9332q499j4910k0824k5504k8330k8978k7640k5005k2003j9365j7258j5279
33587b24263j2801r491n550j523K114N196P895J0579J3709J7620K2332K7419L2076
33574a14688L5421L6826L6152L3705L0043K5683K0963J5967J0617M797j511q218
33562A25757j5132k2000k8520l4307l8933m1911m2747m1110l7039l0972k3544
33551b30458j5310o679J979J0165J7252K2621K5824K6689K5251K1638J6037Q831
33539g6160O91p449j4648k0118k3291k3762k1289j5899q041J377J1141J9916K6482
33526a51050K9922K9920K6952K2145J6768J1687P090K702j799o318j0219j2572
$$ y = [126549, 111253, 91175, 68857, 47435, 29783, 17868, 12373, 12677, 17134, 23459, 29121, 31712, 29332, 20833, 5923, -14901, -40405, -68735, -97713, -125353, -150358, -172361, -191726, -208984, -224263, -237064, -246555, -252105, -253628, -251514, -246318, -238423, -227844, -214135, -196515, -174183, -146764, -114688, -79267, -42441, -6289, 27416, 57459, 83142, 104105, 120072, 130689, 135486, 133975, 125757, 110625, 88625, 60105, 25798, -13135, -55046, -97793, -138903, -175942, -206914, -230458, -245768, -252447, -250468, -240303, -223051, -200430, -174606, -147917, -122666, -101028, -84991, -76160, -75469, -82918, -97566, -117684, -140975, -164737, -186026, -201925, -209966, -208589, -197448, -177532, -151050, -121128, -91208, -64256, -42111, -25343, -13656, -6566, -3864, -5663, -11981, -22200, -34772]
33514c4772j2647j0353o325j745K064M101M059K351j14k347l600l584k542j099
33500f6553N4M49m4j258k741l847l972k775l08L074O880J0738J4564J8543K2786
33485d410K6966L0273L1741L0689K6978K1035J3716O101p47n920q829r343p840
33472A50410n069j856J107L293M305L947K328j30k864n460p823j0150j2667j5375
33458A03996j7972j9986k0993k0773j9402j7271j4991j3088j1745j0657r222o874
33446g8978l413Q99N431R438J2290J3721J3936J3558J3307J3647J4610J5906J7170
33433F1522J8158J8839J9356J9946K0790K1901K3023K3634K3041K0731J6677J1454
33421B99072N987J146k563n042o486p181p374p199o768o272n961o067o621p470
$$ y = [-34772, -47419, -57772, -64097, -65842, -63778, -59677, -55618, -53267, -53381, -55728, -59328, -62912, -65454, -66553, -66499, -66050, -66094, -67352, -70093, -73940, -77912, -80687, -80995, -77921, -71041, -60303, -45739, -27196, -4410, 22556, 52829, 84570, 115259, 142237, 163272, 176988, 183089, 182342, 176422, 167593, 158250, 150410, 145341, 143485, 144592, 147885, 152190, 156137, 158465, 158335, 155471, 150011, 142188, 132038, 119371, 103996, 86024, 66038, 45045, 24272, 4870, -12401, -27392, -40480, -52225, -62882, -72104, -78978, -82391, -81492, -76061, -66623, -54333, -40612, -26676, -13118, 189, 13836, 28446, 44352, 61522, 79680, 98519, 117875, 137821, 158611, 180512, 203535, 227169, 250210, 270941, 287618, 299072, 305059, 306205, 303642, 298600, 292114, 284933, 277559, 270360, 263592, 257320, 251359, 245292, 238671, 231201]
33407B31201q401r259r953j0436j0722j1017j1650j2746j3913j4281j2978r700
33395I6145m980j4L868N745N467L617J168j047k715m120n893q553j2206j6393
33381F0089k0284k2945k3725k2475j9614j5963j2504j0136r386j0148j1669j2922
33369a31682j3209j2526j1441j0595j0298j0459j0832j1297j1900j2649j3314
33358b60202j3424j2507j0303o835k353K756Q067J3254J8187K3019K8076L3646
33346a78619L9665M5577N0430N3244N3374N0719M5657L8889L1195K3287J5649
33335B69067Q494J809m477j0319j5523j9881k3343k6070k8276l0053l1191l1197
33323E9040k9493k5822k0521j4481q663l634N99M323P658J0214J1103R364M575
$$ y = [231201, 222800, 213541, 203588, 193152, 182430, 171413, 159763, 147017, 133104, 118823, 105845, 96145, 91165, 91151, 95019, 100764, 106231, 109848, 111016, 109969, 107254, 103134, 97241, 88688, 76482, 60089, 39805, 16860, -6865, -29340, -48954, -64917, -77421, -87557, -96943, -107091, -118760, -131682, -144891, -157417, -168858, -179453, -189751, -200210, -211042, -222339, -234239, -246888, -260202, -273626, -286133, -296436, -303271, -305624, -302868, -294801, -281547, -263360, -240341, -212265, -178619, -138954, -93377, -42947, 10297, 63671, 114390, 160047, 198936, 230131, 253418, 269067, 277561, 279370, 274893, 264574, 249051, 229170, 205827, 179757, 151481, 121428, 90237, 59040, 29547, 3725, -16796, -31277, -39940, -43574, -42975, -38652, -30994, -20780, -9677, -313, 4262]
33310D262k701j1022j8632k4234k7441k8764k9159k9537l0399l1761l3203l4116
33298b96707l3917l2278k9241k5269k1150j7738j5516j4284j3187j1164p449j914
33286e19814M989J2440J9518K5386K9407L1242L0986K9160K6573K4020K2028K0757
33274b43308K0040J9497J8724J7434J5547J3119J0264P067L595j23m068q288j2836
33261a43336j7688k2587k7023l0408l2308l2563l1209k8401k4397j9629j4681
33250d24230j0208o761m637l802m030n106o967r576j2693j5761j8093j9101j8453
33237e59418j5980j1590n255K813J2033K1431K9876L6326M0136M1206L9999L7296
33225c31127L3865L0247K6756K3651K1249J9873J9715K0696K2489K4627K6670
$$ y = [4262, 1561, -9461, -28093, -52327, -79768, -108532, -137691, -167228, -197627, -229388, -262591, -296707, -330624, -362902, -392143, -417412, -438562, -456300, -471816, -486100, -499287, -510451, -517900, -519814, -514825, -502385, -482867, -457481, -428074, -396832, -365846, -336686, -310113, -286093, -264065, -243308, -223268, -203771, -185047, -167613, -152066, -138947, -128683, -121616, -118021, -118144, -122212, -130500, -143336, -161024, -183611, -210634, -241042, -273350, -305913, -337122, -365523, -389920, -409549, -424230, -434438, -441199, -445836, -449638, -453668, -458774, -465741, -475317, -488010, -503771, -521864, -540965, -559418, -575398, -586988, -592243, -589430, -577397, -555966, -526090, -489764, -449628, -408422, -368423, -331127, -297262, -267015, -240259, -216608, -195359, -175486, -155771, -135075, -112586, -87959, -61289]
33214f1289K8224K8958K8592K6962K3987J9637J3943P165p3o813j2063j5124j5818
33201F6288j4492j1879q838o127m199l147k741k644k569k461k505l030m289o212
33187h845q347j0131j1305j2115j3046j4312j5516j5837j4501j1295o709j709
33175a43668K725N997Q074R366J0468J1834J3619J5679J7735J9494K0734K1272
33163A3329K1024K0004J8347J6219J3732J0895P672M089L18l330o463q754j0029
33150I7053j0335r822q609o701m131j100J990M684O627P633P703P025N921M684
33136A02622L353J678p53m171q403j2749j6133j7430j5879j1392m654L094J0497
33123B9680J6546K0885K3704K5502K6735K7695K8440K8848K8612K7321K4596K0354
$$ y = [-61289, -33065, -4107, 24485, 51447, 75434, 95071, 109014, 116179, 116106, 109293, 97230, 82106, 66288, 51796, 39917, 31079, 24952, 20753, 17606, 14865, 12221, 9652, 7191, 4686, 1656, -2633, -8845, -17192, -27323, -38628, -50743, -63789, -78101, -93617, -109454, -123955, -135250, -141959, -143668, -140943, -134946, -126872, -117506, -107038, -95204, -81585, -65906, -48171, -28677, -7943, 13329, 34353, 54357, 72704, 88923, 102655, 113550, 121222, 125311, 125629, 122299, 115836, 107082, 97053, 86718, 76896, 68287, 61586, 57455, 56355, 58345, 63029, 69656, 77289, 84992, 92017, 97938, 102622, 105975, 107653, 106900, 102729, 94326, 81577, 65444, 48014, 32135, 20743, 16089, 19183, 29680, 46226, 67111, 90815, 116317, 143052, 170747, 199187, 228035, 256647, 283968, 308564, 328918]
33111C28918J4919Q951L164j952o281j0000j3436j6905k0618k4615k8699l2430
33099B01016l5237l6623l6340l4391l0993k6532k1537j6517j1741p204k829J294
33087e7634M846P466Q910R168Q420P017N390M014L258L291M010N200O712Q511
33073B8579J0534J2481J3810J3847J2039Q186K627l830j0154j5469j9223k1219
33061C2208k1514k0342j7993j4812j1208p732m967l351l025l887n700q212j1108
33048a01643j3978j6334j7763j8082j7354j5744j3348j0136o079j234M198R926
33036b17571J5598K0719K4589K6310K5073K0549J3183M103n184j3167j8597k0710
33024a25105j9343j4939q348o30P117J3881J8956K2093K3580K4021K4055K4044
$$ y = [328918, 343837, 352788, 355952, 354000, 347719, 337719, 324283, 307378, 286760, 262145, 233446, 201016, 165779, 129156, 92816, 58425, 27432, 900, -20637, -37154, -48895, -56099, -58928, -57634, -52788, -45322, -36412, -27244, -18824, -11807, -6417, -2403, 855, 4146, 8156, 13356, 20068, 28579, 39113, 51594, 65404, 79251, 91290, 99476, 102103, 98273, 88119, 72650, 53427, 32208, 10694, -9648, -27641, -42453, -53661, -61393, -66360, -69711, -72736, -76623, -82323, -90535, -101643, -115621, -131955, -149718, -167800, -185154, -200898, -214246, -224382, -230461, -231695, -227497, -217571, -201973, -181254, -156665, -130355, -105282, -84733, -71550, -67447, -72631, -85798, -104395, -125105, -144448, -159387, -167735, -168365, -161248, -147367, -128411, -106318, -82738, -58717, -34662, -10618]
33012a0618K4036K3850K3232K1912J9665J6428J2435Q173M129N26k770o102r842
32999A25054j4116j8672k2884k6003k7501k7273k5590k2920j9717j6276j2698
32988a08596r021n423k285nJ263J741J914K344L520N683Q734J2210J5525J8265
32974e4131K0371K2044K3512K4774K5507K5147K3163J9306J3690O682j210r327
32962A39528j6819k2756k6383k7349k5720k1844j6219r390j972N378J1996J7302
32950E752K0947K2887K3337K2643K1132J9089J6780J4431J2195J0177Q494P322
32938B05186O779O739O812O487N376L299K42l775q752j4676k1388k8528l5529
32925A28272m1738m6570m9664n1019n0943m9828m7854m4859m0419l4101k5644
$$ y = [-10618, 13418, 37268, 60500, 82412, 102077, 118505, 130940, 139113, 143242, 143768, 140998, 134896, 125054, 110938, 92266, 69382, 43379, 15878, -11395, -36985, -59905, -79622, -95898, -108596, -117617, -123040, -125325, -125330, -124067, -122326, -120412, -118068, -114548, -108865, -100131, -87921, -72396, -54131, -33760, -11716, 11796, 36570, 62077, 87224, 110387, 129693, 143383, 150065, 148855, 139528, 122709, 99953, 73570, 46221, 20501, -1343, -17562, -26952, -28924, -23546, -11550, 5752, 26699, 49586, 72923, 95566, 116698, 135787, 152567, 166998, 179193, 189370, 197864, 205186, 211965, 218704, 225516, 232003, 237379, 240678, 240920, 237145, 228393, 213717, 192329, 163801, 128272, 86534, 39964, -9700, -60719, -111662, -161490, -209344, -254203, -294622, -328723, -354367]
32914c54367j5186l391Q563J9311K7748L3417L6581L8085L8958M0003M1477M3031
32902d5770M3885M3150M0217L5063K8437K1622J5969J2334J0871J1086J2073J2755
32890B41692J2183R876O089J736j986m099m132k097J626O431J1552J6250K0037
32877C15158K2870K5049K6901K8450K9372K9223K7777K5129K1599J7590J3472
32866E82590R547N971K805J45j673k102o21K942Q284J4728K1501K7942L3571L8032
32852G43662M1058M2552M2709M2068M1355M1285M2424M5207M9942N6720O5289
32841A254271P5156Q5876R7316J09542J22458J35456J47414J57110J63826J67845
32831B516270J70422J73295J77993J85336J95103K05786K14368K16325K06062
$$ y = [-354367, -369553, -372944, -364381, -345070, -317322, -283905, -247324, -209239, -170281, -130278, -88801, -45770, -1885, 41265, 81482, 116545, 144982, 166604, 182573, 194907, 205778, 216864, 228937, 241692, 253875, 263751, 269840, 271576, 269590, 265491, 261359, 259262, 260888, 267319, 278871, 295121, 315158, 338028, 363077, 389978, 418428, 447800, 477023, 504800, 529929, 551528, 569118, 582590, 592137, 598108, 600913, 601058, 599385, 597283, 596662, 599604, 607888, 622616, 644117, 672059, 705630, 743662, 784720, 827272, 869981, 912049, 953404, 994689, 1037113, 1082320, 1132262, 1188982, 1254271, 1329427, 1415303, 1512619, 1622161, 1744619, 1880075, 2027489, 2184599, 2348425, 2516270, 2686692, 2859987, 3037980, 3223316, 3418419, 3624205, 3838573, 4054898, 4260960]
32822D260960J77983J28425N8057k6605j14226j92280k51333k87419l01703k98445
32812C153414k82959k60256k34307k07843j82433j58820j37188j17427r9333q2778
32802A390070o7722n4154m1996l1124k1486j3229o796k788j692l570p950j3935
32790A123628k0462k6582l1556l4804l5847l4435l0769k5624k0139j5456j2373
32779H35581j1223j1916j4156j7639k2184k7651l3849m0528m7437n4328o0809
32768D93861o6304p0133p1802p1163o8461o4163n8870n3208m7665m2362l6949
32757a57219l0822k3576j5416p218k39M367N988M711J273l289p936j1869j4629
32744b55874j6103j6454j6019j5180j4228j3203j1835r755o793l171P59M882R443
$$ y = [4260960, 4438943, 4567368, 4625425, 4598820, 4484594, 4292314, 4040981, 3753562, 3451859, 3153414, 2870455, 2610199, 2375892, 2168049, 1985616, 1826796, 1689608, 1572181, 1472848, 1390070, 1322348, 1268194, 1226198, 1195074, 1173588, 1160359, 1153563, 1150775, 1149083, 1145513, 1137563, 1123628, 1103166, 1076584, 1045028, 1010224, 974377, 939942, 909173, 883549, 863410, 847954, 835581, 824358, 812442, 798286, 780647, 758463, 730812, 696963, 656435, 608998, 554670, 493861, 427557, 357424, 285622, 214459, 145998, 81835, 22965, -30243, -77908, -120270, -157219, -188041, -211617, -227033, -234251, -234490, -230123, -224135, -219424, -218151, -221440, -229376, -241245, -255874, -271977, -288431, -304450, -319630, -333858, -347061, -358896, -368651, -375444, -378615, -377856, -372974, -363531]
32731c63531J4653K0270K5487K9264L0804K9770K6373K1298J5660J0753P681O945
32719a24573Q329J1087J4411J7845K1347K5067K8909L2339L4486L4568L2261K7894
32707A63970K2276J6329J0723N715J333k386n243o942p258o223m259k178r87j561
32693A83309m436r696j6986k5456l3804m0479m4072m3776l9677l2710k4263j5665
32681a47711p791j011M697R511J3617J7114J9944K1910K2756K2289K0486J7574
32669A3385J3946J0080O412L217N07j945m400o972r537j1835j3537j4318j3903
32656b8900j2211r471o176k960l67J306K108K356K484K916M017O088R260J3392
32642a6158J7950K2141K5132K6376K5800K3716K0549J6591J1936O625Q46m941
$$ y = [-363531, -348878, -328608, -303121, -273857, -243053, -213283, -186910, -165612, -149952, -139199, -131518, -124573, -116244, -105157, -90746, -72901, -51554, -26487, 2422, 34761, 69247, 103815, 136076, 163970, 186246, 202575, 213298, 219013, 220346, 217960, 212717, 205775, 198517, 192294, 188035, 185857, 184870, 183309, 178873, 169177, 152191, 126735, 92931, 52452, 8380, -35396, -75073, -107783, -132046, -147711, -155502, -156513, -151816, -142305, -128688, -111574, -91630, -69720, -46964, -24675, -4189, 13385, 27331, 37411, 43823, 47040, 47547, 45602, 41202, 34230, 24693, 12858, -679, -14997, -28900, -41111, -50582, -56758, -59718, -60085, -58779, -56671, -54315, -51831, -48915, -44898, -38810, -29550, -16158, 1792, 23933, 49065, 75441, 101241, 124957, 145506, 162097, 174033, 180658, 181504, 176563]
32630A76563j0089j4096j6959j9163k1294k3523k5442k6280k5311k2210j7182
32619d4986j0970m613P98M387N650M586J702k127n860q589r760r402q085o646
32605i3915n731n498n607n480m678l237j812j384k707n822r978j4039j6989j8283
32591a95160j7885j6125j3448j0224o625k651J653N981R687J2012J2362J0563
32579b09860O890J981l293q001j1237j2229j0383n507J943J0760J9160K5279K7691
32566a66806K5867K0299J2334L719l985r847j3726j6047j7387j8052j7998j7071
32554b18700j5386j3618j2831j3948j7063k1143k4401k5110k2428j6604q686n
32542d09923Q202J4997J9872K2817K4282K4914K5301K5737K6195K6415K6121K5244
$$ y = [176563, 166474, 152378, 135419, 116256, 94962, 71439, 45997, 19717, -5594, -27804, -44986, -55956, -60569, -59771, -55384, -49734, -45148, -43446, -45573, -51433, -60022, -69782, -79184, -87269, -93915, -99646, -105144, -110751, -116231, -120909, -124146, -125958, -127342, -130049, -135871, -145849, -159888, -176877, -195160, -213045, -229170, -242618, -252842, -259467, -262118, -260465, -254484, -244797, -232785, -220423, -209860, -202970, -200989, -204282, -212283, -223520, -235749, -246132, -251639, -249696, -238936, -219776, -194497, -166806, -140939, -120640, -108306, -104587, -108572, -118419, -132145, -148192, -165579, -183631, -201629, -218700, -234086, -247704, -260535, -274483, -291546, -312689, -337090, -362200, -384628, -401232, -409918, -409923, -401721, -386724, -366852, -344035, -319753, -294839, -269538, -243801, -217606, -191191, -165070, -139826]
32530a39826K4061K3112K2902K3603K4915K6198K6756K6097K4139K1152J7550
$$ y = [-139826, -115765, -92653, -69751, -46148, -21233, 4965, 31721, 57818, 81957, 103109, 120659]
$$ [...]
##END NTUPLES=NMR SPECTRUM
##END=
