##TITLE=31Pdec_23-2024-Bay
 DMSO-d6
 24 sc
 2.4.2024
##JCAMPDX= 6.0         $$ Bruker NMR JCAMP-DX V2.0
##DATA TYPE= NMR SPECTRUM
##DATA CLASS= NTUPLES
##ORIGIN= UXNMR, Bruker Analytische Messtechnik GmbH
##OWNER= root
$$ XWIN-NMR		Version 3.5
$$ Tue Apr  2 13:56:09 2024 Russian Standard Time (UT+4h)  she@DPX200
##.OBSERVE FREQUENCY= 81.013821
##.OBSERVE NUCLEUS= ^31P
##.ACQUISITION MODE= SIMULTANEOUS
##.ACQUISITION SCHEME= undefined
##.AVERAGES= 24
##.DIGITISER RES= 16
##SPECTROMETER/DATA SYSTEM= spect
##.PULSE SEQUENCE= zgpg30
##.SOLVENT NAME= D2O
##.SHIFT REFERENCE= (INTERNAL, D2O, 0, 248.564)
##AUDIT TRAIL= $$ (NUMBER, WHEN, WHO, WHERE, WHAT)
$$ ##TITLE= Audit trail, XWIN-NMR		Version 3.5
$$ ##JCAMPDX= 5.01
$$ ##ORIGIN= Bruker BioSpin GmbH
$$ ##OWNER= she
$$ F:/spectra/data/she/nmr/P31/1/pdata/1/auditp.txt
$$ ##AUDIT TRAIL=  $$ (NUMBER, WHEN, WHO, WHERE, WHAT)
(   1,<2024-04-02 13:55:20.10 +0400>,<she>,<DPX200>,
      <created by zg, POWCHK disabled, PULCHK disabled
       configuration hash MD5:
       00 E9 B6 7A A2 85 ED C7 34 08 36 98 17 FE 4E 26
       data hash MD5: 32K
       64 BC CE B7 5A 2C FB E6 11 BB A5 1B E8 44 F1 EE>)
(   2,<2024-04-02 13:55:24.85 +0400>,<she>,<DPX200>,
      <Start of raw data processing
       efp BC_mod = 2 LB = 10 FT_mod = 6 PKNL = 1 PHC0 = -13229.36 PHC1 = 86.28333 SI = 64K 
       data hash MD5: 64K
       A1 93 60 98 81 3D 2F 93 69 67 2B D4 25 60 B7 D2>)
(   3,<2024-04-02 13:55:37.20 +0400>,<she>,<DPX200>,
      <pk PHC0 = -12.74832 PHC1 = 0 
       data hash MD5: 64K
       6F A7 8A DD 1A DE 20 40 A4 84 6A 7A B8 D2 0B 24>)
$$ ##END=
$$ 
$$ hash MD5
$$ 3B 0C 86 1B 8A 76 60 BD 12 14 74 DB 9C 5D CB D2
##$RELAX= 
##$RELAX= 
##$RELAX= 
##$RELAX= 
##$RELAX= 
##$RELAX= 
##$RELAX= 
##$RELAX= 
##$RELAX= 
$$ Bruker specific parameters
$$ --------------------------
##$DU= <F:/spectra>
##$EXPNO= 1
##$NAME= <P31>
##$PROCNO= 1
##$TYPE= <nmr>
##$USER= <she>
##$AMP= (0..31)
100 100 100 100 100 100 100 100 100 100 100 100 100 100 100 100 100 100 
100 100 100 100 100 100 100 100 100 100 100 100 100 100 
##$AQSEQ= 0
##$AQ_mod= 1
##$AUNM= <au_zg>
##$AUTOPOS= <>
##$BF1= 81.014009
##$BF2= 200.13
##$BF3= 200.13
##$BF4= 200.13
##$BF5= 200.13
##$BF6= 200.13
##$BF7= 200.13
##$BF8= 200.13
##$BYTORDA= 1
##$CFDGTYP= 0
##$CFRGTYP= 5
##$CHEMSTR= <none>
##$CNST= (0..31)
1 1 145 1 1 1 1 1 1 1 1 1 1 1 1 1 1 1 1 1 1 1 1 1 1 1 1 1 1 1 1 1 
##$CPDPRG= <waltz16>
##$CPDPRG1= <>
##$CPDPRG2= <waltz16>
##$CPDPRG3= <>
##$CPDPRG4= <mlev>
##$CPDPRG5= <mlev>
##$CPDPRG6= <mlev>
##$CPDPRG7= <mlev>
##$CPDPRG8= <mlev>
##$CPDPRGB= <>
##$CPDPRGT= <>
##$D= (0..31)
0 1 0 0 0 0 0 0 0 0 0 0.03 2e-05 3e-06 0 0 0 0 0 0 0 0 0 0 0 0 0 0 0 0 
0 0 
##$DATE= 1712051719
##$DBL= (0..7)
120 120 120 11 120 120 24 19 
##$DBP= (0..7)
150 150 150 150 150 150 150 150 
##$DBP07= 0
##$DBPNAM0= <>
##$DBPNAM1= <>
##$DBPNAM2= <>
##$DBPNAM3= <>
##$DBPNAM4= <>
##$DBPNAM5= <>
##$DBPNAM6= <>
##$DBPNAM7= <>
##$DBPOAL= (0..7)
0.5 0.5 0.5 0.5 0.5 0.5 0.5 0.5 
##$DBPOFFS= (0..7)
$$ [...]
##$SUBNAM2= <"">
##$SUBNAM3= <"">
##$SUBNAM4= <"">
##$SUBNAM5= <"">
##$SUBNAM6= <"">
##$SUBNAM7= <"">
##$SUBNAM8= <"">
##$SUBNAM9= <"">
##$SW= 501.771253377433
##$SWIBOX= (0..15)
0 1 3 0 0 0 0 0 0 0 0 0 0 0 0 0 
##$SW_h= 40650.406504065
##$TD= 32768
##$TD0= 1
##$TE= 0
##$TE2= 300
##$TE3= 300
##$TEG= 300
##$TL= (0..7)
0 120 53 12 22 120 120 120 
##$TP= (0..7)
150 150 150 150 150 150 150 150 
##$TP07= 0
##$TPNAME0= <>
##$TPNAME1= <>
##$TPNAME2= <>
##$TPNAME3= <>
##$TPNAME4= <>
##$TPNAME5= <>
##$TPNAME6= <>
##$TPNAME7= <>
##$TPOAL= (0..7)
0.5 0.5 0.5 0.5 0.5 0.5 0.5 0.5 
##$TPOFFS= (0..7)
0 0 0 0 0 0 0 0 
##$TUNHIN= 0
##$TUNHOUT= 0
##$TUNXOUT= 0
##$USERA1= <user>
##$USERA2= <user>
##$USERA3= <user>
##$USERA4= <user>
##$USERA5= <user>
##$V9= 5
##$VALIST= <valist>
##$VCLIST= <CCCCCCCCCCCCCCC>
##$VD= 0
##$VDLIST= <DDDDDDDDDDDDDDD>
##$VPLIST= <PPPPPPPPPPPPPPP>
##$VTLIST= <TTTTTTTTTTTTTTT>
##$WBST= 1024
##$WBSW= 4
##$XGAIN= (0..3)
0 0 0 0 
##$XL= 0
##$YL= 0
##$YMAX_a= 2266
##$YMIN_a= -1587
##$ZGOPTNS= <>
##$ZL1= 120
##$ZL2= 120
##$ZL3= 120
##$ZL4= 120
##$ABSF1= 0
##$ABSF2= 0
##$ABSG= 0
##$ABSL= 0
##$ALPHA= 0
##$AQORDER= 0
##$ASSFAC= 0
##$ASSFACI= 0
##$ASSFACX= 0
##$ASSWID= 0
##$AUNMP= <proc_1d>
##$AZFE= 0.1
##$AZFW= 0.5
##$BCFW= 0
##$BC_mod= 2
##$BYTORDP= 0
##$COROFFS= 0
##$CY= -3
##$DATMOD= 1
##$DC= 0
##$DFILT= <>
##$DTYPP= 0
##$F1P= 0
##$F2P= 0
##$FCOR= 1
##$FTSIZE= 65536
##$FT_mod= 6
##$GAMMA= 0
##$GB= 0
##$INTBC= 1
##$INTSCL= 6.047779e-11
##$ISEN= 30
##$LB= 10
##$LEV0= 0
##$LPBIN= 0
##$MAXI= 10000
##$MC2= 0
##$MEAN= 0
##$ME_mod= 0
##$MI= 50
##$NCOEF= 0
##$NC_proc= -9
##$NLEV= 6
##$NOISF1= 182.463
##$NOISF2= 159.3651
##$NSP= 0
##$NTH_PI= 0
##$NZP= 0
##$OFFSET= 248.5645
##$PC= 4
##$PHC0= -13242.11
##$PHC1= 86.28333
##$PH_mod= 1
##$PKNL= yes
##$PPARMOD= 0
##$PSCAL= 0
##$PSIGN= 0
##$REVERSE= no
##$SF= 81.0140089999694
##$SI= 65536
##$SIGF1= 159.3651
##$SIGF2= -187.1042
##$SINO= 113.3802
##$SIOLD= 16384
##$SREGLST= <1H.CDCl3>
##$SSB= 0
##$STSI= 65536
##$STSR= 0
##$SW_p= 40650.406504065
##$SYMM= 0
##$S_DEV= 0
##$TDeff= 32768
##$TDoff= 0
##$TI= <>
##$TILT= no
##$TM1= 0
##$TM2= 0
##$TOPLEV= 0
##$USERP1= <user>
##$USERP2= <user>
##$USERP3= <user>
##$USERP4= <user>
##$USERP5= <user>
##$WDW= 1
##$XDIM= 65536
##$YMAX_p= 481068003
##$YMIN_p= -24176804
$$ End of Bruker specific parameters
$$ ---------------------------------
##NTUPLES= NMR SPECTRUM
##VAR_NAME=  FREQUENCY,     SPECTRUM/REAL,   SPECTRUM/IMAG
##SYMBOL=    X,             R,               I
##VAR_TYPE=  INDEPENDENT,   DEPENDENT,       DEPENDENT
##VAR_FORM=  AFFN,          ASDF,            ASDF
##VAR_DIM=   65536,         65536,           65536
##UNITS=     HZ,            ARBITRARY UNITS, ARBITRARY UNITS
##FACTOR=    0.620285442955139, 1,           1
##FIRST=     20137.2065510682, 0,            0
##LAST=      -20513.1999529968, 0,           0
##MIN=       -20513.1999529968, -24176804,   0
##MAX=       20137.2065510682, 481068003,    0
$$ Real data points
##PAGE= N=1
##DATA TABLE= (X++(R..R)), XYDATA
$$ [...]
39290c109197L24047L69028L72235L42389K93354K39037J89110J47974J16574
39281g15449R4391Q0060P1503O6732O4913O6473P2303Q3047R8560J16865J32926
39270B32324J38812J26422R1618L7322k6531q6420j30683j54460j61420j61146
39260i4162j63495j73177j87775j99958k02004j89522j62399j23413p6457k6196
39250a598558K0664N4450O4538M5027R34n0540q6552r0047n8877o946M3113P1196
39238a591598O8701M0798J383l5545o2864q2168j00803j26662j63921k11717k65924
39227b530320l21750l74155m15573m34100m15634l49877k36222q5628Q2458K46225
39217d834576L87416M94297N60742N83553N61661M98718M06605L05234K16653
$$ y = [-3109197, -2785150, -2416122, -2043887, -1701498, -1408144, -1169107, -979997, -832023, -715449, -621058, -540998, -469495, -402763, -337850, -271377, -199074, -116027, -17467, 99398, 232324, 371136, 497558, 589176, 626498, 599967, 513547, 382864, 228404, 66984, -94162, -257657, -430834, -618609, -818567, -1020571, -1210093, -1372492, -1495905, -1572362, -1598558, -1577894, -1523444, -1458906, -1413879, -1412945, -1463485, -1550037, -1640084, -1698961, -1705907, -1662794, -1591598, -1522897, -1482099, -1480716, -1516261, -1579125, -1661293, -1762096, -1888758, -2052679, -2264396, -2530320, -2852070, -3226225, -3641798, -4075898, -4491532, -4841409, -5077631, -5163259, -5080801, -4834576, -4447160, -3952863, -3392121, -2808568, -2246907, -1748189, -1341584, -1036350, -819697]
39208h19697J56236J26629J18706J18896J17831J14744J15867J29546J62072K15911
39198E56741K89050L73973M56715N18161N38773N05137M14775K76944J09961o3047
39188C977183k18851l38876m12752m39256m24903l81798l25245k70061k26129
39179I39312j96269j78406j69606j67864j71196j77131j84084j92234k01607k08883
39169i07968k06595j85878j40657p0629J8175J15382K10198K95636L70495M37715
39159f4126N00255N57481O04316O33162O36534O08684N46440M50542L27648J91161
39149D992097N8991n1463j28606j69449j78706j64756j34742r1574l4465L7736
39139D135063J22930K14102L00319L69796M13790M29539M20650L94481L58011
$$ y = [-819697, -663461, -536832, -418126, -299230, -181399, -66655, 49212, 178758, 340830, 556741, 845791, 1219764, 1676479, 2194640, 2733413, 3238550, 3653325, 3930269, 4040230, 3977183, 3758332, 3419456, 3006704, 2567448, 2142545, 1760747, 1435502, 1165441, 939312, 743043, 564637, 395031, 227167, 55971, -121160, -305244, -497478, -699085, -907968, -1114563, -1300441, -1441098, -1511727, -1493552, -1378170, -1167972, -872336, -501841, -64126, 436129, 993610, 1597926, 2231088, 2867622, 3476306, 4022746, 4473288, 4800936, 4992097, 5051088, 4999625, 4871019, 4701570, 4522864, 4358108, 4223366, 4131792, 4097327, 4135063, 4257993, 4472095, 4772414, 5142210, 5556000, 5985539, 6406189, 6800670, 7158681]
39130G158681L14952K65929K10952J51517R0217K8685l3598r8415j67102k39510
39120G682308l13308l83024m40154m76240m87643m77591m53302m20956l83297
39111C846793l40894k94224k44156j91443j36786q1570k8285J9783N9163Q6812
39101B695193J00369R7850P7034L5967k4480r7568j70531k29036k63706k73770
39091A947322k65001k44145k14850j78053j35245r0567m9802j7954K288J0825
39081G64818J0187N269J753L786J3397L2375O3932J10923J71743K38498L00040
39070A716721L47290L76220L86808L79891L54351L05840K27765J15241k9285j92385
39060C988457l51430m81560n64027n91832n70837n16476m47288l77710l13880
$$ y = [7158681, 7473633, 7739562, 7950514, 8102031, 8192248, 8220933, 8187335, 8088920, 7921818, 7682308, 7369000, 6985976, 6545822, 6069582, 5581939, 5104348, 4651046, 4230090, 3846793, 3505899, 3211675, 2967519, 2776076, 2639290, 2557720, 2529435, 2549218, 2608381, 2695193, 2795562, 2893412, 2970446, 3006413, 2981933, 2884365, 2713834, 2484798, 2221092, 1947322, 1682321, 1438176, 1223326, 1045273, 910028, 819461, 769659, 751705, 753993, 764818, 775005, 780274, 782027, 785813, 799210, 831585, 895517, 1006440, 1178183, 1416681, 1716721, 2064011, 2440231, 2827039, 3206930, 3561281, 3867121, 4094886, 4210127, 4180842, 3988457, 3637027, 3155467, 2591440, 1999608, 1428771, 912295, 465007, 87297, -226583]
39051b26583k54840j97619j41521q8445m0550J124L5751O1873P9101R1379J08206
39040e72124J41308J98333K77473L66401M45893M96540N05886M73342M10575L36748
39030C080375K71053K26991K11138K25089K67067L31620M09121M87010N52293
39021F061757N93705O03251N77737N19769M36557L36647K27065J12914j526j12638
39011I355238k18649l20168m18651n13929o02978o80653p41057p78347p87245
39002D293561p64369p10331o30909n35643m34401l34417k39970j54278q0969k3106
38992C85168J9740N3491Q8019J32083J87766K48253L00660L32244L36270L14385
38982B398079K74595K26588J77604J31142Q8248M9014J2696k2710n9662r9037
$$ y = [-226583, -481423, -679042, -820563, -909008, -949558, -948434, -912683, -850810, -771709, -680330, -572124, -430816, -232483, 44990, 411391, 857284, 1353824, 1859710, 2333052, 2743627, 3080375, 3351428, 3578419, 3789557, 4014646, 4281713, 4613333, 5022454, 5509464, 6061757, 6655462, 7258713, 7836450, 8356219, 8792776, 9129423, 9356488, 9469402, 9467876, 9355238, 9136589, 8816421, 8397770, 7883841, 7280863, 6600210, 5859153, 5080806, 4293561, 3529192, 2818861, 2187952, 1652309, 1217908, 883491, 643521, 489243, 408274, 385168, 404908, 458399, 546418, 678501, 866267, 1114520, 1415180, 1747424, 2083694, 2398079, 2672674, 2899262, 3076866, 3208008, 3296256, 3345270, 3357966, 3335256, 3275594, 3176557]
38972C176557j38782j74575k01863k17804k22540k19701k15625k16733k25974
38963A342960k40697k53879k58204k50373k32771k11793j94541j86212j89066
38954f74576k01884k19181k31244k26969j99760j53237j02030o5322n6466p6189
38944b206858j14452j58511j99201k30336k44158k29648j76617q2224M5194J87191
38934c409620L20443M23711M83363M94497M57918L76665K55824J05167n8955k15276
38924g66263l42228m23109m49725m23541l54285k56871j47712m1326N2114J27544
38914c025402J83777K21236K40243K40728K23054J89187J43492R2389M2727k8
38904a448597l2380n2460o0414n9821n7927o2819p8805j03387j27709j39592j27509
$$ y = [3176557, 3037775, 2863200, 2661337, 2443533, 2220993, 2001292, 1785667, 1568934, 1342960, 1102263, 848384, 590180, 339807, 107036, -104757, -299298, -485510, -674576, -876460, -1095641, -1326885, -1553854, -1753614, -1906851, -2008881, -2074203, -2130669, -2206858, -2321310, -2479821, -2679022, -2909358, -3153516, -3383164, -3559781, -3642005, -3596811, -3409620, -3089177, -2665466, -2182103, -1687606, -1229688, -853023, -597199, -492032, -550987, -766263, -1108491, -1531600, -1981325, -2404866, -2759151, -3016022, -3163734, -3205060, -3152946, -3025402, -2841625, -2620389, -2380146, -2139418, -1916364, -1727177, -1583685, -1491296, -1448569, -1448597, -1480977, -1533437, -1593851, -1653672, -1711599, -1774418, -1853223, -1956610, -2084319, -2223911, -2351420]
38893b351420q4400j0192Q8334K00384L14323M18634N01037N48844N52782N12705
38883F91031M40748L58557K88934K46356K31895K35484K43183K43606K29388J95232
38873C404414J37462N7231l5964j25063j91130k19971k05905j51906o7675L2897
38863B634390J34103K20604K79824L05130K98692K71625K39728K16283K06007
38854D806386K03464J96215J70171J14168K2715j02417k50993m04406n38736o30866
38844C585701o65460o40068n66605m68638l74399l07052k76068k74510k84495
38835b71594k88140k77569k58022k42705k43513k63660k95749l25037l35923l19236
38825c121148k77363k23715j76015j47363j40834j50366j65979j79144j85085
$$ y = [-2351420, -2435820, -2446012, -2357678, -2157294, -1842971, -1424337, -923300, -374456, 178326, 691031, 1131779, 1490336, 1779270, 2025626, 2257521, 2493005, 2736188, 2979794, 3209182, 3404414, 3541876, 3599107, 3563143, 3438080, 3246950, 3026979, 2821074, 2669168, 2601493, 2634390, 2768493, 2989097, 3268921, 3574051, 3872743, 4144368, 4384096, 4600379, 4806386, 5009850, 5206065, 5376236, 5490404, 5513119, 5410702, 5159709, 4755303, 4216567, 3585701, 2920241, 2280173, 1713568, 1244930, 870531, 563479, 287411, 12901, -271594, -559734, -837303, -1095325, -1338030, -1581543, -1845203, -2140952, -2465989, -2801912, -3121148, -3398511, -3622226, -3798241, -3945604, -4086438, -4236804, -4402783, -4581927, -4767012]
38816d767012j81535j66224j36504r2047l7846J6030N7868P7872O9837L2149l0603
38805e158015j06602j78514k28101k41541k13140j46232n1135N8752J70645K74169
38795e819714L61351M26168M64525M74419M56023M11748L46541K67929J84974
38786b426036J05755L4322l0723r4360j60812k29716k95400l48959l80849l82339
38776d209117l46343k69139j53319j0245J40455K75292L73597M23246M23145L82029
38766b970399L14436K35482J56542Q3913K0739k9742o2258p0099m7621O885Q9581
38755b272541J91472L00360M03189M88270N47625N78699N83840N67551N34220
38746A922685M88564M37341L89163L51952L30846L27960L42093L66854L89389
$$ y = [-4767012, -4948547, -5114771, -5251275, -5343322, -5381168, -5365138, -5307270, -5229398, -5159561, -5127412, -5158015, -5264617, -5443131, -5671232, -5912773, -6125913, -6272145, -6323280, -6264528, -6093883, -5819714, -5458363, -5032195, -4567670, -4093251, -3637228, -3225480, -2878939, -2611010, -2426036, -2320281, -2285959, -2316682, -2411042, -2571854, -2801570, -3096970, -3445929, -3826778, -4209117, -4555460, -4824599, -4977918, -4988163, -4847708, -4572416, -4198819, -3775573, -3352428, -2970399, -2655963, -2420481, -2263939, -2180026, -2159287, -2189029, -2251287, -2321386, -2369007, -2362122, -2272541, -2081069, -1780709, -1377520, -889250, -341625, 237074, 820914, 1388465, 1922685, 2411249, 2848590, 3237753, 3589705, 3920551, 4248511, 4590604, 4957458, 5346847]
38737E346847L93177L64434K97536J95765O8029p4893k22192l63099m86571n81727
38727D937306o39381o54486o28509n70101m92722m09936l30908k58849j92593
38718G59821j29231o5811J14O9824J41965K10957K66544K95633K86652K35268
38708B071736J48450M3528n8631j42552k02834k41047k58159k50049k10472j38104
38698G61866m0473O8510J73876K62762L24729L52468L44314L05993K48407J82194
38688B984646J13064M0926l7537j25091k20546l16451l98912m50616m56639m10431
38678G22413l16756j90127m9896Q5417K02086K92377L53614L86497L93907L80465
38668B259997L52251L15713K75206K30155J74379R9587J631j15010k38024l52194
$$ y = [5346847, 5740024, 6104458, 6401994, 6597759, 6665788, 6590895, 6368703, 6005604, 5519033, 4937306, 4297925, 3643439, 3014930, 2444829, 1952107, 1542171, 1211263, 952414, 759821, 630590, 564779, 564893, 634717, 776682, 987639, 1254183, 1549816, 1836468, 2071736, 2220186, 2263714, 2205083, 2062531, 1859697, 1618650, 1360491, 1110442, 899970, 761866, 721393, 789903, 963779, 1226541, 1551270, 1903738, 2248052, 2554045, 2802452, 2984646, 3097710, 3138636, 3101099, 2976008, 2755462, 2439011, 2040099, 1589483, 1132844, 722413, 405657, 215530, 165634, 251051, 453137, 745514, 1099128, 1485625, 1879532, 2259997, 2612248, 2927961, 3203167, 3433322, 3607701, 3707288, 3708919, 3593909, 3355885, 3003691]
38658C003691m44404n06228n35024n34866n16273m92863m75533m67676m64812
38649a433988m58572m41915m12226l71256l23229k72837k23703j77438j33655
38640d248819r1473n1611j7058Q601K3859L0684L3621L7313M3788N0853N2753
38629d127489M3071J7946k2795p7004j41913k14208k89020l59875m19987m63022
38619f054296m82049m68368m13216l12696j72370p506J61580L15772M41620N32979
38609f458550N90597O20381O30542O28329O17769N99597N73118N38311M96497
38600a163409M49368L97882L42454K84054K24433J65072J06420M8868n795n4798
38590G94549r6809j33733j69681k08009k48758k87675l16456l24296l01578k45221
$$ y = [3003691, 2559287, 2053059, 1518035, 983169, 466896, -25967, -501500, -969176, -1433988, -1892560, -2334475, -2746701, -3117957, -3441186, -3714023, -3937726, -4115164, -4248819, -4340292, -4391903, -4408961, -4400360, -4376501, -4345817, -4312196, -4274883, -4231095, -4180242, -4127489, -4084418, -4066472, -4089267, -4166271, -4308184, -4522392, -4811412, -5171287, -5591274, -6054296, -6536345, -7004713, -7417929, -7730625, -7902995, -7910501, -7748921, -7433149, -6991529, -6458550, -5867953, -5247572, -4617030, -3988701, -3370932, -2771335, -2198217, -1659906, -1163409, -714041, -316159, 26295, 310349, 534782, 699854, 806274, 855142, 849347, 794549, 697740, 564007, 394326, 186317, -62441, -350116, -666572, -990868, -1292446, -1537667]
38580a537667j62847p2559K254M0139K7214m0279j55431l01095m51938n79506
38570c231715o59756o79647o39417n50147m28973k94322j61668l9925P0058J73146
38560f442366K74321L73141M61469N24994N46995N13076M16403K62315O9738j32797
38550c132711l15720m57301n48007n88520n84074n40019m61725l57514k40286
38541g225877j24628k0715P0082J53730K36936L20590L98100M59212M95690N04997
38531d731883M90652M60184M22118L83288L47577L16514K90853K71719K60668
38522a488310K58922K66310K80436K96729L09793L15185L10368K94636K68942
38513A113011K36143K01032J69573J47702J40164J49254J73575K07797K43991
$$ y = [-1537667, -1700514, -1773073, -1770819, -1730680, -1703466, -1743745, -1899176, -2200271, -2652209, -3231715, -3891471, -4571118, -5210535, -5760682, -6189655, -6483977, -6645645, -6685570, -6615512, -6442366, -6168045, -5794904, -5333435, -4808441, -4261446, -3748370, -3331967, -3069652, -2999914, -3132711, -3448431, -3905732, -4453739, -5042259, -5626333, -6166352, -6628077, -6985591, -7225877, -7350505, -7371220, -7301138, -7147408, -6910472, -6589882, -6191782, -5732570, -5236880, -4731883, -4241231, -3781047, -3358929, -2975641, -2628064, -2311550, -2020697, -1748978, -1488310, -1229388, -963078, -682642, -385913, -76120, 239065, 549433, 844069, 1113011, 1349154, 1550186, 1719759, 1867461, 2007625, 2156879, 2330454, 2538251, 2782242]
38504B782242K73422K87358K77472K37693J67544P4165k9576j30160k18197k90368
38494C431595l48728l98800m47131m98086n50782n98214o29962o37168o16462
38485a293738n70457n04806m24147l29838k21332j00326K5831J44866K44286L16298
38475b713363L59289L75723L69064L42352K99100K45323J90261J43925J12351
38466b75975R4432Q3574P3180O1562N2887N4296P1651J06091J52777K02072K42207
38455I18754K61855K51939K07255J28300K2562r5760k07936k94463l39945l37864
38445E14697k92794k18315j31623m7949K2627P5892J12705J36792J51182J55026
38435D78240J43746J13387O5856J0485l9258p1053p7692n8799k0576K6658P2757
$$ y = [2782242, 3055664, 3343022, 3620494, 3858187, 4025731, 4099896, 4070320, 3940160, 3721963, 3431595, 3082867, 2684067, 2236936, 1738850, 1188068, 589854, -40108, -677276, -1293738, -1864195, -2369001, -2793148, -3122986, -3344318, -3444644, -3418813, -3273947, -3029661, -2713363, -2354074, -1978351, -1609287, -1266935, -967835, -722512, -532251, -388326, -275975, -181543, -97969, -24789, 36773, 89660, 143956, 215607, 321698, 474475, 676547, 918754, 1180609, 1432548, 1639803, 1768103, 1790665, 1694905, 1486969, 1192506, 852561, 514697, 221903, 3588, -128035, -175984, -153357, -77465, 35240, 172032, 323214, 478240, 621986, 735373, 801229, 811714, 772456, 701403, 623711, 564912, 544336, 570994, 643751]
38424F43751J11411J40605J60279J69978J68275J53390J24305Q2151L1311k1097
38414A764359o7430j01675j20497j23780j14976r9845q3006o4924m2430j2500
38404I33296K4240O2632R4085J08307R5691N0548k6171j26598k38379l48173m44366
38393A85112n18233n64083n79190n63988n22256m60525l86244l05226k20072j31151
38383d065856l9854M8659J25988J84218K19644K33266K27873K04646J62563J01630
38373b597223K7503m6840j04884j33605j28639r4586m1838J7101P0603J10202
38363b922206J31687J34717J22245J01129Q2445P8708R8105J39583J92477K40883
38353a600227K70198K73076K52220K18389J84304J58026J39869J24166J04267
$$ y = [643751, 755162, 895767, 1056046, 1226024, 1394299, 1547689, 1671994, 1754145, 1785456, 1764359, 1696929, 1595254, 1474757, 1350977, 1236001, 1136156, 1053150, 988226, 945796, 933296, 957536, 1020168, 1114253, 1222560, 1318251, 1368799, 1342628, 1216030, 977651, 629478, 185112, -333121, -897204, -1476394, -2040382, -2562638, -3023163, -3409407, -3714633, -3934705, -4065856, -4105710, -4057051, -3931063, -3746845, -3527201, -3293935, -3066062, -2861416, -2698853, -2597223, -2569720, -2616560, -2721444, -2855049, -2983688, -3078274, -3120112, -3103011, -3032408, -2922206, -2790519, -2655802, -2533557, -2432428, -2349983, -2271275, -2173170, -2033587, -1841110, -1600227, -1330029, -1056953, -804733, -586344, -402040, -244014, -104145, 20021, 124288]
38344A24288P7555M7584K1866O821L682Q596J6352K3954L0910L6655L8433L2156
38332D68852J5296j1075m2614p3168r5696j03013q9755n5125m077N4374J10387
38321A74386J55793J84852J93812J80507J45373R3872L8102n464k2325o708L5443
38310A167643Q8540J32786J50721J32713P9250o39r3410j85043k64014l23135
38300H85412l60064l76209l75119l61810l42710l24350l10211k98026k80657k50907
38290b394651k07188j55787j07984p4229n9440o1769p3716q3837p8959m7699J5498
38279c329761J07926K18610L29895M20011M67310M56094L82117K55042R6407o6739
38269f63088k10619l22057m00221m51779m83234m96142m87926m56272m02844l33372
$$ y = [124288, 201843, 249427, 271293, 278114, 281796, 290392, 306744, 330698, 361608, 398263, 436696, 468852, 484148, 473073, 430459, 357291, 261595, 158582, 68827, 13702, 9625, 63999, 174386, 330179, 515031, 708843, 889350, 1034723, 1128595, 1166697, 1161233, 1138908, 1132200, 1167643, 1256183, 1388969, 1539690, 1672403, 1751653, 1751014, 1657604, 1472561, 1208547, 885412, 525348, 149139, -225980, -587790, -930500, -1254850, -1565061, -1863087, -2143744, -2394651, -2601839, -2757626, -2865610, -2939839, -2999279, -3061048, -3134764, -3218601, -3297560, -3345259, -3329761, -3221835, -3003225, -2673330, -2253319, -1786009, -1329915, -947798, -692756, -596349, -663088, -873707, -1195764, -1595985, -2047764, -2530998, -3027140, -3515066, -3971338, -4374182, -4707554]
38259d707554k54353j69449p8770J8203J18737K15592K99725L64829M10246M40301
38249c342493M60809M75359M83540M81859M66588M36880L95910L48475K96069
38240E02996K33791J52978M8601p4197j99571l06839l79104m10060m05774l80095
38230a217274l46086l09218k67210k15539j52883q1787n330P6172J65648K66970
38220b086537L81247N03365O20827P16469P74239P84450P45228O60180N35732
38211C635200L80893K08866L7359j14446k31017l04401l34680l27518k91163k34664
38201B424429j67199r7461l2890K0540N7944P5513P1384M6162K024n8568j32644
38190B209234k15366k99920l79455m48583n02162n32549n28919m80325l80810
$$ y = [-4707554, -4961907, -5131356, -5210126, -5191923, -5073186, -4857594, -4557869, -4193040, -3782794, -3342493, -2881684, -2406325, -1922785, -1440926, -974338, -537458, -141548, 206927, 502996, 736787, 889765, 938366, 864169, 664598, 357759, -21345, -431405, -837179, -1217274, -1563360, -1872578, -2139788, -2355327, -2508210, -2589997, -2595327, -2519155, -2353507, -2086537, -1705290, -1201925, -581098, 135371, 909610, 1694060, 2439288, 3099468, 3635200, 4016093, 4224959, 4262318, 4147872, 3916855, 3612454, 3277774, 2950256, 2659093, 2424429, 2257230, 2159769, 2126879, 2147419, 2205363, 2280876, 2352260, 2398422, 2400446, 2341878, 2209234, 1993868, 1693948, 1314493, 865910, 363748, -168801, -697720, -1178045, -1558855]
38181a558855k33453n1050J46917L39139N06230O31986P03786P14298O63957N61528
38171B424483M21842K62711J02954l9089j47988k14408k37296k23904j87585j43963
38161B017757j06988q6682q9414j18997j76306k57356l52365m47882n31064n93292
38151g42589o31144o45323o39241o17987n86846n48866n02948m44823l70981k82520
38141f013268j85490q7624N734R3381J76926K57727L34532M03630M61270N05687
38131d047495N36343N50817N42714N03405M26718L13055J69870Q778j57612l16162
38121a469569m51262n44141n76524n37681m30389k72000q9980Q6344K35158L49010
38111c701034M35394N10205N87931O74079P62836Q39235Q84286Q81583Q23290
$$ y = [-1558855, -1792308, -1843358, -1696441, -1357302, -851072, -219086, 484700, 1198998, 1862955, 2424483, 2846325, 3109036, 3211990, 3172901, 3024913, 2810505, 2573209, 2349305, 2161720, 2017757, 1910769, 1824087, 1734673, 1615676, 1439370, 1182014, 829649, 381767, -149297, -742589, -1373733, -2019056, -2658297, -3276284, -3863130, -4411996, -4914944, -5359767, -5730748, -6013268, -6198758, -6286382, -6280648, -6187267, -6010341, -5752614, -5418082, -5014452, -4553182, -4047495, -3511152, -2960335, -2417621, -1914216, -1487498, -1174443, -1004573, -995795, -1153407, -1469569, -1920831, -2464972, -3041496, -3579177, -4009566, -4281566, -4371546, -4285202, -4050044, -3701034, -3265640, -2755435, -2167504, -1493425, -730589, 108646, 992932, 1874515, 2697805]
38102B697805P12725N62695L91414K18273N9953p3201j79161k62713l30987l88831
38092C407972m36773m71953m90759m91551m76072m48762m14468l76224l34528
38083e33118k88275k36427j79558j20679o4865j7576J7633M0490N3435N9362N9582
38072a209996N3743M1533K3847J667k6006o1847j06214j52884j89317k02760j88036
38061b016270j51353j07727p4430o5016q6720j40793k23361l25167m30883n20021
38051d141741n70864n66816n02359l85174k32505o3774J05513K64571M03649N10737
38041e178763N72489N78895N27947M27203K91598J38867j5024j58176k82348l81626
38031c478938m52441m94917n13118n12581m96533m63783m09822l30020k23048
$$ y = [2697805, 3410530, 3973225, 4364639, 4582912, 4642865, 4569664, 4390503, 4127790, 3796803, 3407972, 2971199, 2499246, 2008487, 1516936, 1040864, 592102, 177634, -198590, -533118, -821393, -1057820, -1237378, -1358057, -1422922, -1440498, -1422865, -1382375, -1328940, -1269578, -1209996, -1156253, -1114720, -1090873, -1089206, -1115212, -1177059, -1283273, -1436157, -1625474, -1828234, -2016270, -2167623, -2275350, -2349780, -2414796, -2501516, -2642309, -2865670, -3190837, -3621720, -4141741, -4712605, -5279421, -5781780, -6166954, -6399459, -6463233, -6357720, -6093149, -5689500, -5178763, -4606274, -4027379, -3499432, -3072229, -2780631, -2641764, -2656788, -2814964, -3097312, -3478938, -3931379, -4426296, -4939414, -5451995, -5948528, -6412311, -6822133, -7152153, -7375201]
38022g375201r3458M7234J81736K90985L59972L82740L64178L18020K62175K13304
38012e048315J82402J72892J81744K02051K24380K36012K20737J63029N6417q9240
38002c497891k47749l84960m70769m88446m37901l33205j96633n1867Q1386J90275
37992e837760K69535L20909L51557L71090L87840M06126M26061M45485M62210
37983b396947M75058M83781M88873M91946M96283N06580N26868N57078N90432
37974B219952O14669O17838N95227N51907M98600M44400L92288L39685K81300
37965F555866K10628J20067K321j45633l18001m98493o63581p89989q63067q81615
37955B728503q56460q04188p40153o74236o09870n45260m75915l97583l08506
$$ y = [-7375201, -7468659, -7421425, -7239689, -6948704, -6588732, -6205992, -5841814, -5523794, -5261619, -5048315, -4865913, -4693021, -4511277, -4309226, -4084846, -3848834, -3628097, -3465068, -3408651, -3497891, -3745640, -4130600, -4601369, -5089815, -5527716, -5860921, -6057554, -6109421, -6028035, -5837760, -5568225, -5247316, -4895759, -4524669, -4136829, -3730703, -3304642, -2859157, -2396947, -1921889, -1438108, -949235, -457289, 38994, 545574, 1072442, 1629520, 2219952, 2834621, 3452459, 4047686, 4599593, 5098193, 5542593, 5934881, 6274566, 6555866, 6766494, 6886561, 6888882, 6743249, 6425248, 5926755, 5263174, 4473185, 3610118, 2728503, 1872043, 1067855, 327702, -346534, -956404, -1501664, -1977579, -2375162, -2683668]
37946b683668k10328j08440j2180O6311J15998J32453J21179R6041P3505O6054
37936b343075P7969J04967J37116J62954J72733J60305J24838P2652J7381k3917
37926a336077l8250k3893P771L7858N0252L9930J3846j5484l7931m9572n1904
37915a403454m9981n1561o5742r9428j53129k19302k84210l31805l48358l27302
37905c334272k72755j98897j24661o7291l9011m6773r1619j66203k53463l29982
37895d924927l73353l69500l16393k23273j05828K0929J48647K76437M05783N33529
37885d927949O48670P35549P81290P82629P47692O91633O29095N68653N12199
37876A169461M57797M02311L41826K71316J85949Q4546k7118j36521k29346k96232
$$ y = [-2683668, -2893996, -3002436, -3014616, -2948305, -2832307, -2699854, -2578675, -2482634, -2409129, -2343075, -2265106, -2160139, -2023023, -1860069, -1687336, -1527031, -1402193, -1329541, -1312160, -1336077, -1374327, -1398220, -1390449, -1352591, -1302339, -1262409, -1248563, -1264047, -1301978, -1351550, -1403454, -1453435, -1504996, -1570738, -1670166, -1823295, -2042597, -2326807, -2658612, -3006970, -3334272, -3607027, -3805924, -3930585, -3997876, -4036887, -4083660, -4175279, -4341482, -4594945, -4924927, -5298280, -5667780, -5984173, -6207446, -6313274, -6292345, -6143698, -5867261, -5461478, -4927949, -4279279, -3543730, -2762440, -1979811, -1232119, -540486, 88609, 657262, 1169461, 1627258, 2029569, 2371395, 2642711, 2828660, 2913206, 2886088, 2749567, 2520221, 2223989]
37866B223989l36106l53730l54869l44408l28564l16568l17571l34119l58248
37857h20194l74657l69476l38656k90336k39938k01533j80774j72594j63717j38364
37847c290239q5087k392R9503K01637K82168L22310L11197K49517J50655L7086
37837a723645o7946j49231k03650k37836k62249k85527l11244l37193l56904l62549
37827d297974l47708l08480k43204j52619m1513P9651J95814K91580L55987L84423
37817d084043L77159L37003K68729J80269Q3340q334q2296j29552j44700j25852
37807c328277p6323o829O5775J24888J61960J79713J88603J99985K20943K52612
37797b016950K90651L26550L49943L52216L29981K86172K27975J63286R8311L7400
$$ y = [2223989, 1887883, 1534153, 1179284, 834876, 506312, 189744, -127827, -461946, -820194, -1194851, -1564327, -1902983, -2193319, -2433257, -2634790, -2815564, -2988158, -3151875, -3290239, -3375326, -3377718, -3278215, -3076578, -2794410, -2472100, -2160903, -1911386, -1760731, -1723645, -1791591, -1940822, -2144472, -2382308, -2644557, -2930084, -3241328, -3578521, -3935425, -4297974, -4645682, -4954162, -5197366, -5349985, -5391498, -5311847, -5116033, -4824453, -4468466, -4084043, -3706884, -3369881, -3101152, -2920883, -2837543, -2845877, -2928173, -3057725, -3202425, -3328277, -3404600, -3411429, -3345654, -3220766, -3058806, -2879093, -2690490, -2490505, -2269562, -2016950, -1726299, -1399749, -1049806, -697590, -367609, -81437, 146538, 309824, 408135, 445535]
37787D45535j6145o0066r4207j21108j45027j70038j98805k32615k71767l15234
37777a179477l59702l99278m26780m36277m25209l94713l48243k90006k24286
37768d483971j55409q7597k4909K8175O6090Q3117P6222M7749N430m0335p9726
37757d565164j05385j12733r9578o5808j3595N1706J21064J83395K29410K55115
37747d121573K61742K52119K27209J86658J33121P6220L1743J5760L7273R3766
37737b805962J71524K49844L07433L29353L12369K65817K06821J52513J14083
37728f96205R5552R5656J09557J29119J43609J42752J21221Q1490L2875j2645
37718B42981m5192o0132n8927m7933l5752k9905l4056m6880o2701p3664p2670
$$ y = [445535, 429390, 369324, 275117, 154009, 8982, -161056, -359861, -592476, -864243, -1179477, -1539179, -1938457, -2365237, -2801514, -3226723, -3621436, -3969679, -4259685, -4483971, -4639380, -4726977, -4751886, -4723711, -4657621, -4574504, -4498282, -4450533, -4445103, -4485438, -4565164, -4670549, -4783282, -4882860, -4948668, -4962263, -4910557, -4789493, -4606098, -4376688, -4121573, -3859831, -3607712, -3380503, -3193845, -3060724, -2984504, -2952761, -2937001, -2899728, -2805962, -2634438, -2384594, -2077161, -1747808, -1435439, -1169622, -962801, -810288, -696205, -600653, -504997, -395440, -266321, -122712, 20040, 141261, 222751, 255626, 242981, 197789, 137657, 78730, 30797, -4955, -34860, -68916, -115796, -178497, -252161, -324831]
37707c24831n6186k5403J4960N9142J02171J40130J69830J89133J97762J97627
37697F64335J92195J85553J81910J85451J99519K24426K54698K78494K81300K52708
37687B900589J91785J07209J2593p9296j60333k28179k85041l34345l76490m06599
37677A341893m16488l99652l55584k90741k16658j46958r4328o7767p1085j03521
37667h20889j61750k40967l34042m30149n15108n73930n94360n70292n04178m07188
37657e152853k95873j86238q8513n597O4972J28059J89156K53878L27182M11225
37647d354602N02490N90594O60737O98746O95347O47476N57931M35566K95322
37638G29607J55731L3866n8891j17406j40619j29653q7472j9122O8474J66932
$$ y = [-324831, -381017, -406420, -391460, -332318, -230147, -90017, 79813, 268946, 466708, 664335, 856530, 1042083, 1223993, 1409444, 1608963, 1833389, 2088087, 2366581, 2647881, 2900589, 3092374, 3199583, 3212176, 3132880, 2972547, 2744368, 2459327, 2124982, 1748492, 1341893, 925405, 525753, 170169, -120572, -337230, -484188, -578516, -646283, -717368, -820889, -982639, -1223606, -1557648, -1987797, -2502905, -3076835, -3671195, -4241487, -4745665, -5152853, -5448726, -5634964, -5723477, -5729074, -5664102, -5536043, -5346887, -5093009, -4765827, -4354602, -3852112, -3261518, -2600781, -1902035, -1206688, -559212, -1281, 434285, 729607, 885338, 919204, 860313, 742907, 602288, 472635, 385163, 366041, 434515, 601447]
37628F01447K66565L56501M25414M63240M63521M25395L54138K60145J57133O0263
37618C833762j6029o0846o9505m4546N783P1187J43630K20114L01704L88602M74480
37607E248336N44666N80312N66076M96562L78304K27097O2860r5376k32870l40852
37597G435115m17000m64598m90168n00534n01133m96296m90044m85794m85114
37588C104434m86990m88291m84734m71672m44664m00253l37337k59121j74427
37579d43055r6156l5906K337K4269M0880O0901Q5544J07952J15841R5388L6009
37568e996o4341j95789l37865m65604n57179n99138n87594n26292m23440k89095
37558d052333j33848L1275J94675L44708M71074N66453O27753O56758O59957O47334
$$ y = [601447, 868012, 1224513, 1649927, 2113167, 2576688, 3002083, 3356221, 3616366, 3773499, 3833762, 3817733, 3756887, 3687382, 3642836, 3648619, 3719806, 3863436, 4083550, 4385254, 4773856, 5248336, 5793002, 6373314, 6939390, 7435952, 7814256, 8041353, 8104213, 8008837, 7775967, 7435115, 7018115, 6553517, 6063349, 5562815, 5061682, 4565386, 4075342, 3589548, 3104434, 2617444, 2129153, 1644419, 1172747, 728083, 327830, -9507, -268628, -443055, -539211, -575117, -572780, -548511, -507631, -446730, -361186, -253234, -137393, -42005, -5996, -70337, -266126, -603991, -1069595, -1626774, -2225912, -2813506, -3339798, -3763238, -4052333, -4186181, -4154906, -3960231, -3615523, -3144449, -2577996, -1950243, -1293485, -633528, 13806]
37548A3806O30009O17474O15365O24171O38845O49549O43902O10468N42407M40027
37538F026023L11441J70697L3182q9878j94305k81052l51683m06117m44830m72466
37528D301012m97735n28201n63654n93731o02346n76513n13584m21928l15108
37519c11788k04644r6503P800J08424K05367K97750L83646M60622N27124N83401
37509A961199O30585O68548O94789P05795O99753O78268O45510O05361N58707
37500G848515N02949M33976L49122K49525J41322L5492n4544j17734j50152j56180
37490I082291j45266j27406j10896j02437j07048j26456j57212j90334k13041
37481G802195k12527j81435j23141n3370M411K7883M024o7430j75401l01436m24454
$$ y = [13806, 643815, 1261289, 1876654, 2500825, 3139670, 3789219, 4433121, 5043589, 5585996, 6026023, 6337464, 6508161, 6541343, 6451465, 6257160, 5976108, 5624425, 5218308, 4773478, 4301012, 3803277, 3275076, 2711422, 2117691, 1515345, 938832, 425248, 3320, -311788, -516432, -612935, -605135, -496711, -291344, 6406, 390052, 850674, 1377798, 1961199, 2591784, 3260332, 3955121, 4660916, 5360669, 6038937, 6684447, 7289808, 7848515, 8351464, 8785440, 9134562, 9384087, 9525409, 9560901, 9506357, 9388623, 9238471, 9082291, 8937025, 8809619, 8698723, 8596286, 8489238, 8362782, 8205570, 8015236, 7802195, 7589668, 7408233, 7285092, 7231722, 7236133, 7264016, 7268040, 7200610, 7025209, 6723773, 6299319]
37470F299319n25526n92206o21396o19682o00611n79485n67524n67924n75506
37461A049459n79621n68640n34354m75192l97207l11804k30689j60412r9770m1905
37451b350135K0252Q8878J59984K26331K81452L21319L43313L45237L26238K88245
37441E1114K35328J71103R7249J5035p2032j57693k35064k98511l43279l64266
37431i01016l56972l20518k59590j82922r9752j7433N9035J27046J86790K40274
37421a525058K87788L23488L34045L02707K17573P9930r2411k69726m21080n25233
37411a287977n75772n79051n47909m94748m26437l42888k40736j20778O008J19134
37401d491154J96498K24512K04082J49296Q0329J5020l6525p2308r5054j08127
$$ y = [6299319, 5773793, 5181587, 4560191, 3940509, 3339898, 2760413, 2192889, 1624965, 1049459, 469838, -98802, -633156, -1108348, -1505555, -1817359, -2048048, -2208460, -2308230, -2350135, -2329883, -2241005, -2081021, -1854690, -1573238, -1251919, -908606, -563369, -237131, 51114, 286442, 457545, 554794, 569829, 497797, 340104, 105040, -193471, -536750, -901016, -1257988, -1578506, -1838096, -2021018, -2120770, -2138203, -2079168, -1952122, -1765332, -1525058, -1237270, -913782, -579737, -277030, -59457, 20473, -71938, -341664, -762744, -1287977, -1863749, -2442800, -2990709, -3485457, -3911894, -4254782, -4495518, -4616296, -4610288, -4491154, -4294656, -4070144, -3866062, -3716766, -3636437, -3621417, -3657942, -3730250, -3825304, -3933431]
37391c933431j13521j12618j08327j05835j10199j21761j33173j31339j04009
37382d974213m6995L2433J17639J88719K29405K31906J98069J37131O1880j4805
37372c838831q2094j32348j61817j70965j63773j45642j20438q8382m6450Q316
37362d942424P4285J42670J99117K29024K23486J82870J17171M4156j4338l8558
37352c782541j8680L9293J14099J77312K05317J89232J38044P3537J9680p881
37342b852588o666J5155M5585P5350J01258J25778J53621J87421K25530K63572
37332a665984K97778L26179L46496L53952L43018L12744K71013K33436K16677
37323A035309K29912K69192L17852L53167L55896L17325K40087J33975J1584j12836
$$ y = [-3933431, -4046952, -4159570, -4267897, -4373732, -4483931, -4605692, -4738865, -4870204, -4974213, -5021208, -4988775, -4871136, -4682417, -4453012, -4221106, -4023037, -3885906, -3824026, -3838831, -3920925, -4053273, -4215090, -4386055, -4549828, -4695470, -4815908, -4904290, -4950740, -4942424, -4868139, -4725469, -4526352, -4297328, -4073842, -3890972, -3773801, -3729645, -3743983, -3782541, -3801221, -3761928, -3647829, -3470517, -3265200, -3075968, -2937924, -2864387, -2844707, -2852588, -2859254, -2844099, -2798514, -2723164, -2621906, -2496128, -2342507, -2155086, -1929556, -1665984, -1368206, -1042027, -695531, -341579, 1439, 314183, 585196, 818632, 1035309, 1265221, 1534413, 1852265, 2205432, 2561328, 2878653, 3118740, 3252715, 3264299, 3151463]
37313C151463k23126l03535l44204l45479l16861k71488k20771j72223j29457
37304H24319r2361n7543k0355K2030O8915J17130J63293K04639K37848K57817
37294A725732K58430K35173J87710J20941M4627k7946q2401j07036r6560n3351
37284B205319J4603R7063J83231K61397L18717L43341L28503K76147J97592J10117
37274D336030L0446l1815p7064j13416j51345j98865k59150l29947m04073m71387
37264B329414n22314n50931n55257n34800m88229m13732l11895j88766n6848O6916
37254a226442J65648K27811K50751K40938K11415J78227J56743J57808J84424
37245E47323K30872K85332L34291L66136L73107L52543L07569K46013J77192J08477
$$ y = [3151463, 2928337, 2624802, 2280598, 1935119, 1618258, 1346770, 1125999, 953776, 824319, 731958, 674415, 654060, 676090, 745005, 862135, 1025428, 1230067, 1467915, 1725732, 1984162, 2219335, 2407045, 2527986, 2572613, 2544667, 2462266, 2355230, 2258670, 2205319, 2219922, 2316985, 2500216, 2761613, 3080330, 3423671, 3752174, 4028321, 4225913, 4336030, 4366476, 4334661, 4257597, 4144181, 3992836, 3793971, 3534821, 3204874, 2800801, 2329414, 1807100, 1256169, 700912, 166112, -322117, -735849, -1047744, -1236510, -1293358, -1226442, -1060794, -832983, -582232, -341294, -129879, 48348, 205091, 362899, 547323, 778195, 1063527, 1397818, 1763954, 2137061, 2489604, 2797173, 3043186, 3220378, 3328855]
37235C328855M3689j6576p3790j29871j84947k35555k74989k95938k93429k66323
37225A601126k17315j52240p8590k965P1918J48650K33354L30509M36578N36526
37215B907551O06724O24030N76179M67497L17246J52435j059j25672k15467k74787
37205E034677l13111l38728l54189l55467l34748k85017k04208r7400K3049J39448
37195B914306K33117K90359L06843K87009K38871J68918Q1267j9708j27657k35975
37185D137350l40908m41952n38203o23828o87620p18701p14818o86242o51084
37176a266006o24846o12037o05742n94154n68196n25336m68995m05886l42892
37167f014090k83819k26826j64431q7290J0233J26483K53107L78470M90828N79797
$$ y = [3328855, 3372544, 3355968, 3282178, 3152307, 2967360, 2731805, 2456816, 2160878, 1867449, 1601126, 1383811, 1231571, 1152981, 1150016, 1221934, 1370584, 1603938, 1934447, 2371025, 2907551, 3514275, 4138305, 4714484, 5181981, 5499227, 5651662, 5650603, 5524931, 5309464, 5034677, 4721566, 4382838, 4028649, 3673182, 3338434, 3053417, 2849209, 2751809, 2774858, 2914306, 3147423, 3437782, 3744625, 4031634, 4270505, 4439423, 4520690, 4500982, 4373325, 4137350, 3796442, 3354490, 2816287, 2192459, 1504839, 786138, 71320, -614922, -1266006, -1890852, -2502889, -3108631, -3702785, -4270981, -4796317, -5265312, -5671198, -6014090, -6297909, -6524735, -6689166, -6776456, -6766223, -6639740, -6386633, -6008163, -5517335, -4937538]
37157d937538O37054O57856O43285O01351N45127M88191M40101M04348L78944
37148a41281L57748L31428K88910K20415J21259n300j47338k85888l99316m70000
37138a29363m90687m66765m13006l47391k86003k40749k18757k21737k45080k77685
37128c337223l03575l05372k69203j90048p5989N1293J61988K28681K37105J91214
37118c611129J10393K1319n1131r0682r2517o1754q841N4966J19284J73679K07022
37107c229391K09772J79064J23473O3086K2446J8841N2998J08905J63282J98138
37097b089386K08304K00498J86539J76045J72617J74371J77058J77282J74074
37088d42598J68676J63305J59719J57975J55660J48002J29127R4194M1316k7832
$$ y = [-4937538, -4300484, -3642628, -2999343, -2397992, -1852865, -1364674, -924573, -520225, -141281, 216467, 547895, 836805, 1057220, 1178479, 1173179, 1025841, 739953, 340637, -129363, -620050, -1086815, -1499821, -1847212, -2133215, -2373964, -2592721, -2814458, -3059538, -3337223, -3640798, -3946170, -4215373, -4405421, -4481410, -4430117, -4268129, -4039448, -3802343, -3611129, -3500736, -3479417, -3530548, -3621230, -3713747, -3775501, -3784342, -3729376, -3610092, -3436413, -3229391, -3019619, -2840555, -2717082, -2653996, -2631550, -2612709, -2559711, -2450806, -2287524, -2089386, -1881082, -1680584, -1494045, -1318000, -1145383, -971012, -793954, -616672, -442598, -273922, -110617, 49102, 207077, 362737, 510739, 639866, 734060, 775376, 747544]
37078G47544j08445j92864k70360l27995l54350l44750l04101k44621j79962j19779
37068a699683o7664k2530J7804N2412P4666P3444L8474l3040j32643k42222l40233
37057b281215m09378m42074m41243m16798l80431l41647l06078k75586k49437
37048e543887k26107k04811j85824j69796j57342j49122j44967j41622j31519
37039g054997j05370n7613R896Q8957J69318K42195L01354L42837L64769L67083
37029e331571L50606L16024K63901J96130J17708L7137l5431r1550j27173j42605
37019d446824j39470j16948p0935J819R6701J97238K78847L19229L08559K52973
37009c318811J70317Q2168O254m8585q3902j08650j32657j60184j87538k05478
$$ y = [747544, 639099, 446235, 175875, -152120, -506470, -851220, -1155321, -1399942, -1579904, -1699683, -1767347, -1789877, -1772073, -1719661, -1644995, -1571551, -1533077, -1566117, -1698760, -1940982, -2281215, -2690593, -3132667, -3573910, -3990708, -4371139, -4712786, -5018864, -5294450, -5543887, -5769994, -5974805, -6160629, -6330425, -6487767, -6636889, -6781856, -6923478, -7054997, -7160367, -7217980, -7208084, -7119127, -6949809, -6707614, -6406260, -6063423, -5698654, -5331571, -4980965, -4664941, -4401040, -4204910, -4087202, -4050065, -4085496, -4177046, -4304219, -4446824, -4586294, -4703242, -4774177, -4772358, -4675657, -4478419, -4199572, -3880343, -3571784, -3318811, -3148494, -3066326, -3060072, -3108657, -3192559, -3301209, -3433866, -3594050, -3781588, -3987066]
36999c987066k03579j73738j12234k1244R0321K07891L14802L96604M43652M51059
36989b593532M17476L44858K39572J13422j7264j34721k23608k74152k83960k58783
36979b670692k11738j59994j19149r8101r7793j14061j41158j72726k00815k16045
36969d202272k10204j79407j25058n2014L4644J32270K41312L63583M98975O42457
36959b855714P82851R03879R87270J017383R86056Q95546P57987N91755M16980
36950D483993K52149J12123O783o0349r2769r9694r2348p9592o5856n2860m3385
36939D268195m3184n8591r1185j33901j72145j89767j75983j29240n6849K8048
36929C245398J10528J78520K27360K61941K93902L34443L87129M45511M96702
$$ y = [-3987066, -4190645, -4364383, -4476617, -4497861, -4407540, -4199649, -3884847, -3488243, -3044591, -2593532, -2176056, -1831198, -1591626, -1478204, -1495468, -1630189, -1853797, -2127949, -2411909, -2670692, -2882430, -3042424, -3161573, -3259674, -3357467, -3471528, -3612686, -3785412, -3986227, -4202272, -4412476, -4591883, -4716941, -4768955, -4734311, -4602041, -4360729, -3997146, -3498171, -2855714, -2072863, -1168984, -181714, 835669, 1821725, 2717271, 3475258, 4067013, 4483993, 4736142, 4848265, 4855048, 4794699, 4701930, 4602236, 4509888, 4430296, 4364440, 4311580, 4268195, 4225011, 4166420, 4075235, 3941334, 3769189, 3579422, 3403439, 3274199, 3217350, 3245398, 3355926, 3534446, 3761806, 4023747, 4317649, 4652092, 5039221, 5484732, 5981434]
36920E981434N27633N29441M98043M32258L32085J98865L7103j43427l27273m96122
36910G570040o34262p33306p92658q15434q03952p59221o84519n88728m85223
36901A272737l86749l00565k27536j64762j08822n7606j0920K9367O0016P8428
36891A83588Q4838Q2935P8270P5659P6865P9482P7756O5778M1619R329k3115m8660
36879G84344o5744q0113j03014j46134k15135l05161m01338m84234n36998n50301
36869b103828n23388m62067l75645k74526j68913o7834K2305R9521J66908K30784
36859c456683K96382L63388M24531M68530M85148M68592M18126L38136K39227
36850D5377J38031N2426o646m0872o2694q6719j20072j57860j86475j92762j73041
$$ y = [5981434, 6509067, 7038508, 7536551, 7968809, 8300894, 8499759, 8536862, 8393435, 8066162, 7570040, 6935778, 6202472, 5409814, 4594380, 3790428, 3031207, 2346688, 1757960, 1272737, 885988, 585423, 357887, 193125, 84303, 26697, 15777, 45144, 105160, 183588, 268426, 351361, 429631, 505290, 582155, 661637, 739393, 805171, 846790, 856119, 833004, 784344, 718600, 638487, 535473, 389339, 174204, -130957, -532295, -1016529, -1553527, -2103828, -2627216, -3089283, -3464928, -3739454, -3908367, -3976201, -3953896, -3854375, -3687467, -3456683, -3160301, -2796913, -2372382, -1903852, -1418704, -950112, -531986, -193850, 45377, 183408, 235834, 229188, 188316, 125622, 38903, -81169, -239029, -425504, -618266, -791307]
36839g91307j35743r5914o5977m9393m0807l1543j6716j43N589j5523p4324j68959
36827a480760k82717l89123m62414m88141m67974m16032l49594k80494k12076
36818d829325j42012o7470J1177Q9605J60894K17457K52661K62095K44603K02934
36808c597381J43783P7025J4134l4050n9656n9570l6217K842M6700Q4091J06471
36797c311828J09710R3988O3043K3899j3430l7487l8262j0016M6928J25316K10949
36786b737190K84859L28697L31735K95283K31580J58201R2020M5779K7100L8130
36776i03806P5190J29238J87774K37450K66338K65925K33349J73427R8566K5176
36766G88627l2155o5490p4749o5470m5404k1818J21J8109L2620M5820N9704P3905
$$ y = [-791307, -927050, -1022964, -1088941, -1138334, -1179141, -1210684, -1227400, -1227543, -1221954, -1237477, -1311801, -1480760, -1763477, -2152600, -2615014, -3103155, -3571129, -3987161, -4336755, -4617249, -4829325, -4971337, -5038807, -5027630, -4938025, -4777131, -4559674, -4307013, -4044918, -3800315, -3597381, -3453598, -3376573, -3362439, -3396489, -3456145, -3515715, -3551932, -3549090, -3502390, -3418299, -3311828, -3202118, -3108130, -3045087, -3021188, -3034618, -3072105, -3110367, -3120383, -3073455, -2948139, -2737190, -2452331, -2123634, -1791899, -1496616, -1265036, -1106835, -1014815, -969036, -941936, -903806, -828616, -699378, -511604, -274154, -7816, 258109, 491458, 664885, 763451, 788627, 756472, 690982, 616233, 550763, 505359, 483541, 483662, 501771, 534391, 580211, 639915, 713820]
36754G13820Q3695P9795N1725n573q5895j71674k40668k75381k69680k29736j69915
36743e19487j06067m9421l895L2378O3248R1419J17437J40268J58520J71519J79532
36732B75451J82722J79770J68045J45984J15791Q3765N7428M1737L7402M2430
36722A330525N5148P5987J06945J49656K03456K63853L21672L64117L78955L60370
36712C610684L12530K47826J80834J22052P4696L4944n288n3698j12214j73696
36702D238670k23818k48089k39971k04918j58036j17189r5695r8099j19976j50168
36692B582711j73566j74281j40128o7850L3946J46808K48514L19812L49326L36154
36682C461446K90121K28762J71076J30501J10696J05974J05339R7442P4131L2023
$$ y = [713820, 797515, 877310, 929035, 923462, 837567, 665893, 425225, 149844, -119836, -349572, -519487, -625554, -674975, -678870, -646492, -583244, -491825, -374388, -234120, -75600, 95919, 275451, 458173, 637943, 805988, 951972, 1067763, 1151528, 1208956, 1250693, 1288095, 1330525, 1385673, 1461660, 1568605, 1718261, 1921717, 2185570, 2507242, 2871359, 3250314, 3610684, 3923214, 4171040, 4351874, 4473926, 4548622, 4583566, 4578278, 4524580, 4412366, 4238670, 4014852, 3766763, 3526792, 3321874, 3163838, 3046649, 2950954, 2852855, 2732879, 2582711, 2409145, 2234864, 2094736, 2026886, 2060832, 2207640, 2456154, 2775966, 3125292, 3461446, 3751567, 3980329, 4151405, 4281906, 4392602, 4498576, 4603915, 4701357, 4775488, 4807511]
36672D807511k7127r6502j65229k20984k53366k56144k27772j71309r4523r061
36662C285494P2270J38778J83446K02419J94201J59755J02864K9473n3879j41303
36652D173518k27164l03957l60404l82687l59980k91433j89690p8098J6808P3737
36642B070650Q2699M6850k0371j01475j81075k48561k96794l19308l08949k59191
36632D64475j67600l9941J07498K49812L60127M17853M13888L50862K40735J03000
36622B500709l6650j50219k15062k21797j76997r8567p084Q1056J55190K07724
36612B038303K31498K20553J73818R8096P212q2368j56580k06940k31309k33009
36602A859274k18775j95509j66132j26160o3773L4890J77066L56629N54281P44957
$$ y = [4807511, 4780384, 4683882, 4518653, 4297669, 4044303, 3788159, 3560387, 3389078, 3294555, 3285494, 3357764, 3496542, 3679988, 3882407, 4076608, 4236363, 4339227, 4368700, 4314821, 4173518, 3946354, 3642397, 3281993, 2899306, 2539326, 2247893, 2058203, 1980105, 1996913, 2070650, 2153349, 2200199, 2179828, 2078353, 1897278, 1648717, 1351923, 1032615, 723666, 464475, 296875, 256934, 364432, 614244, 974371, 1392224, 1806112, 2156974, 2397709, 2500709, 2464059, 2313840, 2098778, 1876981, 1699984, 1601417, 1594333, 1675389, 1830579, 2038303, 2269801, 2490354, 2664172, 2762268, 2769480, 2687112, 2530532, 2323592, 2092283, 1859274, 1640499, 1444990, 1278858, 1152698, 1088925, 1123815, 1300881, 1657510, 2211791, 2956748]
36592B956748R07621J031428J115523J164288J181954J169808J126984J053765
36584A1708119R54889Q40218P21657O08142N02462M02473L05519K12372J27881
36575A6383732N8334P621k5202m5273n8488o8035p4060p6497p7674q1508q9906
36564A5853044r9991j04992r8540p9420n3099k8271j0343L111K1086N2937J01979
36553A5557501J63077K24879K74670L03463L09725L00498K88968K88978L09346
36544A8021105L51820M13708M92119N85963O95515Q21980R67633J134263J319612
36535B4803718J515486J710939J898622K079225K261264K457426K679728K935254
36527D2341662L224245L541671L881681M242805M631977N065613N566283O155852
$$ y = [2956748, 3864369, 4895797, 6011320, 7175608, 8357562, 9527370, 10654354, 11708119, 12663008, 13503226, 14224883, 14833025, 15335487, 15737960, 16043479, 16255851, 16383732, 16442066, 16449687, 16424485, 16379212, 16320724, 16252689, 16178629, 16102132, 16024458, 15942950, 15853044, 15753053, 15648061, 15549521, 15470101, 15417002, 15388731, 15378388, 15381499, 15402585, 15455522, 15557501, 15720578, 15945457, 16220127, 16523590, 16833315, 17133813, 17422781, 17711759, 18021105, 18372925, 18786633, 19278752, 19864715, 20560230, 21382210, 22349843, 23484106, 24803718, 26319204, 28030143, 29928765, 32007990, 34269254, 36726680, 39406408, 42341662, 45565907, 49107578, 52989259, 57232064, 61864041, 66929654, 72495937, 78651789]
36519G8651789O849274P653275Q569813R600405J0748122J2016761J3408298J4920138
36511A62417875J6543423J8262457K0054050K1886240K3715823K5480837K7081360
36504C15442065K8348125K9011135K8690258K6933623K3326576J7669173J0162134
36497D79583089J484914p330472j5206240k1351011k5442076k7594620k8191545
36490C55952039k7696041k6523883k4987096k3288879k1546939j9825823j8163372
36483A93920006j6584676j5105715j3732816j2463295j1289675j0205538r208712
36476A05329579q300046p480303o748363o100756n531287n030851m588129m190681
36468E7359163l826115l484094l159048k851369k565553k307170k081588j894375
$$ y = [78651789, 85501063, 93154338, 101724151, 111324556, 122072678, 134089439, 147497737, 162417875, 178961298, 197223755, 217277805, 239164045, 262879868, 288360705, 315442065, 343790190, 372801325, 401491583, 428425206, 451751782, 469420955, 479583089, 481068003, 473737531, 458531291, 437180280, 411738204, 384143584, 355952039, 328255998, 301732115, 276745019, 253456140, 231909201, 212083378, 193920006, 177335330, 162229615, 148496799, 136033504, 124743829, 114538291, 105329579, 97029533, 89549230, 82800867, 76700111, 71168824, 66137973, 61549844, 57359163, 53533048, 50048954, 46889906, 44038537, 41472984, 39165814, 37084226, 35189851]
36460C5189851j751039j654835j603734j588512j593508j600415j593233j561038
36452B2243537j497396j399209j268154j113548r52277q03673o81825n89927n19749
36443A3417779m56507l86745l05079k16343j32688o7895l1515k4502l7676n4067
36433A1704762n4713k5632L6859J24318K18339K96144L38000L34168K88797K18827
36423A3479869J47518R5152P1656P4912R4508J17184J30616J25244R5675M1947
36413A4474281l0920j16047k08610l07124m10832n15755o13542o94398p51668
36404A0825385p84376p96252p92700p78032p54331p21509o77849o21218n51484
36395D347634m73084l94987l26848k74212k37075k12635j98639j94003j97188
$$ y = [35189851, 33438812, 31783977, 30180243, 28591731, 26998223, 25397808, 23804575, 22243537, 20746141, 19346932, 18078778, 16965230, 16012953, 15209280, 14527455, 13937528, 13417779, 12961272, 12574527, 12269448, 12053105, 11920417, 11852522, 11821007, 11796505, 11758829, 11704762, 11650049, 11624417, 11661276, 11785594, 12003933, 12300077, 12638077, 12972245, 13261042, 13479869, 13627387, 13722539, 13794195, 13869107, 13963615, 14080799, 14211415, 14336659, 14432334, 14474281, 14443361, 14327314, 14118704, 13811580, 13400748, 12884993, 12271451, 11577053, 10825385, 10041009, 9244757, 8452057, 7674025, 6919694, 6198185, 5520336, 4899118, 4347634, 3874550, 3479563, 3152715, 2878503, 2641428, 2428793, 2230154, 2036151, 1838963]
36386A838963k04990k13172k18205k18654k15121k08599j98592j83071j60521
36377A8038j31486r7328n7396q238N3500J26545K02337K66240L02227K98969K54302
36366A227710J75699P6868k7059j22825j99962k50556k69536k55986k14562j55815
36356a6024r4765m7769k8219m2074q5060j43358j98331k33594k41493k25852j99262
36345a555801j75940j64061j62058j60607j48251j17072o5972n59O9766J35639
36335b344916J89964K27810K45436K40336K12456J65470J07340M9862O802r331
36325i08771R286O3723J48159K51334L58993M56871N33535N82577O03988O03985
36315B703680N92372N77877N64114N48674N25325M87087M28282L45083K35219
$$ y = [1838963, 1633973, 1420801, 1202596, 983942, 768821, 560222, 361630, 178559, 18038, -113448, -210776, -268172, -276410, -222910, -96365, 105972, 372212, 674439, 973408, 1227710, 1403409, 1480277, 1453218, 1330393, 1130431, 879875, 610339, 354353, 139791, -16024, -110789, -158558, -186777, -228851, -313911, -457269, -655600, -889194, -1130687, -1356539, -1555801, -1731741, -1895802, -2057860, -2218467, -2366718, -2483790, -2549762, -2550321, -2480555, -2344916, -2154952, -1927142, -1681706, -1441370, -1228914, -1063444, -956104, -906242, -899440, -908771, -899485, -835762, -687603, -436269, -77276, 379595, 913130, 1495707, 2099695, 2703680, 3296052, 3873929, 4438043, 4986717, 5512042, 5999129, 6427411, 6772494, 7007713]
36306G007713R8106o3274k39417m13349n63980o72351p27142p27292o81983o07856
36296B409175n23082m40493l64487k94139k29313j73923j33740j11312j02529
36287C6157r7713q6661o4217l2409J971L1964N3699O7126P5368Q4042J00394J31423
36275C01144J81068K47415L21491L88716M33007M42152M12199L48681K64074J72925
36265C512872Q7422J5378l9746p8418j04837j25698j46907j69698j89448j99135
36255B561785j95274j81643j67493j61665j67195j80102j92467j97152j91288
36246I27506j76781j57702j36662j13065q4397m8616n219M4791R8250J48434J85145
36235F81684J97532J78417J28083N6290j8581p4258r2079o3263R575J15151K37374
$$ y = [7007713, 7105819, 7042545, 6803128, 6389779, 5825799, 5153448, 4426306, 3699014, 3017031, 2409175, 1886093, 1445600, 1081113, 786974, 557661, 383738, 249998, 138686, 36157, -61556, -148217, -212434, -244843, -242872, -210908, -157209, -90083, -14715, 69327, 169721, 301144, 482212, 729627, 1051118, 1439834, 1872841, 2314993, 2727192, 3075873, 3339947, 3512872, 3600294, 3615672, 3575926, 3497508, 3392671, 3266973, 3120066, 2950368, 2760920, 2561785, 2366511, 2184868, 2017375, 1855710, 1688515, 1508413, 1315946, 1118794, 927506, 750725, 593023, 456361, 343296, 258899, 210283, 205064, 249855, 348105, 496539, 681684, 879216, 1057633, 1185716, 1242006, 1223425, 1149167, 1057088, 993825, 1003400, 1118551, 1355925]
36224A355925L58315M60890N31750N63546N55156N10035M34062L34352K19630
36215E323661J01205p492r4081j52065j84166k01544k18994k48410k93850l50692
36205C673572m09345m60957n00950n27921n39937n32743n02310m49694l83822
36196f34107l19586k72023k49472k49310k59122k63413k51936k23691j83723j35765
36186c042148p6880J876J09224K45663L98467N43465O53789P10982P11633O65999
36176I22070N90907N02221M10250L18393K24139J22175R207j11385k28018l24120
36166B435839l84527m01120l74347l10755k19642j11815n33R8190J68636K01278
36156A101204J97640J70392J38323J19586J26538J63105K24005K95914L61235
$$ y = [1355925, 1714240, 2175130, 2706880, 3270426, 3825582, 4335617, 4769679, 5104031, 5323661, 5424866, 5417374, 5323293, 5171228, 4987062, 4785518, 4566524, 4318114, 4024264, 3673572, 3264227, 2803270, 2302320, 1774399, 1234462, 701719, 199409, -250285, -634107, -953693, -1225716, -1475188, -1724498, -1983620, -2247033, -2498969, -2722660, -2906383, -3042148, -3119028, -3117152, -3007928, -2762265, -2363798, -1820333, -1166544, -455562, 256071, 922070, 1512977, 2015198, 2425448, 2743841, 2967980, 3090155, 3099362, 2987977, 2759959, 2435839, 2051312, 1650192, 1275845, 965090, 745448, 633633, 633100, 731290, 899926, 1101204, 1298844, 1469236, 1607559, 1727145, 1853683, 2016788, 2240793, 2536707, 2897942]
36147B897942M03785M13863L90308L39077K69908J92967J16721M6863j4274o7797
36137D989363j17148j65960k16313k68305l20299l68824m08487m32777m35425
36128B255825m11740l60188k84163j92067r4198J039Q7217J56519J98433K04158
36118A560835J73045J14509M3989k2783p3243r9235r7812p1890k9733J7444N9399
36107A574525R0836J13401J34161J61190J98663K44147K89501L24968L44344L48333
36097C824069L44103L41468L47974L65247L87924M05349M05348L78837L23686
36088G124005K46064J58139P2495l786p1574j37281k07542k84631l65031m41588
36078F089270n07774n60959o01931o31067o45331o39498o10803n62621n04110
$$ y = [2897942, 3301727, 3715590, 4105898, 4444975, 4714883, 4907850, 5024571, 5071434, 5057160, 4989363, 4872215, 4706255, 4489942, 4221637, 3901338, 3532514, 3124027, 2691250, 2255825, 1844085, 1483897, 1199734, 1007667, 913469, 914508, 1001725, 1158244, 1356677, 1560835, 1733880, 1848389, 1892378, 1869595, 1796352, 1697117, 1599305, 1527415, 1497682, 1515126, 1574525, 1665361, 1778762, 1912923, 2074113, 2272776, 2516923, 2806424, 3131392, 3475736, 3824069, 4168172, 4509640, 4857614, 5222861, 5610785, 6016134, 6421482, 6800319, 7124005, 7370069, 7528208, 7600703, 7596917, 7525343, 7388062, 7180520, 6895889, 6530858, 6089270, 5581496, 5020537, 4418606, 3787539, 3142208, 2502710, 1891907, 1329286, 825176]
36069H25176m46068l96024l55969l24300l00120k85408k82465k89174k97104k94476
36059b445932k71241k22504j48882n4745N4191J72682K96402M21285N42734O55168
36049a000842P51531Q22543Q56639Q42034P71536O48508M89994L23117J75012
36040D680072O2033j4901o6863j09006j52986k02376k52078k92025l13413l13493
36030C024964k95844k66898k32166j94860j56958j21045r1184p1729o4609o6658
36020A463013o8763n7569j9542N3727J61205K91428M25553N42483O23416O54629
36010D069580O29029N47079M16679K51465O7808j18017k91015m37093n42815n97121
36000C995579n94885n40045m46083l33057k22318j30915o8263l6603l4339n9182
$$ y = [825176, 379108, -16916, -372885, -697185, -997305, -1282713, -1565178, -1854352, -2151456, -2445932, -2717173, -2939677, -3088559, -3143304, -3089113, -2916431, -2620029, -2198744, -1656010, -1000842, -249311, 573232, 1429871, 2271905, 3043441, 3691949, 4181943, 4505060, 4680072, 4742105, 4727204, 4660341, 4551335, 4398349, 4195973, 3943895, 3651870, 3338457, 3024964, 2729120, 2462222, 2230056, 2035196, 1878238, 1757193, 1666009, 1594280, 1529671, 1463013, 1394250, 1336681, 1317139, 1370866, 1532071, 1823499, 2249052, 2791535, 3414951, 4069580, 4698609, 5245688, 5662367, 5913832, 5981640, 5863623, 5572608, 5135515, 4592700, 3995579, 3400694, 2860649, 2414566, 2081509, 1859191, 1728276, 1660013, 1623410, 1589071, 1529889]
35990A529889j08456j76957k55251l30995l93052m35513m58494m65257m58644
35981a552730m40106m11416l75958l37218k95916k49081j92409j23793m5238L7365
35971c986500J15336J78283K15914K21395J94922J44588Q3047K1752l3390q2598
35961b927251j29365j76306k22198k61908k89217l00341k95616k78713k54898
35952e135813k29779k08468j94623j89514j91665j97157k00550j96482j81684
35943f925735j56407j24239r0143n7523k5850R366N3527J08529J70231K30001
35933f808243K79295L14282L37790L57397L80482M08997M37403M55421M53780
35924c383396M29248L86104L33407K79915K29677J81118J30070P4535J8402k7604
$$ y = [1529889, 1421433, 1244476, 989225, 658230, 265178, -170335, -628829, -1094086, -1552730, -1992836, -2404252, -2780210, -3117428, -3413344, -3662425, -3854834, -3978627, -4023865, -3986500, -3871164, -3692881, -3476967, -3255572, -3060650, -2916062, -2833015, -2811263, -2844653, -2927251, -3056616, -3232922, -3455120, -3717028, -4006245, -4306586, -4602202, -4880915, -5135813, -5365592, -5574060, -5768683, -5958197, -6149862, -6347019, -6547569, -6744051, -6925735, -7082142, -7206381, -7296524, -7354047, -7379897, -7370531, -7317004, -7208475, -7038244, -6808243, -6528948, -6214666, -5876876, -5519479, -5138997, -4730000, -4292597, -3837176, -3383396, -2954148, -2568044, -2234637, -1954722, -1725045, -1543927, -1413857, -1339322, -1320920, -1348524]
35914a348524m8381l0454L0020J21415K17633K87137L05950K67570J84632Q2155
35904F9153j3051q1221j13918j14301r4801p2586o3547p7111j14308j69307k32423
35893a077421k92721l39840l65511l65081l38971k93361k38912j87088j45537
35884c644443j15221r0844o3896k6262K7132R6886J78650K63599L40278L97827
35874b636294M29444M34255M16429L81786L33532K69932J86595Q2972l2195j42735
35864b76279k34301l03351l57982m10572m69157n33433n96008o46369o75484o79507
35854e182443o60888o25976n80493n25743m57779l69962k57457j21324K9517J78735
35844h573813L05174L87777M12426L78149K98796J98591J03790L4652J150L393
$$ y = [-1348524, -1396905, -1427359, -1397339, -1275924, -1058291, -771154, -465204, -197634, -13002, 69153, 56102, -25119, -139037, -253338, -348139, -420725, -484272, -561383, -675691, -844998, -1077421, -1370142, -1709982, -2075493, -2440574, -2779545, -3072906, -3311818, -3498906, -3644443, -3759664, -3850508, -3914404, -3940666, -3913534, -3816648, -3637998, -3374399, -3034121, -2636294, -2206850, -1772595, -1356166, -974380, -640848, -370916, -184321, -101349, -133544, -276279, -510580, -813931, -1171913, -1582485, -2051642, -2585075, -3181083, -3827452, -4502936, -5182443, -5843331, -6469307, -7049800, -7575543, -8033322, -8403284, -8660741, -8782065, -8752548, -8573813, -8268639, -7880862, -7468436, -7090287, -6791491, -6592900, -6489110, -6454458, -6453308, -6449915]
35834f449915L5383Q8749J54060K20477K76815L15134L34016L37974L32941L21525
35824d032841L01889K71137K30779J89801J62225J60038J86414K33802K87520
35815b009236L31852L55536L55164L35636L07311K80947K63328K55950K56378
35806G32866K60074K61323K54288K35365K05940J72715J44282J26114J17836J14243
35796B625046J08513R5167P1836L9765L014l3400o5138q9049j03242j07822j05716
35785B438974j02010j01442j05792j12773j16412j08424q0964l0807L7059J09794
35775A827203J71897K12209K28232K25746K15357K08628K15114K40193K83418
35766C827997L37755L90208M24363M24754L81752K94555J70729K3269j32499k81248
$$ y = [-6449915, -6414532, -6325783, -6171723, -5951246, -5674431, -5359297, -5025281, -4687307, -4354366, -4032841, -3730952, -3459815, -3229036, -3039235, -2877010, -2716972, -2530558, -2296756, -2009236, -1677384, -1321848, -966684, -631048, -323737, -42790, 220538, 476488, 732866, 992940, 1254263, 1508551, 1743916, 1949856, 2122571, 2266853, 2392967, 2510803, 2625046, 2733559, 2828726, 2900562, 2940327, 2943341, 2909941, 2844803, 2755754, 2652512, 2544690, 2438974, 2336964, 2235522, 2129730, 2016957, 1900545, 1792121, 1711157, 1680350, 1717409, 1827203, 1999100, 2211309, 2439541, 2665287, 2880644, 3089272, 3304386, 3544579, 3827997, 4165752, 4555960, 4980323, 5405077, 5786829, 6081384, 6252113, 6275382, 6142883, 5861635]
35756E861635m10101n11016n81183o20325o27491o00867n40685m51635l42193
35747A176139k22148j01231J0666J03423J67990J98415J93402J56834R7289K6561
35737A807340m2147r5620j21688j11318o2128J8597J14309K03935K68638K97434
35727B277352K89788K54867K07647J62909J29542J08335R4303Q1416O5795M5268
35717C717222J6694k5175q4959j61401k43934l14487l53838l48302k92709j89235
35707A719876m4871J29406L17852N00412O56566P71003Q36918Q54705Q28277P63039
35697G333183O66635N49938M25587L04459J92764R1472k200r2612j83458k75509
35687I010259l64896m43539n02935n39808n59503n73579n92400o17613o39548
$$ y = [5861635, 5451534, 4940518, 4359335, 3739010, 3111519, 2510652, 1969967, 1518332, 1176139, 953991, 852760, 863426, 966849, 1134839, 1333254, 1526656, 1683490, 1780779, 1807340, 1765193, 1669573, 1547885, 1436567, 1374439, 1393036, 1507345, 1711280, 1979918, 2277352, 2567140, 2822007, 3029654, 3192563, 3322105, 3430440, 3524743, 3606159, 3671954, 3717222, 3733916, 3708741, 3623782, 3462381, 3218447, 2903960, 2550122, 2201820, 1909111, 1719876, 1675005, 1804411, 2122263, 2622675, 3279241, 4050244, 4887162, 5741867, 6570144, 7333183, 7999818, 8549756, 8975343, 9279802, 9472566, 9564038, 9561838, 9469226, 9285768, 9010259, 8645363, 8201824, 7698889, 7159081, 6599578, 6025999, 5433599, 4815986, 4176438]
35678D176438o41188o06510n29025m16037k85923j59717n2287L1397R3655J38807
35668A749610J69772J88045J95186J93566J85792J73777J58279J39020J15441
35659C268488Q7994N9205L2857J0921r453l5494p4171j26595j85848k39746k76627
35648B511531k90541k83116k61451k34006k07581j87103j76604j78650j91703
35639E00776k08133k15731k02504j62000r6469j7036N9184J14589J37729J27631
35629C8036R2940M6549J37l7722o0494o3276m4710r069L4326P4084R9506J01566
35617B71873P3375J2028p8467j85764k91574l77190m28930m40591m12831l51412
35607b209483k65572j66015o2228L9337J34598K19292K87270L31490L46842L32567
$$ y = [4176438, 3535250, 2928740, 2399715, 1983678, 1697755, 1538038, 1485751, 1517148, 1610803, 1749610, 1919382, 2107427, 2302613, 2496179, 2681971, 2855748, 3014027, 3153047, 3268488, 3356482, 3415687, 3448544, 3459465, 3450012, 3414518, 3340347, 3213752, 3027904, 2788158, 2511531, 2220990, 1937874, 1676423, 1442417, 1234836, 1047733, 871129, 692479, 500776, 292643, 76912, -125592, -287592, -384061, -401097, -341913, -227324, -89595, 38036, 130976, 177525, 177662, 139940, 79446, 16170, -28540, -37609, -3283, 70801, 170307, 271873, 345248, 357276, 278809, 93045, -198529, -575719, -1004649, -1445240, -1858071, -2209483, -2475055, -2641070, -2703298, -2663961, -2529363, -2310071, -2022801, -1691311, -1344469, -1011902]
35597a011902K92827K35378J69058J01052L5266k7262q6429j41279j89664k28940
35587h51895k56439k69530k66096k45724k10342j63435j08667m9500J0141O5507
35577b345980J11570J43984J60244J61404J53268J44974J44811J56548J79440
35568i89737K10930K48646K90239L32876L73694M10470M41538M65753M83221M95386
35558B763016N02661N00637M78701M23759L27298J91307K9530j35851k79866l80757
35548D420435m25285m12081l51390k61251j62639p6242k0607r415m7575j28933
35538B525017k38049l54976m60073n37372n77150n77724n45147m89992m22947
35529a678413l51979k82420k18813j66356j30451j14491j17443j33020j51228
$$ y = [-1011902, -719075, -483697, -314639, -213587, -178321, -205583, -292012, -433291, -622955, -851895, -1108334, -1377864, -1643960, -1889684, -2100026, -2263461, -2372128, -2421628, -2411487, -2345980, -2234410, -2090426, -1930182, -1768778, -1615510, -1470536, -1325725, -1169177, -989737, -778807, -530161, -239922, 92954, 466648, 877118, 1318656, 1784409, 2267630, 2763016, 3265677, 3766314, 4245015, 4668774, 4996072, 5187379, 5216909, 5081058, 4801192, 4420435, 3995150, 3583069, 3231679, 2970428, 2807789, 2731547, 2710940, 2701525, 2653950, 2525017, 2286968, 1931992, 1471919, 934547, 357397, -220327, -765474, -1255466, -1678413, -2030392, -2312812, -2531625, -2697981, -2828432, -2942923, -3060366, -3193386, -3344614]
35520c344614j61384j54915j27063p7641j1313O2789J32515J85318K11479K06981
35510c077848J74932J24448O7077J2561l3473o8912r3233j06898j12765j17295
35500c231406j28509j50533j78651j99787j99171j68369j08992l1007N1134J22155
35490d223136J69795J88911J83068J61191J31618R8612O3393K7265o382l1905
35480c237570m2871l5207j0906K0901M7457N8422N0125K6241l871k7951l4826
35469c190056j8906J7780O8316J26869J93054K70932L63396M66403N67540O49984
35459d84688O98944P06336O71606N99659M98285L76407K42760J04546l3437j67964
35449C212454k94781m06151m91417n41449n54267n37162n03086m64023m26646
$$ y = [-3344614, -3505998, -3660913, -3787976, -3865617, -3876930, -3814141, -3681626, -3496308, -3284829, -3077848, -2902916, -2778468, -2711391, -2698830, -2732303, -2801215, -2894448, -3001346, -3114111, -3231406, -3359915, -3510448, -3689099, -3888886, -4088057, -4256426, -4365418, -4396425, -4345291, -4223136, -4053341, -3864430, -3681362, -3520171, -3388553, -3289941, -3226548, -3199283, -3205665, -3237570, -3280441, -3315648, -3326554, -3305653, -3258196, -3199774, -3149649, -3123408, -3127279, -3155230, -3190056, -3208962, -3191182, -3122866, -2995997, -2802943, -2532011, -2168615, -1702212, -1134672, -484688, 214256, 920592, 1592198, 2191857, 2690142, 3066549, 3309309, 3413855, 3380418, 3212454, 2917673, 2511522, 2020105, 1478656, 924389, 387227, -115859, -579882, -1006528]
35440a006528l92722l61684l31359k96638k49712j84363j01799j2746O6583J21891
35430b749077J46482J42410J17784Q2847M6862J6491m552j4919j4583l899J6472
35419b217682M4782P7315J08585J32765J45591J45515J33439J11531Q2257M8391
35409a187511J3486j8335m3493n9744o5505n8506l5835L796N7102J15235J65806
35398a113504J96709J99593J71759J16570M3032l5802j06092j57547j86674j97132
35388a069088j97306j96736k02633k16985k35131k46960k41132k10506j55793
35379b972270q5377j1853N2027R5712J11798R7271N4987o719p7374j47982k11664
35368c101444k61567k89525k87422k49860j76065p0633N6621J92279L22318M34978
$$ y = [-1006528, -1399250, -1760934, -2092293, -2388931, -2638643, -2823006, -2924805, -2937551, -2870968, -2749077, -2602595, -2460185, -2342401, -2259554, -2212692, -2196201, -2200753, -2215672, -2230255, -2234154, -2217682, -2172900, -2095585, -1987000, -1854235, -1708644, -1563129, -1429690, -1318159, -1235902, -1187511, -1174025, -1192360, -1235853, -1295597, -1361102, -1419608, -1455443, -1451647, -1394545, -1279310, -1113504, -916795, -717202, -545443, -428873, -385841, -421643, -527735, -685282, -871956, -1069088, -1266394, -1463130, -1665763, -1882748, -2117879, -2364839, -2605971, -2816477, -2972270, -3057647, -3069500, -3017473, -2921761, -2809963, -2712692, -2657705, -2664424, -2741798, -2889780, -3101444, -3363011, -3652536, -3939958, -4189818, -4365883, -4436516, -4379895, -4187616, -3865298, -3430320]
35358c430320N21973N78108O00408N87246N38127M54745L42894K12924P7421n1980
35348D31546j65700k55269l13261l35652l24581k88564k39736j90375j50906j29706
35338a962204j33396j66098k27626l11849m06476m94560n57539n79819n53936
35329e393503m83443l80874k61380j36452j1966J08890K21270L17011L87060M25398
35319e207989M30689M04630L49987K71570J79353Q9537K0622j3766j0781K0964
35309c465184O6864J14944J61860K11818K69636L34198L97227M46644M70668M60941
35299e30384M15460L41089K53367J72530J17782J02467J30875J96156K80135L57061
35289A836538M01578L98007L46274K61268J66023Q2482K4454m561r479k99J0929
$$ y = [-3430320, -2908347, -2330239, -1729831, -1142585, -604458, -149713, 193181, 406105, 483526, 431546, 265846, 10577, -302684, -638336, -962917, -1251481, -1491217, -1681592, -1832498, -1962204, -2095600, -2261698, -2489324, -2801173, -3207649, -3702209, -4259748, -4839567, -5393503, -5876946, -6257820, -6519200, -6655652, -6667618, -6558728, -6337458, -6020447, -5633387, -5207989, -4777300, -4372670, -4022683, -3751113, -3571760, -3482223, -3461601, -3475367, -3486148, -3465184, -3398320, -3283376, -3121516, -2909698, -2640062, -2305864, -1908637, -1461993, -991325, -530384, -114924, 226165, 479532, 652062, 769844, 872311, 1003186, 1199342, 1479477, 1836538, 2238116, 2636123, 2982397, 3243665, 3409688, 3492170, 3516624, 3512063, 3502584, 3502285, 3513214]
35278C513214J2881k128l5892q4408j40737j98929k56398l13041l67960m16669
35268A709933m51673m66509m59861m35809l99810l54165k96938k24441j34132
35259a513405k5675R8859K33769L67959M85421N69605O09494O02908N54455M70224
35249B453614L54014K08491L9904j38146l05856m43042n35617n78224n72016n20841
35239c7719m29966l08332j71201l9280O6736J33532J60580J60571J54446J62967
35229a47666J98457K60204L35261M04083M48343M57145M28942L69446K88638J99451
35219C242304J17374N8127L2557M1556P5116J16804J51023J68455J66942J48902
35209D319160J18509Q0440L9219k051m2454q2002j19593j53360j83724k15279
$$ y = [3513214, 3526095, 3523967, 3488075, 3403667, 3262930, 3064001, 2807603, 2494562, 2126602, 1709933, 1258260, 791751, 331890, -103919, -503729, -857894, -1154832, -1379273, -1513405, -1539080, -1440221, -1206452, -838493, -353072, 216533, 826027, 1428935, 1983390, 2453614, 2807628, 3016119, 3056023, 2917877, 2612021, 2168979, 1633362, 1055138, 483122, -37719, -467685, -776017, -947218, -986498, -919762, -786230, -625650, -465079, -310633, -147666, 50791, 310995, 646256, 1050339, 1498682, 1955827, 2384769, 2754215, 3042853, 3242304, 3359678, 3417805, 3450362, 3491918, 3567034, 3683838, 3834861, 4003316, 4170258, 4319160, 4437669, 4518109, 4557328, 4555277, 4512823, 4430821, 4311228, 4157868, 3974144, 3758865]
35199C758865k53879l00729l49015l86720m03781l98466l78886l59118l52558
35190E75713l65856l95654m28753m45635m26853l60518k47897j04348M5151J73949
35180a980701K61821K99986K91884K50625J94750J42665J06329Q6637P4142N5435
35170b16427K0830l1845r8369j71221k41858l01859l43971l63293l58184l30271
35160b436468k83484k23047j55574r0236l8667j1627j3705m0055p7788j10955
35150c481606j26071j15946q0918k7407L5522R9644J59100K09537K46583K65742
35140b815820K64160K42314K03226J49288Q0003o237j07377k14538l13697l90652
35130b909330m35340m43653m17688l65470k99417k32915j76066j32640r9450o8065
$$ y = [3758865, 3504986, 3204257, 2855242, 2468522, 2064741, 1666275, 1287389, 928271, 575713, 209857, -185797, -614550, -1060185, -1487038, -1847556, -2095453, -2199801, -2154650, -1980701, -1718880, -1418894, -1127010, -876385, -681635, -538970, -432641, -346004, -271862, -216427, -195597, -227442, -325811, -497032, -738890, -1040749, -1384720, -1748013, -2106197, -2436468, -2719952, -2942999, -3098573, -3188809, -3227476, -3239103, -3252808, -3292863, -3370651, -3481606, -3607677, -3723623, -3804541, -3831948, -3796426, -3696782, -3537682, -3328145, -3081562, -2815820, -2551660, -2309346, -2106120, -1956832, -1876829, -1883066, -1990443, -2204981, -2518678, -2909330, -3344670, -3788323, -4206011, -4571481, -4870898, -5103813, -5279879, -5412519, -5511969, -5580034]
35120e580034k8563K5373R1946J60244K14192K39649K30434J90271J30539O5805
35110d260144R051l2146n7369p2405q5907j05253j33276j67236k00572k26665
35100e331922k42112k47019k42483k28322k03784j70440j33886j02002q0664o9940
35090g052574o3060m9009j7551L5768J07402J87747K65832L33994L90204M37492
35080e423755M81202N25406N69984O09865O36607O41170O16386N58840M70644
35071c13651L61025K46451J47976Q6052P4441J15752K00515L10430M24087N22301
35061B175379N90993O21977O13200N69177N00645M22240L48073K86864K39201
35052F367749J98624J55884J03563L8453l8588j23907k12252k97932l76032m43037
$$ y = [-5580034, -5608597, -5583224, -5491278, -5331034, -5116842, -4877193, -4646759, -4456488, -4325949, -4260144, -4251093, -4283239, -4340608, -4413013, -4498920, -4604173, -4737449, -4904685, -5105257, -5331922, -5574034, -5821053, -6063536, -6291858, -6495642, -6666082, -6799968, -6901970, -6982634, -7052574, -7115634, -7164643, -7182194, -7146426, -7039024, -6851277, -6585445, -6251451, -5861247, -5423755, -4942553, -4417147, -3847163, -3237298, -2600691, -1959521, -1343135, -784295, -313651, 47374, 293825, 441801, 527853, 602294, 718046, 918561, 1228991, 1653078, 2175379, 2766372, 3388349, 4001549, 4570726, 5071371, 5493611, 5841684, 6128548, 6367749, 6566373, 6722257, 6825820, 6864273, 6825685, 6701778, 6489526, 6191594, 5815562, 5372525]
35042E372525m96290n32537n46837n33313m88336m14913l25231k38594j74799
35033A621675j46181j52492j81159k12608k28036k16078j75647j14620m5877J7343
35023A66320O5164R2954J01512R6558Q7926Q6917J00873J27618J54683J65268
35013A245793J47024R7827K6100n2992j23142j72086j94286j89950j61674j11497
35003E11117m0139N1356J58232K68470L62441M18265M20832L68286K71579J48516
34993B938955J7481j05663k07793k78356l10555l03761k65175k08521j49483j00023
34983A027106o4334l8157j1689K4752P4623J31967J83235K12775K08169J62846
34973A911293P6576m3931j83841l20805m30027m92996n04920m75520m22343l61135
$$ y = [5372525, 4876235, 4343698, 3796861, 3263548, 2775212, 2360299, 2035068, 1796474, 1621675, 1475494, 1323002, 1141843, 929235, 701199, 485121, 309474, 194854, 148977, 166320, 231484, 324438, 425950, 522508, 610434, 697351, 798224, 925842, 1080525, 1245793, 1392817, 1490644, 1516744, 1463752, 1340610, 1168524, 974238, 784288, 622614, 511117, 470978, 522334, 680566, 949036, 1311477, 1729742, 2150574, 2518860, 2790439, 2938955, 2956436, 2850773, 2642980, 2364624, 2054069, 1750308, 1485133, 1276612, 1127129, 1027106, 962772, 924615, 912926, 937678, 1012301, 1144268, 1327503, 1540278, 1748447, 1911293, 1987869, 1943938, 1760097, 1439292, 1009265, 516269, 11349, -464171, -886514, -1247649]
34963a247649k99298k35588j65129q6178m548O6961J13837J26710J06135O3270
34953a561477J6310j6053k1543J660M5907R9366J52625K03244K55724L16352L85708
34942a22177M54450N06631N28726N17549M81155M32710L82338L32252K77489K10928
34932D002051J28831L3370o8801j69606k61018l34179l78467l83504l44439k67165
34922A957073j69090p3802k492L2978L2395M988l5769p8560j19215j61284k11520
34911A175702k73663l45450m20668m93274n59276o15086o55210o72841o63818
34902c523584o30153n79261n19158m54157l84945l12200k39681j73972j21432
34893f938543q4622o0332m0384j5433J9848O3169J05283J34977J45782J40372
$$ y = [-1247649, -1546947, -1782535, -1947664, -2033842, -2038390, -1971429, -1857592, -1730882, -1624747, -1561477, -1545167, -1561220, -1582763, -1581103, -1535196, -1435830, -1283205, -1079961, -824237, -507885, -122177, 332273, 838904, 1367630, 1885179, 2366334, 2799044, 3181382, 3513634, 3791123, 4002051, 4130882, 4164252, 4095451, 3925845, 3664827, 3330648, 2952181, 2568677, 2224238, 1957073, 1787983, 1714181, 1711689, 1744667, 1777062, 1782050, 1746281, 1667721, 1548506, 1387222, 1175702, 902039, 556589, 135921, -357353, -916629, -1531715, -2186925, -2859766, -3523584, -4153737, -4732998, -5252156, -5706313, -6091258, -6403458, -6643139, -6817111, -6938543, -7023165, -7083497, -7123881, -7139314, -7119466, -7056297, -6951014, -6816037, -6670255, -6529883]
34883f529883J29476J25474J34820J54377J73758J81068J67959J31857P6006Q783
34873e246305n7242j06940j25495j02117l3258P5697K10413L49090M66566N41642
34863d027949N64739N40321M81584M01939L10363K12687J14520K1664o1383j32044
34853a573559j88939k31469k60190k76687k82274k76799k59054k28919j89677
34844c767567j48400j13134q8381p2645o0741m9055l8635l3285l5017m1616m8403
34833d496879n2213n4018n8473p1126r5682j32891j80825k35364k90619l40282
34823f008372l79932m08527m27344m37207m36587m21929l89187l35043k57564
34814i501692j56897l5934R9766K43077L86567N22665O42582P35481P89694P96253
$$ y = [-6529883, -6400407, -6274933, -6140113, -5985736, -5811978, -5630910, -5462951, -5331094, -5255088, -5246305, -5303547, -5410487, -5535982, -5638099, -5671357, -5595660, -5385247, -5036157, -4569591, -4027949, -3463210, -2922889, -2441305, -2039366, -1729003, -1516316, -1401796, -1380132, -1441515, -1573559, -1762498, -1993967, -2254157, -2530844, -2813118, -3089917, -3348971, -3577890, -3767567, -3915967, -4029101, -4117482, -4190127, -4250868, -4299923, -4338558, -4371843, -4406860, -4448476, -4496879, -4549092, -4603110, -4661583, -4732709, -4828391, -4961282, -5142107, -5377471, -5668090, -6008372, -6388304, -6796831, -7224175, -7661382, -8097969, -8519898, -8909085, -9244128, -9501692, -9658589, -9694523, -9594757, -9351680, -8965113, -8442448, -7799866, -7064385, -6274691, -5478438]
34804e478438P52731O65082N46778M15962K91496J88984J18281Q3493Q4343J16548
34794b214740J70776K32452K84281L10523L00837K52988J74711Q3588K747m7295
34784d49132n6405k7350K8322R7991J74442K57161L47701M42261N27460N83658
34774A926109N94421N55555M77191L78238K78089J90967J24423Q0083N4836M2466
34764D702378L5978K9712K0271O558j0228k7105m1445n3866o8884r1441j21653
34753D380275j52571j73380j75948j60219j35195j15079j12517j32241j68511
34744C054614k08072k37034k47592k40602k22912k01542j78651j50330j09827
34735A258052n2663J9886J00821J79746K45139K85680K92033K60101J94433J08649
$$ y = [-5478438, -4725707, -4060625, -3513847, -3097885, -2806389, -2617405, -2499124, -2415631, -2331288, -2214740, -2043964, -1811512, -1527231, -1216708, -915871, -662883, -488172, -404584, -401837, -449132, -505537, -532887, -504565, -406574, -232132, 25029, 372730, 814991, 1342451, 1926109, 2520530, 3076085, 3553276, 3931514, 4209603, 4400570, 4524993, 4605076, 4659912, 4702378, 4738356, 4768068, 4788339, 4794897, 4784669, 4757564, 4716119, 4662253, 4593369, 4501928, 4380275, 4227704, 4054324, 3878376, 3718157, 3582962, 3467883, 3355366, 3223125, 3054614, 2846542, 2609508, 2361916, 2121314, 1898402, 1696860, 1518209, 1367879, 1258052, 1205389, 1225275, 1326096, 1505842, 1750981, 2036661, 2328694, 2588795, 2783228, 2891877]
34725B891877K1133n2106j03020j32317j45955j50810j52298j53890j56936j60336
34715A705342j61030j55478j41131j17191q5449n1671k6056k0724m4687r9101
34705H02824j75452k57258l24552l60014l54986l12787k47182j76240j14515o7709
34695a587871l2721k231K9934O6412J07061J50029J91082K22544K34602K19492
34685d01667J75726J08996K9111n4435j35268k10361k78880l40760l95009m37837
34675a940384m62073m59444m24760l59221k70790j72122p7514L84N3803Q2371
34665d029750R3888J02670J25129J73327K49253L43360M38360N15505N59533N61398
34655h67327N20048M43625L48305K53513J75127J20245Q6577O6409N2229M0127
$$ y = [2891877, 2913010, 2860904, 2757884, 2625567, 2479612, 2328802, 2176504, 2022614, 1865678, 1705342, 1544312, 1388834, 1247703, 1130512, 1045063, 993392, 967336, 946612, 901925, 802824, 627372, 370114, 45562, -314452, -669438, -982225, -1229407, -1405647, -1520162, -1587871, -1620592, -1622823, -1592889, -1526477, -1419416, -1269387, -1078305, -855761, -621159, -401667, -225941, -116945, -87834, -142269, -277537, -487898, -766778, -1107538, -1502547, -1940384, -2402457, -2861901, -3286661, -3645882, -3916672, -4088794, -4166308, -4165924, -4112121, -4029750, -3935862, -3833192, -3708063, -3534736, -3285483, -2942123, -2503763, -1988258, -1428725, -867327, -347279, 96346, 444651, 698164, 873291, 993536, 1080113, 1146522, 1198751, 1238878]
34645A238878K9534K0945J3885N773q594l6058q1939j46546k24536l07627l87501
34634A16214m56365n06550n32064n32093n13048m86155m61341m41195m19064l82855
34624d614516l22079k33743j23909n516J04900J90124K35437K32661J83987J03316
34614d249338J3474o0158r7147q7360l2190N7933J67574K79861L78916M51559
34604c176876M89106M89559M59279M12419L66870L37701L31036L41370L53529
34595D03993L48379L09990K31624J18351j4582j46751k58712l36794l74869l73242
34585i2613l36257k70440j83865q5887J3980J08333J94148K73065L48575M21117
34575C90156M84272N25215N30217M92221M15796L16060K12304J20370M8335k898
$$ y = [1238878, 1268412, 1289357, 1303242, 1309015, 1300421, 1264363, 1182424, 1035878, 811342, 503715, 116214, -340151, -846701, -1378765, -1910858, -2423906, -2910061, -3371402, -3812597, -4231661, -4614516, -4936595, -5170338, -5294247, -5299763, -5194863, -5004739, -4769302, -4536641, -4352654, -4249338, -4235864, -4296022, -4393169, -4480529, -4512719, -4454786, -4287212, -4007351, -3628435, -3176876, -2687770, -2198211, -1738932, -1326513, -959643, -621942, -290906, 50464, 403993, 752372, 1062362, 1293986, 1412337, 1397755, 1251004, 992292, 655498, 280629, -92613, -428870, -699310, -883175, -969062, -955082, -846749, -652601, -379536, -30961, 390156, 874428, 1399643, 1929860, 2422081, 2837877, 3153937, 3366241, 3486611, 3534946, 3532048]
34565C532048l5943n3646n8496n4562m9362n2753p2377j08965j55837k03507k45557
34554B441043k80956l11789l39298l61649l74615l74231l59664l34660l06476
34545f02295k82817k68617k64416k66832k70466k70083k62188k45490k20346j87730
34535c141280j48165j00969m4170K4602J06482J99392K96453L85748M52839M86263
34525a482805M83467M52957M10547L71973L46400L33794L26257L12038K80667
34516A835295K27356J54850P2468o314o6730r6352q9538n0581P365O7572J15857
34505B171248J43820J48719J32218R9537N8691J8887j1640k7247k5435o844K4547
34494B726501O0910R0764J01220Q2404L1969m3040j27881k04017k53830k65856
$$ y = [3532048, 3496105, 3442459, 3383963, 3329401, 3280039, 3227286, 3154909, 3045944, 2890107, 2686600, 2441043, 2160087, 1848298, 1509000, 1147351, 772736, 398505, 38841, -295819, -602295, -885112, -1153729, -1418145, -1684977, -1955443, -2225526, -2487714, -2733204, -2953550, -3141280, -3289445, -3390414, -3434584, -3409982, -3303500, -3104108, -2807655, -2421907, -1969068, -1482805, -999338, -546381, -135834, 236139, 582539, 916333, 1242590, 1554628, 1835295, 2062651, 2217501, 2289969, 2283655, 2216925, 2120573, 2031035, 1980454, 1987819, 2055391, 2171248, 2315068, 2463787, 2596005, 2695542, 2754233, 2773120, 2761480, 2734233, 2708798, 2701954, 2726501, 2787411, 2878175, 2979395, 3061799, 3093768, 3050728, 2922847, 2718830, 2465000, 2199144]
34484B199144k39489j85797j21920o1851j0584L4144P5511J13304J44880J68802
34474B116144J86684K01526K14249K21495K16605J93462J50876R4867L7642o291
34464C627259k5683j8282N571K4324J2474m8952j63920l19078m88025o39646p47182
34453A218860p95404p83669p23310o30121n16307l87167k44550r3334N5096J85168
34443b714738K83028L41427L60968L48037L11277K58467J95310J26639N9127K919
34433d27539l0145l1677k250M6385R4176J19221J04895M5197n2670j68867k74866
34422e78140l40426l42083k70637j34968L9500K17643L64899M57413M88478M68547
34412C70226M18688L60231L05564K54839K00133J34106N7349k0377q5170j26107
$$ y = [2199144, 1959655, 1773858, 1651938, 1590087, 1579503, 1613647, 1689158, 1802462, 1947342, 2116144, 2302828, 2504354, 2718603, 2940098, 3156703, 3350165, 3501041, 3595908, 3633550, 3627259, 3601576, 3583294, 3588865, 3613189, 3625663, 3576711, 3412791, 3093713, 2605688, 1966042, 1218860, 423456, -360213, -1083523, -1713644, -2229951, -2617118, -2861668, -2955002, -2899906, -2714738, -2431710, -2090283, -1729315, -1381278, -1070001, -811534, -616224, -489585, -430458, -427539, -457684, -489361, -491611, -445226, -351050, -231829, -126934, -81737, -134407, -303274, -578140, -918566, -1260649, -1531286, -1666254, -1626754, -1409111, -1044212, -586799, -98321, 370226, 788914, 1149145, 1454709, 1709548, 1909681, 2043787, 2101136, 2080759, 1995589, 1869482]
34402A869482j39505j28648j00980o5392l0157q84K0731L5423M2345L6338J0410
34391A549163l7634j00317j62323k07942k28430k24643k04839j80240j60783j52137
34381a10125j54743j64988j77612j87924j93161j93001j88726j80761j66251j39793
34371a857085r8134m5339O482M2264N1520L3769o52l4472n0546l9174j957M9836
34359a943488J01278J40387J61983J67702J63387J55913J50732J50167J51931
34350f00008J48373J27814P8911l502j14155k37569l53404m44456n02757n29858
34340b430611n31433n10715m66182l95077k99251j88031p5572K5187J07054J68273
34330d596358K08660K26709K20950J94063J55431J19166R8695J01298J25686J63625
$$ y = [1869482, 1729977, 1601329, 1500349, 1434957, 1404800, 1403916, 1424647, 1460070, 1502415, 1538753, 1549163, 1511529, 1411212, 1248889, 1040947, 812517, 587874, 383035, 202795, 42012, -110125, -264868, -429856, -607468, -795392, -988553, -1181554, -1370280, -1551041, -1717292, -1857085, -1955219, -2000558, -1994076, -1951812, -1900292, -1866523, -1867175, -1901647, -1952193, -1991367, -1993324, -1943488, -1842210, -1701823, -1539840, -1372138, -1208751, -1052838, -902106, -751939, -600008, -451635, -323821, -244910, -248412, -362567, -600136, -953540, -1397996, -1900753, -2430611, -2962044, -3472759, -3938941, -4334018, -4633269, -4821300, -4896872, -4871685, -4764631, -4596358, -4387698, -4160989, -3940039, -3745976, -3590545, -3471379, -3372684, -3271386, -3145700, -2982075]
34320b982075K04310K38666K61235K69723K63983K45472K16632J79945J38020
34311i64089R5461O0318M1888M4875O4759Q9396J06931J14562J21443J43323J92431
34300A11298K69426L62194M50892N14456N34912M99549M03103K50271N6618j53673
34290C299046l52347n12401o13320o45588o12417n26928m05655k62215j04305
34281g36130O5159K44257M27138O00340P43202Q34053Q59392Q20377P32187O17101
34271E207076M96294L85013K92203K22162J75381J47933J31011J12206P8358J9029
34261G266666o9972j83659l07233m19724n01189n39640n33593m89404m16122l21445
34251C484685k10822q9301L6012J55226K57813L36648L91370M28304M55917M77940
$$ y = [-2982075, -2777765, -2539099, -2277864, -2008141, -1744158, -1498686, -1282054, -1102109, -964089, -868628, -808310, -766422, -721547, -656788, -567392, -460461, -345899, -224456, -81133, 111298, 380724, 742918, 1193810, 1708266, 2243178, 2742727, 3145830, 3396101, 3452719, 3299046, 2946699, 2434298, 1820978, 1175390, 562973, 36045, -369610, -631825, -736130, -670971, -426714, 424, 600764, 1343966, 2178019, 3037411, 3857788, 4589975, 5207076, 5703370, 6088383, 6380586, 6602748, 6778129, 6926062, 7057073, 7169279, 7247637, 7266666, 7196694, 7013035, 6705802, 6286078, 5784889, 5245249, 4711656, 4222252, 3806130, 3484685, 3273863, 3184562, 3220574, 3375800, 3633613, 3970261, 4361631, 4789935, 5245852, 5723792]
34241E723792M89163M77824M33386L53741K46634J25464L651j08965k07218k89879
34231G247593l57298m08334m38611m41866m13711l55183k73864j82226r4376k2689
34221D259435K4762M5492M2157K0167j5648o2961j20638j85247k48909l01229
34211C457381l34217l46387l42728l30596l14606k94275k65713k25467j73058
34202H30334j10766m2142K8433R5019J50089J86437J99840J90346J61390J17954
34192A806934O5119P194n3095j14794j77056k35885k82567l07109l05293k83128
34182A20320k53395k26379k02895j76088j40092r7585n9473l7070l3076l7908
34172a143641l3588k208O6128J69588K95638M25081N37033O13815O45227O31146
$$ y = [5723792, 6212955, 6690779, 7124165, 7477906, 7724540, 7850004, 7853655, 7744690, 7537472, 7247593, 6890295, 6481961, 6043350, 5601484, 5187773, 4832590, 4558726, 4376500, 4282124, 4259435, 4284197, 4329689, 4371846, 4392013, 4376365, 4313404, 4192766, 4007519, 3758610, 3457381, 3123164, 2776777, 2434049, 2103453, 1788847, 1494572, 1228859, 1003392, 830334, 719568, 677426, 705859, 800878, 950967, 1137404, 1337244, 1527590, 1688980, 1806934, 1872053, 1879247, 1826152, 1711358, 1534302, 1298417, 1015850, 708741, 403448, 120320, -133075, -359454, -562349, -738437, -878529, -976114, -1035587, -1072657, -1105733, -1143641, -1177229, -1179437, -1113309, -943721, -648083, -223002, 314031, 927846, 1573073, 2204219]
34162B204219N80978N09875M33898L66647L17659K90729K81468K76622K58239
34153E520334K11925J34181L4011p1529j64280k30752k65057k68764k48029k09387
34143D442653j56781r1622j5422O7361J48378K17109K64544K86874K86342K67957
34133E717393K34473J84250J14255K5224p5884j77882k69633l43828l99207m40963
34123D568198m78559n21360n74191o35381o97768p51439p87110p99605p90269
34114a467484p66660p38892p14092o91989o64254o18854n47727m53618l51281
34105g014851k61491k01258j76359j80423k00032k21600k35655k37052k22797
34096h951518j90297j37573o4972K3408J19942K15628L02878L77562M39598M92291
$$ y = [2204219, 2785197, 3295072, 3728970, 4095617, 4413276, 4704005, 4985473, 5262095, 5520334, 5732259, 5866440, 5900451, 5828922, 5664642, 5433890, 5168833, 4900069, 4652040, 4442653, 4285872, 4194250, 4178828, 4246189, 4394567, 4611676, 4876220, 5163094, 5449436, 5717393, 5951866, 6136116, 6250371, 6275595, 6199711, 6021829, 5752196, 5408368, 5009161, 4568198, 4089639, 3568279, 2994088, 2358707, 1660939, 909500, 122390, -677215, -1467484, -2234144, -2973036, -3687128, -4379117, -5043371, -5662225, -6209952, -6663570, -7014851, -7276342, -7477600, -7653959, -7834382, -8034414, -8256014, -8491669, -8728721, -8951518, -9141815, -9279388, -9344360, -9320952, -9201010, -8985382, -8682504, -8304942, -7865344, -7373053]
34086g373053N40578N88280O35219O76183P02839P07241O84212O31600N49823
34077a657078M42514L17872J89035P2140j7832p2275r3048r2477q7504r0187j00478
34066a189318j06724r3972n4238Q237P9265J41298J79400J84016J51489Q3949
34056f16598j0933j20782k30298l23843l88526m16979m08524l67963l02953k21808
34046c409207j32621m3009M0399J12837J72184K19441K58324K93074L24627L47761
34036a816190L52267L28206K71209J83787P2657n4359j88840l20328m35432n19175
34026b126198n58355n45472m81528l76113k44282j01652L9429J70581K85355L77024
34016c561211M38438M64011M52043M05681L32480K43427J51770P1318J4190j1401
$$ y = [-7373053, -6832475, -6244195, -5608976, -4932793, -4229954, -3522713, -2838501, -2206901, -1657078, -1214564, -896692, -707657, -635517, -653349, -725624, -818672, -911149, -998653, -1088840, -1189318, -1296042, -1390014, -1444252, -1436015, -1356750, -1215452, -1036052, -852036, -700547, -616598, -627531, -748313, -978611, -1302454, -1690980, -2107959, -2516483, -2884446, -3187399, -3409207, -3541828, -3584837, -3544438, -3431601, -3259417, -3039976, -2781652, -2488578, -2163951, -1816190, -1463923, -1135717, -864508, -680721, -608064, -662423, -851263, -1171591, -1607023, -2126198, -2684553, -3230025, -3711553, -4087666, -4331948, -4433600, -4394171, -4223590, -3938235, -3561211, -3122773, -2658762, -2206719, -1801038, -1468558, -1225131, -1073361, -1002043, -987853, -999254]
34006i99254l138L3641Q5526J34084J62669J63628J40983J06763P3660M8436K8995
33995b4007N936l2302r2973j74309k64721l45738l96904m00723l46639k33411
33985b305791o9823J26021L28666N09013O40139P04022O96441O27651N18569L94258
33975B169166K76916J80202J06401M7598r399p6770j61330k63603l79107m99776
33965A390298o14997p12956p82232q12805p96356p27325o05490m38665k43119
33956d343647m0979J44192K92331L91454M40695M49954M35597M13993L96032L84675
33946a035703L75503L59332L26238K70266J93195J04897J9290n1913j03502j36595
33936C21008j55832j67588j80484k05299k51401l20757m04385m84750n42974n66395
$$ y = [-999254, -1002392, -968751, -883225, -749141, -586472, -422844, -281861, -175098, -101438, -53002, -24007, -18071, -50373, -143346, -317655, -582376, -928114, -1325018, -1725741, -2072380, -2305791, -2375614, -2249593, -1920927, -1411914, -771775, -67753, 628688, 1256339, 1774908, 2169166, 2446082, 2626284, 2732685, 2780283, 2770884, 2694114, 2532784, 2269181, 1890074, 1390298, 775301, 62345, -719887, -1532692, -2329048, -3056373, -3661863, -4100528, -4343647, -4384626, -4240434, -3948103, -3556649, -3115954, -2666000, -2230403, -1816410, -1420378, -1035703, -660200, -300868, 25370, 295636, 488831, 593728, 613018, 561105, 457603, 321008, 165176, -2412, -182896, -388195, -639596, -960353, -1364738, -1849488, -2392462, -2958857]
33926b958857n52604n08751m47183l79859l14443k53869j98472j47804j00425
33917e862267n3229k908N0403J00518J36947J50639J39628J10245P3219L8258
33907e118547J1851p88O602L9574R7397J68691K33269K70113K66834K25251J60589
33896c639164R5290N0685M0065O5512J19103J87267K55791L12836L49287L58307
33886a805021L36532K86495K17557J43663P9358L6372K1218L3446O5738J07304
33876d77338J49300J88183K24331K57556K83472K93651K79661K38863J78237J12847
33866A728763N8850K5119Q952j898k2996o6465j36168k25806l20330m00584m49858
33855A97579m59674m32464l80385l21323k73736k51501k59770k93136l37458l75183
$$ y = [-2958857, -3511461, -4020212, -4467395, -4847254, -5161697, -5415566, -5614038, -5761842, -5862267, -5915496, -5918404, -5868001, -5767483, -5630536, -5479897, -5340269, -5230024, -5156805, -5118547, -5106696, -5107484, -5100882, -5061308, -4963911, -4795220, -4561951, -4291838, -4025004, -3799753, -3639164, -3543874, -3493189, -3453124, -3387612, -3268509, -3081242, -2825451, -2512615, -2163328, -1805021, -1468489, -1181994, -964437, -820774, -741416, -705044, -683826, -650380, -584642, -477338, -328038, -139855, 84476, 342032, 625504, 919155, 1198816, 1437679, 1615916, 1728763, 1787613, 1812732, 1821684, 1819786, 1796790, 1730325, 1594157, 1368351, 1048021, 647437, 197579, -262095, -694559, -1074944, -1396267, -1670003, -1921504, -2181274, -2474410, -2811868, -3187051]
33845c187051l91895l80893l44218k90714k32750j82600j48900j34199j35052
33836e428272j44920j57651j68657j73194j64311j33242p2366K1394J44612K87485
33826e989122M36133N77071P01922Q08927Q99439R72006J019483J031740J001192
33817A458791R26054Q09619O58280M81320K91659J04442o7121k15180l36695m30041
33807C681128m92975n23869n24069m98392m53569l96391l32532k65607j96539
33798b815j24296m8384K8627J00823J61256K04853K29527K35330K23234J94982
33788A203137J53490J02820M7844n595n0623q1155r5550r8963j01337j12148j36346
33777H25574j74084k22777k78381l35072l84656m17064m22101l92132l25045k26031
$$ y = [-3187051, -3578946, -3959839, -4304057, -4594771, -4827521, -5010121, -5159021, -5293220, -5428272, -5573192, -5730843, -5899500, -6072694, -6237005, -6370247, -6442613, -6421219, -6276607, -5989122, -5552989, -4975918, -4273996, -3465069, -2565630, -1593624, -574141, 457599, 1458791, 2384845, 3194464, 3852744, 4334064, 4625723, 4730165, 4663044, 4447864, 4111169, 3681128, 3188153, 2664284, 2140215, 1641823, 1188254, 791863, 459331, 193724, -2815, -127111, -175495, -146868, -46045, 115211, 320064, 549591, 784921, 1008155, 1203137, 1356627, 1459447, 1507291, 1501696, 1451073, 1369918, 1274368, 1175405, 1074068, 961920, 825574, 651490, 428713, 150332, -184740, -569396, -986460, -1408561, -1800693, -2125738, -2351769]
33767b351769j06710J8288J35134K32885L03689L42624L48466L25204K82792K35594
33757b33803J98221J80330J82843J97291K08262J97998J52675O9275l9923j49454
33747I63715k30783k65612k53959k11488j58443j08583o5323k5862J2247M8072
33737b96019P9383J06291J31948J59017J84937K00474J93508J55715Q7379k865
33727I99768j02369j99089k83835l50672l97050m23825m34235m32161m20904m02632
33717b447004l77236l40854k87013k12173j22199l3212L5767P3617Q3396Q0075
33707c546836Q1926J01095J38326J84135K25442K53742K69734K81777K99889L29719
33697a381051L69975M13582M50709M71540M68010M34852L70790K80361J75391
$$ y = [-2351769, -2458479, -2440191, -2305057, -2072172, -1768483, -1425859, -1077393, -752189, -469397, -233803, -35582, 144748, 327591, 524882, 733144, 931142, 1083817, 1153092, 1113169, 963715, 732932, 467320, 213361, 1873, -156570, -265153, -330476, -356338, -344091, -296019, -216636, -110345, 21603, 180620, 365557, 566031, 759539, 915254, 1002633, 999768, 897399, 698310, 414475, 63803, -333247, -757072, -1191307, -1623468, -2044372, -2447004, -2824240, -3165094, -3452107, -3664280, -3786479, -3819691, -3783924, -3710307, -3626911, -3546836, -3464910, -3363815, -3225489, -3041354, -2815912, -2562170, -2292436, -2010659, -1710770, -1381051, -1011076, -597494, -146785, 324755, 792765, 1227617, 1598407, 1878768, 2054159]
$$ [...]
##END NTUPLES=NMR SPECTRUM
##END=
