##TITLE=31Pdec_21-2025
 CDCl3, 24 sc
 3.2.2025
##JCAMPDX= 6.0         $$ Bruker NMR JCAMP-DX V2.0
##DATA TYPE= NMR SPECTRUM
##DATA CLASS= NTUPLES
##ORIGIN= UXNMR, Bruker Analytische Messtechnik GmbH
##OWNER= root
$$ XWIN-NMR		Version 3.5
$$ Tue Feb  4 13:59:46 2025 Russian Standard Time (UT+4h)  she@DPX200
##.OBSERVE FREQUENCY= 81.013821
##.OBSERVE NUCLEUS= ^31P
##.ACQUISITION MODE= SIMULTANEOUS
##.ACQUISITION SCHEME= undefined
##.AVERAGES= 24
##.DIGITISER RES= 17
##SPECTROMETER/DATA SYSTEM= spect
##.PULSE SEQUENCE= zgpg30
##.SOLVENT NAME= D2O
##.SHIFT REFERENCE= (INTERNAL, D2O, 0, 198.062)
##AUDIT TRAIL= $$ (NUMBER, WHEN, WHO, WHERE, WHAT)
$$ ##TITLE= Audit trail, XWIN-NMR		Version 3.5
$$ ##JCAMPDX= 5.01
$$ ##ORIGIN= Bruker BioSpin GmbH
$$ ##OWNER= she
$$ F:/spectra/data/she/nmr/P31/2/pdata/1/auditp.txt
$$ ##AUDIT TRAIL=  $$ (NUMBER, WHEN, WHO, WHERE, WHAT)
(   1,<2025-02-04 13:58:32.04 +0400>,<she>,<DPX200>,
      <created by zg, POWCHK disabled, PULCHK disabled
       configuration hash MD5:
       00 E9 B6 7A A2 85 ED C7 34 08 36 98 17 FE 4E 26
       data hash MD5: 32K
       63 EC 0D C6 19 3C 08 1F 78 73 FA 17 0A DD 92 DD>)
(   2,<2025-02-04 13:58:34.51 +0400>,<she>,<DPX200>,
      <Start of raw data processing
       efp BC_mod = 2 LB = 1.5 FT_mod = 6 PKNL = 1 PHC0 = 1716.837 PHC1 = 177.2909 SI = 64K 
       data hash MD5: 64K
       3A CB D7 25 09 D4 4A B0 72 77 8E D6 40 2C E1 23>)
(   3,<2025-02-04 13:59:13.82 +0400>,<she>,<DPX200>,
      <pk PHC0 = -370.201 PHC1 = 852.0045 
       data hash MD5: 64K
       E8 D8 CE 7D F9 FA F3 4D BA 4D D5 E6 BE 67 5C 4D>)
$$ ##END=
$$ 
$$ hash MD5
$$ FE 6E 7D 8E 76 A0 69 13 5F 39 09 6A BD 51 0A 73
##$RELAX= 
##$RELAX= 
##$RELAX= 
##$RELAX= 
##$RELAX= 
##$RELAX= 
##$RELAX= 
##$RELAX= 
$$ Bruker specific parameters
$$ --------------------------
##$DU= <F:/spectra>
##$EXPNO= 2
##$NAME= <P31>
##$PROCNO= 1
##$TYPE= <nmr>
##$USER= <she>
##$AMP= (0..31)
100 100 100 100 100 100 100 100 100 100 100 100 100 100 100 100 100 100 
100 100 100 100 100 100 100 100 100 100 100 100 100 100 
##$AQSEQ= 0
##$AQ_mod= 1
##$AUNM= <au_zg>
##$AUTOPOS= <>
##$BF1= 81.014009
##$BF2= 200.13
##$BF3= 200.13
##$BF4= 200.13
##$BF5= 200.13
##$BF6= 200.13
##$BF7= 200.13
##$BF8= 200.13
##$BYTORDA= 1
##$CFDGTYP= 0
##$CFRGTYP= 5
##$CHEMSTR= <none>
##$CNST= (0..31)
1 1 145 1 1 1 1 1 1 1 1 1 1 1 1 1 1 1 1 1 1 1 1 1 1 1 1 1 1 1 1 1 
##$CPDPRG= <waltz16>
##$CPDPRG1= <>
##$CPDPRG2= <waltz16>
##$CPDPRG3= <>
##$CPDPRG4= <mlev>
##$CPDPRG5= <mlev>
##$CPDPRG6= <mlev>
##$CPDPRG7= <mlev>
##$CPDPRG8= <mlev>
##$CPDPRGB= <>
##$CPDPRGT= <>
##$D= (0..31)
0 1 0 0 0 0 0 0 0 0.06 0 0.03 2e-05 3e-06 0 0 0.0002 0 0 0 0 0 0 0 0 0 
0 0 0 0 0 0 
##$DATE= 1738663111
##$DBL= (0..7)
120 120 120 11 120 120 24 19 
##$DBP= (0..7)
150 150 150 150 150 150 150 150 
##$DBP07= 0
##$DBPNAM0= <>
##$DBPNAM1= <>
##$DBPNAM2= <>
##$DBPNAM3= <>
##$DBPNAM4= <>
##$DBPNAM5= <>
##$DBPNAM6= <>
##$DBPNAM7= <>
##$DBPOAL= (0..7)
0.5 0.5 0.5 0.5 0.5 0.5 0.5 0.5 
##$DBPOFFS= (0..7)
$$ [...]
##$SUBNAM2= <"">
##$SUBNAM3= <"">
##$SUBNAM4= <"">
##$SUBNAM5= <"">
##$SUBNAM6= <"">
##$SUBNAM7= <"">
##$SUBNAM8= <"">
##$SUBNAM9= <"">
##$SW= 400.765351723535
##$SWIBOX= (0..15)
0 1 3 0 0 0 0 0 0 0 0 0 0 0 0 0 
##$SW_h= 32467.5324675325
##$TD= 32768
##$TD0= 1
##$TE= 0
##$TE2= 300
##$TE3= 300
##$TEG= 300
##$TL= (0..7)
0 120 53 12 22 120 120 120 
##$TP= (0..7)
150 150 150 150 150 150 150 150 
##$TP07= 0
##$TPNAME0= <>
##$TPNAME1= <>
##$TPNAME2= <>
##$TPNAME3= <>
##$TPNAME4= <>
##$TPNAME5= <>
##$TPNAME6= <>
##$TPNAME7= <>
##$TPOAL= (0..7)
0.5 0.5 0.5 0.5 0.5 0.5 0.5 0.5 
##$TPOFFS= (0..7)
0 0 0 0 0 0 0 0 
##$TUNHIN= 0
##$TUNHOUT= 0
##$TUNXOUT= 0
##$USERA1= <user>
##$USERA2= <user>
##$USERA3= <user>
##$USERA4= <user>
##$USERA5= <user>
##$V9= 5
##$VALIST= <valist>
##$VCLIST= <CCCCCCCCCCCCCCC>
##$VD= 0
##$VDLIST= <DDDDDDDDDDDDDDD>
##$VPLIST= <PPPPPPPPPPPPPPP>
##$VTLIST= <TTTTTTTTTTTTTTT>
##$WBST= 1024
##$WBSW= 4
##$XGAIN= (0..3)
0 0 0 0 
##$XL= 0
##$YL= 0
##$YMAX_a= 4658
##$YMIN_a= -5030
##$ZGOPTNS= <>
##$ZL1= 120
##$ZL2= 120
##$ZL3= 120
##$ZL4= 120
##$ABSF1= 0
##$ABSF2= 0
##$ABSG= 0
##$ABSL= 0
##$ALPHA= 0
##$AQORDER= 0
##$ASSFAC= 0
##$ASSFACI= 0
##$ASSFACX= 0
##$ASSWID= 0
##$AUNMP= <proc_1d>
##$AZFE= 0.1
##$AZFW= 0.5
##$BCFW= 0
##$BC_mod= 2
##$BYTORDP= 0
##$COROFFS= 0
##$CY= -3
##$DATMOD= 1
##$DC= 0
##$DFILT= <>
##$DTYPP= 0
##$F1P= 0
##$F2P= 0
##$FCOR= 1
##$FTSIZE= 65536
##$FT_mod= 6
##$GAMMA= 0
##$GB= 0
##$INTBC= 1
##$INTSCL= 9.790993e-09
##$ISEN= 30
##$LB= 1.5
##$LEV0= 0
##$LPBIN= 0
##$MAXI= 10000
##$MC2= 0
##$MEAN= 0
##$ME_mod= 0
##$MI= 50
##$NCOEF= 0
##$NC_proc= -8
##$NLEV= 6
##$NOISF1= 182.463
##$NOISF2= 159.3651
##$NSP= 0
##$NTH_PI= 0
##$NZP= 0
##$OFFSET= 198.0616
##$PC= 4
##$PHC0= 1346.636
##$PHC1= 1029.295
##$PH_mod= 1
##$PKNL= yes
##$PPARMOD= 0
##$PSCAL= 0
##$PSIGN= 0
##$REVERSE= no
##$SF= 81.0140089999434
##$SI= 65536
##$SIGF1= 159.3651
##$SIGF2= -187.1042
##$SINO= 113.3802
##$SIOLD= 16384
##$SREGLST= <1H.CDCl3>
##$SSB= 0
##$STSI= 65536
##$STSR= 0
##$SW_p= 32467.5324675325
##$SYMM= 0
##$S_DEV= 0
##$TDeff= 32768
##$TDoff= 0
##$TI= <>
##$TILT= no
##$TM1= 0
##$TM2= 0
##$TOPLEV= 0
##$USERP1= <user>
##$USERP2= <user>
##$USERP3= <user>
##$USERP4= <user>
##$USERP5= <user>
##$WDW= 1
##$XDIM= 65536
##$YMAX_p= 354156135
##$YMIN_p= -38690921
$$ End of Bruker specific parameters
$$ ---------------------------------
##NTUPLES= NMR SPECTRUM
##VAR_NAME=  FREQUENCY,     SPECTRUM/REAL,   SPECTRUM/IMAG
##SYMBOL=    X,             R,               I
##VAR_TYPE=  INDEPENDENT,   DEPENDENT,       DEPENDENT
##VAR_FORM=  AFFN,          ASDF,            ASDF
##VAR_DIM=   65536,         65536,           65536
##UNITS=     HZ,            ARBITRARY UNITS, ARBITRARY UNITS
##FACTOR=    0.49542278885378, 1,            1
##FIRST=     16045.7642231865, 0,            0
##LAST=      -16421.768244346, 0,            0
##MIN=       -16421.768244346, -38690921,    0
##MAX=       16045.7642231865, 354156135,    0
$$ Real data points
##PAGE= N=1
##DATA TABLE= (X++(R..R)), XYDATA
$$ [...]
39832a855145N66312J021898J293987R69132j95722j961227l446225l521980j782058
39823h911028P14179J989064R63918j197347k085270o85589J487946K372524J855755
39814c495848J397433J592117J456691K92946j078505j574473j293794q99973
39806c603406l94552N41505J543701J859438J344610M17585o14691j417769j249862
39797a573441K48411K000728K237148N08394j699621k549534j591103J28075J231251
39788a059692J217945Q05246J022749J793179J784245R0601k335575l550283k684430
39779b916015o18981J102697J473493N28493o09202m95683J045989K391747J979865
39770C882403L67372n55232j09845O00602N89627J75830P6599M66419J233877
$$ plain form
39832 -1855145 -1288833 -266935 1027052 1996184 1800462 -160765 -3606990 -7128970 -8911028
39823 -8911028 -8196849 -6207785 -5243867 -6441214 -8526484 -9212073 -7724127 -5351603 -3495848
39814 -3495848 -2098415 -506298 950393 1243339 164834 -1409639 -2703433 -3603406
39806 -3603406 -3997958 -3456453 -1912752 -53314 1291296 1708881 1094190 -323579 -1573441
39797 -1573441 -1325030 675698 2912846 3421240 1721619 -827915 -2419018 -2290943 -1059692
39788 -1059692 158253 963499 1986248 3779427 5563672 5654273 3318698 -231585 -2916015
39779 -2916015 -3534996 -2432299 -958806 -430313 -1039515 -1535198 -489209 1902538 3882403
39770 3882403 4249775 3694543 3584698 4185300 4774927 4950757 5027356 5493775 6727652
39761F727652K133543K440886J600123N13306Q47641K477782L021262R24199k201576
39752A8484818l659665l203266k887913l763735m409527l137724m28978J597857
39744a408133J586455J46753j178818j589726j400327j012351j94375J191103
39736c859419K278779J951645M23495r21516j408848j675088k014628j485570
39728f711150L27310J815212J194790o76387j066401R38052L072560K859068P27274
39719B480328q20343m82165N42053M55436q98678k155974k275445j584493r67854
39710e707135o21127o1403Q88842J698674J778554J156633M10592J64450N98305
39701C06385J174399J043448J52681l74148L02645J212954O67289j132314k007330
$$ plain form
39761 6727652 8861195 11302081 12902204 13415510 14263151 16740933 19762195 20686394 18484818
39752 18484818 14825153 11621887 8733974 4970239 560712 -2577012 -3005990 -1408133
39744 -1408133 178322 325075 -853743 -2443469 -3843796 -4856147 -5050522 -3859419
39736 -3859419 -1580640 371005 794500 -127016 -1535864 -3210952 -5225580 -6711150
39728 -6711150 -6383840 -4568628 -3373838 -4050225 -5116626 -4178574 -1106014 1753054 2480328
39719 2480328 1659985 1177820 1719873 2175309 1276631 -879343 -3154788 -4739281 -5707135
39710 -5707135 -6328262 -6389665 -5500823 -3802149 -2023595 -866962 -456370 -291920 306385
39701 306385 1480784 2524232 2676913 2302765 2605410 3818364 4485653 3353339 1346009
39692A346009q29498P87490P83118n75379j519055j478770j397440j762731j891406
39683f537662j248651k57306M55978P66127Q50523R29916J170406J286702N69669
39674b014298r52579j855746q89533J116565K129786J538615O51501O41196J301579
39665A667086J872515J729314K11525k615829m776154l828540k57800K355564
39657c642319J666796n51026j233975j60440O56419N22253O07647J320754J511601
39648F97710O56124j49384j29124j82664j300728k776703l096764j902244j00207
39639h283984J458142K469523K681429J864083L22977j182806k073276k089597
39631d833509j035507R04582K629864K812868J518938L99726O47994J369409Q90505
$$ plain form
39692 1346009 516511 1304001 2087119 1511740 -7315 -1486085 -2883525 -4646256 -6537662
39683 -6537662 -7786313 -8043619 -7587641 -6821514 -5970991 -5041075 -3870669 -2583967 -2014298
39674 -2014298 -2966877 -4822623 -5712156 -4595591 -2465805 -927190 -275689 365507 1667086
39665 1667086 3539601 5268915 5480440 2864611 -1911543 -5740083 -5997883 -3642319
39657 -3642319 -1975523 -2526549 -3760524 -3920964 -3264545 -2742292 -2134645 -813891 697710
39648 697710 1353834 1204450 1075326 892662 -408066 -3184769 -6281533 -8183777 -8283984
39639 -8283984 -6825842 -4356319 -1674890 189193 512170 -670636 -2743912 -4833509
39631 -4833509 -5869016 -4964434 -2334570 478298 1997236 2396962 3044956 4414365 5304870
39622E304870p15921j650729j001416J9630N9282m17174k84393J13593l87396
39613A040346j437764j338406K64044J589003J290609K65658j15443k04800j048765
39604C04482k128847j903855k95669J049986J146777Q50162J172334J654612J272389
39595C122371J78225m59314j10415M76109M25261r4852l16417j91355n18651j487330
39585A023632j883029o94584R20438P34289j269331k331701n64642K265845L072324
39576A273241J509048j13853l31985J26028L45790M34606L40055n44974j835334
39567A202622j968696n48885O78512L12985o65058o31751K14869O43608N70160
39558a91634P68029J158078J054292N77864K62125k07790j217444j750764o23652
$$ plain form
39622 5304870 4588949 2938220 1936804 1956434 2015716 1598542 1314149 1427742 1040346
39613 1040346 -397418 -1735824 -1471780 117223 1407832 1673490 1558047 1353247 304482
39604 304482 -1824365 -3728220 -4023889 -2973903 -1827126 -976964 195370 1849982 3122371
39595 3122371 3300596 2841282 2730867 3206976 3632237 3537385 3220968 3029613 2510962 1023632
39585 1023632 -859397 -1553981 -633543 100746 -1168585 -3500286 -4064928 -1799083 1273241
39576 1273241 2782289 2668436 2336451 2462479 2808269 3242875 3582930 3037956 1202622
39567 1202622 -766074 -1314959 -636447 -323462 -988520 -1620271 -1405402 -761794 -191634
39558 -191634 576395 1734473 2788765 3366629 3628754 3420964 2203520 452756 -170896
39549a70896J163544J459996K95869j55780P45338J018606m26143j700832r84856
39540A244846M81410N90872r7109L94281J652317J204869j336502l122826j930215
39531i18057P80333J910681N94318j261284j644633m79718R02797J487367J409732
39522B781536J284158J122219L98284q23072j623038j567143j461770j881308
39514a770134j773702K1691K353341K706080P16201j082548o41878J120091K134605
39505C783747J943409J345007N40002p19004j852010j974067j381919j090664
39497E94501j111285o27607J86804P5463j260626k382551j932158j73555J798540
39488d832474L314629L903750K905834M96776j483636j055862J480583L597979
$$ plain form
39549 -170896 992648 2452644 2748513 2592733 3338071 4356677 3930534 2229702 1244846
39540 1244846 1726256 2317128 2220019 2614300 4266617 5471486 4134984 1012158 -918057
39531 -918057 -137724 1772957 2367275 1105991 -538642 -1018360 -115563 1371804 2781536
39522 2781536 4065694 5187913 5586197 4763125 3140087 1572944 111174 -1770134
39514 -1770134 -3543836 -3522145 -1168804 1537276 2253477 1170929 529051 1649142 3783747
39505 3783747 5727156 7072163 7612165 6893161 5041151 3067084 1685165 594501
39497 594501 -516784 -1144391 -957587 -882124 -2142750 -4525301 -6457459 -6631014 -4832474
39488 -4832474 -1517845 2385905 5291739 5788515 4304879 3249017 4729600 8327579
39480H327579L267631R70181j280283k240527k183505j778188j161449l68749
39472C552690M6758m44679j405686j758320j119881j65073M75934R00774J160451
39463A242968O97496o48000j766384j500670l79678L0594o16917j070768m90834
39454d502193M25227P86421Q12506J021003J057342L71523m98197m10136P44829
39445a91675J749588J470632Q198j559054k132242j386200r1349M10848m59603
39436b180857j706866j739266k27618J449951J759248O27529o93433j047958l27427
39427d086697Q03742J662123J900480J494742P72571L20838M10791N12155r5034
39418C695711j139318j527107j028483q40969j642797k048151m80453J990335
$$ plain form
39480 8327579 11595210 12565391 11285108 9044581 6861076 5082888 3921439 3552690
39472 3552690 3599448 3154769 1749083 -9237 -1129118 -1294191 -818257 82517 1242968
39463 1242968 1940464 1292464 -473920 -1974590 -2354268 -2323674 -2940591 -4011359 -4502193
39454 -4502193 -4076966 -3290545 -2478039 -1457036 -399694 -28171 -526368 -936504 -191675
39445 -191675 1557913 3028545 3036743 1477689 -654553 -2040753 -2132102 -1721254 -2180857
39436 -2180857 -3887723 -5626989 -5854607 -4404656 -2645408 -2017879 -2711312 -3759270 -4086697
39427 -4086697 -3282955 -1620832 279648 1774390 2546961 2867799 3278590 3790745 3695711
39418 3695711 2556393 1029286 803 -840166 -2482963 -4531114 -5011567 -3021232
39410c021232K640979J003982l28268M31236J628870Q62444j322265k409289j610474
39401b124017m73174j96033l67786m14805m60322m11306J97199R86033Q38705
39392b425506k12077o23563L93819J572659J463299M19012l73354p58866j163290
39383a707867j124264R4734J787730K362212J685281J296338J808397J621087
39375G823648o58119l547763m049239j513163J342654J777032J99106r49460n96641
39366a71945J46721K95830L48066P82779P94139k80347j400388j192796j57023
39357h34964J20882m90950o87463j18795J56265k07643k57093K03966K0216r57913
39347c053492j017136N17055J506171R4944k047374k010388o7150Q92572j26783
$$ plain form
39410 -3021232 -380253 623729 295461 726697 2355567 3218011 1895746 -513543 -2124017
39401 -2124017 -2597191 -2793224 -3161010 -3575815 -4036137 -4447443 -4250244 -3264211 -2425506
39392 -2425506 -2637583 -3261146 -2867327 -1294668 168631 587643 214289 -544577 -1707867
39383 -1707867 -2832131 -2737397 -949667 1412545 3097826 4394164 6202561 7823648
39375 7823648 7165529 3617766 -431473 -1944636 -601982 1175050 1374156 424696 -171945
39366 -171945 -25224 270606 618672 1401451 2195590 1915243 514855 -677941 -834964
39357 -834964 -714082 -1205032 -1892495 -2011290 -1855025 -2062668 -2319761 -2115795 -2095579 -3053492
39347 -3053492 -4070628 -3553573 -2047402 -1952458 -3999832 -6010220 -6077370 -5184798 -5311581
39338e311581j068173l55246J000260J519904J281018Q62106J28680q32367j088692
39329c864091k37244Q70936J598712K272950K634497J323536j718121l987113
39321a105938l377788j143597L5132j28700J43876J280816J776937R69827N6988
39312a492447n7197R0608P9923M18388J025193O64146j030792k388808j758550
39303d449536L12745J993539K314645J466170k1506j295126j296096n7937Q55183
39294a77919L22312p28328q87771m99904p35137j224801o42327O79179R31742
39285b962954j20749m63991R85794K447304J823231k39558j351769n55476R40308
39276E02140J657238J181973p6155j288525j502221n08082O65978R06067M14774
$$ plain form
39338 -5311581 -6379754 -6735000 -5734740 -4214836 -2933818 -2071712 -1943032 -2775399 -3864091
39329 -3864091 -4101335 -3230399 -1631687 641263 3275760 4599296 2881175 -1105938
39321 -1105938 -4483726 -5627323 -5592191 -5720891 -5577015 -4296199 -2519262 -1549435 -1492447
39312 -1492447 -1549644 -1459036 -1379113 -960725 64468 728614 -302178 -2690986 -4449536
39303 -4449536 -4136791 -2143252 171393 1637563 1616057 320931 -975165 -1033102 -177919
39294 -177919 144393 -583935 -1471706 -1971610 -2706747 -3931548 -4573875 -3894696 -2962954
39285 -2962954 -3083703 -3547694 -2561900 -114596 1708635 1469077 117308 -438168 502140
39276 502140 2159378 3341351 3265196 1976671 474450 -33632 632346 1538413 1953187
39267A953187J33897J45610j92339o90283l12049R83589J688000P20406r96157
39258C433861j721819r57464M36935J518073J753791P93820j077375k400140j680925
39249I8757N68731J896867O62270j892307l050573j744217N48511J908728K017574
39240A014341J711149J344091N57857n58545j154911q40056m09841o79384j144868
39231a60167p41862K94078M59467q44833k204408j955093l19542J119530J565653
39222b787177J498255J236138M11179p47685r52795L19721J482364O92951j335606
39213a82655j913950M4893K458815K772664J038827p42084j450187j571867j499865
39204a045409q04119M20819R15041q3928j401524j267627K64728J318818O52862
$$ plain form
39267 1953187 2087084 2232694 2040355 1350072 1038023 2021612 3709612 4430018 3433861
39258 3433861 1712042 754578 1191513 2709586 4463377 5257197 4179822 1779682 98757
39249 98757 667488 2564355 3226625 1334318 -1716255 -3460472 -2911961 -1003233 1014341
39240 1014341 2725490 4069581 4627438 4068893 2913982 2073926 1664085 984701 -160167
39231 -160167 -902029 -607951 -148484 -993317 -3197725 -5152818 -5472360 -4352830 -2787177
39222 -2787177 -1288922 -52784 358395 -389290 -1342085 -1022364 460000 1152951 -182655
39213 -182655 -2096605 -2051712 407103 3179767 4218594 3476510 2026323 454456 -1045409
39204 -1045409 -1849528 -1428709 -513668 -597596 -1999120 -3266747 -3002019 -1683201 -1030339
39195a030339q11194j307191m15566P10216J039049Q19118Q03260R42831N75898
39186A326082k62483o55186k49097N3067l68192m87302Q02233K233158J215873
39177C608153k247126m622199l074232P56545K838003J715378m28157j245986
39169b699621p43738l7409O01004J495627K399459K556441J589990p5099j363636
39160C723018j164545M93762J878580J117509j446495l420119l198250j645432
39152c661972n30742l85588o07298o87632m32390K81152J088086J141099L33040
39143c462245k27372J77115O56537K08544m73492j92219M44413j86718j789280
39134d844717k047722L2967K437963K716412R48670q72448j411063q29368K07707
$$ plain form
39195 -1030339 -1841533 -3148724 -3564290 -2854074 -1815025 -995907 -192647 750184 1326082
39186 1326082 1063599 408413 159316 212383 -155809 -643111 159122 2392280 3608153
39177 3608153 1361027 -3261172 -6335404 -5578859 -2740856 -1025478 -1453635 -2699621
39169 -2699621 -3443359 -3480768 -2879764 -1384137 1015322 3571763 5161753 5086654 3723018
39160 3723018 2558473 3052235 4930815 6048324 4601829 1181710 -2016540 -3661972
39152 -3661972 -4192714 -4578302 -5185600 -5873232 -6305622 -6024470 -4936384 -3795285 -3462245
39143 -3462245 -3689617 -3512502 -2855965 -2647421 -3120913 -3313132 -2868719 -3055437 -4844717
39134 -4844717 -6892439 -6859472 -4421509 -1705097 -756427 -1628875 -3039938 -3869306 -3661599
39125c661599J147658J430412P73231l35066r90153p60843L4276P10721O43185
39116a008178k51572j075036n27643J447159L050204K484664K09536j538185j458241
39107A332708n17269l08384r35746j185465l57160Q21161J125069K07483j126250
39098i43853j797314j463520p22077l70932m82852l26274O43656J807176J762270
39089a893720n4304k334585k957398j239715J183015K027576P79878q60293r22919
39080f272465P49399K478393K592055J053595p21619j406117q56238K34414J249807
39071h98776J847039J668330O37199n09235q35129n28958o84839j407448j311447
39062b023264K23453J478281N80420j510076k095210n66995R38796R70226O27918
$$ plain form
39125 -3661599 -2513941 -1083529 -310298 -645364 -1635517 -2396360 -2362084 -1651363 -1008178
39116 -1008178 -1259750 -2334786 -2862429 -1415270 1634934 4119598 4329134 2790949 1332708
39107 1332708 815439 507055 -428691 -1614156 -1971316 -1150155 -25086 182397 -943853
39098 -943853 -2741167 -4204687 -4926764 -5297696 -5780548 -6106822 -5463166 -3655990 -1893720
39089 -1893720 -1948024 -4282609 -7240007 -8479722 -7296707 -5269131 -4489253 -5349546 -6272465
39080 -6272465 -5523066 -3044673 -452618 600977 -120642 -1526759 -2382997 -2148583 -898776
39071 -898776 948263 2616593 3253792 2744557 1909428 1380470 695631 -711817 -2023264
39062 -2023264 -1799811 -321530 258890 -1251186 -3346396 -3913391 -2974595 -2004369 -1376451
39053a376451J097728J434720M51993q14156o47591L17700r4785k073782l288814
39044d993438k146691K58831J953124K267531J608333M83622m01547k50827O98557
39035e22505J049657P0575j172048j294538l80803N78696J183093J478118J050427
39026B040672l85388j838380j838116m35449O82688K76024j072235j819266j055167
39017e444617P89964K228659J857428p0546j475677p77410R20839J248870L626
39008g18864n67361O98440J965588J174472q53521j773117j139895n30391p00035
38999b444684o48511K95599J251842J301574Q54809O85924O44822K16583m14992
38990A742966p78353j025614j504892j778015j027172N92276J811966J670066
$$ plain form
39053 -1376451 -278723 1155997 1607990 793834 146243 463943 369158 -1704624 -4993438
39044 -4993438 -7140129 -6881298 -4928174 -2660643 -1052310 -568688 -970235 -1221062 -522505
39035 -522505 527152 597727 -574321 -1868859 -2249662 -1670966 -487873 990245 2040672
39026 2040672 1655284 -183096 -2021212 -2456661 -1773973 -1497949 -2570184 -4389450 -5444617
39017 -5444617 -4654653 -2425994 -568566 -639112 -2114789 -2892199 -1971360 -722490 -718864
39008 -718864 -1286225 -587785 1377803 2552275 1698754 -74363 -1214258 -1744649 -2444684
38999 -2444684 -3093195 -2797596 -1545754 -244180 610629 1296553 1941375 2157958 1742966
38990 1742966 964613 -61001 -1565893 -3343908 -4371080 -3778804 -1966838 -296772
38982b96772N62612l39227l89948K6854J19547l90316r97542j015289l46484M27251
38972b639314O19313k0591j118375j762617j095614O46423J934288J544478K17105
38963a674904k62916L58006M65711p50812j796295j125522L78138P84567J25250
38954c498777P1574R02038R24898o12126j922237j057605J374327L051673K729408
38945A963173J146112l33125r86898q67117m20308K1044O46071J764756K841318
38936E775026K627180P63059j399542k260416j752342r73005n43993k07221K26518
38927B255264M21304M9011p52348j424038j269461j28294R45146M92735j227439
38918f38120j952316l84936J540010J102207j126873j893015J2226K046698J754170
$$ plain form
38982 -296772 265840 -73387 -463335 -436481 -316934 -707250 -1704792 -2720081 -3066565 -2639314
38972 -2639314 -2020001 -2040592 -3158967 -4921584 -6017198 -5370775 -3436487 -1892009 -1674904
38963 -1674904 -1937820 -1579814 -1114103 -1864915 -3661210 -4786732 -4408594 -3624027 -3498777
38954 -3498777 -3427203 -2525165 -1600267 -2212393 -4134630 -5192235 -3817908 -766235 1963173
38945 1963173 3109285 2776160 1789262 922145 501837 522881 1168952 2933708 5775026
38936 5775026 8402206 9165265 7765723 5505307 3752965 2779960 2235967 2028746 2255264
38927 2255264 2676568 2725579 1973231 549193 -720268 -848562 96584 589319 -638120
38918 -638120 -2590436 -2975372 -1435362 -333155 -1460028 -3353043 -3340817 -1294119 460051
38909D60051O6537p14134m10991m38517r60058q42629nL69493j7192J7134R87850
38898a482461J692508J047452k46627p66806k30594N62877J019335J109553P89502
38889C494739j50685j626143k988813l256959j748316J063799L373391L447118
38881A608131J454215p03774j533538j172735m01263L64421O01872l97310k082300
38872b262281k375857l65552J737443J244956j028512j702153L37919K526960
38864a887077K640064J726655J640130J799227N53694j573063k374305j180499
38856A344826M34629R80567L65881r00699k079239j931360j971J806140J048322
38847A067096j558453k573246p25719J160023O06846o68325K06844K317626K299977
$$ plain form
38909 460051 526588 -187546 -598537 -1037054 -1997112 -2839741 -2839746 -2470253 -2487445 -2470311 -1482461
38898 -1482461 210047 1257499 1010872 244066 13472 576349 1595684 2705237 3494739
38889 3494739 3344054 1717911 -1270902 -4527861 -6276177 -5212378 -1838987 1608131
38881 1608131 3062346 2358572 825034 -347701 -748964 -384543 217329 -179981 -2262281
38872 -2262281 -4638138 -5003690 -3266247 -2021291 -3049803 -4751956 -4414037 -1887077
38864 -1887077 752987 2479642 4119772 5918999 6472693 4899630 2525325 1344826
38856 1344826 1779455 2760022 3125903 2225204 145965 -1785395 -1787366 18774 1067096
38847 1067096 -491357 -3064603 -3790322 -2630299 -2023453 -2691778 -2484934 -167308 2132669
38838B132669k55457k171472j598986l53248m46206j168102j140722q18466r34778
38829f754768m53031J489055L017033J688066j461259k863410j375185M71486
38821f242013O70734M29718J364287K437738J782216l2381q98357m69512k21325
38812a178895n45303j62484J228856J926288Q43531n62247l94822Q06619R44008
38803B905551m13441j377311n28980J013368J140560l32170j351477l42603J574307
38794B287804J872180m3777j850493j307271O24092J011231r36344k668832j786869
38785b798279P80449K302544J893876J028208Q54814P26652k84274j712442k259364
38776E32184j410727L2696Q03403M08043l04022l6176J188515J734858N53973
$$ plain form
38838 2132669 1877212 -294260 -1893246 -2246494 -2692700 -3860802 -5001524 -5819990 -6754768
38829 -6754768 -7207799 -5718744 -2701711 -1013645 -2474904 -5338314 -6713499 -6242013
38821 -6242013 -5571279 -5141561 -3777274 -1339536 442680 410299 -488058 -957570 -1178895
38812 -1178895 -1724198 -1886682 -657826 1268462 2111993 1549746 1154924 1961543 2905551
38803 2905551 2492110 1114799 585819 1599187 2739747 2407577 1056100 713497 2287804
38794 2287804 4159984 4116207 2265714 958443 1582535 2593766 1657422 -1011410 -2798279
38785 -2798279 -2017830 284714 2178590 3206798 4061612 4788264 4503990 2791548 532184
38776 532184 -878543 -845847 -42444 365599 61577 25401 1213916 2948774 3502747
38767C502747j019786r57990M34876R37800j16356q18175J58538J341479P97806
38758D260939q49599j537876q94265l16609m47205n17482j62234p5582n11418
38749a051331o41230M3957Q75784J091551P74668K37254n55091j386515j516095
38740b127048o61399M07930Q14181N56663J95221J82975P51187J647205J810156
38731C577071M47533j247049r73150J311209K615270Q97943j807176k289843q82753
38722A649055o10167k249441l284800k044264O1368J325660K034446K599160K003263
38713A484280O2607j034642J27715J380235R0721k403522k728811q69520L1519
38704c859418r46677j218776M83269J782595Q09668n93539j09227J255143J229354
$$ plain form
38767 3502747 2482961 1524971 1959847 2897647 2781291 1963116 2121654 3463133 4260939
38758 4260939 3411340 1873464 979199 662590 215385 -302097 -464331 -539913 -1051331
38749 -1051331 -1692561 -1648604 -772820 318731 1093399 1330653 775562 -610953 -2127048
38740 -2127048 -2788447 -2380517 -1566336 -1009673 -814452 -631477 119710 1766915 3577071
38731 3577071 4024604 2777555 1804405 3115614 5730884 6628827 4821651 2531808 1649055
38722 1649055 1038888 -1210553 -4495353 -6539617 -6478249 -5152589 -3118143 -518983 1484280
38713 1484280 1546887 512245 639960 2020195 2110916 -292606 -3021417 -3890937 -3859418
38704 -3859418 -4806095 -6024871 -5541602 -3759007 -2949339 -3542878 -3652105 -2396962 -1167608
38695a167608J11647k38132K53753K93597j04521l8558M9668p60080j447735k74889
38685c322858J977439K803731J853491J172267J498504J292920q3411j198216
38677E993867j402931j997589l364474l676182k012574k81637k10896o16213L14982
38668g253647J892905K215039J117998j41923q77976q84259K44008J925669K247157
38659D84971P03916l88288N81101J461367k65601k671411j743246K122200M079800
38650D364809J789703j330099j246651J262690K335501K48488l070997m760843
38642d07399l756296j267821N98627Q93127N78160Q32589J206555O28608l89189
38633a083039l69940N51530P50428m5864k36431P42701J131067m21642k528220
$$ plain form
38695 -1167608 -1055961 -1294093 -1040340 -746743 -851264 -889822 -840154 -1600234 -3047969 -3322858
38685 -3322858 -1345419 1458312 3311803 4484070 5982574 7275494 7192083 5993867
38677 5993867 4590936 2593347 -771127 -4447309 -6459883 -6741520 -6952416 -7568629 -7253647
38668 -7253647 -5360742 -3145703 -2027705 -2169628 -3047604 -3931863 -3687855 -1762186 484971
38659 484971 1188887 800599 1381700 2843067 2577466 -93945 -1837191 285009 4364809
38650 4364809 6154512 4824413 3577762 4840452 7175953 7424441 4353444 -407399
38642 -407399 -4163695 -5431516 -4832889 -3939762 -3361602 -2529013 -1322458 -693850 -1083039
38633 -1083039 -1452979 -901449 -151021 -196885 -433316 309385 1440452 1018810 -1509410
38624a509410k803371q63851J469377K253892J098870n86113q33643O19185J618820
38615D63756L92390j521291j151821J409806K999030K100913P09758N99395O60720
38606F662656m78637j798446j886718j469389j758780k020159j022364M81986
38598c289851R09531L74345P0554J21032j00234m15760l08394k7617J95208Q42366
38588a628820J667643J214202n84213j320605K12257J446594o138j945104q67597
38579a811781J908559J911781j258873l163661j550196M48227k34987j963465
38571e714396j674708K48626J196698M64405m05976k28823Q81853K259625K864225
38562a08471J702556n94590j675980k79854J865052K242987O83715j003217j574324
$$ plain form
38624 -1509410 -4312781 -5176632 -3707255 -1453363 -354493 -940606 -1774249 -1155064 463756
38615 463756 856146 -665145 -1816966 -407160 2591870 4692783 5402541 6001936 6662656
38606 6662656 6184019 4385573 2498855 1029466 -729314 -2749473 -3771837 -3289851
38598 -3289851 -2380320 -2005975 -1935421 -1814389 -1914623 -2330383 -2638777 -2666394 -2471186 -1628820
38588 -1628820 38823 1253025 668812 -651793 -439536 1007058 1000920 -944184 -1811781
38579 -1811781 96778 2008559 749686 -2413975 -3964171 -3515944 -3750931 -5714396
38571 -5714396 -7389104 -7140478 -5943780 -5479375 -5885351 -6114174 -5232321 -2972696 -108471
38562 -108471 1594085 999495 -676485 -956339 908713 3151700 3835415 2832198 1257874
38553A257874j134125j74339P02191O37477n41573j598870j271256j2746P42035
38544a393332O51533N74454Q52284Q35545K63610r5311L26253R12846Q08657L17901
38534D054440N08636J447174J691083J48374k044809k538158p75454J092750R15617
38525D499653p96639j900398j547299p75146n57780o90987o83885n51980m48001
38516c452462l68282l97023n72232n71739j91382J49017J24251K30557Q47310
38507d201985J225108O59505j0201L60160J116457Q41426J2388L60627J683835
38498B047320J769317r5060j888318j888577q42840k24990k10227l04400l25356
38489a963131R393Q76182J263832q751j828155j703553K56905J067597l59694
$$ plain form
38553 1257874 123749 -50590 651601 1289078 747505 -851365 -2122621 -2135367 -1393332
38544 -1393332 -741799 -167345 684939 1520484 1784094 1688783 2015036 2927882 3736539 4054440
38534 4054440 4563076 6010250 7701333 7849707 5804898 3266740 2491286 3584036 4499653
38525 4499653 3703014 1802616 255317 -519829 -1077609 -1768596 -2452481 -3004461 -3452462
38516 -3452462 -3820744 -4217767 -4789999 -5361738 -5553120 -5404103 -5279852 -5049295 -4201985
38507 -4201985 -2976877 -2317372 -2327573 -1967413 -850956 -9530 2858 363485 2047320
38498 2047320 3816637 3721577 1833259 -55318 -898158 -1123148 -1333375 -1637775 -1963131
38489 -1963131 -1953738 -1077556 186276 177525 -1650630 -3354183 -3097278 -2029681 -2389375
38480b389375j232689M67158K292828J009091k254198l587754j704081J072044
38472f326976K410952K130165J222246O93081J013531J455385P73864n54103l92288
38463B425857J573982K618104J054039q56856n99620L17311r37430l359143l450955
38454a214711p47765J708133J983003R65983k33866j336500j504804r4970J275768
38445H00271M84581j438609j617520p8301M16931o44371o73238J207160K479009
38436I35913J645941N96690Q42887Q43007q08934k537415k471319j474593j165996
38427c593819j054669L1463J408425J605700O30103n55941j484417j756494p55166
38418e524815R21220J472170N79457J34648J059513J724885J060570O25718J509632
$$ plain form
38480 -2389375 -3622064 -3154906 -862078 147013 -2107185 -5694939 -7399020 -6326976
38472 -6326976 -3916024 -1785859 -563613 129468 1142999 2598384 3372248 2818145 2425857
38463 2425857 3999839 6617943 7671982 6815126 6215506 6532817 5595387 2236244 -1214711
38454 -1214711 -1962476 -254343 1728660 2694643 2460777 1124277 -380527 -475497 800271
38445 800271 1284852 -153757 -1771277 -1849578 -1432647 -2077018 -2750256 -1543096 935913
38436 935913 2581854 3178544 4021431 4864438 4055504 1518089 -953230 -2427823 -3593819
38427 -3593819 -4648488 -4617025 -3208600 -1602900 -972797 -1528738 -3013155 -4769649 -5524815
38418 -5524815 -4603595 -3131425 -2551968 -2417320 -1357807 367078 1427648 2053366 3562998
38409C562998J803330j33665k192479j484594R55853J791531M71503o55051m98403
38400C621023j66101j31018L10975P26157l05689k345346l085224j791499m03011
38391c569733m48438r22432j68969J683192L072622K799356R97921r18565j293406
38382A231548q741J140919P91707n4258J74980Q04687p4959k261447l358356k099982
38372c713902K31920J870656K178085J075864j118748k874592k367355J12815
38364d605257K187801K294105J094439k64583j508942k312401j854387k40717
38356e209942J098567J339011J287288J647950J632950L87324j304765j933545
38348a055162j179723N4842R50824J235464P99073k96636j523278k113660j671972
$$ plain form
38409 3562998 5366328 5232663 3040184 1555590 2511443 4302974 4774477 4119426 3621023
38400 3621023 3454922 3323904 3634879 4361036 4055347 1710001 -1375223 -3166722 -3569733
38391 -3569733 -4018171 -4940603 -5109572 -3426380 -353758 2445598 3443519 2524954 1231548
38382 1231548 1222807 2363726 3155433 3101175 3276155 4080842 4005883 1744436 -1613920 -3713902
38372 -3713902 -3481982 -1611326 566759 1642623 523875 -2350717 -4718072 -4605257
38364 -4605257 -2417456 -123351 971088 706505 -802437 -3114838 -4969225 -5209942
38356 -5209942 -4111375 -2772364 -1485076 162874 1795824 2183148 878383 -1055162
38348 -1055162 -2234885 -2180043 -1229219 6245 805318 508682 -1014596 -3128256 -4800228
38339d800228n21546N25206R81330J324651K193773K811896J518192j346925k741304
38330e4955q21330J882028J615250j231766k851477j739548l71067p01804j331902
38321e606571n04573R14050J296701Q88577O74678L95709m31331r64369k82807
38312c619936R74834J667804J636939R12226r68268l339354l821284j335390J678025
38303f214404K187930O17608j98058Q09196K059168K048066Q27032q86626k167979
38294i18067j832807J96584J837784J065781j124658j937228p20286M37709J24499
38285b870689n66238j83763R27712J473723R70881k5627o35635k93836O38477
38276e64995J013664M24001R0948J078285K219360J435222j194629l386119l577288
$$ plain form
38339 -4800228 -5321774 -4796568 -3815238 -2490587 -296814 2515082 4033274 2686349 -54955
38330 -54955 -876285 1005743 2620993 1389227 -1462250 -3201798 -3572865 -4274669 -5606571
38321 -5606571 -6111144 -5197094 -3900393 -3011816 -2337138 -1941429 -2372760 -3337129 -3619936
38312 -3619936 -2645102 -977298 659641 1571867 603599 -2735755 -6557039 -7892429 -6214404
38303 -6214404 -4026474 -3408866 -3606924 -2797728 -738560 1309506 2136538 1249912 -918067
38294 -918067 -2750874 -2554290 -716506 349275 -775383 -2712611 -3432897 -2995188 -2870689
38285 -2870689 -3436927 -3620690 -2692978 -1219255 -248374 -274001 -909636 -1203472 -564995
38276 -564995 448669 872670 963618 2041903 4261263 5696485 4501856 1115737 -2461551
38267b461551k288083o99240M10579M26664n54316r75760M63492K419935K403640
38258h54640O50250r3522J004141J579962J90610j283812j032830l72386j091106
38249a303333j964205p16651J936627L024339J458457r06063k003800j431781
38241a906410M7079J165692P34633q74993j429024L57983K492842K193830N5953
38232B837585p05902R49925K413185J316709j270037k568182j477545P41802K095910
38223D333450J434945p17345k408961k082508l47232Q68608Q05728L74579L36716
38214B597980M68149N69835P05553L08333j144245k333988j177521J620804K515543
38205D130443j1443k833502k451881N9190R89417m46360j507546m88387J080740
$$ plain form
38267 -2461551 -4749634 -5448874 -5038295 -4611631 -5165947 -6141707 -5678215 -3258280 -854640
38258 -854640 -204390 -297912 706229 2286191 2476801 1192989 160159 -212227 -1303333
38249 -1303333 -3267538 -3984189 -2047562 976777 2435234 1529171 -474629 -1906410
38241 -1906410 -1859331 -693639 40994 -833999 -2263023 -1905040 587802 2781632 2837585
38232 2837585 2131683 3081608 5494793 6811502 5541465 2973283 1495738 2237540 4333450
38223 4333450 5768395 5051050 2642089 559581 212349 1080957 1886685 2261264 2597980
38214 2597980 3066129 3635964 4341517 4649850 3505605 1171617 -5904 1614900 4130443
38205 4130443 4119000 1285498 -1166383 -1107193 -117776 -564136 -2071682 -2560069 -1479329
38196a479329J255539K46285p66016j479881j990345j817648n94985J087326K371357
38187c167697L018825L066180K383460J175047J82830k12475m35948p79285q18921
38178D412016l76213j91829p95859j451115j239229o19911p31001j449649j417324
38169c860114p0751J448427J723711N86777j073720k267338k322830j097026O82273
38160f250591J761183J566980P68082L05243L18742M47477O24133Q67516P18299
38151A127064j83227j134581j042161j53619L0249r57502j507591j32502K199208
38142a754662L258309K553986J544673R67964j52118k199951l465672k358030
38134a605501O8311J472165J383492J171566J244455M56978j336350k289041j239345
$$ plain form
38196 -1479329 -223790 22495 -743521 -2223402 -4213747 -6031395 -6626380 -5539054 -3167697
38187 -3167697 -148872 2917308 5300768 6475815 6658645 6446170 6010222 5230937 4412016
38178 4412016 4035803 3843974 3048115 1597000 357771 -262140 -993141 -2442790 -3860114
38169 -3860114 -3930865 -2482438 -758727 -171950 -1245670 -3513008 -5835838 -6932864 -6250591
38160 -6250591 -4489408 -2922428 -2154346 -1849103 -1530361 -1082884 -458751 408765 1127064
38151 1127064 943837 -190744 -1232905 -1386524 -1356275 -2313777 -3821368 -3953870 -1754662
38142 -1754662 1503647 4057633 5602306 6570270 6418152 4218201 752529 -1605501
38134 -1605501 -1537190 -65025 1318467 2490033 3734488 4191466 2855116 566075 -673270
38125f73270L34361N68557P5835N71473J496066N22586k382956l877321j511883
38116d876552K603103M210306K132792p96494j812505j248741q89019j024010
38108a701120o38694L26111O66993o3850p00766k07065P99992J080169N50034
38099A11804P5645J2070J8289N5122M27347Q38444N39046l58016p93602l77073
38089E49076n439k79595l90912M70717J480064J170542m09248j729532j757903
38080i02230q30879K93332J125270J194613K90525p86190p53641M71904J514463
38071A617167J343129M45212k49131o23855q56010n92312K99613Q27150r360j462404
38061G39199j695198l07483R88349O72512n73674q82997M16443K230460L142439
$$ plain form
38125 -673270 -338909 229648 305483 876956 2373022 2895608 512652 -3364669 -4876552
38116 -4876552 -2273449 1936857 4069649 3273155 1460650 211909 -677110 -1701120
38108 -1701120 -2339814 -2013703 -1346710 -1410560 -2111326 -2318391 -1518399 -438230 111804
38099 111804 187449 199519 217808 272930 700277 1538721 2077767 1719751 926149 549076
38089 549076 543637 264042 -126870 343847 1823911 2994453 2585205 855673 -902230
38080 -902230 -1733109 -1439777 -314507 880106 1170631 384441 -369200 102704 1617167
38071 1617167 2960296 3405508 3156377 2532522 1676512 1084200 1383813 2210963 2201603 739199
38061 739199 -955999 -1263482 -275133 397379 -176295 -1059292 -642849 1587611 4730050
38052D730050K649136J151462m72822j263380r25004l81837q69284k193683k700878
38043b76240j489170K03639O91550J51457j9260L75792K38851n28279n63676N00257
38033g15079R80531k52687j714373j502002k94781j33272j050143j255630l82772
38024f320208l6919p46330q03583Q08710K381549J877460r1854j307291r77270
38015e215736j30141M18823R20911J627009K085117J698309L96395j180012j872896
38006a252221q97260J014765K006672J187396l73983j282017j469337j417975
37998b483960q62931M48133J597149J582749R19352O71934N64899k22441r69406
37989A245478k58155J282816J430533j03951r77030P9641J103426o5709k391977
$$ plain form
38052 4730050 7379186 8530648 8057826 6794446 5869442 5487605 4618321 2424638 -276240
38043 -276240 -1765410 -1561771 -870221 -718764 -738024 -362232 -123381 -651660 -1215336 -715079
38033 -715079 265452 12765 -1701608 -3203610 -3498391 -3631663 -4681806 -5937436 -6320208
38024 -6320208 -6357127 -7103457 -7907040 -7098330 -4716781 -2839321 -2931175 -4238466 -5215736
38015 -5215736 -5345877 -4927054 -4006143 -2379134 -294017 1404292 1800687 620675 -1252221
38006 -1252221 -2149481 -1134716 871956 2059352 1685369 403352 -1065985 -2483960
37998 -2483960 -3346891 -2898758 -1301609 281140 1200492 1872426 2437325 2214884 1245478
37989 1245478 987323 2270139 3700672 3596721 2619691 2699332 3802758 3737049 1345072
37980A345072l156377j722801O3228N78402j59722j368084k191495j667667M92460
37971g786984K898580L459684J722494n79763j512470p77118N06219J104090N98623
37962c66645l62595o15689K17865J046471N61599r43054j853841j357731l08107
37953c981727K48941L66205N02764N33268K75088K42212Q60615J426763R42895
37944A417024k70771r38812p34746n76315q13058n00881P89033J675176P34060
37935G80710j184238j866161p04623O75958Q62745L28934J99002N68731Q42579
37926E03637Q52978P83971N93492K56411L9115r6181o70156j558850j573288k46915
37916a115786Q05981j28736j994617j920839Q09080L490488L339573P17757j808579
$$ plain form
37980 1345072 -1811305 -3534106 -3470878 -2892476 -3052198 -4420282 -6611777 -8279444 -7786984
37971 -7786984 -4888404 -1428720 293774 -285989 -1798459 -2575577 -2069358 -965268 -366645
37962 -366645 -729240 -1344929 -1127064 -80593 481006 -462048 -2315889 -3673620 -3981727
37953 -3981727 -3732786 -3366581 -2863817 -2330549 -2055461 -1813249 -952634 474129 1417024
37944 1417024 1146253 207441 -527305 -1103620 -1916678 -2417559 -1628526 46650 780710
37935 780710 -403528 -2269689 -2974312 -2298354 -1435609 -1106675 -907673 -338942 503637
37926 503637 1356615 2140586 2734078 2990489 3029604 2933423 2263267 704417 -868871 -1115786
37916 -1115786 -309805 -438541 -2433158 -4353997 -3544917 -54429 3285144 4002901 2194322
37907B194322k511830j639519l55180L38843p451j029320j680241j148460L49923
37898e488913J868791K601116K318690J289679m956j213006k151848k415142j439844
37889d635433M86607J871645J630356N91249K32161M36355J00408m47649J79641
37880D45340J548877J384877q22128k617098k180530q07906l18378l67166k28774
37871c962886q00993k313522k374880M70638L210309K270929m81238k15297K971376
37862a225564L774467P0868l499796k527492R11297K105877N47350o47742K1932
37853d68803J296237K012235K046554J148395n93062j704833r66526N14372Q15954
37844D100523k1496o80496r79022j352855r94152Q40170K464192J623605p40391
$$ plain form
37907 2194322 -317508 -1957027 -2312207 -1973364 -1980815 -3010135 -4690376 -5838836 -5488913
37898 -5488913 -3620122 -1019006 1299684 2589363 2584407 1371401 -780447 -3195589 -4635433
37889 -4635433 -4148826 -2277181 -646825 -55576 176585 612940 713348 265699 445340
37880 445340 1994217 3379094 2556966 -60132 -2240662 -3048568 -3366946 -3734112 -3962886
37871 -3962886 -4763879 -7077401 -9452281 -8981643 -5771334 -3500405 -3981643 -4196940 -1225564
37862 -1225564 2548903 2619771 -880025 -3407517 -2496220 -390343 157007 -490735 -468803
37853 -468803 827434 2839669 4886223 6034618 5441556 3736723 2770197 3284569 4100523
37844 4100523 4079027 3398531 2419509 1066654 72502 912672 3376864 5000469 4260078
37835D260078j630325o80879l99683j510070j647995K86401J920014J257376k31717
37826A623200m42666L2574k53612p07554l09675k23256j745287l016692j159558
37817f202526K839307M717464K648250n99488j888164j358642o63680k9000R95365
37808D58886J524450L69080j576320k039861n37642Q01619Q7003j873243k783165
37799e569193j752114P1032J434073K309866K973909K933591J781777M12631N5861
37790D651433L33646k49988j722163k160575n26624J499629J737838M35382n25783
37781C472795n90998r47960k141764k936309k008623K77444K274239K636591J303737
37772A339152o10718j796513j877938j419144p61557L40281J533296J537688N1745
$$ plain form
37835 4260078 2629753 1948874 1549191 39121 -1608874 -1322473 597541 1854917 1623200
37826 1623200 1180534 1213108 959496 251942 -57733 -280989 -2026276 -5042968 -6202526
37817 -6202526 -3363219 1354245 4002495 3403007 1514843 156201 -507479 -536479 458886
37808 458886 1983336 2352416 776096 -1263765 -1801407 -999788 -912785 -2786028 -5569193
37799 -5569193 -7321307 -7250275 -5816202 -3506336 -532427 2401164 4182941 4595572 4651433
37790 4651433 4985079 4735091 3012928 852353 325729 1825358 3563196 3998578 3472795
37781 3472795 2881797 1933837 -207927 -3144236 -5152859 -4875415 -2601176 35415 1339152
37772 1339152 728434 -1068079 -2946017 -4365161 -5126718 -4786437 -3253141 -1715453 -1663708
37763a663708j154813n27001Q91368J158959N92249Q93307J714400R39772j462659
37754A381874k804422j708331n9862L01181K70810J184305K120729J584163R2440
37745B362887j002654j720016k379315j904208L59202K432742K026553J72874
37737C48065k21198J192974K124502J637094J087232R19074k33671k401531l252591
37728A199950j650783K69928K89579p34029p56618J25920L10005n51485j419673
37719b917206j743785j697161j104489K28472J480815J598606R07496O65420J175105
37710a406727J509063R91823j00818j204706j849339j521075j41087J374058J923546
37701d25262J512198Q91947J65841j108168k447352k411196n51471J583902K093965
$$ plain form
37763 -1663708 -2818521 -3345522 -2454154 -1295195 -702946 190361 1904761 2844533 1381874
37754 1381874 -1422548 -3130879 -3190741 -2889560 -2618750 -1434445 686284 2270447 2362887
37745 2362887 1360233 -359783 -2739098 -4643306 -4284104 -1851362 175191 348065
37737 348065 126867 1319841 3444343 5081437 6168669 7087743 6854072 4452541 1199950
37728 1199950 -450833 -180905 108674 -625355 -1381973 -1256053 -946048 -1497533 -2917206
37719 -2917206 -4660991 -6358152 -7462641 -7234169 -5753354 -4154748 -3247252 -2581832 -1406727
37710 -1406727 102336 1094159 993341 -211365 -2060704 -3581779 -3722866 -2348808 -425262
37701 -425262 1086936 1978883 2144724 1036556 -1410796 -3821992 -4373463 -2789561 -695596
37692f95596P98247q83643j635422j248947k96371N12661O85367K11541l44737
37683b896900l39961J69268M08866n1787m64009K77181J906571K640493J301866
37674B951588r82700k049555j336187k62520q0014m80525n95216k85638J16872
37665c003895N16138Q76561R71499P98808O52529M49419k12091r46099n94006
37656d91137R49430J966046R77549j215226k574934k203376o94420J042681K081514
37647a61873J421873p80778k430493j625465O42381J615746N43792n08251Q7442
37638a195626J340889J534729P12148R7595J25541K87837K70797J00028m45548
37629B828390j501399k335033j854788j06766J397812J283063k2299p04366K09466
$$ plain form
37692 -695596 102651 -780992 -2416414 -3665361 -3961732 -3449071 -2763704 -2552163 -2896900
37683 -2896900 -3236861 -3067593 -2658727 -2710514 -3174523 -2897342 -990771 1649722 2951588
37674 2951588 1968888 -80667 -1416854 -1679374 -1759388 -2239913 -2835129 -3120767 -3003895
37665 -3003895 -2487757 -1611196 -639697 159111 811640 1261059 1048968 102869 -491137
37656 -491137 458293 2424339 3401888 2186662 -388272 -2591648 -3286068 -2243387 -161873
37647 -161873 1260000 479222 -1951271 -3576736 -2934355 -1318609 -774817 -1283068 -1195626
37638 -1195626 145263 1679992 2392140 2489735 2615276 2903113 3173910 3273938 2828390
37629 2828390 1326991 -1008042 -2862830 -2969596 -1571784 -288721 -311020 -1015386 -805920
37620h05920J503863J257528n57088j971815j718295p45237l03143P3468J198747
37611b067892K032606J007247r82136j361855K41141J403811Q30966L17492J425737
37602B847117K537715J371214j184829k261637j226418k21234o19137j232955
37594I836n78443Q65684J551668Q96325l93514j333301j389257o95200j659l3227
37584a101088n77170n69069O01505K132065K484359J022492j128558j973724n99944
37575B90868J747596K852758J861887O487j090538j127528p58237l07512L20293
37566C796074R17341J061756P47455K12458n96748j621796k089853j355457k20556
37557H50674k03787j260748j456564L96346K728055K915667O35908j576232j365921
$$ plain form
37620 -805920 697943 1955471 1398383 -573432 -2291727 -3036964 -3340107 -3266639 -2067892
37611 -2067892 -35286 971961 -10175 -1372030 -1130889 272922 1103888 1421380 2847117
37602 2847117 5384832 6756046 5571217 3309580 2083162 1861928 1242791 9836
37594 9836 -568607 297077 1848745 2745070 2351556 1018255 -371002 -1066202 -1067861 -1101088
37584 -1101088 -1678258 -2247327 -1645822 486243 2970602 3993094 2864536 890812 290868
37575 290868 2038464 4891222 6753109 6759596 5669058 4541530 3783293 3475781 3796074
37566 3796074 4713415 5775171 6522626 6735084 6138336 4516540 2426687 1071230 850674
37557 850674 646887 -613861 -2070425 -1674079 1053976 3969643 4605551 3029319 1663398
37548A663398N99091J504023o1676k253697k263324J4390J750920Q73948j258029
37539E69044j878580n80229N44494K35036l49244R3189Q43447N39341m00394l52439
37529g36335R08260J770911J145998o4076m30753N5990L47705N0981j73503J94077
37519C069255P33694O92009n5515q75182j032408m41294J24741k40516j376049
37510E98735j915136r16796O55729R97150n1955p60811r5509P74164M22901o09379
37500i00907r11542n51432n53193o14857M84405K182473K191610M3454j561738
37491a91727l70076K127750K792975J085187p31306r78914j91526M97481P42614
37482D782458M59575n58472j901773k499206j909635r34473n40792p91675j110852
$$ plain form
37548 1663398 2262489 3766512 3704836 1451139 -812185 -797795 953125 1827073 569044
37539 569044 -1309536 -1889765 -1345271 -1110235 -1459479 -1366290 -522843 16498 -383896 -736335
37529 -736335 171925 1942836 3088834 3024758 2594005 2649995 2997700 3048681 2875178 3069255
37519 3069255 3802949 4494958 4439443 3564261 2531853 2090559 2215300 1974784 598735
37510 598735 -1316401 -2233197 -1577468 -580318 -632273 -1393084 -1488593 -714429 -291528 -900907
37500 -900907 -1812449 -2363881 -2917074 -3531931 -3047526 -865053 1326557 1370011 -191727
37491 -191727 -561803 1565947 4358922 5444109 4712803 3733889 3542363 4039844 4782458
37482 4782458 5242033 4683561 2781788 282582 -1627053 -2561526 -3102318 -3893993 -5004845
37473e004845r95705k57785Q30622J455426R64778j68448p33197k95530L73862
37464c830822N91084O72662J140192J722335J731466R80746j45141j123714j410569
37455C28239o50367O63509J187929J23811j585376k171644j155602J36003L39965
37446b783533k98992n12782J95971J052778J270479J064741J009036R30300J99147
37437B127145j031020j696106j162751o3652N66786M84388J47842j11740k92546
37428a031654l35889m9209N93894J294271J532056R35668j08556m53528M26911
37419B803964J216011J75451k017908k516954k26682K257005K157546L93367k65361
37410C976439K66245l67744k461694l237907j220094J241272J491865L78236L76837
$$ plain form
37473 -5004845 -6000550 -6258335 -5427713 -3972287 -3007509 -3175957 -3909154 -4204684 -3830822
37464 -3830822 -3239738 -2567076 -1426884 295451 2026917 3007663 2862522 1738808 328239
37455 328239 -322128 341381 1529310 1653121 67745 -2103899 -3259501 -3123498 -2783533
37446 -2783533 -3082525 -3595307 -3399336 -2346558 -1076079 -11338 997698 1927998 2127145
37437 2127145 1096125 -599981 -1762732 -1826384 -1259598 -775210 -627368 -739108 -1031654
37428 -1031654 -1367543 -1416752 -822858 471413 2003469 2939137 2830581 2377053 2803964
37419 2803964 4019975 4195426 2177518 -339436 -566118 1690887 3848433 4241800 3976439
37410 3976439 4242684 3874940 1413246 -1824661 -3044755 -1803483 -311618 66618 443455
37401D43455J523081J725697L85693q18406q06163n53456j024047j384076m21376
37392i29598J294295J949580Q63593p10048j261477p43190k00406j47854j2088
37383A02807P51005J626201J615180N43061p56146j460329j457129j050011n09569
37374e94930n8100J02306p2595m90758j029734j382840j030659J64252J475702
37365b917356J944564J418187N13822k52438p27418p38429j93297M94919P54602
37356B97156N78999L33864P6146k55889l17782J18964M89695K75135P2463O04706
37346B273457J153142N69213n13594m26455O75295R44490J06764R3108J574381
37337F449801K394035R25516j230407j734340q01095J5200O28384J670317K249531
$$ plain form
37401 443455 1966536 3692233 4077926 3259520 2453357 1899901 875854 -508222 -929598
37392 -929598 364697 2314277 3177870 2467822 1206345 463155 262749 114895 102807
37383 102807 853812 2480013 4095193 4638254 3882108 2421779 964650 -85361 -594930
37374 -594930 -653030 -550724 -623319 -1114077 -2143811 -3526651 -4557310 -4393058 -2917356
37365 -2917356 -972792 445395 959217 706779 -20639 -759068 -952365 -457446 297156
37356 297156 876155 1210019 1286165 1030276 712494 831458 1321153 1596288 1668751 2273457
37346 2273457 3426599 3995812 3482218 3055763 3731058 4675548 4782312 4875420 6449801
37337 6449801 8843836 9769352 8538945 6804605 6003510 6018710 6647094 8317411 10566942
37328A0566942J020293j246002k504956k348865j939748j601646p52559J76384
37320A369843J47405l27694J75923J251563J088425j59033j77482J610007K681280
37311G660237J261412q92341j328294n22259n14261j370580j413805k90256N25014
37302C114867K92730R2767Q14550J564357R91012o31780j623315j006285L36502
37293C945405Q42918J80810n30017l39776L32023M57267j97973j003403j349109
37284B338145r23731M04095K031950K355107L68166k450589l227877j100429J622852
37275A417689K295125R01888n70976q56641m32494k31250l74476l39746J87407
37266A996526R18276J297291J090883N38061m1816m63274l96435N54233K068796
$$ plain form
37328 10566942 11587235 10341233 7836277 5487412 3547664 1946018 1193459 1369843
37320 1369843 1517248 1189554 1365477 2617040 3705465 3546432 3368950 4978957 7660237
37311 7660237 8921649 8029308 6701014 6178755 5664494 4293914 2880109 2589853 3114867
37302 3114867 3407597 3500364 4314914 5879271 6870283 6238503 4615188 3608903 3945405
37293 3945405 4788323 4969133 4439116 4099340 4431363 4888630 4690657 3687254 2338145
37284 2338145 1414414 1818509 3850459 6205566 6573732 4123143 895266 -205163 1417689
37275 1417689 3712814 4614702 4043726 3187085 2754591 2523341 2148865 1809119 1996526
37266 1996526 2914802 4212093 5302976 5841037 5799221 5335947 4939512 5493745 7562541
37257G562541K994575K643776J633798O98382n48911k484721l864871l090936
37249E543633q43699M35509j06297p42056k9157J129047J176924J46611q63320
37240E847195j254048r57838M0860J242499J644356J093160O69200R57565J119285
37231A0402234N93941L59243J209035K060798J595649N52844N89615J626826K248875
37222B1239060K209513K449069K787421J825048m08253j672425l33841K411531
37214C0507123M128955L994406L123805K771848L181955L948896M719382N375383
37206F1751753N806254N727984N012651M335604M992005P443032J0323650J1709484
37198A17102417J1400062J1228868J2922817J6192851J9151627K0262325J9760646
$$ plain form
37257 7562541 10557116 13200892 14834690 15533072 14984161 12499440 8634569 5543633
37249 5543633 4699934 5135443 5029146 4287090 4257933 5386980 6563904 6710515 5847195
37240 5847195 4593147 3635309 3676169 4918668 6563024 7656184 8325384 9282949 10402234
37231 10402234 10996175 11355418 12564453 14625251 16220900 16773744 17363359 18990185 21239060
37222 21239060 23448573 25897642 28685063 30510111 30101858 28429433 28095592 30507123
37214 30507123 34636078 38630484 41754289 44526137 47708092 51656988 56376370 61751753
37206 61751753 67558007 73285991 78298642 82634246 87626251 95069283 105392933 117102417
37198 117102417 128502479 139731347 152654164 168847015 187998642 208260967 228021613
37191B28021613J9375096K0548685K2676144K3312388K0414662J4059584N747963
37184C54156135l133944j1385639j7456316k0410431k1296728k2119619k3264614
37177B35088844k3227402k1152821j8233623j5980036j4414814j2909458j1679933
37170A17490757j1194031j0826726r502027p413156n852678n333649n014921m198096
37162E8155473l337801l081246l156152k912942k416662k222546k354956k302230
37154C6370938j981940j938224k362079k573965j925000p90195j64724m97572
37146B4137239j362407k110632k407675k232915j782065j327918q54695j2534
37138A2046398J146414J668515O42385j406327k798181k515708j128269J87541
$$ plain form
37191 228021613 247396709 267945394 290621538 313933926 334348588 348408172 354156135
37184 354156135 351022191 339636552 322180236 301769805 280473077 258353458 235088844
37177 235088844 211861442 190708621 172474998 156494962 142080148 129170690 117490757
37170 117490757 106296726 95470000 85967973 78554817 72702139 67368490 62353569 58155473
37162 58155473 54817672 51736426 48580274 45667332 43250670 41028124 38673168 36370938
37154 36370938 34388998 32450774 30088695 27514730 25589730 24799535 24634811 24137239
37146 24137239 22774832 20664200 18256525 16023610 14241545 12913627 12058932 12046398
37138 12046398 13192812 14861327 15503712 14097385 11299204 8783496 7655227 7842768
37130G842768Q51917R04082N59565J90834K74071R44438J823965K369054K105211
37121A7865905P70071j103524k028682j077298M90294M46575j292348k301231
37113A1769762j086735O61724N26720j168763k055057j259497m35956j107629
37105E844569k423939k303292k02101K009359K151592M41616o51673L03921J560326
37096F730378P03672j474960j902452K6495J395289L50606j091633o13568N75569
37087D699396L0262j716510k156343q41926M27777P11368N76606K53514l57606
37078A626538m51880M34817P65043o85670j865049j87274K555820K166706j153847
37069C205204k565301m5550K542363J732372n10155q14410K09668M2513j063755
$$ plain form
37130 7842768 8694685 9598767 10158332 10349166 10623237 11567675 13391640 15760694 17865905
37121 17865905 18635976 17532452 15503770 14426472 14916766 15363341 14070993 11769762
37113 11769762 10683027 11344751 11871471 10702708 8647651 7388154 6952198 5844569
37105 5844569 3420630 1117338 915237 2924596 5076188 5517804 4866131 5170052 6730378
37096 6730378 7434050 5959090 4056638 4083133 5478422 5829028 4737395 4123827 4699396
37087 4699396 4729658 3013148 856805 14879 442656 1154024 1730630 1984144 1626538
37078 1626538 1174658 1609475 2374518 1688848 -176201 -363475 2192345 4359051 3205204
37069 3205204 639903 594353 3136716 4869088 4358933 3544523 3754191 3796704 2732949
37060B732949j147979m22550n83404j401298j123865M48708J901186K544668K583301
37051E531716J799309K70141n40202L28279J267039K45409j865985k545893j412257
37042C077556k50129R1943K43559K46833m02248r23344n6213J435596J561989
37033E025542K85969o01685o30738r54699j508946q19858R44391J652475O68284
37024D060735j29422L24849O38229k52986j249627j341014j228344j299905m52419
37015i29904J412754K140038O04329r13603K1245K142856K409491M80008j282786
37006F084428j452784q03303l82423l91996p45011j086541n99410Q00610J680810
36997C104380R56772k42398k34686N03446K35371j056820j748140j322015q72695
$$ plain form
37060 2732949 1584970 1162420 579016 -822282 -1946147 -1497439 403747 2948415 5531716
37051 5531716 7331025 7601166 7060964 7389243 8656282 8901691 7035706 4489813 3077556
37042 3077556 2827427 2919370 3162929 3409762 3007514 2084170 2027957 3463553 5025542
37033 5025542 5311511 4709826 4079088 3124389 1615443 795585 1739976 3392451 4060735
37024 4060735 3931313 4256162 4894391 4641405 3391778 2050764 822420 -477485 -929904
37015 -929904 482850 2622888 3227217 2313614 2334859 4477715 6887206 7367214 6084428
37006 6084428 4631644 3828341 3445918 3053922 2308911 1222370 622960 1423570 3104380
36997 3104380 4061152 3818754 3584068 4087514 4322885 3266065 1517925 195910 -676785
36988f76785q70378n29621L35501P63764M00065J24709M88326R95648J248569
36979B279798J327846Q76108n23439j844448j391937M81089J415954M69454n82535
36970B507890l24794N8578r31096k510853l092215k745339k251485j138362J107940
36961i319736L004327K730515J157172P13112J598487J741159N27904j84237O17770
36952B586473J394098P76553k95563o16785q53205j819171k325657r87421R34298
36943a206380R14097j045731k300616j344644L55346Q54985L15357J26225O63260
36934b668101J087567Q43402L83792M27471R91394J309560O98354n29979j309781
36925A233679j133080o22033m30421k69631K70292O99844N37704N51859J565948
$$ plain form
36988 -676785 -1547163 -2076784 -1741283 -977519 -577454 -452745 35581 1031229 2279798
36979 2279798 3607644 4483752 3960313 2115865 723928 1205017 2620971 3090425 2507890
36970 2507890 2183096 2241674 1310578 -1200275 -4292490 -7037829 -9289314 -10427676 -9319736
36961 -9319736 -6315409 -3584894 -2427722 -1714610 -116123 1625036 2152940 1968703 2586473
36952 2586473 3980571 4757124 4461561 3844776 2991571 1172400 -1153257 -2140678 -1206380
36943 -1206380 -292283 -1338014 -3638630 -4983274 -4627928 -3772943 -3457586 -3331361 -2668101
36934 -2668101 -1580534 -737132 -353340 74131 1065525 2375085 3073439 2543460 1233679
36925 1233679 100599 -521434 -951855 -1221486 -951194 -251350 286354 838213 2404161
36916B404161K457696J291551j426137k676732q63339J949977K792314J301418
36908G230909p05063j831299j821317p06071J114293K391761K003172K77955j412110
36899F542230j968124r67985J252134L095550K495469n30332l189569l190537
36891C538836j627396r97138j537132j638763r25748l98305p0797Q29328J521305
36882a305810M17998j609027j758082K38284J300590j01893j351223M1210K335745
36873a792208K420357O52277k35213K81833K66751q73814j467065p29144j55724
36864a631950r04133j819421j183548R05044K877732L492089K511018L89424j850596
36855B785659k847071j839649M43862K152218J892403J36874j149452o87280N55826
$$ plain form
36916 2404161 4861857 6153408 4727271 2050539 1187200 3137177 5929491 7230909
36908 7230909 6525846 4694547 2873230 2167159 3281452 5673213 7676385 7954340 6542230
36899 6542230 4574106 3606121 4858255 7953805 10449274 9918942 6729373 3538836
36891 3538836 1911440 914302 -622830 -2261593 -3187341 -3585646 -3656443 -2827115 -1305810
36882 -1305810 -887812 -2496839 -4254921 -4016637 -2716047 -2817940 -4169163 -4127953 -1792208
36873 -1792208 628149 1280426 1045213 1327046 1593797 719983 -747082 -1476226 -1631950
36864 -1631950 -2536083 -4355504 -5539052 -4634008 -1756276 1735813 4246831 4636255 2785659
36855 2785659 -61412 -1901061 -1457199 695019 2587422 2724296 1574844 887564 1443390
36846A443390P25374k36360n70466M45797J255533M50710j103351j829935j755772
36837a175080j681097j230928L01586J954239K061884Q78681K11400N65614O67473
36828B553772p7508o61054m10390j5375k4968N0542M46882M25945l73042j114166
36818H00638j056874n94249l34533j35437L40891R85117J584915J950118J520798
36809E061384k7695j639444j721680m26805M18544M5566l29590P2460J95863p12345
36799I36258j403694o24764O41243O35899n54927j483798j554882j187018n51972
36790e147655L08340P77849N30017M23848J146351J758621J131370L78j69489
36781G59630L63060K45818m87367p14015n83571j190839j974783j044520J437592
$$ plain form
36846 1443390 2168764 1932404 1361938 1807735 3063268 3513978 2410627 580692 -1175080
36837 -1175080 -2856177 -4087105 -3785519 -1831280 230604 1109285 1320685 1886299 2553772
36828 2553772 2476264 1815210 1404820 1389445 1364477 1415019 1861901 2287846 1914804 800638
36818 800638 -256236 -850485 -1185018 -1320455 -979564 5553 1590468 3540586 5061384
36809 5061384 5033689 3394245 1672565 1245760 1664304 1709870 1380280 1452740 1648603 936258
36799 936258 -467436 -1092200 -450957 184942 -369985 -1853783 -3408665 -4595683 -5147655
36790 -5147655 -4839315 -4061466 -3531449 -3107601 -1961250 -202629 928741 929119 759630
36781 759630 1122690 1368508 881141 167126 -416445 -1607284 -3582067 -4626587 -3188995
36772c188995K757139J527821k28948k76757N89292L28880q61229j094248r2570
36763e39615K91383j006952k556381k333781l40899J501089J732642R22919O34868
36754a694727J241171J491723M45379j016772j437717r57308r96533j891567k184072
36745g000423o51865J979965L850768L768752J922222m49610j835821j651150
36737f7162q72976q20830j393257j483590r47867p05099p98009r8609J535710
36728e651689K580230K187263J533087J698529J817137P58564p74781j457235
36720B691105j408405j333407p86155O97455J709963N53615j755973k370348m19305
36711b421455K115223L297365K930683J317757j350319l834026m232059k419642
$$ plain form
36772 -3188995 -431856 1095965 867017 590260 1179552 1508432 647203 -447045 -539615
36763 -539615 -248232 -1255184 -3811565 -6145346 -6486245 -4985156 -3252514 -2329595 -1694727
36754 -1694727 -453556 1038167 1483546 466774 -970943 -1928251 -2924784 -4816351 -7000423
36745 -7000423 -7652288 -5672323 -1821555 1947197 3869419 3419809 1583988 -67162
36737 -67162 -940138 -1760968 -3154225 -4637815 -5585682 -6290781 -7088790 -7187399 -5651689
36728 -5651689 -3071459 -884196 648891 2347420 4164557 4923121 4148340 2691105
36720 2691105 1282700 -50707 -836862 -139407 1570556 2124171 368198 -2002150 -2421455
36711 -2421455 -306232 2991133 5921816 7239573 5889254 2055228 -2176831 -4596473
36703d596473l76585O39167J427465K555542K797498J257190o75433j170340m92540
36694A365491j04681l81017q28503j459934k112014j429711J230128L522888K324779
36685B127426j682999m120786k354067J262697K710560J144432j026994j601567
36677c541298m73102J196392K119986J544353R6075l14385J261014K985371K307286
36668G181692j95885j115690R45015K954094J515254k286860m411873l304172
36660A281575j129139K04436J232539K367034K132134j12819j992837j203030
36652B779893P54764O91087j384854k497983j456657k03879q6991P4897J116772
36643b12951J588756L94175r92566r48930l64965o32796p01697J117352L511519
$$ plain form
36703 -4596473 -4973058 -4333891 -2906426 -350884 2446614 3703804 3028371 1858031 1365491
36694 1365491 1260810 879793 51290 -1408644 -3520658 -4950369 -3720241 -197353 2127426
36685 2127426 444427 -3676359 -6030426 -4767729 -2057169 -912737 -1939731 -3541298
36677 -3541298 -4014400 -2818008 -698022 846331 942406 628021 1889035 4874406 7181692
36668 7181692 6985807 5870117 6815132 9769226 11284480 8997620 4585747 1281575
36660 1281575 152436 356872 1589411 3956445 6088579 5975760 3982923 2779893
36652 2779893 3534657 4225744 2840890 342907 -1113750 -1317629 -1404620 -1329723 -212951
36643 -212951 1375805 1769980 777414 -171516 -536481 -1169277 -1870974 -753622 2757897
36634B757897L387113N33200j777031j321323L71650P56127l45709j388169j616553
36625A357202j385383q03777L87718J716036J961277O55871j011886j391301m08768
36616A076989K03703q09842k252638j880511L38551J965253J632673R91253J698374
36607B963805K249882K89175k939799l581969p85731J724758Q52683j696458k344897
36598c268551q08404J48191q00432j862694j135028P05466J597788Q77484j43111
36589d689291k8381J107013J927714J515697L14750n59350n53395K5422N54598
36580c85223M95612l93425j633059k098798j245060k9704J75905o04445j118400
36571f836597o69006K79422J134989J679141J605035Q01826R5112L47719Q16595
$$ plain form
36634 2757897 6145010 6678210 4901179 3579856 3951506 4707633 4361924 2973755 1357202
36625 1357202 -28181 -831958 -444240 1271796 3233073 3888944 2877058 1485757 1076989
36616 1076989 1280692 470850 -1781788 -3662299 -3323748 -1358495 274178 1265431 2963805
36607 2963805 5213687 5502862 2563063 -1018906 -1804637 -79879 772804 -923654 -3268551
36598 -3268551 -4076955 -3928764 -4729196 -6591890 -7726918 -7021452 -5423664 -4546180 -4689291
36589 -4689291 -4717672 -3610659 -1682945 -167248 147502 -411848 -965243 -939821 -385223
36580 -385223 110389 -283036 -1916095 -4014893 -5259953 -5289657 -5113752 -5718197 -6836597
36571 -6836597 -7505603 -7226181 -6091192 -4412051 -2807016 -2005190 -1910078 -1562359 -745764
36562g45764K2379j597681j866871k77298Q67261j51274j820204j680160K78860
36553f970752K166734K877406K548666J474545L06622L19331J637876K141453
36545F501881J36208k680737l150220j030070Q91677Q78286N4560p3014L75004
36536A903575P03940P28985J09711j607305l508870l589439j472782O42790Q38491
36527e250904l9888M1161J310838K150360J471632n5199r97094o45186M05853
36518a608427Q42581L6323j093934j148260j32087N78554K73076j32762L98395
36509a986541J488651J948101J308669K23315l07230J05651P20776K89143j238193
36500B552342k105602r00263J187363J749765M95822o62424p76788q51770j280148
$$ plain form
36562 -745764 -723385 -2321066 -4187937 -4465235 -3597974 -3749248 -5569452 -7249612 -6970752
36553 -6970752 -4804018 -1926612 622054 2096599 2403221 2722552 4360428 6501881
36545 6501881 6638089 3957352 807132 -222938 668739 1547025 1601585 1528571 1903575
36536 1903575 2607515 3336500 3446211 1838906 -1669964 -5259403 -6732185 -6089395 -5250904
36527 -5250904 -5290792 -5249631 -3938793 -1788433 -316801 -372000 -1369094 -2014280 -1608427
36518 -1608427 -765846 -729523 -1823457 -2971717 -3103804 -2525250 -2252174 -2384936 -1986541
36509 -1986541 -497890 1450211 2758880 2982195 2674965 2780616 3501392 3790535 2552342
36500 2552342 446740 -453523 733840 2483605 2979427 2317003 1540215 688445 -591703
36491e91703q32691O93523J239504m02334k249664j881515J11854J487496J684890
36482g40640J550539J000647n05339j980616j937977r11435n56218o79081K79532
36473d480588K042025K535119J331501L21619L92238J17280j272176k156381j197239
36464b366602L80951Q06228L34811J85279L96707M33209O27193J252449J240098
36455C290323l03589k070192j948486o1407J342326R08891m30727j122406p50544
36446a145811j6244P1405r82396k330150k135804K10978K685943K796759Q81069
36437C5749l54206L93009J473558J029691l79462r18573k2816J391626K433910
36428E082486K723191J904937J1658j771084j904965m26115P66910J08355j636644
$$ plain form
36491 -591703 -1424394 -730871 508633 106299 -2143365 -4024880 -3913026 -2425530 -740640
36482 -740640 809899 1810546 1305207 -675409 -2613386 -3524821 -4081039 -4760120 -4480588
36473 -4480588 -2438563 96556 1428057 1749676 2141914 2259194 987018 -1169363 -2366602
36464 -2366602 -1985651 -1179423 -844612 -659333 -262626 170583 797776 2050225 3290323
36455 3290323 2986734 916542 -1031944 -1093351 248975 1157866 727139 -395267 -1145811
36446 -1145811 -1162055 -1090650 -2073046 -4403196 -6539000 -6328022 -3642079 -845320 35749
36437 35749 -318457 74552 1548110 2577801 2198339 1279766 1256950 2648576 5082486
36428 5082486 7805677 9710614 9722272 7951188 6046223 5620108 6387018 6495373 4858729
36419D858729k210053n71209J845512K803453J733650N0166p47644n73445k77120
36410F912039m48909j118079j990748k419432j740412l27385L58571k84430p04230
36401a763015P55574K994456L218902R40150j163846j085023j29979l73234j293253
36392B100732j011137K94148O52831l59662r15701J06071J473084J651025Q90142
36383D881533L15956J89212J24576J51294N19964J003555J211359J166135R59416
36374A0523000L62596n88614j165710q25996j20126n9523q94856k042687k804905
36365B383179k648582j351065M08401J139418J45881j288620j272979K97283J652834
36356e34250J436811J69917p39984o81057j96249j26191o60873j061346l90582
$$ plain form
36419 4858729 2648676 2077467 3922979 6726432 8460082 8510248 7762604 7189159 6912039
36410 6912039 6463130 5345051 3354303 934871 -805541 -1132926 -774355 -1058785 -1763015
36401 -1763015 -1007441 1987015 5205917 6146067 4982221 3897198 3767219 3393985 2100732
36392 2100732 1089595 1383743 2036574 1676912 761211 867282 2340366 3991391 4881533
36383 4881533 5197489 5386701 5511277 5662571 6182535 7186090 8397449 9563584 10523000
36374 10523000 10885596 10296982 9131272 8305276 8185150 8125627 7230771 5188084 2383179
36365 2383179 -265403 -1616468 -1208067 -68649 77232 -1211388 -2484367 -2187084 -534250
36356 -534250 902561 1072478 332494 -348563 -544812 -671003 -1331876 -2393222 -2783804
36347b783804J261242K604194K619713J767223J056676M07633r64198k679573
36339C289106l068524j398333P82402J317705l9557j467806j221194N74309K236270
36330A004378K314750R44401n38328j117341q72762k77213N38430J360877J463612
36321D820804M71232p63922j066513m44628J89075M54760N95344M32431m31527
36312D257056j386267j187349J64081J157561P42227n75695j872878k755938k772633
36303d229835j302385J212943L108943L358633K612685J827927J072225L43725
36295H004861J70170M52936R4271j113948j643750o28713L21720n33035k121574
36286C002938k083701m26550O54139K72247j70349L30590Q97915O04916Q053j3965
$$ plain form
36347 -2783804 -1522562 1081632 3701345 5468568 6525244 6932877 5968679 3289106
36339 3289106 220582 -1177751 -395349 922356 882799 -585007 -1806201 -1231892 1004378
36330 1004378 3319128 4263529 3725201 2607860 1735098 1457885 1996315 3357192 4820804
36321 4820804 5292036 4528114 3461601 3016973 3206048 3660808 4256152 4688583 4257056
36312 4257056 2870789 1683440 1847521 3005082 3747309 3171614 1298736 -1457202 -4229835
36303 -4229835 -5532220 -4319277 -1210334 2148299 4760984 6588911 7661136 8004861
36295 8004861 8175031 8627967 8722238 7608290 5964540 5335827 5657547 5124512 3002938
36286 3002938 919237 492687 1146826 1419073 1248724 1579314 2477229 3082145 3090198 3076233
36276C076233L61063M89106K17137m00847j422482k428078k440892j115774N66227
36267c098307J342722R97576K91348j7551K37599P12294R56585Q10015L83531
36258B615812k48971q50950n60968J276830L383655L113328p2598l105189l074382
36249B476567j264040r84059k231928j762369J322360L533917K044799j088880
36241B046367k040001n42513N41389j41918r94851n32896M89744O96665K44267
36232b33747L49200J362856K178361J557123l09830j826045j675852k32455J044833
36223B214444J284011O70548l51615j337570j530687n96565K95730m26770k296887
36214b075361l035501j727017o2675M12132M71707J294193K053549J313448l14251
$$ plain form
36276 3076233 3437296 3926402 4143539 3742692 2320210 -107868 -2548760 -3664534 -3098307
36267 -3098307 -1755585 -758009 -466661 -484212 -246613 465681 1422266 2232281 2615812
36258 2615812 2366841 1515891 954923 2231753 5615408 8728736 8656138 5550949 2476567
36249 2476567 1212527 228468 -2003460 -3765829 -2443469 1090448 3135247 2046367
36241 2046367 6366 -536147 5242 -136676 -1131527 -1664423 -1174679 -478014 -233747
36232 -233747 115453 1478309 3656670 5213793 4903963 3077918 1402066 1169611 2214444
36223 2214444 3498455 4169003 3817388 2479818 949131 352566 648296 221526 -2075361
36214 -2075361 -5110862 -6837879 -6900554 -6488422 -6016715 -4722522 -2668973 -1355525 -1669776
36205a669776r35582j54412P97740J256825J570758J593313O58007q28864j514506
36196G73503j123065p76647r23915n65718P61788J720165R74510p65931j692627
36187a617937j236656k92790N30579J581735K871099L263862J867596k70557j008757
36178E688174J20960J031071k47898k788863l881771k536106l95939Q40340J241486
36169i28546J405931J106518K01750m72661l47555j52610n30196p81159l26230
36160h24758j48444j032086j519956J37328K714248L206384J152209p34892n82785
36151B367248L76808L24529n41715j100710j246176j331325r73534J71181J318305
36142f35389J473460P95414N4936n76047j185041j238599k59999R27088Q37019
$$ plain form
36205 -1669776 -2605358 -2759770 -1962030 -705205 865553 2458866 3116873 2288009 773503
36196 773503 -349562 -1126209 -2050124 -2615842 -1854054 -133889 840621 74690 -1617937
36187 -1617937 -2854593 -3147383 -2616804 -1035069 1836030 5099892 6967488 6696931 5688174
36178 5688174 5809134 6840205 6592307 3803444 -78327 -2614433 -3010372 -2170032 -928546
36169 -928546 477385 1583903 1785653 1312992 965437 812827 282631 -498528 -824758
36160 -824758 -973202 -2005288 -3525244 -3387916 -673668 2532716 3684925 2950033 2367248
36151 2367248 2744056 3068585 2526870 1426160 179984 -1151341 -2124875 -1953694 -635389
36142 -635389 838071 1633485 1688421 1112374 -72667 -1311266 -1571265 -644177 192842
36133A92842o62398j858175j130713J031822K424203J586071m62347j417992n42072
36124h38759N57034L44515n82894q66272o70084q90788r13637M93453K242968
36115a124464J628613j348402l038646j039198K227057K871896P53306j070403
36107a40241r69275k19896k17132o21110n69384J02615J244342K532008K944580
36098D086507J509484j040857k626403k272583j083354l81855q6826M50250J080263
36089c65374J173204N87257l91067j487188k220397j897666n75018M92425K33799
36080d450025o62565m34956J448142L402733L440493J318555j368461k975223
36072b81307l202998k660387j594492K32935K388943L384932K248242J13544p61806
$$ plain form
36133 192842 -469556 -2327731 -3458444 -2426622 -2419 1583652 1121305 -296687 -838759
36124 -838759 -281725 62790 -520104 -1386376 -2056460 -2947248 -3860885 -3367432 -1124464
36115 -1124464 504149 -844253 -3882899 -4922097 -2695040 176856 930162 -140241
36107 -140241 -1109516 -1329412 -1546544 -2167654 -2737038 -2634423 -1390081 1141927 4086507
36098 4086507 5595991 4555134 1928731 -343852 -1427206 -1809061 -1895887 -1445637 -365374
36089 -365374 807830 1395087 1004020 -483168 -2703565 -4601231 -5176249 -4683824 -4450025
36080 -4450025 -5112590 -5547546 -4099404 -696671 2743822 4062377 2693916 -281307
36072 -281307 -3484305 -6144692 -7739184 -7506249 -5117306 -1732374 515868 629412 -132394
36063a32394K89417J510893J024428q28387k168040k019111j079004k64141L69869
36054c296470R67052J149109O92285K77024O26945J188705O79898r84195k282414
36045i82061j988149o78816K10502J79728j92858l77785l17164j8612M23818N61493
36035c179904J55884j34084M67340J454309J453757J50739j260255j776532j586193
36026d254939r84097L45689K108381K742005J340987o12409r59707J96147Q73942
36017G95999L06902j58363M38436J057434M82977o20861q03595j09215K22243
36008A611957m3017K09675J375139K126771J269686l46552q59545N3827P94982
35999F192923J20909j214013j661660j047064o66182j363235k308379k006842
$$ plain form
36063 -132394 157023 1667916 2692344 1863957 -304083 -2323194 -3402198 -3666339 -3296470
36054 -3296470 -2329418 -1180309 -488024 -211000 415945 1604650 2284548 1300353 -982061
36045 -982061 -2970210 -3649026 -3438524 -3258796 -3451654 -3829439 -4146603 -4165215 -3741397 -3179904
36035 -3179904 -3024020 -3158104 -2690764 -1236455 217302 368041 -892214 -2668746 -4254939
36026 -4254939 -5239036 -4893347 -2784966 -42961 1298026 685617 -274090 -77943 795999
36017 795999 1102901 944538 1382974 2440408 2923385 2302524 1498929 1389714 1611957
36008 1611957 1568940 1778615 3153754 5280525 6550211 6203659 5344114 5397941 6192923
35999 6192923 6313832 5099819 3438159 2391095 1724913 361678 -1946701 -3953543
35991c953543j45180J928151K525261J265270o48991j752897j717662j218335
35983c717926o98909R541P61162P77372q5651o02625K34126J495262J496932L46738
35973A6022k72648J50061K59110n83401r06828M42189K021782J673268k71833
35964B527722j516007j042011K0528O28809R87784J131064K20102j775293l112001
35955a929303k253262N2178J848689K446295K534991K342044J309582k64418q69387
35946E217409J28727J197192N65977j268097k262422j718697r96323j181194j515917
35937a833345q98584K19287N53205r5604p97847r72085p93887l70845L72017J024479
35927c593209R33353J82408n19556q74123j039392q33745J1428R48340J201100
$$ plain form
35991 -3953543 -4098723 -2170572 354689 1619959 970968 -781929 -2499591 -3717926
35983 -3717926 -4416835 -4407294 -3646132 -2868760 -2954411 -3557036 -3322910 -1827648 -330716 16022
35973 16022 -256626 -106565 152545 -430856 -1337684 -895495 1126287 2799555 2527722
35964 2527722 1011715 -30296 -9768 619041 1606825 2737889 2957991 1182698 -1929303
35955 -1929303 -4182565 -4130387 -2281698 164597 2699588 5041632 6351214 6086796 5217409
35946 5217409 5346136 6543328 7109305 5841208 3578786 1860089 863766 -317428 -1833345
35937 -1833345 -2731929 -2512642 -1959437 -2055041 -2852888 -3824973 -4618860 -4989705 -4617688 -3593209
35927 -3593209 -2659856 -2477448 -2997004 -3871127 -4910519 -5744264 -5732836 -4784496 -3583396
35918c583396J120595J497631J668307K37471k080307k614125n77775J479486
35910b852113J364551J88743j46308k42566j466691k619208j470366J224701K453301
35901c565956J496140O17762R26734P65567p32649j522195J8152J979163J571425
35892A554143o13904j572286m37425M89657n01656j903409j195766J558841L667864
35883A046059L057658N11126j566908j838714q72696J99558Q33847Q65673L00291
35874B535894k03320K90393J377065J187796r65964k876735k016155Q75465K690936
35865B895375K110969P59192J54114k13801j069533j685871j245437l79905j12617
35856A212486l67381n78163p68343j046020r88663m59036j05027k21774j72107
$$ plain form
35918 -3583396 -2462801 -965170 703137 940608 -1139699 -3753824 -4331599 -2852113
35910 -2852113 -1487562 -1298819 -1445127 -1687693 -3154384 -5773592 -7243958 -6019257 -3565956
35901 -3565956 -2069816 -1452054 -525320 240247 -492402 -2014597 -1996445 -17282 1554143
35892 1554143 940239 -632047 -1069472 -579815 -1081471 -2984880 -4180646 -2621805 1046059
35883 1046059 4103717 4614843 3047935 1209221 336525 536083 1369930 2235603 2535894
35874 2535894 2332574 2622967 4000032 5187828 4221864 1345129 -671026 204439 2895375
35865 2895375 5006344 5765536 5919650 5705849 4636316 2950445 1705008 1325103 1212486
35856 1212486 845105 266942 -501401 -1547421 -2536084 -2995120 -3100147 -3321921 -3494028
35847c494028K20494j6764j193190j799430o43392J053242J451271R76483J321944
35838b123370K239970J764536l27566j659291o18361J310334J722654M75094o26098
35829B157902n64822k10428p02435j661890j527539M06564K691056L018799R42182
35820D549389j406404j814619n23121N16978K42115p83726j717292k113478j441183
35811d491341N16775K555292K808768J129618n58954q23402l29661k11040k68355
35802C27700N3416J58100o42032j378828n42421J353342K095569Q05396r64239
35793A266003j576333j230380q10234k38923Q37369J758479J661211R99397Q53894
35784C520483J078424O34889l16579l61801P21851J132447l84975k508702l197012
$$ plain form
35847 -3494028 -3273534 -3290298 -4483488 -6282918 -6926310 -5873068 -4421797 -3445314 -2123370
35838 -2123370 116600 1881136 1553570 -105721 -724082 586252 2308906 2784000 2157902
35829 2157902 1593080 1382652 680217 -981673 -2509212 -2102648 588408 3607207 4549389
35820 4549389 3142985 1328366 805245 1322223 1564338 780612 -936680 -3050158 -4491341
35811 -4491341 -3974566 -1419274 1389494 2519112 1960158 1136756 807095 596055 327700
35802 327700 381116 539216 -102816 -1481644 -2024065 -670723 1424846 2230242 1266003
35793 1266003 -310330 -1540710 -2350944 -2589867 -1752498 5981 1667192 2666589 3520483
35784 3520483 4598907 5233796 4917217 4555416 5277267 6409714 6024739 3516037 319025
35775C19025k512868j974671j790631p13689J369026K662547J947110L28604m18162
35766g83709j12850K45769K32796J27799j27401q17006j459409j087005K95335
35757c485681J398621J148671l3779p67189k33288J012957J590035O36650j208321
35748E8676k261372j467717M88775J983861K143751J363473L93376m13134q85418
35739A404271p96178k70579L1257k92737o53793j73265R14980J292697K87912
35730A744565j089509j456974r01606o14466r18294q16381K44673J277013J074473
35721a456506j80907j350747j674618r51542P90951K776288L314410J477159j335960
35712A408528k676514j732985K25728J679666J950890R46846o54841j206506K65604
$$ plain form
35775 319025 -2193843 -4168514 -5959145 -6672834 -5303808 -2641261 -694151 -365547 -783709
35766 -783709 -896559 -650790 -417994 -290195 -417596 -1234602 -2694011 -3781016 -3485681
35757 -3485681 -2087060 -938389 -972168 -1739357 -1972645 -959688 630347 1266997 58676
35748 58676 -2202696 -3670413 -3181638 -1197777 945974 2309447 2702823 2289689 1404271
35739 1404271 608093 337514 368771 76034 -577759 -751024 163956 1456653 1744565
35730 1744565 655056 -801918 -1703524 -2317990 -3236284 -4052665 -3807992 -2530979 -1456506
35721 -1456506 -1637413 -2988160 -4662778 -5614320 -4823369 -2047081 1267329 2744488 1408528
35712 1408528 -1267986 -3000971 -2775243 -1095577 855313 1802159 1147318 -59188 206416
35703B06416K270698K407686O97467n53890l36546j07593q21697j237979l90143
35694B134419M69622J5498r09620r57713n60644o66425o60532L47729J368310
35685E80644R22176k90673m35898L10101K3076j705115k980901k372423o96271
35676f645284L71000K13037m31314k56252J299298K857528K142334p59645k605072
35667c814370j187425J232056J203220n85364o50021J346527K082352M04288n46370
35658e15107J330887L352028K204076r85443k709981k231033j559021j516274
35650b629868r46242M84946J406426R58904p2871o86247p12328k36171O55183
35641a778268J305801R29999n3667k36193Q07413J697705R70541j020367k490395
$$ plain form
35703 206416 2477114 4884800 5582267 5028377 4691831 4584238 3762541 2524562 2134419
35694 2134419 2604041 2619539 1709919 752206 191562 -474863 -1135395 -787666 580644
35685 580644 1502820 1212147 776249 1086350 1109426 -595689 -3576590 -5949013 -6645284
35676 -6645284 -6274284 -6061247 -6492561 -6748813 -5449515 -2591987 -449653 -1209298 -3814370
35667 -3814370 -5001795 -3769739 -2566519 -3151883 -3801904 -2455377 -373025 31263 -515107
35658 -515107 815780 4167808 6371884 5386441 2676460 445427 -1113594 -2629868
35650 -2629868 -3576110 -3091164 -1684738 -725834 -798705 -1484952 -2197280 -2433451 -1778268
35641 -1778268 -472467 457532 403865 167672 975085 2672790 3643331 2622964 132569
35632A32569k189516n77114P75369O50297q38206k410895k644459j047957J480897
35623f669015L165206K738893P13375j004926j133126l24172l9066o23600j270183
35614d446614j465152j437822j324210r38120m05567q4806J67660P43951J372756
35605g817924J481761J383030J922824K941785L302933K486642R08740j232644
35597E377147l813401n462108m376727j034501J743969K192967J353922P28757
35589c289975J94377o05515p92279J89654J154601J042880Q21704J729695K871902
35580C317044K527223R04108l61400p29535q86754r38829l61678N62956R18988
35571D952123N33098j29977r21809j555984j041338Q16424K225199J606098J36139
$$ plain form
35632 132569 -2056947 -2634061 -1858692 -1208395 -2046601 -4457496 -7101955 -8149912 -6669015
35623 -6669015 -3503809 -764916 -51541 -1056467 -2189593 -2513765 -2552831 -3176431 -4446614
35614 -4446614 -5911766 -7349588 -8673798 -9611918 -10017485 -10102291 -9934631 -9190680 -7817924
35605 -7817924 -6336163 -4953133 -3030309 -88524 3214409 5701051 6609791 5377147
35597 5377147 1563746 -3898362 -8275089 -9309590 -7565621 -5372654 -4018732 -3289975
35589 -3289975 -3095598 -3701113 -4493392 -4303738 -3149137 -2106257 -1284553 445142 3317044
35580 3317044 5844267 6748375 6386975 5657440 4770686 3831857 3470179 4033135 4952123
35571 4952123 5485221 5355244 4433435 2877451 1836113 2652537 4877736 6483834 6619973
35562F619973p7760M60869l67966k190774k210042J75496J925132P64081j576001
35553C523008k201985j073489k28317m59023p84921m65796J92286P26336R51126
35544A79225P08893P8801m07314m12780l18474n86005j063301j397856j587668
35535d806479j626873j198112k72035N20035O38573K93855k2582q2675L16389
35526f239904J339915K402823K364417J116728J13383M47936J206094Q12667o27196
35517B936863j617766j526359j139896r94831n85604L35572Q97547L49796o32704
35508a977382p60605J97865J344000J939685J943233J393077J99538j194594j724223
35499A360594q11400Q27206J893210J741123O79386m70926q16555n8207P78207
$$ plain form
35562 6619973 6542213 7003082 6635116 4444342 2234300 2409796 4334928 5099009 3523008
35553 3523008 1321023 247534 19217 -439806 -1224727 -1690523 -1498237 -771901 179225
35544 179225 888118 966919 559605 146825 -171649 -757654 -1820955 -3218811 -4806479
35535 -4806479 -6433352 -7631464 -7903499 -7383464 -6744891 -6451036 -6473618 -6556293 -6239904
35526 -6239904 -4899989 -2497166 -132749 983979 1097362 1545298 2751392 3564059 2936863
35517 2936863 1319097 -207262 -1347158 -2341989 -2927593 -2592021 -1694474 -1344678 -1977382
35508 -1977382 -2737987 -2540122 -1196122 743563 2686796 4079873 4279411 3084817 1360594
35499 1360594 549194 1376400 3269610 5010733 5690119 5219193 4402638 4344431 5122638
35490E122638P6623k084413l255776j526364J571226K756723J248399o60411j242925
35481B005720j222340j420203r88376N82240J728179R71285o66386j298438r85843
35472a294162r49394j063091l17061R49720J467623J234300J225925J296008M79296
35463C029164q48414j274953p55088n86953r70693p82489N8187K92591j96868
35454b035516P6879J480893K287983J413913J42905k2189M94133N01890j58515
35445D182376j038466j878406k084789r49496P26683R63987m12458j032274M38124
35436a084719J998815J452773m8610l9764J059774O64819j564680k875100j384911
35427a821603J322835K428003J228122n96782j200308l64533N46234J52643j294393
$$ plain form
35490 5122638 5199261 3114848 -140928 -1667292 -96066 2660657 3909056 3248645 2005720
35481 2005720 783380 -636823 -1625199 -1042959 685220 1656505 990119 -308319 -1294162
35472 -1294162 -2243556 -3306647 -3623708 -2673988 -1206365 27935 1253860 2549868 3029164
35463 3029164 2180750 905797 150709 -436244 -1406937 -2189426 -2131239 -1838648 -2035516
35454 -2035516 -1958637 -477744 1810239 3224152 3367057 3344868 3839001 4340891 4182376
35445 4182376 3143910 1265504 -819285 -1768781 -1042098 -78111 -490569 -1522843 -1084719
35436 -1084719 914096 2366869 2318259 2278495 3338269 4003088 2438408 -436692 -1821603
35427 -1821603 -498768 1929235 3157357 2560575 1360267 995734 1541968 1694611 400218
35418D00218k098632j212417M45221J323536J215677J033404J141730R73148J08732
35409C330617j133949k115923k268263j321120K39957J248787J024413J89209
35401h06272k01446P0586N55194J034202J465952J424755M67460j039919k083042
35392H87470j951599p44800P91756J705117J558076R39336P36551Q27982L05864
35383E055753q96432j707874j545601r99153m92824K71124R39346L20603j399024
35374d54082k056969o13545Q58409J83147j457057j437011R4628O95011j76073
35365d363542l57085J294795K964870K620461Q08361m21450k04237M84460K26976
35356C053609j286879k750728k404807k42163J498251J001182o11209p99396Q73788
$$ plain form
35418 400218 -1698414 -2910831 -2465610 -1142074 73603 1107007 2248737 3221885 3330617
35409 3330617 2196668 80745 -2187518 -3508638 -3268681 -2019894 -995481 -806272
35401 -806272 -1007718 -937132 -381938 652264 2118216 3542971 4010431 2970512 887470
35392 887470 -1064129 -1808929 -1017173 687944 2246020 3185356 3921907 4749889 5055753
35383 5055753 4159321 2451447 905846 -93307 -586131 -315007 624339 944942 -454082
35374 -454082 -2511051 -3124596 -2266187 -2083040 -3540097 -4977108 -4882480 -4187469 -4363542
35365 -4363542 -4720627 -3425832 -460962 2159499 2967860 2546410 2342173 2826633 3053609
35356 3053609 1766730 -983998 -3388805 -3630968 -2132717 -1131535 -1742744 -2542140 -1668352
35347a668352K393380K227228Q82927m70079j216026r36348M86882J991449K011857
35338E702918M90938j004631j413278j121621o44586Q8667P72275O05104k88674
35329C187112o99078j76695K58232j70008q54671j013415p99897n29493M5479
35320g52434R51245J482772J139159K01451j034853k553810l738743l431669j540432
35311i277314M40980J142508O80945k4897k32513O01639K445443L904497L236595
35302B917883P40415j284726j563375j232832j432771j329305J08260J884054
35294a192397K215289J042077k12031p06080p28599p49784r82530j363491j258323
35285c935869J803J669240J854334J02120j619601j549242l49913N08842J011291
$$ plain form
35347 -1668352 725028 2952256 3835183 3365104 2149078 1212730 1699612 3691061 5702918
35338 5702918 6193856 5189225 3775947 2654326 2009740 2098407 2870682 3475786 3187112
35329 3187112 2488034 2311339 2569571 2399563 1544892 531477 -268420 -797913 -752434
35320 -752434 198811 1681583 2820742 3022193 1987340 -566470 -4305213 -7736882 -9277314
35311 -9277314 -8836334 -7693826 -7012881 -7037778 -7270291 -6668652 -4223209 -318712 2917883
35302 2917883 3658298 2373572 810197 -422635 -1855406 -3184711 -3076451 -1192397
35294 -1192397 1022892 2064969 1852938 1146858 418259 -331525 -1314055 -2677546 -3935869
35285 -3935869 -3934066 -2264826 -410492 -308372 -1927973 -3477215 -3827128 -3318286 -2306995
35276b306995J622821J588029K54701j111958j060028m95907j107840k081881
35268d699058j131244J554212L236639K663644J454583R85703N97535j63186j03720
35259D395108J290438K174932Q44276j509999k349127j180430J99965K69930p64845
35250C370248j720392j629680n28347K91205n54954k483339l008649q44328K031759
35241e076477K725771J057962p08433j206751j174463j369393j203371q4558J332341
35232e707372K073251K008069J403351K78780j074123j851105j773245j456394
35224f098788r99467N64097L173288M402348K259728j370871k508986l24634J830729
35215I27444J208886r75846k157506k041670j715100j043426N58743J927866J365735
$$ plain form
35276 -2306995 -684174 903855 1158556 46598 -1013430 -1509337 -2617177 -4699058
35268 -4699058 -5830302 -4276090 -1039451 1624193 3078776 4064479 4662014 4498828 4395108
35259 4395108 5685546 7860478 8704754 7194755 4845628 3665198 3865163 4135093 3370248
35250 3370248 1649856 20176 -508171 -216966 -771920 -3255259 -6263908 -7108236 -5076477
35241 -5076477 -2350706 -1292744 -2001177 -3207928 -4382391 -5751784 -6955155 -7039713 -5707372
35232 -5707372 -3634121 -1626052 -222701 56079 -1018044 -2869149 -4642394 -6098788
35224 -6098788 -7098255 -6534158 -3360870 1041478 3301206 1930335 -578651 -903285 927444
35215 927444 2136330 1160484 -997022 -3038692 -4753792 -5797218 -5238475 -3310609 -1944874
35206a944874m14752r97542J82993J237827Q47868k74353j177042j756154j623778
35197e919807q6922J994504K392833N62495j298071j266616p5649N84617M19097
35188b693519k6329o07523r26749m3829J667415J940549l73720l077592l251644
35179g392941r70646J406863K501148K478189J460084k80918j205934R005K099253
35170A04103K497158R10004m71569l68430J34605q8834m63751j31957M21247J90077
35160B732653p54566j284765n29357J055498J829788O15386j556225k305953j087362
35151a284903r3399q90901j888377j066915M32345K02694j097244o60771J543948
35142d803523K310525K26804k081006j942411j66883Q83414N23062m23895j169276
$$ plain form
35206 -1944874 -2359626 -3357168 -3174175 -1936348 -1088480 -1362833 -2539875 -4296029 -5919807
35197 -5919807 -6006729 -4012225 -1619392 -1056897 -2354968 -3621584 -3697233 -3112616 -2693519
35188 -2693519 -2719848 -3327371 -4254120 -4297949 -2630534 -689985 -1063705 -4141297 -7392941
35179 -7392941 -8363587 -6956724 -4455576 -1977387 -517303 -798221 -2004155 -1995150 104103
35170 104103 2601261 3511265 3039696 2671266 2805871 2717037 2253286 2121329 2542576 2732653
35160 2732653 1978087 693322 163965 1219463 3049251 3664637 2108412 -197541 -1284903
35151 -1284903 -1378302 -2269203 -4157580 -5224495 -4792150 -4589456 -5686700 -6347471 -4803523
35142 -4803523 -2492998 -2266194 -4347200 -6289611 -6456494 -5573080 -5050018 -5473913 -6643189
35133f643189j012465M93104K294742K426813Q32192k40493L33972Q56735j22497
35124g81086j261467q27952K95849K24151q04252j169354n98065O8230R06237
35115c947709K425691L606481K649872l36554l104378l772324k404972l66534
35107e250427Q35953N21034l73591r2401J519366K475814J527778P6085k93616
35098I45995n08892k050343l739713l272673j106265J51062j23710m3479J132316
35089h615702J866618J420739J154341J773386J941270R31295K46800R91914J710121
35080C420782O70414j365556k513283k498379k133280j272022O15635K565974
35072b509715K891422J610913M14612K69525N03339K66139l85454r49519r73167
$$ plain form
35133 -6643189 -7655654 -7162550 -4867808 -2440995 -1608803 -1849296 -1515324 -658589 -781086
35124 -781086 -2042553 -2870505 -2574656 -2350505 -3154757 -4324111 -4922176 -4853946 -3947709
35115 -3947709 -1522018 2084463 4734335 4397781 1293403 -2478921 -4883893 -5250427
35107 -5250427 -4414474 -3893440 -4267031 -4359432 -2840066 -364252 1163526 1239611 945995
35098 945995 437103 -1613240 -5352953 -8625626 -9731891 -9580829 -9704539 -9748018 -8615702
35089 -8615702 -6749084 -5328345 -4174004 -2400618 -459348 471947 718747 1710661 3420782
35080 3420782 4091196 2725640 212357 -2286022 -4419302 -5691324 -5075689 -2509715
35072 -2509715 381707 1992620 2407232 2676757 3180096 3446235 3060781 2111262 1138095
35063A138095r2245J451997K434237J811456K12268p57380o23909l61363o37555
35054D575601j015375j082051j056882q74827N15J203992J249969l14457j728989
35045I57496j312929L2413K43030o79111q75056Q0602L60667r98321k254324j567419
35035f012952J86922R47656O30822P22815J377311J168904k47407j341240j061783
35026c628952j83252L66664Q26400J381247J267678K67655l76421N7734K18175
35017A96928j192071k852020k441290j58868J544063J505790R38532Q46975O11901
35008a000060j69050m69226L62385J153125O23388n89713r84032l97800J95176
34999a275807M18252N75948M13467o73269k147185k418297q40790J340801K485226
$$ plain form
35063 1138095 1045850 2497847 4932084 6743540 6955808 6198428 5574519 5213156 4575601
35054 4575601 3560226 2478175 1421293 546466 546981 1750973 3000942 2686485 957496
35045 957496 -355433 -323020 -79990 -759101 -1634157 -1553555 -1192888 -2191209 -4445533 -6012952
35035 -6012952 -5826030 -4878374 -4247552 -3524737 -2147426 -978522 -1225929 -2567169 -3628952
35026 -3628952 -3812204 -3445540 -2619140 -1237893 29785 297440 -78981 -21247 196928
35017 196928 -995143 -3847163 -6288453 -6447321 -4903258 -3397468 -2458936 -1611961 -1000060
35008 -1000060 -1169110 -1638336 -1275951 -122826 500562 -89151 -1073183 -1470983 -1275807
34999 -1275807 -857555 -281607 131860 -541409 -2688594 -5106891 -5947681 -4606880 -2121654
34990b121654K260677J462799Q09871M19941j2961r83773k657946m129389l769208
34981h721643j099926K034848L165383K038841P33683P01795R14977j83744j880765
34972b296551j837432O46788L407639L814047J435170k023207m505238m840488
34964f199272l103083n45672J278151J894236K036611K160430J677736K66933
34956e33930j004854r43092j0406L58820n5932r274J178925K416511K123105J74367
34946C694240j806422j986255k03574J644148J519364l14034j531508p87283N78189
34937H06865P03305j06462k86559K89199L54651m10331r73562q39783n56012k22882
34927a241571O78445J674927J385006k04440j305678r17203j45620p3680n9247
$$ plain form
34990 -2121654 139023 1601822 2411693 2831634 2818673 1834900 -823046 -4952435 -8721643
34981 -8721643 -9821569 -7786721 -4621338 -2582497 -1848814 -1147019 -232042 -415786 -2296551
34972 -2296551 -4133983 -3487195 -79556 3734491 5169661 3146454 -1358784 -6199272
34964 -6199272 -9302355 -9848027 -8569876 -6675640 -4639029 -2478599 -800863 -533930
34956 -533930 -1538784 -2481876 -2492282 -2133462 -2189394 -2198668 -1019743 1396768 3519873 3694240
34946 3694240 1887818 -98437 -302011 1342137 2861501 2547467 1015959 228676 806865
34937 806865 1510170 1403708 1117149 1406348 1760999 1350668 377106 -462677 -1018689 -1241571
34927 -1241571 -563126 1111801 2496807 2292367 986689 69486 -76134 -149814 -209061
34918b09061O41715J180518N74485m13506m71309J60735L47847j8546l27590p17797
34908G47491j543148j934915p25192J378336K258701J144007n41781j234715q29860
34899a281076l2928O40437Q86816O64409N10642R39082J423540R89598q4066l69123
34889D287331N32803J117109N04k097193l242455k559576q14978Q33096J806206
34880a37153J947937J211872j44646j380337j677332q57948L72927J017421O30328
34871I83069m49818j506115j807686q49883J098068K695195K581703R72585n38994
34862C178124r78773q54691p44435l31375M12188M76661n19937j167177l47402
34853h76817N96297k55684k119049k398440n75865J155678J283714O76213M06755
$$ plain form
34918 -209061 432654 1613172 2187657 1774151 1302842 1463577 1811424 1792878 1465288 747491
34908 747491 -795657 -2730572 -3455764 -2077428 181273 1325280 783499 -451216 -1281076
34899 -1281076 -1314004 -673567 213249 877658 1388300 2327382 3750922 4740520 4656454 4287331
34889 4287331 4820134 5937243 5937747 3840554 598099 -1961477 -2776455 -1943359 -137153
34880 -137153 1810784 3022656 2878010 1497673 -179659 -1037607 -664680 352741 983069
34871 983069 533251 -972864 -2780550 -3630433 -2532365 162830 2744533 3717118 3178124
34862 3178124 2199351 1344660 600225 268850 681038 1157699 637762 -529415 -876817
34853 -876817 -280520 -536204 -2655253 -5053693 -5629558 -4473880 -3190166 -2513953 -2107198
34844b107198J43838m30771o37289k94340l78165j079719r97970M69304J717060
34835c595250J417454O92650J011744J513447O11107r77052j254498k33755K96463
34826e17690r6053j01890N80180O20381l25512p09864K45157R67153n6687j750452
34816a145277j824530J54426K381044L095286K243328J017168M42002M71316K64337
34807G099100n95151j376003j176304l68844k13295j034784j737935j335673q7471
34798h26360J128541J727644J462834M53649n33808p22232n00778r68435k011100
34789g90045k067572m10259J570347K227196J691357J002871K65789r23622j907603
34780F58459j457425K41329J456885J067340o5949k60900R58130K292573K025084
$$ plain form
34844 -2107198 -1963360 -2394131 -3031420 -3325760 -3703925 -4783644 -5781614 -5312310 -3595250
34835 -3595250 -2177796 -1485146 -473402 1040045 1651152 674100 -580398 -814153 -517690
34826 -517690 -613743 -715633 -135453 484928 159416 -550448 -305291 661862 605175 -1145277
34816 -1145277 -2969807 -2815381 -434337 2660949 4904277 5921445 6363447 6834763 7099100
34807 7099100 6503949 5127946 3951642 3582798 3369503 2334719 596784 -738889 -826360
34798 -826360 302181 2029825 3492659 3946308 3412500 2690268 2189490 1221055 -790045
34789 -790045 -2857617 -3267876 -1697529 529667 2221024 3223895 3489684 2566062 658459
34780 658459 -798966 -557637 899248 1966588 1900639 1639739 2597869 4890442 6915526
34771F915526l045j864791j570157L11552J037391p68642l048371k856035j65965
34762b012537K246059K344472Q18919n06122r28494j047272j480504j956529j536192
34753d058200K37031K303367K748601J032453j000663j123370O75376K390512
34745C205107K381379O99261j509359k927502k751109j468960o85032j270571
34737d326786k154686j904060p69617J45657R38061K314029L518034L020947J189483
34728A971062Q4344L70475N56721k78202j148687j182727q94413o52856Q1814
34719a092469J108894J140121J15691k43464O60693J100729J20411n70858L56912
34710B696660J290447M69126q47728p28697j10274q31034j776200o32452J557048
$$ plain form
34771 6915526 6912481 5047690 3477533 3789085 4826476 4057834 1009463 -1846572 -2012537
34762 -2012537 233522 2577994 3396913 2890791 1962297 915025 -565479 -2522008 -4058200
34753 -4058200 -3821169 -1517802 1230799 2263252 1262589 139219 814595 3205107
34745 3205107 5586486 6285747 4776388 1848886 -902223 -2371183 -3056215 -4326786
34737 -4326786 -6481472 -8385532 -9155149 -9009492 -8071431 -5757402 -2239368 781579 1971062
34728 1971062 2055406 2425881 2982602 2704400 1555713 372986 -521427 -1174283 -1092469
34719 -1092469 16425 1156546 1272237 1028773 1689466 2790195 2910606 2339748 2696660
34710 2696660 3987107 4456233 3608505 2879808 2769534 1938500 162300 -470152 1086896
34701A086896J523495q62296k248485j081511N50629J060405J566424K592909
34693D188466K161059o40435l084274k420024N915Q31173o16999k180744k380292
34684d136155j666192p46443J74291O78347M40706J88208Q50353J806248J434111
34675i76526m23780j845994j153740J023509K524933K017026J39490j490373j985670
34666b171125j678480j114220k56970Q81363J527100J036011J27207Q7646R07397
34657f54071J410498J142561P53424M82672j65791j004077j095766n62912p06813
34648d00275j660846j777582l51848Q89498L87252q10858q37498J65639Q02494
34639c594024Q83920J228202J763149J653511Q78255J70708j77248k11076K73159
$$ plain form
34701 1086896 2610391 1748095 -500390 -1581901 -1031272 29133 1595557 4188466
34693 4188466 6349525 5709090 2624816 204792 210707 1041880 424881 -1755863 -4136155
34684 -4136155 -5802347 -6548790 -6374499 -5696152 -5255446 -5067238 -4216885 -2410637 -976526
34675 -976526 -1400306 -3246300 -4400040 -3376531 -851598 1165428 1304918 -185455 -2171125
34666 -2171125 -3849605 -4963825 -5220795 -4339432 -2812332 -1776321 -1649114 -1561468 -654071
34657 -654071 756427 1898988 2652412 3135084 2969293 1965216 869450 306538 -400275
34648 -400275 -2061121 -3838703 -4190551 -3301053 -2913801 -3724659 -4562157 -4396518 -3594024
34639 -3594024 -2710104 -1481902 281247 1934758 2813013 2983721 2806473 2595397 2868556
34630B868556R33289M65227j447200k770363j610730P85367J647029N92134m57900
34621A005409p82909j505995k639478k392828l25229J282807N56575j331651k016860
34612h150159r75395N94828J709604K115015J765392R35171K38362k20190r79270
34603b966642j942920k009856p52254O19998R55994Q15216J269452J975851J861998
34594a73163J096856Q05870J078898Q43713j63247q05963m02937J71321N3382
34585B504730r2673O40180J389580M65749j801896k970885j875530m24431o99461
34576b864637j713222j139383O15635Q32955r45834j777441N9024K062034J285348
34567c585521j032860j432299N05872J964816J459268M86624L71618L65939k12502
$$ plain form
34630 2868556 3801845 4267072 2819872 49509 -1561221 -775854 871175 1463309 1005409
34621 1005409 222500 -1283495 -3922973 -6315801 -6641030 -5358223 -4801648 -6133299 -8150159
34612 -8150159 -9125554 -8530726 -6821122 -4706107 -2940715 -2005544 -1767182 -1987372 -2966642
34603 -2966642 -4909562 -6919418 -7671672 -7051674 -6095680 -5280464 -4011012 -2035161 -173163
34594 -173163 923693 1729563 2808461 3652174 3488927 2682964 2280027 2451348 2504730
34585 2504730 2412057 3052237 4441817 4907566 3105670 134785 -1740745 -2165176 -2864637
34576 -2864637 -4577859 -5717242 -5101607 -4268652 -5214486 -6991927 -6932903 -4870869 -3585521
34567 -3585521 -4618381 -6050680 -5544808 -3579992 -2120724 -1634100 -1262482 -896543 -1109045
34558a109045m30789L31290Q52341K944j221356j152904N5017Q56547N97788K3684
34548a194483k01748l03286o28126q61710l80782P88573J652964J235639q3414
34539B3627q46492m91924j63191p81175j373369o82796N00667M95407l86154l01452
$$ plain form
34558 -1109045 -1539834 -1208544 -356203 -353259 -1574615 -2727519 -2672502 -1815955 -1218167 -1194483
34548 -1194483 -1396231 -1699517 -2327643 -3189353 -3570135 -2781562 -1128598 107041 23627
34539 23627 -822865 -1314789 -1477980 -2259155 -3632524 -4315320 -3814653 -3319246 -3705400 -4006852
$$ [...]
##END NTUPLES=NMR SPECTRUM
##END=
