##TITLE=31Pdec_2-2025-Bay
 CDCl3, 24 sc
 10.12.2024
##JCAMPDX= 6.0         $$ Bruker NMR JCAMP-DX V2.0
##DATA TYPE= NMR SPECTRUM
##DATA CLASS= NTUPLES
##ORIGIN= UXNMR, Bruker Analytische Messtechnik GmbH
##OWNER= root
$$ XWIN-NMR		Version 3.5
$$ Fri Jan 10 14:07:34 2025 Russian Standard Time (UT+4h)  she@DPX200
##.OBSERVE FREQUENCY= 81.013821
##.OBSERVE NUCLEUS= ^31P
##.ACQUISITION MODE= SIMULTANEOUS
##.ACQUISITION SCHEME= undefined
##.AVERAGES= 24
##.DIGITISER RES= 17
##SPECTROMETER/DATA SYSTEM= spect
##.PULSE SEQUENCE= zgpg30
##.SOLVENT NAME= D2O
##.SHIFT REFERENCE= (INTERNAL, D2O, 0, 198.062)
##AUDIT TRAIL= $$ (NUMBER, WHEN, WHO, WHERE, WHAT)
$$ ##TITLE= Audit trail, XWIN-NMR		Version 3.5
$$ ##JCAMPDX= 5.01
$$ ##ORIGIN= Bruker BioSpin GmbH
$$ ##OWNER= she
$$ F:/spectra/data/she/nmr/P31/2/pdata/1/auditp.txt
$$ ##AUDIT TRAIL=  $$ (NUMBER, WHEN, WHO, WHERE, WHAT)
(   1,<2025-01-10 14:05:47.71 +0400>,<she>,<DPX200>,
      <created by zg, POWCHK disabled, PULCHK disabled
       configuration hash MD5:
       00 E9 B6 7A A2 85 ED C7 34 08 36 98 17 FE 4E 26
       data hash MD5: 32K
       EE C3 6B 24 6A 30 5A DE CB A3 74 D1 66 BB 6C 95>)
(   2,<2025-01-10 14:05:50.48 +0400>,<she>,<DPX200>,
      <Start of raw data processing
       efp BC_mod = 2 LB = 1.5 FT_mod = 6 PKNL = 1 PHC0 = 2482.303 PHC1 = -896.7134 SI = 64K 
       data hash MD5: 64K
       C1 FA 18 2E 43 D0 04 60 A0 BC EA 04 EC 35 63 4B>)
(   3,<2025-01-10 14:07:00.01 +0400>,<she>,<DPX200>,
      <pk PHC0 = -544.0907 PHC1 = 1439.599 
       data hash MD5: 64K
       60 B3 AA E6 08 5C 08 A5 77 0B 5F 22 75 A3 38 03>)
(   4,<2025-01-10 14:07:08.03 +0400>,<she>,<DPX200>,
      <abs ABSG = 5 
       data hash MD5: 64K
       A9 96 C2 39 EE B3 E8 A1 53 EE 64 88 F8 B9 3A 8F>)
$$ ##END=
$$ 
$$ hash MD5
$$ 68 2C 88 5E F4 55 9E 25 96 54 3C D2 6D 71 4A 7F
##$RELAX= 
##$RELAX= 
##$RELAX= 
##$RELAX= 
##$RELAX= 
##$RELAX= 
##$RELAX= 
##$RELAX= 
$$ Bruker specific parameters
$$ --------------------------
##$DU= <F:/spectra>
##$EXPNO= 2
##$NAME= <P31>
##$PROCNO= 1
##$TYPE= <nmr>
##$USER= <she>
##$AMP= (0..31)
100 100 100 100 100 100 100 100 100 100 100 100 100 100 100 100 100 100 
100 100 100 100 100 100 100 100 100 100 100 100 100 100 
##$AQSEQ= 0
##$AQ_mod= 1
##$AUNM= <au_zg>
##$AUTOPOS= <>
##$BF1= 81.014009
##$BF2= 200.13
##$BF3= 200.13
##$BF4= 200.13
##$BF5= 200.13
##$BF6= 200.13
##$BF7= 200.13
##$BF8= 200.13
##$BYTORDA= 1
##$CFDGTYP= 0
##$CFRGTYP= 5
##$CHEMSTR= <none>
##$CNST= (0..31)
1 1 145 1 1 1 1 1 1 1 1 1 1 1 1 1 1 1 1 1 1 1 1 1 1 1 1 1 1 1 1 1 
##$CPDPRG= <waltz16>
##$CPDPRG1= <>
##$CPDPRG2= <waltz16>
##$CPDPRG3= <>
##$CPDPRG4= <mlev>
##$CPDPRG5= <mlev>
##$CPDPRG6= <mlev>
##$CPDPRG7= <mlev>
##$CPDPRG8= <mlev>
##$CPDPRGB= <>
##$CPDPRGT= <>
##$D= (0..31)
0 1 0 0 0 0 0 0 0 0.06 0 0.03 2e-05 3e-06 0 0 0.0002 0 0 0 0 0 0 0 0 0 
0 0 0 0 0 0 
##$DATE= 1736503547
##$DBL= (0..7)
120 120 120 11 120 120 24 19 
##$DBP= (0..7)
150 150 150 150 150 150 150 150 
##$DBP07= 0
##$DBPNAM0= <>
##$DBPNAM1= <>
$$ [...]
##$SUBNAM3= <"">
##$SUBNAM4= <"">
##$SUBNAM5= <"">
##$SUBNAM6= <"">
##$SUBNAM7= <"">
##$SUBNAM8= <"">
##$SUBNAM9= <"">
##$SW= 400.765351723535
##$SWIBOX= (0..15)
0 1 3 0 0 0 0 0 0 0 0 0 0 0 0 0 
##$SW_h= 32467.5324675325
##$TD= 32768
##$TD0= 1
##$TE= 0
##$TE2= 300
##$TE3= 300
##$TEG= 300
##$TL= (0..7)
0 120 53 12 22 120 120 120 
##$TP= (0..7)
150 150 150 150 150 150 150 150 
##$TP07= 0
##$TPNAME0= <>
##$TPNAME1= <>
##$TPNAME2= <>
##$TPNAME3= <>
##$TPNAME4= <>
##$TPNAME5= <>
##$TPNAME6= <>
##$TPNAME7= <>
##$TPOAL= (0..7)
0.5 0.5 0.5 0.5 0.5 0.5 0.5 0.5 
##$TPOFFS= (0..7)
0 0 0 0 0 0 0 0 
##$TUNHIN= 0
##$TUNHOUT= 0
##$TUNXOUT= 0
##$USERA1= <user>
##$USERA2= <user>
##$USERA3= <user>
##$USERA4= <user>
##$USERA5= <user>
##$V9= 5
##$VALIST= <valist>
##$VCLIST= <CCCCCCCCCCCCCCC>
##$VD= 0
##$VDLIST= <DDDDDDDDDDDDDDD>
##$VPLIST= <PPPPPPPPPPPPPPP>
##$VTLIST= <TTTTTTTTTTTTTTT>
##$WBST= 1024
##$WBSW= 4
##$XGAIN= (0..3)
0 0 0 0 
##$XL= 0
##$YL= 0
##$YMAX_a= 1712
##$YMIN_a= -2325
##$ZGOPTNS= <>
##$ZL1= 120
##$ZL2= 120
##$ZL3= 120
##$ZL4= 120
##$ABSF1= 198.0616
##$ABSF2= -202.7028
##$ABSG= 5
##$ABSL= 3
##$ALPHA= 0
##$AQORDER= 0
##$ASSFAC= 0
##$ASSFACI= 0
##$ASSFACX= 0
##$ASSWID= 0
##$AUNMP= <proc_1d>
##$AZFE= 0.1
##$AZFW= 0.5
##$BCFW= 0
##$BC_mod= 2
##$BYTORDP= 0
##$COROFFS= 0
##$CY= -3
##$DATMOD= 1
##$DC= 0
##$DFILT= <>
##$DTYPP= 0
##$F1P= 0
##$F2P= 0
##$FCOR= 1
##$FTSIZE= 65536
##$FT_mod= 6
##$GAMMA= 0
##$GB= 0
##$INTBC= 1
##$INTSCL= 9.790993e-09
##$ISEN= 30
##$LB= 1.5
##$LEV0= 0
##$LPBIN= 0
##$MAXI= 10000
##$MC2= 0
##$MEAN= 0
##$ME_mod= 0
##$MI= 50
##$NCOEF= 0
##$NC_proc= -10
##$NLEV= 6
##$NOISF1= 182.463
##$NOISF2= 159.3651
##$NSP= 0
##$NTH_PI= 0
##$NZP= 0
##$OFFSET= 198.0616
##$PC= 4
##$PHC0= 1938.212
##$PHC1= 542.8856
##$PH_mod= 1
##$PKNL= yes
##$PPARMOD= 0
##$PSCAL= 0
##$PSIGN= 0
##$REVERSE= no
##$SF= 81.0140089999434
##$SI= 65536
##$SIGF1= 159.3651
##$SIGF2= -187.1042
##$SINO= 113.3802
##$SIOLD= 16384
##$SREGLST= <1H.CDCl3>
##$SSB= 0
##$STSI= 65536
##$STSR= 0
##$SW_p= 32467.5324675325
##$SYMM= 0
##$S_DEV= 0
##$TDeff= 32768
##$TDoff= 0
##$TI= <>
##$TILT= no
##$TM1= 0
##$TM2= 0
##$TOPLEV= 0
##$USERP1= <user>
##$USERP2= <user>
##$USERP3= <user>
##$USERP4= <user>
##$USERP5= <user>
##$WDW= 1
##$XDIM= 65536
##$YMAX_p= 420244680
##$YMIN_p= -226882238
$$ End of Bruker specific parameters
$$ ---------------------------------
##NTUPLES= NMR SPECTRUM
##VAR_NAME=  FREQUENCY,     SPECTRUM/REAL,   SPECTRUM/IMAG
##SYMBOL=    X,             R,               I
##VAR_TYPE=  INDEPENDENT,   DEPENDENT,       DEPENDENT
##VAR_FORM=  AFFN,          ASDF,            ASDF
##VAR_DIM=   65536,         65536,           65536
##UNITS=     HZ,            ARBITRARY UNITS, ARBITRARY UNITS
##FACTOR=    0.49542278885378, 1,            1
##FIRST=     16045.7642231865, 0,            0
##LAST=      -16421.768244346, 0,            0
##MIN=       -16421.768244346, -226882238,   0
##MAX=       16045.7642231865, 420244680,    0
$$ Real data points
##PAGE= N=1
##DATA TABLE= (X++(R..R)), XYDATA
$$ [...]
41845d783699P911452R126883P355301M307185K632751K254962P21615l004033
41837B6522417p015415q833431p774424m889880j920785k57746L68675J814075
41829a986514M611741N866292K470794l785786p141515m394749J969151P486871
41821E096285R567984P143076L66927p443783j1066052r108053n567137l344950
41813a4355703m6207O009348R513497M085443p061657j2853484p500797L254942
41805a8954618J0199431J0055392N060508j734628o997245o581440N24754Q711022
41797B83176J0386448M627697j670944k139170J864349L811365K12893n702326
41789A1673488q084058m396204K891535Q603166Q122892P67973q048423j0206825
$$ plain form
41845 -4783699 3127753 12254636 19609937 23917122 26549873 28804835 29526450 26522417
41837 26522417 19507002 10673571 2899147 -1990733 -3911518 -4169264 -3800589 -1986514
41829 -1986514 2625227 8491519 10962313 7176527 35012 -4359737 -2390586 5096285
41821 5096285 14664269 21807345 22174272 14730489 3664437 -5443616 -11010753 -14355703
41813 -14355703 -14401910 -8392562 1120935 5206378 -1855279 -14708763 -22209560 -18954618
41805 -18954618 -8755187 1300205 6360713 4626085 -2371160 -8952600 -8427846 283176
41797 283176 10669624 15297321 13626377 11487207 13351556 17162921 17375814 11673488
41789 11673488 3589430 -806774 2084761 10687927 18810819 19578792 11530369 1323544
41781A323544l762927L122408J526355n973954q430486k426159K833205j03946
41773a1891960n223097k722092N471975R178379N811427K486449K772291J838492
41765G721864k880062n860077k960713J210013J199320l79115J657990N608044
41757E317264N973051K661517J12174o99598k598828n536664o037381l451984
41749d260449j126844p42035n67646j25676j501268m533783n485850k764583J80356
41740b0927778M67202O84251M534656R973821J0878238N126719k306636n086432
41732C344041k358096J207291J295662j317399k330347K97960L444006K563367
41724F146485k570381p232835o451528O75440J0318784J5937887J2433321J349838
$$ plain form
41781 1323544 -2439383 683025 2209380 -3764574 -12195060 -14621219 -11788014 -11891960
41773 -11891960 -17115057 -19837149 -14365174 -5186795 624632 3111081 5883372 7721864
41765 7721864 4841802 -1018275 -3978988 -2768975 -1569655 -1948770 -290780 5317264
41757 5317264 11290315 13951832 14064006 13364408 10765580 5228916 -808465 -4260449
41749 -4260449 -5387293 -6129328 -6696974 -6822650 -8323918 -12857701 -18343551 -21108134 -20927778
41740 -20927778 -20460576 -19776325 -15241669 -5267848 5610390 10737109 8430473 3344041
41732 3344041 985945 2193236 3488898 2171499 -158848 139112 3583118 6146485
41724 6146485 3576104 -3656731 -10108259 -9432819 885965 16823852 29257173 30607011
41716C0607011q650542j0056636n206573k601665m298813l100033M771963J0935441
41708A2400153N835423n605184q740695M58234R249203N798217m992982r649822
41700D752547m588739J636620K238197N8715N72984L644386N092715K389014l649933
41691A2146506r832096j1554001o024700L419702R090403P190614J826002r74813
41683E287617k67792J012966J119836K49774j302083k620755j940159K22298L00694
41674B062396k696326l854004R93888Q033633J0187243O910802L297138J004779
41666B5939549k847467p953184r531889o313109k962189k239438j247419J597124
41658e558022K440536r64398l980558j995662K244289L708825L253833M556619
$$ plain form
41716 30607011 21956469 11899833 6693260 4091595 -207218 -3307251 1464712 12400153
41708 12400153 18235576 12630392 3889697 4347931 13597134 19395351 14402369 4752547
41700 4752547 163808 1800428 4038625 4097340 4670324 8314710 13407425 15796439 12146506
41691 12146506 2314410 -9239591 -15264291 -11844589 -2754186 4436428 6262430 5287617
41683 5287617 5019825 6032791 7152627 7402401 6100318 3479563 1539404 1761702 2062396
41674 2062396 -633930 -4487934 -3494046 4539587 14726830 21637632 24934770 25939549
41666 25939549 23092082 15138898 5607009 -706100 -3668289 -5907727 -7155146 -5558022
41658 -5558022 -3117486 -4081884 -8062442 -10058104 -7813815 -4104990 -851157 3705462
41650C705462O145151L318949l399556p931396o603164j708462K577477L782879
41642a12660J378604k486505l219062J254578O487550O322663P30303n102838
41634E252633q128764r160676q387541m719159L88168L658481M918125O371761
41626i806972O824268K386644n823839j0417889o663723J778771Q321586J0521194
41618b879960R547455O840332M079860L053429K999241R91932l308834o759366
41610A4564089q051613r497484j1343649r405985k005759N355554O906121M510305
41602h968421L649927M578648L224102q33245l139908j104016K601562L871283
41594C879932J221709l923458q240190q246288l654983J599182L835616L786867
$$ plain form
41650 3705462 9850613 13169562 9770006 1838610 -4764554 -6473016 -3895539 -112660
41642 -112660 1265944 -1220561 -4439623 -3185045 3302505 9625168 10355471 5252633
41634 5252633 -2876131 -12036807 -20424348 -25143507 -24755339 -21096858 -16178733 -9806972
41626 -9806972 -2982704 -596060 -6419899 -16837788 -23501511 -21722740 -13401154 -2879960
41618 -2879960 6667495 13507827 17587687 20641116 23640357 24632289 21323455 14564089
41610 14564089 6512476 -2985008 -14328657 -23734642 -25740401 -20384847 -13478726 -8968421
41602 -8968421 -5318494 -739846 2484256 1651011 -1488897 -2592913 8649 3879932
41594 3879932 5101641 1178183 -7062007 -15308295 -18963278 -17364096 -13528480 -9741613
41586i741613M050211M631331M209606L483998L281888J583555k918732o499232
41578B081012n214976k058130k442849l919969Q46010J0087884J1955143J810210
41570A3144335q604806o562417L949421Q958714M566890j7414J702353N071769
41562B2208845L937025n5565k409265l453214n296106n674671j388089M533525
41554A2402485N658730J546252j862258j813867k401301o305983q990093n867466
41546g633501o86201k93454l480887k478948M361043Q848696M584840l809270
41538e87682p242119l469437K538265N868036M629832j011785p356345p450622
41530a4081857R43198R527609Q443462M2102l968897O54314N350410K628284l404853
$$ plain form
41586 -9741613 -5691402 -1060071 3149535 6633533 9915421 11498976 8580244 2081012
41578 2081012 -3133964 -5192094 -7634943 -11554912 -10708902 -621018 11334125 13144335
41570 13144335 4539529 -2022888 1926533 10885247 15452137 15434723 17137076 22208845
41562 22208845 26145870 26090305 23681040 20227826 14931720 9257049 7868960 12402485
41554 12402485 18061215 19607467 17745209 15931342 13530041 7224058 -1766035 -7633501
41546 -7633501 -8319702 -8613156 -12094043 -14572991 -10211948 -1363252 3221588 -587682
41538 -587682 -7829801 -11299238 -8760973 -2892937 1736895 725110 -6631235 -14081857
41530 -14081857 -13138659 -3611050 4832412 4874514 905617 1559931 6910341 9538625 6133772
41521F133772n327308l698855l183553l071720J55458M210883L439166j349560
41513b691717l340810k21483K919481K428049J237662K772266N234329N240194
41505A3577971L098768J218991J49661j066419k855899n436040q838391j0995660
41497a1147018q633964k120291L385684M151742K826728M351460Q806111J1377142
41489A2997594Q552623J947485l656988m780456k487462j588093m917712q556995
41481b490004o213507J095391M908780J445448j884792K723639J0975757J2075594
41473B2636306M045538m712356q267766q978803r443797p432227k470232M0465
41465a4582872l221575o812689l776620M014879Q558971O475149J818120m10562
$$ plain form
41521 6133772 806464 -2892391 -6075944 -9147664 -8992206 -4781323 -1342157 -2691717
41513 -2691717 -6032527 -6254010 -3334529 -906480 331182 3103448 8337777 13577971
41505 13577971 16676739 17895730 18045391 16978972 14123073 8687033 -151358 -11147018
41497 -11147018 -19780982 -21901273 -18515589 -14363847 -11537119 -7185659 1620452 12997594
41489 12997594 21550217 23497702 19840714 15060258 12572796 10984703 6066991 -2490004
41481 -2490004 -8703511 -7608120 -2699340 -1253892 -3138684 -415045 10560712 22636306
41473 22636306 26681844 21969488 13701722 4722919 -4720878 -12153105 -14623337 -14582872
41465 -14582872 -17804447 -24617136 -28393756 -24378877 -15819906 -9344757 -7526637 -7937199
41457g937199R90622M064212N248756J725495m171813n098628K265404J0706182
41449G793031J0845477M288352J126801M457161N813820j161765j0238772j1246221
41441A1677884l859635L603277N906711M818212K692574j159881o455164r405034
41433G818944p104584j926552J065116J23288j751422j411888K0687j120771n080837
41424i368019o903809k799833L516438M779932R1195l972697l220570j190134
41416a9067497j613525j434317L023641P668610O134077R14651K04686M400926
41408B31252N410668Q49376j376743K962685N854381K3762p870658p330661j406498
41399b652436j524396p633625p573143K090280Q602081K695251o160024m167194
$$ plain form
41457 -7937199 -6946577 -2882365 2366391 4091886 -79927 -5178555 -2913151 7793031
41449 7793031 18638508 22926860 24053661 28510822 34324642 33162877 22924105 11677884
41441 11677884 7818249 11421526 17328237 22146449 24839023 23679142 17223978 7818944
41433 7818944 714360 -1212192 -147076 -23788 -1775210 -3187098 -3166411 -4287182 -9368019
41424 -9368019 -16271828 -19071661 -15555223 -10775291 -10684096 -14656793 -17877363 -19067497
41416 -19067497 -20681022 -22115339 -19091698 -11423088 -5289011 -4374360 -4169674 231252
41408 231252 5641920 6491296 5114553 8077238 13931619 13955381 6084723 -1245938 -2652436
41399 -2652436 -4176832 -11810457 -19383600 -17293320 -8691239 -5995988 -12156012 -16323206
41391a6323206N565363Q446549P45120o387355n022183n03490q7005j677099M7307
41382a5195999L435821L148422j66299l43918N192243J1659679J2233528M641627
41374B4605104o486298j2295839p472693K411981N023904l725648j2882673r922271
41366b0744433K699546J1580924J0417266N104005J239313l013757q218123p732075
41358h667334K165401J2818204J2662432K935752m424505l312242K79551o95773
41350A3761486m673929o159115m496236l373730m521837o149542o396313m926733
41342b6935949j615078L298650P477322P638453L681014k52964n82870J173398
41334f118024R57187j590778k847524j634583j633371m650840n614872M14473
$$ plain form
41391 -16323206 -10757843 -2311294 -1566174 -7953529 -12975712 -13479202 -13566207 -15243306 -15195999
41382 -15195999 -11760178 -8611756 -8778055 -9121973 -3929730 7729949 19963477 24605104
41374 24605104 18118806 5822967 -1649726 762255 5786159 2060511 -10822162 -20744433
41366 -20744433 -18044887 -6463963 3953303 9057308 10296621 7282864 -935259 -8667334
41358 -8667334 -6501933 6316271 18978703 21914455 17489950 14177708 14457259 13761486
41350 13761486 9087557 2928442 -1567794 -4941524 -9463361 -15612903 -22009216 -26935949
41342 -26935949 -28551027 -25252377 -17775055 -10136602 -6455588 -6708552 -7291422 -6118024
41334 -6118024 -5160837 -6751615 -9599139 -11233722 -12867093 -17517933 -23132805 -22718332
41326b2718332Q795681R961611L380612q50001L399367R709874R623203M804892
41318B6106907J998162J307189j814256n899290m421821K502622O141614J229519
41310B7150646o833065r861562o432960m05119N222957R071793R384273N244686
41302C2541649j451756p217749r128265n839515P92062N239556L303796k057844
41294A6181934m140130k004582j182217l875371n073510j360843K852050K387758
41286C785089r22822k680344l185291m433581m291367m42081L284230J860249
41278g025918k028690j665855K501593L434378p26242l653588j354726J881964
41270h637084J381431m94398N91100L232785L002929J86513n46557K456099N364829
$$ plain form
41326 -22718332 -13922651 -3961040 -580428 -1430429 1968938 11678812 21302015 26106907
41318 26106907 28105069 29412258 27598002 21698712 17276891 19779513 25921127 27150646
41310 27150646 20317581 10456019 4023059 3617940 8840897 17912690 27296963 32541649
41302 32541649 31089893 23872144 14743879 8904364 9696426 14935982 18239778 16181934
41294 16181934 12041804 10037222 8855005 4979634 -93876 -1454719 1397331 3785089
41286 3785089 2862267 181923 -3003368 -7436949 -11728316 -12170397 -8886167 -7025918
41278 -7025918 -9054608 -10720463 -8218870 -4784492 -5510734 -9164322 -10519048 -8637084
41270 -8637084 -7255653 -7750051 -7158951 -3926166 -923237 -736724 -1283281 1172818 6537647
41261F537647M882089L192544M028814N454393J180259r054531j4967600p490173
41253f236558O876527J1664101J877915r043508q230372k54217K984726R54705
41245E93319J240649L136739q47158q435856p993203J726111O773453r49556j0612976
41236a5368478q906987J006316P013368O219084M593980M268291K381112n75526
41228F31160j267419n74013j741480l444350k561584j454235m041955o888640
41220b1342516l568575L388966M925447r9169l024098M74411M287720L122509
41212a1835305O60436J597845L105883K63988n048615o339816q75933P578294
41204a0893223J2151696P910279k760525r592280m816358N440049P445067j019568
$$ plain form
41261 6537647 11419736 14612280 18641094 24095487 25275746 16221215 1253615 -6236558
41253 -6236558 639969 12304070 14181985 5138477 -3091895 -3346112 -361386 593319
41245 593319 1833968 4970707 4123549 -4312307 -12305510 -10579399 -3805946 -4755502 -15368478
41236 -15368478 -24275465 -23269149 -16255781 -10036697 -5442717 -1174426 1206686 631160
41228 631160 -636259 -1210272 -2951752 -6396102 -8957686 -10411921 -14453876 -21342516
41220 -21342516 -24911091 -21522125 -16596678 -16695847 -19719945 -19245534 -14957814 -11835305
41212 -11835305 -11174869 -9577024 -6471141 -6207153 -11255768 -17595584 -18471517 -10893223
41204 -10893223 1258473 9168752 6408227 -3184053 -8000411 -2560362 4884705 3865137
41196C865137o968501j533071O857980N880517k478286o782930l398252J641082
41188b916324M445430O217325N878986L26606p203574q328489j161061O755847
41180D014746Q970088O562241K595682k109466n102497k201502M428027N227463
41172B2384782m052920j4306218j4087187m428223L960060N237293L221114L011530
41164I40231M520092M913244K585579k162666o984934q139292m686363j287316
41156a0301425k658548n969726m099971L213465P702824M396053q34797o1247
41148h613372M912817N753642M33660l945585j864016K973621L669532j29612
41140C190687k715943j012393J459025J56425l930870n684087k744956J667099
$$ plain form
41196 3865137 -3103364 -4636435 2221545 8102062 5623776 -1159154 -4557406 -2916324
41188 -2916324 1529106 7746431 13625417 13952023 6748449 -1580040 -2741101 4014746
41180 4014746 12984834 19547075 22142757 20033291 14930794 12729292 17157319 22384782
41172 22384782 18331862 4025644 -10061543 -14489766 -10529706 -5292413 -2071299 940231
41164 940231 5460323 10373567 12959146 10796480 3811546 -4327746 -9014109 -10301425
41156 -10301425 -12959973 -18929699 -23029670 -19816205 -12113381 -7717328 -8552125 -8613372
41148 -8613372 -3700555 2053087 2486747 -1458838 -3322854 -349233 3320299 3190687
41140 3190687 474744 -537649 921376 1077801 -2853069 -8537156 -11282112 -9615013
41132i615013L493120L114835L731344N673825N555485J582296l450768o225469
41124C859655p134701p615779n714377J223037J0182900J3848607R622509L067425
41116B1339276J38948k20223k398020o080626o663262k836972Q56214K68856k654002
41107A750189k539545K287096P287917O864446J351724k745814q38406K996663
41099A6414270R10568p172694j2029505p600144K04447K048050j722410l495836
41091a2443254j375180r68374l886559l711355K860401Q708838O218844r35506
41083e532145k988239K067906O962709O334593K651757J63053j278466l758948
41075D622220o361546n939428j769285K669521L071144o95688l609214r92330
$$ plain form
41132 -9615013 -6121893 -3007058 724286 6398111 11953596 13535892 10085124 3859655
41124 3859655 -3275046 -10890825 -16605202 -15382165 -5199265 8649342 18271851 21339276
41116 21339276 21478224 21258001 18859981 12779355 6116093 3279121 4135335 4404191 1750189
41107 1750189 -789356 1497740 8785657 15650103 17001827 14256013 13417607 16414270
41099 16414270 17324838 10152144 -1877361 -9477505 -9273058 -7225008 -8947418 -12443254
41091 -12443254 -13818434 -14786808 -18673367 -22384722 -19524321 -10815483 -4596639 -5532145
41083 -5532145 -8520384 -6452478 510231 6844824 9496581 9659634 8381168 4622220
41075 4622220 -1739326 -7678754 -9448039 -6778518 -3707374 -4403062 -8012276 -9004606
41067i004606N075123P600698M006162q7829O77529K967036J22948o291970p364430
41058b299339J63066Q578073R812018N615685K486473R71173l220757r214272
41050A2892120r840362k604908M478378K802452m807093p901214k749871L789727
41042c940771N626218N565680Q102896J0168106N942463k521315p372361o555583
41034A5015333n439580o461479n299978L81118O038467P628875P017966O130561
41026B5011283K709305l341641o553298m674051l595688o558814o392817J980282
41018a415439Q922400K787797r917621j2066331j723979N372758O01750o083199
41010a3521864m476370N90094M96835k267964l62529N426871Q865513Q120259
$$ plain form
41067 -9004606 -3929483 3671215 7677377 7589548 8267077 11234113 11357061 5065091 -2299339
41058 -2299339 -2136273 6441800 16253818 21869503 24355976 25327149 22106392 12892120
41050 12892120 3051758 446850 4925228 7727680 2920587 -4980627 -7730498 -3940771
41042 -3940771 1685447 7251127 15354023 25522129 31464592 28943277 21570916 15015333
41034 15015333 9575753 3114274 -2185704 -1804586 4233881 11862756 18880722 25011283
41026 25011283 27720588 24378947 17825649 13151598 9555910 2997096 -3395721 -1415439
41018 -1415439 7506961 10294758 377137 -11689194 -13413173 -8040415 -7438665 -13521864
41010 -13521864 -17998234 -17408140 -16911305 -19179269 -19541798 -14114927 -5249414 2870845
41002B870845N132535M83775m241413m504881J00522K563958j093120m419517
40994c107296r45256M792979N383289L140350M288266O262951K647259l323403
40986A9139139k971325K287403K620344l487211p162355m877657l241324n133926
40978b826912l840453L601097Q563884L820613m324640m944774K465494R059706
40970A1574015Q500490J928669n448590q312501n141253j067973k454456o713146
40962g134745m324984N855562J1807526M895443o725629r618880l655951O96067
40954h205591p67401k685083j773454r61108j280067P03719N053201O244228K063412
40945a608144k019984j118849J974215J927568j470279m995423p545379r239765
$$ plain form
41002 2870845 8003380 8487155 4245742 -259139 -158617 2405341 1312221 -3107296
40994 -3107296 -4052552 740427 6123716 9264066 13552332 19815283 22462542 19139139
40986 19139139 16167814 18455217 21075561 17588350 10425995 5548338 2307014 -2826912
40978 -2826912 -6667365 -3066268 5497616 9318229 4993589 48815 2514309 11574015
40970 11574015 20074505 22003174 16554584 8242083 3100830 2032857 -421599 -7134745
40962 -7134745 -11459729 -5604167 6203359 11098802 4373173 -5245707 -8901658 -8205591
40954 -8205591 -8972992 -11658075 -13431529 -14392637 -15672704 -14968985 -9915784 -3671556 -1608144
40945 -1608144 -3628128 -4746977 -2772762 -845194 -2315473 -7310896 -14856275 -24096040
40937b4096040p536484K94662J0979465J6134156J1331751J993740k132698J982784
40929H951336P129882M484856n534271j3473392j2014178l976711K462254L644227
40921h325997K293315J467141J114611O51139P16118R28523p26216m078952m977129
40912a0937447l44861O210425P215951L62283p735718q534284j145702P179550
40904g729803R899773P753581N154400K969540j269779p049836r764580p392293
40896g428997m040512l950192n234225l320949J637336N152524N219514M357331
40888g608170M587245M439211K475270O45191J564612L846329K780090l729343
40880I000435j1243214j2535293n827660K371933M728216K136027J774544O358555
$$ plain form
40937 -24096040 -31632524 -31337862 -20358397 -4224241 7107510 9101250 6968552 8951336
40929 8951336 16081218 20566074 15031803 1558411 -10455767 -14432478 -11970224 -8325997
40921 -8325997 -6032682 -4565541 -3450930 -2799791 -2083673 -1155150 -1881366 -5960318 -10937447
40912 -10937447 -11282308 -5071883 2144068 2506351 -5229367 -13763651 -14909353 -7729803
40904 -7729803 2169970 9923551 15077951 18047491 16777712 9727876 -36704 -7428997
40896 -7428997 -11469509 -15419701 -20653926 -23974875 -22337539 -17185015 -11965501 -7608170
40888 -7608170 -3020925 1418286 3893556 4538747 6103359 9949688 12729778 9000435
40880 9000435 -2242779 -14778072 -20605732 -18233799 -13505583 -11369556 -9595012 -3236457
40872c236457J0263769Q115495K132487k541567n017737o280773m102330K834151
40864B167038Q658191O106349k424817p555931o603937o039453q940368r424047
40856b4056975l737357J784881N20851l305194j319842N468049Q308843L943844
40848a2392900j678409k667660N73062M837974P820629P384407K725446k193571
40840D408978j457256M478414P810552L309700m648825p904437m282225J472049
40832C186950M160753K580561r17418k855605j619927P14016J134064O00248K686583
40823I670225O221079M683269l273172q223091j757590R796768J2258498L067561
40815C2443547n850510o134798l508347n354703p575575k781328N071920N407204
$$ plain form
40872 -3236457 7027312 15142807 17275294 14733727 9715990 3435217 -667113 2167038
40864 2167038 10825229 16931578 14506761 6950830 346893 -5692560 -14632928 -24056975
40856 -24056975 -27794332 -26009451 -25488600 -28793794 -30113636 -24645587 -16336744 -12392900
40848 -12392900 -14071309 -16738969 -16165907 -11327933 -3507304 3877103 6602549 4408978
40840 4408978 2951722 7430136 15240688 18550388 13901563 5997126 1714901 3186950
40832 3186950 7347703 9928264 9010846 6155241 4535314 5249330 6383394 6983642 9670225
40823 9670225 15891304 20574573 17301401 9078310 7320720 17117488 29375986 32443547
40815 32443547 26593037 20458239 16949892 11595189 4019614 1238286 6310206 11717410
40807A1717410k127077o430753j173045P219337J0035840O587084R70707m060071
40799B2739432o079052k513897M118007O251533J423325l097997j081505L009664
40791B4769510J815614k703301l235513L37037J697972l77926q68064J153039
40783B2588368N38092l820169n815127k312480J379189M58300j871585r63210
40775A0181378J028882n69609m466403n148902r50489M286410O192834L427082
40767A3981183j850881m873561k503590J573910J61936o524492r000263j963155
40759a0998913O473015N838738j285338l582900K085416P551365O669679K579042
40751A5330104Q3642r88320j845060j082166J287807J683154j447145m539394
$$ plain form
40807 11717410 9590333 3159580 1986535 9205872 19241712 25828796 26799503 22739432
40799 22739432 16660380 14146483 18264490 24516023 25939348 22841351 21759846 24769510
40791 24769510 26585124 23881823 20646310 20983347 22681319 22303393 21435329 22588368
40783 22588368 23126460 19306291 13491164 11178684 12557873 13016173 11144588 10181378
40775 10181378 11210260 10640651 6174248 1025346 74857 4361267 10554101 13981183
40767 13981183 12130302 7256741 4753151 6327061 6488997 -35495 -9035758 -10998913
40759 -10998913 -4525898 1312840 27502 -3555398 -1469982 6081383 12751062 15330104
40751 15330104 15413746 14425426 12580366 11498200 12786007 14469161 13022016 8482622
40743H482622m848059m827992o793222p729979m197058J215864L595376L265640
40735a1836808M084692N735812L712113k622116p221367m774463K275116O552468
40727d094553M222545j158081l187724k86045K120815j657648r220807j1674487
40719b4935985m969537M044688O439303L053334K042156N929642Q091001L806402
40711C501004j957378k468867L4482j690249p395256q586034j505435O104352
40703a3963381N308327j913200o470613n040124k353883j486368L76030M165366
40695b1377846M348655k236609q218470m178507O992091J2707223P926379J080604
40687b956480q5273J51950n151908j1668797q954488K883084J1648394R399220
$$ plain form
40743 8482622 3634563 -1193429 -7986651 -15716630 -19913688 -18697824 -15102448 -11836808
40735 -11836808 -7752116 -2016304 1695809 -926307 -8147674 -12922137 -10647021 -4094553
40727 -4094553 127992 -1030089 -4217813 -4503858 -2383043 -4040691 -13261498 -24935985
40719 -24935985 -29905522 -25860834 -19421531 -16368197 -14326041 -8396399 -305398 3501004
40711 3501004 1543626 -925241 -890759 -2581008 -9976264 -18562298 -20067733 -13963381
40703 -13963381 -8655054 -10568254 -17038867 -22078991 -24432874 -25919242 -25543212 -21377846
40695 -21377846 -17029191 -19265800 -27484270 -31662777 -24670686 -11963463 -4037084 -2956480
40687 -2956480 -3041753 -2889803 -8041711 -19710508 -28664996 -25781912 -14133518 -4734298
40679d734298J779153k128931j712187j441168j705722j47510J415625r23879
40671i598917n413852o338120l567122k874789n025006k647472P305389J5125304
40663a3034585J0192832k866256q975946k566036O411773P992818M656301L508169
40655E319070L692566l89600p350978r235186l439168L256219M429133K097584
40647a620360K219941O065615R186224P010862l03855p166386o705572J540672
40639A0227141Q515632M844667o408214j2228393o923887L06481k62555m423846
40631f352974k186125N284259Q064856M509642L256992O766374N804303l902894
40623B1244433j1072851m640547Q005108J0370460J61218q972456p945514k483064
$$ plain form
40679 -4734298 -2955145 -5084076 -6796263 -8237431 -9943153 -10090663 -8675038 -9598917
40671 -9598917 -15012769 -21350889 -24918011 -27792800 -32817806 -35465278 -28159889 -13034585
40663 -13034585 -2841753 -5708009 -14683955 -17249991 -10838218 -2845400 1810901 5319070
40655 5319070 9011636 8622036 1271058 -7964128 -11403296 -8147077 -3717944 -1620360
40647 -1620360 599581 6665196 15851420 22862282 22558427 15392041 8686469 10227141
40639 10227141 18742773 23587440 17179226 4950833 -1973054 -1666573 -1929128 -6352974
40631 -6352974 -8539099 -3254840 4810016 9319658 12576650 19343024 25147327 21244433
40623 21244433 10171582 5531035 13536143 23906603 24067821 15095365 7149851 4666787
40615D666787p54960j743895j066695K48543l24241j13985M120306Q581112O816421
40606B0429393K782l956944j499808K365981J954186j948229m925034n344417
40598G077910n266439o664767q718443q380271l288028M830857R822560O276290
40590d310331m020062j2312392j0998468j165137Q689582J1242356P090948K744444
40582c039060K457490L719756K097835j372753j399280L010940N981508L049236
40574A4505672k270746m031796k486309k198410l971391m464226k789743j538786
40566i245735j193901O81977L888419M840063K737929J007456Q59568p72443m319077
40557a515744m711212M79486N441154L937234j386120l159360K31392L951507
$$ plain form
40615 4666787 3911827 2167932 1101237 1349780 1025539 911554 5031860 13612972 20429393
40606 20429393 20432175 16475231 14975423 17341404 19295590 17347361 12422327 7077910
40598 7077910 1811471 -4853296 -13571739 -21952010 -25240038 -20409181 -10586621 -4310331
40590 -4310331 -8330393 -20642785 -31641253 -32806390 -24116808 -12874452 -5783504 -3039060
40582 -3039060 -581570 3138186 5236021 3863268 2463988 5474928 11456436 14505672
40574 14505672 12234926 8203130 5716821 3518411 -452980 -4917206 -7706949 -9245735
40566 -9245735 -10439636 -9757659 -5869240 -1029177 1708752 2716208 3575776 2803333 -1515744
40557 -1515744 -6226956 -5747470 -306316 3630918 2244798 -914562 -683170 3268337
40549C268337M348670J824554k309739o423971p003065j828630N397953Q165464
40541E439573M903100k04287l531599m963507n064558l744115j785597L8452K817996
40532f094542O691670P701475K576394m572104o427275k702004N53400J489713
40524g83273L976127P536273N548304k550061o845133j490505M559916L89975
40516A0341623r425320j0961257j445365P475699O803743K53993m648605o185073
40508g790562n304105q91276O094725R427231M909026k554881n084107k707103
40500c901052k086983n413988p078033k844044L174885M225075K35636k801398
40492a6489902j419520J616623K545970J604467Q17943m0456j935797k865671
$$ plain form
40549 3268337 7617007 9441561 7131822 707851 -6295214 -8123844 -2725891 5439573
40541 5439573 10342673 10138386 6606787 1643280 -3421278 -7165393 -8950990 -8912538 -6094542
40532 -6094542 597128 8298603 10874997 6302893 -124382 -2826386 -2272986 -783273
40524 -783273 3192854 10729127 16277431 13727370 6882237 5391732 9951648 10341623
40516 10341623 916303 -10044954 -11490319 -4014620 2789123 3043116 -1605489 -7790562
40508 -7790562 -13094667 -13985943 -7891218 1536013 6445039 3890158 -1193949 -3901052
40500 -3901052 -5988035 -11402023 -18480056 -21324100 -18149215 -13924140 -13688504 -16489902
40492 -16489902 -17909422 -16292799 -13746829 -12142362 -11324419 -11364875 -13300672 -16166343
40484a6166343J18637N365248P232955L291821k687102o309411p294256o601173
40476b3049624l241311K251438N086853K392514m80543L701029J2392630J4990717
40468A4043703P170133l243094p276247n507026l708585l064671m98399M180412
40460B096226P373037P146105M937275J943795k305412p359030j0772183j0233280
40452g173467n221267K694645R437679J0062721L855228l463508n882258m139759
40444A70014k907477k657349J51154N154578O873884L180649j021849j658609
40436G284995j582847m499986p464609n227619P57268L883037K031923o4804J289973
40427c592669L351067J403856m275329q167250n527464K098122P650756O002891
$$ plain form
40484 -16166343 -16047706 -10682458 -3449503 -157682 -2844784 -9154195 -16448451 -23049624
40476 -23049624 -26290935 -24039497 -18952644 -16560130 -17040673 -13339644 -947014 14043703
40468 14043703 21213836 17970742 10694495 5187469 1478884 -1585787 -2084186 2096226
40460 2096226 9469263 16615368 21552643 23496438 21191026 13831996 3059813 -7173467
40452 -7173467 -12394734 -9700089 -262410 9800311 13655539 10192031 4309773 170014
40444 170014 -2737463 -5394812 -5243658 -89080 6784804 9965453 8943604 7284995
40436 7284995 5702148 1202162 -6262447 -11490066 -10732798 -6849761 -4817838 -4882642 -3592669
40427 -3592669 -241602 1162254 -3113075 -11280325 -16807789 -14709667 -7058911 -1056020
40419a056020N22979o86522M050322P087167K667224m064466m934050j455514
40411B131120j642495o096743o655465P0742O778577O456374J807098p63157l40479
40402A745572M28023J326340K983916L088117k14353l730544l088098O83768K724097
40393E946838Q35518l079456n978865m888859J942169J1190251J4644304P874295
40385B8486195l327843r353435p521425k470557J410122K992692K012861j037129
40377A1191481l620474l828391k890423j845188J118869N955865P572890K910345
40369A6564974k902748l990037l051850n472761q420216n468310J216112M210814
40361g314022M011390O760785J0212731N967361l403381m668530M734279J0765222
$$ plain form
40419 -1056020 -533041 -1219563 2830759 9917926 12585150 8520684 3586634 2131120
40411 2131120 488625 -5608118 -12263583 -12192841 -5414264 1042110 2849208 2086051 1745572
40402 1745572 2173595 3499935 6483851 9571968 9357615 5627071 2538973 3222741 5946838
40393 5946838 6782356 3702900 -2275965 -7164824 -5222655 5967596 20611900 28486195
40385 28486195 25158352 15804917 8283492 5812935 7223057 10215749 12228610 11191481
40377 11191481 7571007 3742616 852193 -992995 125874 6081739 13654629 16564974
40369 16564974 13662226 9672189 6620339 1147578 -7272638 -12740948 -11524836 -7314022
40361 -7314022 -3302632 3458153 13670884 19638245 16234864 11566334 16300613 27065835
40353B7065835M646030l993775m864549l857492r774852j6147062j1655818o49377
40345a9231060L079728j385693k111063M573356Q426710K985254m334869m447677
40337a2445314J181029N838653P600225Q548170Q761672N973369o67561q735307
40329A6054936j3383787j0525484j318064P730068J1514588J0980490Q507608
40322B9560355K894083o335449j3981640j5059695j2139963r842186n953816L113063
40314b7745248J1412220R308850m84145m491591K117386Q896318O542376l74311
40306E181855k519909J015041M941898O336084M656107j180787r428301j3530641
40298d528653r389098j476337K980579K766997J529608J384031K079960L459235
$$ plain form
40353 27065835 31711865 27718090 22853541 18996049 9221197 -6925865 -18581683 -19231060
40345 -19231060 -16151332 -17537025 -19648088 -15074732 -6648022 -3662768 -7997637 -12445314
40337 -12445314 -11264285 -5425632 2174593 10722763 19484435 25457804 24790243 16054936
40329 16054936 2671149 -7854335 -9172399 -1442331 10072257 21052747 29560355
40322 29560355 32454438 26118989 12137349 -2922346 -15062309 -24904495 -30858311 -27745248
40314 -27745248 -16333028 -7024178 -7508323 -11999914 -9882528 -986210 5556166 5181855
40306 5181855 2661946 3676987 8618885 14954969 19611076 18430289 9001988 -4528653
40298 -4528653 -13917751 -15394088 -12413509 -9646512 -8116904 -6732873 -4652913 -1193678
40290a193678M456002K369817k894316o539663m696678M1761K600873K195375
40282c660507J164498j79948k799623m901689l610641j0140J797298O84123j32268
40273a1648897J672771L864865K613087k236022o148646m579822J334166M966308
40265a0162190J676532m883233o650823j083505N929703P508248L061849k636271
40257g239690m765315j901739L322248O183736M436545P82749j162330j762222
40249b106018l000847l643991j828388k48912k074002l463453J335730Q128916
40241f900965O448766l348643q156829j687973N496673K795384m116160l867377
40233a3337124K057458L551007m58132j417744L461634P108996M849751P98090
$$ plain form
40290 -1193678 3262324 5632141 2737825 -3801838 -8498516 -8456755 -5855882 -3660507
40282 -3660507 -2496009 -2675957 -5475580 -10377269 -13987910 -13998050 -12200752 -11516629 -11648897
40273 -11648897 -9976126 -6111261 -3498174 -5734196 -11882842 -16462664 -15128498 -10162190
40265 -10162190 -8485658 -13368891 -20019714 -21103219 -15173516 -7665268 -4603419 -7239690
40257 -7239690 -12005005 -13906744 -10584496 -4400760 35785 818534 -343796 -2106018
40249 -2106018 -5106865 -8750856 -10579244 -10828156 -12902158 -16365611 -15029881 -6900965
40241 -6900965 -452199 -3800842 -11957671 -13645644 -8148971 -5353587 -9469747 -13337124
40233 -13337124 -11279666 -7728659 -8186791 -9604535 -6142901 966095 5815846 6613936
40225F613936m44153m78438k251099m447571m119311j103994K532183M788111
40217A089664M284607R67339l058740n311863n529095m949880m018216k648009
40209a9174193j413575m79515J183576L740117N427568N072684L557372J761088
40201c24878j56280r90954m4894m43278m935882q097725j276865J2360086J7855529
40192A3944859Q626322l569007n931433j630486k04577j047888J341760L980185
40184A5509735J159485k780593q78970J733699l833770j1667969q208346M419424
40176d547305J0623253O541366L711070N768327K195794r108180j3672934m585340
40168c073949L870327o58541q126527l827400O838863Q374104L37881m945673
$$ plain form
40225 6613936 6169783 5691345 3440246 -1007325 -5126636 -6230630 -3698447 1089664
40217 1089664 5374271 6341610 3282870 -2028993 -7558088 -12507968 -16526184 -19174193
40209 -19174193 -20587768 -21067283 -19883707 -16143590 -10716022 -5643338 -2085966 -324878
40201 -324878 -481158 -1472112 -1517006 -1960284 -6896166 -14993891 -16270756 -3910670 13944859
40192 13944859 22571181 19002174 13070741 11440255 11235678 10187790 11529550 15509735
40184 15509735 16669220 13888627 13009657 14743356 10909586 -758383 -8966729 -4547305
40176 -4547305 6075948 12617314 16328384 22096711 24292505 15184325 1511391 -3073949
40168 -3073949 796378 137837 -7988690 -11816090 -4977227 3396877 3734758 -1210915
40160a210915l733098l043952m624834k532107L576805O419503L677827J215277
40152b55494J902601J207672l476263p415225n677217J65962M859731M785365
40144c902868l35821p083151r755596o084974q60849J16310j683067q0047O021135
40135b3648928J0766559R498847M220473K5343o72287N84720R82054j3294K77980
40126B021467L675789O803245M671730j314462m378611k536861j163408l097282
40118D681607l793385k80908L028653K855733L105105N581165L440009o706614
40110A1911365j4168093p541451P064100J3940029R866530M864875L512641L01535
40102B9751531n952187p660351k050695L036361J682021j976697k860454k915877
$$ plain form
40160 -1210915 -4944013 -7987965 -12612799 -15144906 -11568101 -5148598 -1470771 -255494
40152 -255494 1647107 2854779 -621484 -8036709 -13713926 -13547964 -8688233 -3902868
40144 -3902868 -4238689 -11321840 -21077436 -27162410 -28023259 -27906949 -29590016 -29670063 -23648928
40135 -23648928 -12882369 -3383522 836951 862294 190007 774727 1756781 1743487 2021467
40126 2021467 5697256 12500501 17172231 15857769 11479158 8942297 7778889 4681607
40118 4681607 888222 607314 3635967 6491700 9596805 15177970 18617979 11911365
40110 11911365 -2256728 -9798179 -2734079 11205950 21072480 25937355 29449996 29751531
40102 29751531 23799344 16138993 14088298 17124659 18806680 16829983 13969529 11053652
40094A1053652m812058n775578l145493M46494K039346K598047K688340J67481
40086E260231m169923m996823m55704M115537M078122J217207j685560n317298
40078a954211q927333p952461j641370L328136K410800L04743K335042M634980
40070g461674O46038o857897q754175k781322L851851M924803K017063k5890L49223
40061a4091980J151609O41721j04698J734302O658291J0478041Q443031J658999
40053A6569316l862137m732965k864288n23189J991892K703332j837374j0008620
40045b564033j4374558j0731643l037476L228773O852654P340869K863490l765546
40037a4187470m457610K609327P635840K753887n408540n571832J106345M215624
$$ plain form
40094 11053652 6241594 466016 -2679477 -2232983 -193637 2404410 5092750 5260231
40086 5260231 1090308 -3906515 -4362219 -246682 3831440 5048647 3363087 -1954211
40078 -1954211 -10881544 -18834005 -20475375 -17147239 -14736439 -14431696 -12096654 -7461674
40070 -7461674 -6815636 -13673533 -22427708 -25209030 -21357179 -16432376 -14415313 -14441203 -14091980
40061 -14091980 -12940371 -12298650 -12403348 -10669046 -4010755 6467286 14910317 16569316
40053 16569316 12707179 7974214 5109926 4586737 6578629 9281961 7444587 -2564033
40045 -2564033 -16938591 -27670234 -30707710 -27478937 -20626283 -13285414 -10421924 -14187470
40037 -14187470 -18645080 -16035753 -8399913 -5646026 -11054566 -16626398 -15520053 -11304429
40029a1304429J072382p50971K672468N820563L705432q94497k948201j500593
40021d127846J747442M870908N235874J518415k791767k627072J519991M620403
40013I966348N075953N712367O611261L893170k571528o777335m853482m23126
40005A6633628J255663j40694k175895m102426n969262o676715n769369m612701
39997a1557771l990371l152130k127956j623857r6278M689093J0284691J0819152
39989C244573N275429o52166k941991l834180n374566m599624N64213O132776
39981b185536P850196P245686O577245K970148n340187j1357257o985633L522575
39973B297237P203908R7836p443219n771335J553801M953321K546392L44393J654050
$$ plain form
40029 -11304429 -10232047 -10983018 -8310550 -2489987 1215445 320948 -2627253 -4127846
40021 -4127846 -2380404 2490504 7726378 9244793 6453026 3825954 5345945 9966348
40013 9966348 15042301 20754668 27365929 31259099 28687571 21910236 17056754 16633628
40005 16633628 17889291 17748597 15572702 11470276 5501014 -1175701 -6945070 -11557771
39997 -11557771 -15548142 -18700272 -20828228 -22452085 -22548363 -17859270 -7574579 3244573
39989 3244573 8520002 7867836 4925845 1091665 -4282901 -8882525 -8318312 -2185536
39981 -2185536 5664660 12910346 19487591 22457739 17117552 5760295 -1225338 2297237
39973 2297237 9501145 9598981 2155762 -3615573 -2061772 2891549 5437941 5782334 7436384
39964G436384K732748n14863n845113o959057j245491O518477R032275M708700
39956A5864060o49820j423161Q53673R81245j392174j791683O27391Q16199l396996
39947A0488734o119240k037462M074730L254673m406344r763828p528534j551066
39939a3588337L972049J0075319J5848543J4127475K078326r817818r250506J88455
39931A3633506L303667m786530j2095331q170308J563267O186517N186327N067073
39923I888188O197301L532333k246591m629864k269823q71097k651446k425119
39915D523882K731733P328392N499143l47740l794620l289172j929032j228719
39907I493867N6602K039070K442305o25855o248467j0660276r632203k915130
$$ plain form
39964 7436384 10169132 9654269 3809156 -3149901 -4395392 2123085 11155360 15864060
39956 15864060 15214240 13791079 14644752 15625997 14233823 12442140 13069531 13885730 10488734
39947 10488734 4369494 2332032 6406762 9661435 5255091 -4508737 -12037271 -13588337
39939 -13588337 -9616288 459031 16307574 30435049 32513375 22695557 13445051 13633506
39931 13633506 16937173 12150643 55312 -8114996 -6551729 -365212 4821115 9888188
39923 9888188 16085489 19617822 17371231 12741367 10471544 9600447 6949001 4523882
39915 4523882 7255615 14584007 20083150 19735410 15940790 12651618 10722586 9493867
39907 9493867 9550469 11589539 14031844 13405989 7157522 -3502754 -13134957 -16050087
39899a6050087L855151M879892J726023P43582K881464K473569k015762l801802
39891e307970R57184N134910J297416n484082m888765K220018N236255P96981
39883c8053k474408J751658Q061303Q295258K577601l367260o109383n159638
39875C537078p87240M126235M413252n38651m234827k049408J317161j001540
39867D782060o859245p814756j290877O618322J0005997Q587258M004799l001937
39859A5031621r891416j2033218p964879j495313L457480O738850Q777285P504938
39851A0125348J860351m334188n844442k237253K352174M730645N089272M609606
39843A6351513L707702K913092K881565K829602J205171j145744q88779K863851
$$ plain form
39899 -16050087 -12194936 -7315044 -5589021 -4845439 -1963975 509594 -1506168 -5307970
39891 -5307970 -4350786 784124 2081540 -3402542 -8291307 -6071289 -835034 -38053
39883 -38053 -2512461 -760803 7300500 15595758 18173359 14806099 8696716 3537078
39875 3537078 2749838 6876073 11289325 10750674 6515847 4466439 5783600 4782060
39867 4782060 -2077185 -9891941 -11182818 -4564496 5441501 14028759 18033558 15031621
39859 15031621 5140205 -6893013 -14857892 -16353205 -12895725 -6156875 2620410 10125348
39851 10125348 11985699 7651511 1807069 -430184 1921990 6652635 11741907 16351513
39843 16351513 20059215 22972307 25853872 28683474 29888645 28742901 27854122 30717973
39835C0717973N870884M671106M107220J3084529K9892887L7198412J9379497
39828A44922508j5810993m1130711l8705384j8487467l144800j225038l659636
39821B2758479k154936J020013K110277L000957M654428K884031k866478m425970
39813B6980801L325420J1796560R361476j334594o989437k537305M226252O829165
39805E1658338P873153J0232684J1374309J1569837J7815365L1229469L7841374
39798A79594529K2850849q249835l2669941l5543560k4725360j7854204k0667762
39791F2734716k3277792j5878017k574293L509393k733170j1204845r549085M18116
39783A445023N723680P64227n576417m091627J741436L055565n48515k593929
$$ plain form
39835 30717973 36588857 41259963 45367183 58451712 88344599 125543011 144922508
39828 144922508 129111515 87980804 49275420 30787953 27643153 26418115 22758479
39821 22758479 20603543 21623556 23733833 26734790 31389218 34273249 31406771 26980801
39813 26980801 30306221 42102781 51464257 50129663 43140226 40602921 44829173 51658338
39805 51658338 59531491 69764175 81138484 92708321 110523686 141753155 179594529
39798 179594529 202445378 194195543 161525602 125982042 101256682 83402478 62734716
39791 62734716 39456924 23578907 21004614 24514007 21780837 10575992 1026907 1445023
39783 1445023 7168703 7932930 2356513 -1735114 6322 3061887 2513372 -80557
39775h0557j124078K72980O92562K295092L171482j168600q333244r849413l693228
39766a7817004K213700K315725J179447M123954P509377N154025r19213l642546
39758A17465j573115P39892J193563K050405L781439L144882j423458o756656
39750A274417q471066m880485K481753R411656J0636303M290126m961815r922849
39742a41960q017044k458658K529413M698095L187369j105866m765513n036522
39734a1110686l642208l892563m478372q16507O855279J1754662Q994744J683225
39726E347574l831724n280731m431113l058164k175103k737037l895786k642944
39718b2705028J770561N314775M599162K534504L935013O969262M929712k933288
$$ plain form
39775 -80557 -1204635 -931655 -239093 2055999 5227481 4058881 -4274363 -14123776 -17817004
39766 -17817004 -15603304 -13287579 -12108132 -7984178 -474801 4679224 3760011 117465
39758 117465 -1455650 -715758 477805 2528210 6309649 9454531 8031073 1274417
39750 1274417 -7196649 -12077134 -9595381 -183725 10452578 14742704 9780889 -141960
39742 -141960 -8159004 -10617662 -8088249 -3390154 -202785 -1308651 -6074164 -11110686
39734 -11110686 -14752894 -18645457 -23123829 -23940336 -17085057 -5330395 3664349 5347574
39726 5347574 1515850 -3764881 -8195994 -11254158 -13429261 -16166298 -20062084 -22705028
39718 -22705028 -20934467 -15619692 -11020530 -8486026 -4551013 2418249 7347961 4414673
39710D414673q498854n687166O94978J865325k307512l732691J452310P365776
39702d433161P610232M449424L957048N678179L884061j706053m035487l89L259059
39693A8662913j243162q675712q646850p86058M357694N37294o133340p182679
39685i109900k826190J418934L346899L756269K111718j198611j660809L506503
39677f55187Q569946N572205l681026r246900o534756p55621K679104M084330
39669C2095L793145q66525q451549j0844882l904151N258862Q056872O135854
39661g90279O062033P170046L735644l469595p290824n296424k163021p58572
39653b800992Q19894K526031J228608j943981j550141K456689L634271P85293
$$ plain form
39710 4414673 -4084181 -9771347 -9076369 -7211044 -9518556 -13251247 -11798937 -4433161
39702 -4433161 3177071 7626495 11583543 17261722 21145783 19439730 15404243 15403854 18662913
39693 18662913 17419751 8744039 97189 -688869 3668825 4206119 -1927221 -9109900
39685 -9109900 -11936090 -10517156 -7170257 -3413988 -1302270 -2500881 -4161690 -655187
39677 -655187 7914759 13486964 9805938 559038 -5975718 -6731339 -4052235 32095
39669 32095 3825240 2958715 -5492834 -16337716 -20241867 -14983005 -6926133 -790279
39661 -790279 5271754 12441800 16177444 12707849 5417025 120601 -2042420 -2800992
39653 -2800992 -1981098 544933 1773541 -170440 -1720581 736108 4370379 5155672
39645E155672J143551O793588Q082980j312427j1811737j1195862l588318k499927
39637i232480r049755j1135663l738377L871768M069321J631104L299578O901200
39629a3383304P541240O367590N886020L374040l080737p355181k874772N764976
39621B239872P400456n83291r313394j0575525n177558J440408N503347M957577
39613d108108r64792q673940j0515201k454448R637114J4759200Q611011j063915
39605E226921k689019N552513J2712984Q163746m213873j0188845l983996L993439
39597A4573870K243594n624575p487352j315385K970544p8990l629491o73296
39589I78919M837289N026167K4252m130192n315695n625383m466161N02694N957795
$$ plain form
39645 5155672 6299223 13092811 21175791 19863364 8051627 -3144235 -6732553 -9232480
39637 -9232480 -18282235 -29417898 -33156275 -29284507 -25215186 -23584082 -20284504 -13383304
39629 -13383304 -5842064 525526 6411546 9785586 6704849 -650332 -3525104 2239872
39621 2239872 9640328 9057037 -256357 -10831882 -16009440 -14569032 -9065685 -4108108
39613 -4108108 -5072900 -13746840 -24262041 -26716489 -17079375 -2320175 6290836 5226921
39605 5226921 2537902 8090415 20803399 28967145 24753272 14564427 10580431 14573870
39597 14573870 16817464 11192889 3705537 2390152 5360696 5281706 1652215 978919
39589 978919 5816208 10842375 10866627 6736435 1420740 -4204643 -8670804 -8168110 -2210315
39580b210315M694564l079421p582995k725342M540133M066588k672510n315892
39572a0285190m05392M211171K387721j053448J037009O261947O418505m0182
39564H532141o562827q443949p153132m510204J64064N085028N193896R4748l114118
39555a0714353L00303N092632L894739j621886m031027j440229J743012L336079
39547c440730M901105N456169J890324l414989l605164J386315K465665n224162
39539D14533j3359573j1188842m18094P772005P905403N103993N264548P140622
39531H634595O208085J689343l303157o182912o704104n315949k071663K172399
39523d873363M647405K480466l555929q232349o661237K07590O569106Q094597
$$ plain form
39580 -2210315 2484249 -595172 -8178167 -10903509 -6363376 -2296788 -4969298 -10285190
39572 -10285190 -10690582 -6479411 -4091690 -5145138 -4108129 2153818 8572323 8532141
39564 8532141 1969314 -6474635 -13627767 -18137971 -17973907 -12888879 -7694983 -7600235 -10714353
39555 -10714353 -10414050 -5321418 -1426679 -3048565 -7079592 -8519821 -6776809 -3440730
39547 -3440730 1460375 6916544 8806868 5391879 1786715 3173030 5638695 414533
39539 414533 -12945040 -24133882 -24551976 -16779971 -8874568 -3770575 1493973 8634595
39531 8634595 14842680 16532023 13228866 7045954 341850 -4974099 -7045762 -4873363
39523 -4873363 -225958 2254508 -1301421 -9533770 -16195007 -15987417 -9418311 -1323714
39515a323714N303759R04097l193946n417974m228206k03687L607665M998201
39507D46195M470898K849885l50899m572693o876835n203043j106425K392134
39499g950783L667102K167000j642062m513153k495030K876381M739985M04461
39491b746099m135599l540832j602517l778450o174482j354843P374995Q449670
39483g508157m21901p924465n792254N6937Q62869j061202J823252Q189585R357308
39474b418028L009906l358319l367433Q87691M318156O002198P633701Q569847
39466B1277719O465248J782717j516380o20749K327354K639301q80073m316812
39458B7158325m292164k862246l613656m783015j679426M060672M420867k998815
$$ plain form
39515 -1323714 3980045 4884142 1690196 -3727778 -7955984 -8159671 -4552006 446195
39507 446195 4917093 7766978 7416079 2843386 -4033449 -9236492 -10342917 -7950783
39499 -7950783 -4283681 -2116681 -3758743 -8271896 -10766926 -7890545 -3150560 -2746099
39491 -2746099 -6881698 -10422530 -12025047 -15803497 -21977979 -23332822 -15957827 -7508157
39483 -7508157 -7930058 -15854523 -21646777 -21589840 -20726971 -21788173 -19964921 -11775336 -2418028
39474 -2418028 591878 -2766441 -6133874 -5246183 -928027 5074171 12707872 21277719
39466 21277719 27742967 29525684 28009304 27388555 29715909 32355210 31475137 27158325
39458 27158325 22866161 20003915 16390259 11607244 9927818 13988490 18409357 15410542
39450A5410542r349585n972857L630908R520364Q860320O317047M026223K06702
39442C2649664l138172r41442M710537M313883n017130j3045450r514108K179748
39434A2197530J0409919R970794N389859K972199N118172J0097696J3068430J0334886
39426G9559485O088983R437310J9900927K4427913J8716299K2153170N2721731
39419B33005818Q9234570Q2567522J5436770o7027324j03476373q2489177m4630224
39412A22621582k6164483k4081572j8991780q926337n772683j1361859j4556187
39405A2766681r043689q84664K482892J370276k11928r70948j785163k859466
39397H63991l647757l191523l6663N413749Q689910N301029k424740o643940l582746
$$ plain form
39450 15410542 6060957 88100 3719008 13239372 22099692 28416739 32442962 32649664
39442 32649664 29511492 28570050 33280587 37594470 32577340 19531890 10017782 12197530
39434 12197530 22607449 32578243 37968102 40940301 46058473 56156169 69224599 79559485
39426 79559485 85648468 95085778 114986705 139414618 158130917 180284087 233005818
39419 233005818 322240388 404807910 420244680 353217356 249740983 167251806 122621582
39412 122621582 96457099 72375527 53383747 44457410 38684727 27322868 12766681
39405 12766681 3722992 2838328 5321220 6691496 6479568 5508620 3723457 863991
39397 863991 -2783766 -5975289 -6011952 -598203 8091707 13392736 10967996 4324056 741310
39388G41310K018664M012960K498518J262782R65611o28141l323233m232571k833275
39379D82625j991805k871672k574040J084761N397412O115846K973762j085552
39371G531337m611397p907888r374669o166106M58894M747317L714434R71730
39363a0636348K30256q61463n273875q481526l511743O644949J0384493L594723
39355g910534l822871k327409L735728M227724q21251k791904O06064K162262
39347f942191k358672p627896p650263m129497k039530k222772k335929j092015
39339c6398765J754416O061914R387221Q417794M664568L921310P196146P813507
39331A2818111J735965n073046n483639k205605k606951o455611p204967l248305
$$ plain form
39388 741310 2759974 6772934 9271452 10534234 11499845 10871704 7548471 3315900 482625
39379 482625 -1509180 -4380852 -6954892 -5870131 -472719 5643127 8616889 7531337
39371 7531337 2919940 -4987948 -14362617 -20528723 -20069829 -15322512 -11608078 -10636348
39363 -10636348 -10406092 -11267555 -16541430 -25022956 -28534699 -21889750 -11505257 -7910534
39355 -7910534 -11733405 -14060814 -10325086 -6097362 -6918613 -9710517 -9104453 -6942191
39347 -6942191 -9300863 -16928759 -24579022 -28708519 -30748049 -32970821 -35306750 -36398765
39339 -36398765 -34644349 -28582435 -19195214 -10777420 -6112852 -2191542 5004604 12818111
39331 12818111 14554076 9481030 3997391 1791786 -815165 -7270776 -14475743 -17724048
39323a7724048P31657K742928N184864P357398N001291j011237l817408j197907
39315b732462O70239k155079m367126l04057O135306O758922M80008o258661q061774
39306i834684n054539p90335P85007j621327m127256j248472N880270R414210
39298f597126N800592J023221L25477o30689o958719j2649931p686237N499802
39290b1873610J3260109Q681967j093261o859918p660431o353816l268493J069164
39282b4098289L052519P09396k751727l424807r16744L860207R907865J2933063
39274g28517P398704m347986j1373153p672814l25097J919564J698775N934703
39266g495821J0948826O731868m931089r387054Q483J0743315Q234498l540244
$$ plain form
39323 -17724048 -16992391 -14249463 -9064599 -1707201 3294090 2282853 -1534555 -2732462
39315 -2732462 -2062223 -4217302 -8584428 -8888485 -2753179 4005743 4485751 -1772910 -9834684
39306 -9834684 -14889223 -15679558 -14894551 -16515878 -20643134 -21891606 -16011336 -6597126
39298 -6597126 -796534 226687 552164 -78525 -7037244 -19687175 -27373412 -21873610
39290 -21873610 -8613501 68466 -1024795 -7884713 -15545144 -21898960 -25167453 -24098289
39282 -24098289 -21045770 -20336374 -23088101 -26512908 -27429652 -23569445 -13661580 -728517
39274 -728517 6670187 2322201 -9050952 -16723766 -17048863 -15129299 -13430524 -7495821
39266 -7495821 3453005 10184873 5253784 -4133270 -4124787 6618528 14853026 11312782
39258A1312782q144575Q5056R241085P228503l070520j0522138j1029503q978546
39250a3877856o792918j824087N461782Q399797L653738k158828j383395L411705
39242e110062M169224K65693j889493r69415k460456o597895m909951N904993
39234a1597362J5190330J1074807l483663j4945916j5621457q747769n19058N204740
39226b3445348O058515K548207r3592K515861P066936O838858J671444k351435
39218H09446k140523j20599J703990L422897L430854K26887k036592K251151R593072
39209A7140583R568124j82472r625196j0362388n593913j491755K718283Q887805
39201A1059071J1296969L421187r986057j6489400j1053026p59620N387816N437226
$$ plain form
39258 11312782 3168207 3253263 12494348 19722851 16652331 6130193 -4899310 -13877856
39250 -13877856 -20670774 -22494861 -17033079 -8633282 -4979544 -7138372 -8521767 -5110062
39242 -5110062 -940838 -675145 -2564638 -3534053 -5994509 -12592404 -17502355 -11597362
39234 -11597362 3592968 14667775 11184112 -3761804 -19383261 -28131030 -28650088 -23445348
39226 -23445348 -17386833 -14838626 -14932218 -12416357 -5349421 1489437 3160881 809446
39218 809446 -1331077 -1451676 252314 3675211 7106065 7332952 5296360 7547511 17140583
39209 17140583 26708707 26526235 16901039 6538651 944738 -547017 2171266 11059071
39201 11059071 22356040 25777227 15791170 -698230 -11751256 -12510876 -7123060 -1685834
39193a685834K716906L83517l21560M22376J250334N27871k035952m790324n098177
39184h630843j763065K164002Q60962o381310j0556687k552458J2669096J9519742
39176E329439J1800404N70099k739087j777288n436623j0546022o672921N390719
39168d081280J2893427R397917K498395O10463J908439R74138j457739j376722
39160B1367038Q53684J255956j954971p017202j1020860j1393364p426320k096256
39152a7432295K67301n16790l46999K641434N197401M386310K030538J235239
39144b537861J901635K401730K586128K274232k21997m780197p297133m509548
39136a0183011R17669L772900L308021L039162M350429M418259J128287l326285
$$ plain form
39193 -1685834 1031072 1414589 1093029 1515405 2765739 3293610 1257658 -3532666 -8630843
39184 -8630843 -10393908 -8229906 -7368944 -13750254 -24306941 -26859399 -14190303 5329439
39176 5329439 17129843 17699942 14960855 13183567 7746944 -2799078 -9471999 -4081280
39168 -4081280 8812147 18210064 20708459 21318922 23227361 24201499 22743760 21367038
39160 21367038 22220722 23476678 21521707 14504505 3483645 -7909719 -15336039 -17432295
39152 -17432295 -17164994 -17681784 -18028783 -15387349 -10189948 -5803638 -3773100 -2537861
39144 -2537861 -636226 1765504 4351632 6625864 6403867 1623670 -5673463 -10183011
39136 -10183011 -9265342 -5492442 -2184421 854741 5205170 9623429 10751716 7425431
39128G425431n414507m785900l897343l940234l061583O65853N554762P318444
39120a35077M225693m78823k832159l320908n168857q276769q510411l865535
39112b8362846K011682M518394L899430L799501N504621O501190M597885J103526
39104C573383r47938m61022R22184J320269P81734L42278k74410k408922n731966
39095b884410p565160n992741k256937J058738K738877K649260P37413j802942
39087a3317902k308425O3087K544087K652091J834219K418705L316318K354238
39079d43582M77834o67694k710183o646807p674575j406336O200136M385298n856842
39070a4342751j0474483j509040J1194002J3495841N207332k527625l144719o5283
$$ plain form
39128 7425431 2010924 -2774976 -6672319 -10612553 -13674136 -13008283 -7453521 -135077
39120 -135077 4090616 3611793 779634 -2541274 -7710131 -15986900 -24497311 -28362846
39112 -28362846 -26351164 -21832770 -17933340 -14133839 -8629218 -2128028 2469857 3573383
39104 3573383 2625445 2164423 3086607 4406876 5188610 5530888 5256478 2847556 -2884410
39095 -2884410 -10449570 -16442311 -18699248 -17640510 -14901633 -12252373 -11514960 -13317902
39087 -13317902 -15626327 -15563240 -13019153 -10367062 -8532843 -6114138 -2797820 -443582
39079 -443582 34252 -633442 -3343625 -9990432 -17665007 -19071343 -12871207 -8485909 -14342751
39070 -14342751 -24817234 -26326274 -15132272 -1636431 3570901 1043276 -2101443 -2166726
39062b166726J153537j133682n460964q452447o073934J591359Q047538P413652
39054e081667K208942o98850j60851q92432m394844o271797l626446N73954K603266
39045a5740725K923989L586855M174932K988560J53072k353021k406265J035206
39037e637397O293127Q400202L415843n545191r952182n670539J768770M551322
39029b376045K617849K069715M777445N210112m33134o767001n713152J729739
39021A115528O142459K676983k568978k289039J124797Q689o353085j0706568
39013a0849214q316792k086847L310726O320787O265965K415156k300725k379799
39005g620743K307021M897144J286458l748644m251882j675026o54581q92656
$$ plain form
39062 -2166726 -1013189 -2146871 -7607835 -16060282 -22134216 -20542857 -12495319 -5081667
39054 -5081667 -2872725 -3571575 -3732426 -4624858 -9019702 -15291499 -18917945 -18343991 -15740725
39045 -15740725 -12816736 -9229881 -5054949 -2066389 -1913317 -4266338 -6672603 -5637397
39037 -5637397 655730 9055932 12471775 6926584 -3025598 -8696137 -6927367 -2376045
39029 -2376045 241804 2311519 7088964 12299076 11865942 5098941 -614211 1115528
39021 1115528 7257987 9934970 7365992 5076953 6201750 6210439 -142646 -10849214
39013 -10849214 -19166006 -21252853 -17942127 -11621340 -5355375 -2940219 -5240944 -7620743
39005 -7620743 -5313722 -416578 869880 -2878764 -7130646 -8805672 -9460253 -10352909
38997a0352909O85550L241565L768239K876342K843848K285782j130308m832171
38989f14062m636717k077914j653732k219074J263595P691378R563773M190029
38981A1507276k132270l680052k643831l449552m997303k974340L029083Q427918
38973C086929Q617866L465946k167618k377220L607792R877550J0524515O096227
38965D0731987M57412n641676j2404739j5142694q701570K365607O555199N04417
38957H723943o311153n159754Q80060L756588J695114k036538o088516r942844
38949a4483100r596385j769180Q750490J2437768O374447k224664m677577L26951
38941d861250P368471J0848944R275311M598991n11273l966367l886568O06401
$$ plain form
38997 -10352909 -9667359 -6425794 -2657555 218787 3062635 5348417 4218109 -614062
38989 -614062 -5250779 -7328693 -8982425 -11201499 -9937904 -2246526 7317247 11507276
38981 11507276 9375006 5694954 3051123 -398429 -5395732 -8370072 -5340989 3086929
38973 3086929 11704795 15170741 13003123 10625903 14233695 24111245 34635760 40731987
38965 40731987 41189399 35547723 23142984 8000290 -701280 1664327 8219526 8723943
38957 8723943 2412790 -2746964 -1866904 1889684 3584798 1548260 -4540256 -14483100
38949 -14483100 -24079485 -25848665 -17098175 -4660407 1714040 -510624 -5188201 -4861250
38941 -4861250 2507221 13356165 22631476 27230467 26719194 22752827 18866259 19472660
38933A9472660O923720R492308N376126j857319o538860p502511p032352n588277
38925A2745495k696177j320760m669185r044256p395620r55580Q67536n014201
38917a7482748r342234m041073N480695Q350272L284912j668469j045422L313657
38909a3150410P374184Q585775N793864P23791j695678R08651L930254J758166
38901A4228597l764112o083164l542192n43303k6317p31892j848904m225361n869807
38892a2406455k314196N734553J0011038M204715o802510j1644023n898918L047306
38884a6068490N857848K801229J786492N910416Q637619M242473k353413k773871
38876H040303J065033l65132p891773j0596732k818102N892414M868332j927146
$$ plain form
38933 19472660 26396380 35888688 41264814 39407495 32868635 25366124 18333772 12745495
38925 12745495 10049318 8728558 4059373 -4984883 -12380503 -13336083 -12468547 -17482748
38917 -17482748 -26824982 -30866055 -25385360 -17035088 -13750176 -15418645 -16464067 -13150410
38909 -13150410 -5776226 2809549 8603413 9327204 7631526 8540177 12470431 14228597
38901 14228597 10464485 4381321 839129 295826 269509 -462383 -2311287 -6536648 -12406455
38892 -12406455 -14720651 -8986098 1024940 5229655 -1572855 -13216878 -19115796 -16068490
38884 -16068490 -10210642 -7409413 -5622921 287495 8925114 13167587 10814174 8040303
38876 8040303 9105336 8740204 848431 -9748301 -12566403 -6673989 -1805657 -3732803
38868c732803l568591N73558K245403l88780o12606L787724O277276K895408j251387
38859F225202p93858J619775M09414m492394q418379p842688k601401M632646
38851a1261683Q915043O487776m3544l301135k71063L461817J437247m804520
38843F19938q288514o104254k146363n22850j7082K980571P952879R619413M566656
38834H660394l551329p696246n504643r08361K040003L256021L616050K103930
38826B015819j378425l739579k517276N14173K443934L306570M109021L659314
38818H413551P80656k881312n362753o698759n939508l50436Q311267J1882851
38810H155557O061030k053353l559945n07074r34863n175314o901560n361416
$$ plain form
38868 -3732803 -7301394 -6727836 -4482433 -4871213 -5483819 -1696095 4581181 7476589 6225202
38859 6225202 5431344 7051119 7460533 2968139 -5450240 -13292928 -15894329 -11261683
38851 -11261683 -2346640 4141136 4097592 796457 525394 3987211 5424458 619938
38843 619938 -7668576 -13772830 -15919193 -16442043 -16459125 -13478554 -5525675 4093738 8660394
38834 8660394 5109065 -2587181 -8091824 -9000185 -6960182 -3704161 -88111 2015819
38826 2015819 637394 -3102185 -5619461 -5105288 -2661354 645216 4754237 8413551
38818 8413551 9194207 6312895 950142 -5748617 -11688125 -12038561 -3727294 8155557
38810 8155557 14216587 12163234 8603289 8096215 7161352 1986038 -4915522 -10276938
38802a0276938n778654q097190o102539J136118P005721Q356917R184291J1048077
38794F475803R421158K853347l082937m557093m057492l320128m57145K798717
38786F074230O06020o240421q921596m536095r88855k493156j754500N659676
38778a2594697J0787417N455192l303671m955257k451893l984810n736580J228031
38770a5556268J1973005J2684886L002395l188532o3752K969290n52419l989112
38762G279493j305237K240939N11824l033020k980572j340760j830608k460966
38754b918907j140506j556222n792754p610543j516557O816672Q041787K957706
38746b719324p1863J573229L281446L252436M546251P001402N965999Q07882k842436
$$ plain form
38802 -10276938 -16055592 -24152782 -30255321 -29119203 -22113482 -13756565 -4572274 6475803
38794 6475803 15896961 18750308 15667371 11110278 7052786 3732658 3275513 6074230
38786 6074230 6680250 439829 -8481767 -13017862 -14006717 -16499873 -18254373 -12594697
38778 -12594697 -1807280 3647912 344241 -4611016 -7062909 -11047719 -16784299 -15556268
38770 -15556268 -3583263 9101623 12104018 8915486 8851734 11821024 11268605 7279493
38762 7279493 5974256 8215195 8727019 5693999 2713427 1372667 -457941 -2918907
38754 -2918907 -4059413 -5615635 -11408389 -19018932 -20535489 -13718817 -5677030 -2719324
38746 -2719324 -2791187 -1217958 2063488 5315924 9862175 16863577 22829576 23637458 20795022
38737B0795022j752718L75196m87190l310535n718749p437119p294776k705005
38729g535874M159676N539480j485262q741339p101451J231293P139659P679494
38721H85676O956138O435880L579949j47401N85514M960440N086814j517586o946702
38712A9878722n126694j162799k412032p195298r478226q697101p181570l494352
38704b4869350K841994N191714j322487q894479o513580K448121M931050p38068
38696b6925085k747466L700493Q587425M538848j668467k138482r0191m12114
38688a7155039R94392Q172318J4466036J1837217L696685j856440m602730p293380
38680H259059n572678M192477J2807464Q584954l528226q056426k626937J68584
$$ plain form
38737 20795022 19042304 19417500 18930310 15619775 9901026 2463907 -4830869 -7535874
38729 -7535874 -3376198 2163282 678020 -8063319 -15164770 -13933477 -6793818 885676
38721 885676 7841814 14277694 17857643 17710242 18295756 23256196 28343010 26825424 19878722
38712 19878722 14752028 13589229 11177197 3981899 -5496327 -14193428 -21374998 -24869350
38704 -24869350 -22027356 -16835642 -18158129 -27052608 -33566188 -31118067 -26187017 -26925085
38696 -26925085 -29672551 -25972058 -17384633 -12845785 -14514252 -16652734 -16742925 -17155039
38688 -17155039 -16160647 -7988329 6477707 18314924 22011609 20155169 15552439 8259059
38680 8259059 2686381 6878858 19686322 28271276 24743050 16686624 14059687 14228271
38672A4228271m731441o971872o3518O522338K789170n887509p962064k659931
38664d736556J820107J666682L50012J227465M131154P422833Q617000N133673
38656B5632370j797985o618165o038033l114983j933470k124858j939925k386681
38648c21730m046769l801236K39947L754345J533468m400428p213672m407869
38640a8663944K39503K905356L233044J911553q85409l939231n072708l696113
38632b3967949j293458P89607K285017K965804K546011J579495R70329P20080
38624a3405064K99778j84563k82834k4309N85330K000035L830230M158374K009809
38615a013214l6612J962859P771781J1437368P258874l082731j1616830j3190493
$$ plain form
38672 14228271 9496830 2524958 2461440 8983778 11772948 5885439 -2076625 -4736556
38664 -4736556 -2916449 -1249767 -899755 327710 4458864 11881697 20498697 25632370
38656 25632370 23834385 17216220 11178187 8063204 6129734 4004876 2064951 -321730
38648 -321730 -4368499 -8169735 -7929788 -4175443 -2641975 -7042403 -14256075 -18663944
38640 -18663944 -18424441 -15519085 -12286041 -10374488 -11259897 -15199128 -20271836 -23967949
38632 -23967949 -25261407 -24471800 -22186783 -19220979 -16674968 -15095473 -14125144 -13405064
38624 -13405064 -13105286 -13289849 -13572683 -13596992 -13011662 -11011627 -7181397 -3023023 -1013214
38615 -1013214 -1049826 913033 8684814 20122182 27381056 24298325 12681495 -508998
38607e08998j0959497j0223264r443284l029711P295792J1445757M679802m292909
38599a5036312m652750K436011Q034262Q938494Q053684M802330l586416j1774374
38591b785071r414078K553781R803252M049780n227107n563341M37107J198075
38583d947602n149192q594133k418573Q028108J2892902Q650609N2240n365022
38575C149337l902395J333524M069376J791957k719040o531521r111198q837460
38567b0757420k631222P684312J3735961R908869O42976n705892o556161m434049
38559h112626r38479K979021M044634K69970m308416m136421r0520K140223M16649
38550g735965k015498k302765j192007p74426k245264n124770o518129l289570
$$ plain form
38607 -508998 -11468495 -21691759 -31135043 -34164754 -26868962 -15423205 -10743403 -15036312
38599 -15036312 -19689062 -17253051 -9218789 -280295 7773389 12575719 8989303 -2785071
38591 -2785071 -12199149 -9645368 157884 4207664 -1019443 -6582784 -6145677 -4947602
38583 -4947602 -10096794 -18690927 -21109500 -13081392 -188490 8462119 8514359 3149337
38575 3149337 -753058 580466 4649842 6441799 3722759 -2808762 -11919960 -20757420
38567 -20757420 -23388642 -15704330 -1968369 7940500 8583476 2877584 -3678577 -8112626
38559 -8112626 -9051105 -6072084 -2027450 -1757480 -6065896 -10202317 -10292837 -8152614 -7735965
38550 -7735965 -9751463 -12054228 -13246235 -14020661 -16265925 -21390695 -27908824 -31198394
38542c1198394K942624O446960N444530M663092O479233N921360K7667m692767
38534c965695k125557K400860R45751k556435J037018Q446632P448453k261219
38526I369808o700450O71751Q978318P570484R41988k063133k908845p039961
38518H819960j1272381q858598k013142J436310Q94275K353324O298237O061171
38510C719156o64102o678299m452325M525530J1854205J0676034J235010r389178
38502A0826031j3043097q313368j892355p3494j100499N02905M544450N697780
38494b851647K493206n18282o21993j057444m595043p922072o574231k326631
38486b3974137r44839l707818n548977k146631M604976R770955J1500414J1501147
$$ plain form
38542 -31198394 -28255770 -21808810 -16364280 -11701188 -5221955 699405 727072 -3965695
38534 -3965695 -6091252 -3690392 -2744641 -5301076 -4264058 4182574 11631027 9369808
38526 9369808 2669358 3341109 12319427 19889911 20831899 18768766 15859921 8819960
38518 8819960 -2452421 -11311019 -13324161 -11887851 -10993576 -8640252 -2342015 3719156
38510 3719156 3055054 -3623245 -8075570 -3550040 8304165 18980199 20215209 10826031
38502 10826031 -2217066 -10530434 -12422789 -12496283 -13596782 -13093877 -8549427 -2851647
38494 -2851647 -358441 -876723 -1498716 -2556160 -7151203 -15073275 -21647506 -23974137
38486 -23974137 -24918976 -28626794 -34175771 -36322402 -31717426 -21946471 -10446057 1055090
38478A055090J0669482P448335J261546n001990p973195p849174p066477n735250
38470a3191633j499785N491717J0491267R008218K065968n269590r250410r332725
38462a1486973o114627n59727M634123O024663L345001M27521M78468K171191
38454a080360K675376K760313N003863P444321M306614m793616j1425506q731086
38446c840081j528184L00373l548673l613439M376288J2586741J2417761N655447
38438B2806233o10301m235749p003533p996435n212569j231746n30049k631096
38430f645245l792881l749697m582672m615677n68432M962076N669275J549465
38422a1773788n99772K137608M869730L674034J168234K10801j216430m355225
$$ plain form
38478 1055090 11724572 19172907 20434453 15432463 7459268 -389906 -7456383 -13191633
38470 -13191633 -14691418 -9199701 1291566 10299784 12365752 7096162 -2154248 -11486973
38462 -11486973 -17601600 -18161327 -13527204 -7502541 -4157540 -3730019 -3251551 -1080360
38454 -1080360 1595016 4355329 9359192 16803513 21110127 16316511 4891005 -3840081
38446 -3840081 -5368265 -5067892 -8616565 -12230004 -7853716 4733025 17150786 22806233
38438 22806233 22195932 17960183 10956650 2960215 -2252354 -3484100 -4014149 -6645245
38430 -6645245 -10438126 -14187823 -18770495 -23386172 -23954604 -18992528 -13323253 -11773788
38422 -11773788 -12373560 -10235952 -5366222 -1692188 -523954 -313153 -1529583 -5884808
38414e884808m525788K530134J2236618J4695091O288344n425658r093742j462066
38406I358125Q110045O918843n678315j5695011j1517831P29945O068391J424894
38398b80914k801839q08679J404517o71522k090903O04296J794609k197927m471630
38389i519992Q49213O874067M292557l301049n616314k097086n05162k438456
38381a1462222k071952J934061M288203L026828J965084K537323J911280O7731
38373B196336O42317L708114N102256L583441J607939q38614n295952p986243
38365B719594l108290O063723Q966595K919716k933184k199337l22600m029965
38357H076252j0044930j0754735m930528L173259J0190394J3722037J1116620
$$ plain form
38414 -5884808 -10410596 -7880462 4356156 19051247 25339591 19913933 10820191 9358125
38406 9358125 17468170 24387013 18708698 3013687 -8504144 -7774199 -1705808 -280914
38398 -280914 -3082753 -3891432 -2486915 -3158437 -5249340 -4645044 -2850435 -5048362 -9519992
38389 -9519992 -8670779 -1796712 2495845 -805204 -6421518 -8518604 -9023766 -11462222
38381 -11462222 -13534174 -11600113 -7311910 -4285082 -2319998 217325 2128605 2196336
38373 2196336 2838653 6546767 11649023 15232464 16840403 16001789 10705837 2719594
38365 2719594 -388696 5675027 14641622 17561338 14628154 12428817 12106217 8076252
38357 8076252 -1968678 -12723413 -17653941 -14480682 -4290288 9431749 20548369
38350B0548369L773527j572379r30197J618601J059787j044600j340443j717936
38342B0394729n009875q030860o261886k254872j686112l231609m44988O949219
38334D23746J1455066Q388620J446021l803122o260906p184199o579823m200601
38326f315198r59760K194827M367736L727375p5904k904911l71188M621104M361632
38317H645713k036686n951254j884845L395430N58151p870915j0863581n096759
38309b1104746Q74364K24531k453980J93112N949682O432882K31434m779067k781656
38300a7213444K608339M799471L151546J545033J213425j62698l041162m158369
38292a1257859j358017K499418K650601j254382l821914j0574P933000J1724567
$$ plain form
38350 20548369 24321896 22749517 21819320 23437921 24497708 23453108 22112665 20394729
38342 20394729 15384854 7353994 1092108 -1162764 -2848876 -6080485 -6525473 423746
38334 423746 11878812 20267432 21713453 17910331 11649425 4465226 -2114597 -6315198
38326 -6315198 -7274958 -5080131 -712395 3014980 2939076 34165 -337023 4284081 8645713
38317 8645713 6609027 657773 -1227072 2168358 2726509 -5144406 -16007987 -21104746
38309 -21104746 -20230382 -20005851 -22459831 -22266719 -16317037 -9884155 -9652721 -14431788 -17213444
38300 -17213444 -14605105 -9805634 -6654088 -5109055 -3895630 -4058328 -7099490 -11257859
38292 -11257859 -12615876 -10116458 -7465857 -8720239 -12542153 -12552727 -4619727 7104840
38284G104840O637364k131086n647539k270182K000008L410758M206978N099097
38276A8410238J683086o922866j2703182r101526j620575J98311k601474j498360
38268a4156348M227965O573023L336065J837449N054117N211192k874489j1304153
38260b095179r691381J90843P959748Q132009L130364l208789q119091q712940
38252a2414416m768265q89730q50848k097272l55730L555290O417528Q256840
38244c146603R554367O916778j406746r143613r082290l966894j940760l208547
38236a5424308p31619O409164J0410127O960888R75788k205397l030866k605668
38228G58109L18330L913634K978446j884056k776306K917660O497916R56566p267417
$$ plain form
38284 7104840 13742204 11611118 5963579 3693397 5693405 9104163 13311141 18410238
38276 18410238 20093324 13170458 467276 -8634250 -10254825 -10056514 -12657988 -14156348
38268 -14156348 -9928383 -3355360 -19295 1818154 6872271 12083463 9208974 -2095179
38260 -2095179 -11786560 -11595717 -3635969 4496040 7626404 4417615 -3701476 -12414416
38252 -12414416 -17182681 -18072411 -18923259 -21020531 -21376261 -17820971 -11403443 -3146603
38244 -3146603 6407764 13324542 11917796 2774183 -6308107 -10275001 -12215761 -15424308
38236 -15424308 -16155927 -9746763 663364 7624252 8600040 6394643 3363777 758109
38228 758109 1076439 4990073 7968519 6084463 3308157 6225817 12723733 13680299 6412882
38219F412882p666315j213641K579879P31757m73643L020509P023420N779919
38211A6194767r00006q259728j0785729o265330J156305L797743q5656k667224
38203g814858K693325J0626636J0686595K402171n155473p523335q621542r552602
38195a2259083m608461O957371J4575013R061160m370290j2855055j1296873m548829
38187a9345047J904535O225185P512082N861486M360216N319186N528976R20436
38179A8287055n255270n628859j31038K875445j363991p355982p969428m198873
38171a0740941j895005k579898k593820K37188L549453M232516K462121J067207
38163f261179J877012L354023K451711q15603k310558P68488N125347N401920
$$ plain form
38219 6412882 -1253433 -2467074 112805 844562 370919 3391428 10414848 16194767
38211 16194767 15294761 7035033 -3750696 -10016026 -8859721 -5061978 -5147634 -7814858
38203 -7814858 -5121533 5505103 16191698 18593869 13438396 5915061 -2706481 -12259083
38195 -12259083 -16867544 -9910173 4664840 13726000 9355710 -3499345 -14796218 -19345047
38187 -19345047 -17440512 -11215327 -3703245 2158241 6518457 11837643 17366619 18287055
38179 18287055 13031785 7402926 7271888 10147333 8783342 1427360 -6542068 -10740941
38171 -10740941 -12635946 -15215844 -17809664 -17572476 -14023023 -9790507 -7328386 -6261179
38163 -6261179 -4384167 -1030144 1421567 605964 -1704594 -936106 4189241 9591161
38155I591161J536580k378476n371046r468985j2289902p700144L385050J0717356
38147a1978406Q176273K536557K471553N319037L102184l391522o470335m538146
38139d772805k884715k646457M04287N366208N063638j885151p355312n939299
38131a4649606k389074k370479l735484k340449N36966K337575M309119O627598
38123a1673834N038230r15518k900362M637464J3466452J1734356J145344o267010
38115A4265122n906005m072734m397509k611176K747565N166190P83317m068081
38107A906689k120195L808642N358442N76047m487959m411820j2513M246988N387399
38098A0251720M139115L092472K630882k12913o763452j2025654r383609j38910
$$ plain form
38155 9591161 11127741 8749265 3378219 -6090766 -18380668 -26080812 -22695762 -11978406
38147 -11978406 -3802133 -1265576 1205977 6525014 9627198 6235676 -234659 -4772805
38139 -4772805 -7657520 -10303977 -9899690 -4533482 530156 -1354995 -8710307 -14649606
38131 -14649606 -17038680 -19409159 -23144643 -25485092 -24948126 -22610551 -18301432 -11673834
38123 -11673834 -6635604 -7551122 -10451484 -5814020 7652432 19386788 20532132 14265122
38115 14265122 8359117 4286383 -111126 -2722302 25263 5191453 5974770 1906689
38107 1906689 -213506 3595136 8953578 9529625 5041666 629846 617333 4864321 10251720
38098 10251720 14390835 17483307 20114189 19901276 13137824 1112170 -8271439 -8410349
38090h410349O569365N020731m67567k685826j038131j47636j895365l204482
38082f259260r79872L832403P262636O051467P63814m174315m323608N98630O990349
38073I762244J0752043Q936285L94745j1299313j7234420j1166772J562934Q638091
38065C45837N243419j673075m696735m584633m767506m424752k189536r88645
38057a7735626l131526m962612k478328J551429K391543J730091M099900P574788
38049a0960341O085775J40099k712701J055594O348756P618228N702300M162021
38041A7439731L595506K330730l77771l739257n817541m254299O27145L966662
38033A3770906J467532m022231n623623k150331N95345q22253k546757k63756
$$ plain form
38090 -8410349 -1840984 3179747 2712180 26354 -1011777 -1159413 -3054778 -6259260
38082 -6259260 -7239132 -3406729 3855907 9907374 10671188 6496873 2173265 2771895 9762244
38073 9762244 20514287 29450572 29845317 18546004 1311584 -9855188 -8292254 345837
38065 345837 5589256 3916181 -780554 -5365187 -10132693 -14557445 -16746981 -17735626
38057 -17735626 -20867152 -25829764 -28308092 -26756663 -24365120 -22635029 -18535129 -10960341
38049 -10960341 -4874566 -4734467 -7447168 -6391574 -42818 7575410 13277710 17439731
38041 17439731 21035237 23365967 22988196 19248939 13431398 9177099 9804244 13770906
38033 13770906 15238438 11216207 5592584 3442253 4037598 3215345 668588 404832
38025D04832M117796O081253N015831L454522K346796L63757l500164q610845
38017I673778j2585430j1804737m646555M898563R958133Q334862M211273J488670
38009I528557m19318k695233l860513l037171j924212n40395M070947J0964642
38001A2087304J2412086L734106q099249j2494452q938157n330611m752002k720164
37993a4101139K018573L175686k845462r399781p741105J380708R364315J0505507
37985g642698O436763J288915k817320m995184m004869M61737O068314Q948909
37977C744567O910809J462244l451237m857381k802692Q59715M671031P775521
37969A4312577R002463P400669L519183j089238n411393q874992j0245048q325698
$$ plain form
38025 404832 4522628 10603881 15619712 19074234 21421030 21784787 18284623 9673778
38017 9673778 -2911652 -14716389 -19362944 -14464381 -4506248 3828614 8039887 9528557
38009 9528557 9109239 6414006 2553493 -483678 -2407890 -2948285 1122662 12087304
38001 12087304 24499390 28233496 20134247 7639795 -1298362 -6628973 -11380975 -14101139
37993 -14101139 -12082566 -8906880 -11752342 -21152123 -28893228 -27512520 -18148205 -7642698
37985 -7642698 -1205935 82980 -2734340 -7729524 -11734393 -11272656 -5204342 3744567
37977 3744567 10655376 12117620 8666383 3809002 1006310 1866025 6537056 14312577
37969 14312577 23315040 30715709 34234892 33145654 27734261 18859269 8614221 288523
37961B88523l878315M51153K365800J513070n60369j245879J262761N608825P765284
37952A3570853N275046p4331m897694p528882p257514l578528P42440k77092p436716
37943a1462418j1333686l274943J0485813J4687761N960369k432662k67911N830385
37935H192708N415487J463130L370923Q781688O127042n550525j2521810n704634
37927I574009O319187R426032J683801p432544j0336483p180437j555535L222188
37919C720218M539325K223610k27232M42629K798307L426976K983447N289750
37911B5197030J0485060J3804643J3023665J3107465J9554543K8629726K8630698
37904A52432830J2607566j2219968l0045253l1287524k0418775r404978n739576
$$ plain form
37961 288523 -3589792 -3138639 -772839 740231 179862 -1066017 196744 5805569 13570853
37952 13570853 18845899 18771568 13873874 6344992 -912522 -4491050 -3748610 -4025702 -11462418
37943 -11462418 -22796104 -26071047 -15585234 -897473 5062896 2630234 2362323 8192708
37935 8192708 13608195 15071325 18442248 27223936 33350978 27800453 15278643 9574009
37927 9574009 15893196 25319228 27003029 19570485 9234002 2053565 498030 3720218
37919 3720218 8259543 10483153 10255921 10698550 13496857 16923833 19907280 25197030
37911 25197030 35682090 49486733 62510398 75617863 95172406 123802132 152432830
37904 152432830 165040396 152820428 122775175 91487651 71068876 61663898 55924322
37897E5924322p908270j0136286q744015m499997j189973j872537m950212m867631
37889A1755401R90642P387548O885920j16289n569423m566597q57693L06081n43424
37880A5672166n83107o24895k388752l567263j762678p38715n540309j2384123
37872a1917676j1430892r96765Q669215R163095M616342L413178M996548K475694
37864H988739m566285q422577n062287k47842p85116n014114o378741l119076
37856b4607299N35065J479746J218828J786346K244410J100829m56343n9637K462977
37847a4295078N108173O214319N432093L049378q6267k605081l835486m104563
37839e122512k809675J790163Q615406J1844481O918334k504327p969734o462971
$$ plain form
37897 55924322 48016052 37879766 29135751 24635754 23445781 21573244 16623032 11755401
37889 11755401 12746043 20133591 27019511 26903222 21333799 16767202 15909509 16215590 15672166
37880 15672166 15089059 14464164 12075412 8508149 6745471 6006756 466447 -11917676
37872 -11917676 -23348568 -24345333 -15676118 -6513023 -1896681 1516497 6513045 8988739
37864 8988739 4422454 -4000123 -9062410 -9310252 -10095368 -15109482 -21488223 -24607299
37856 -24607299 -24072234 -22592488 -21373660 -19587314 -17342904 -16242075 -16698418 -16758055 -14295078
37847 -14295078 -9186905 -2972586 2459507 5508885 5422618 2817537 -1017949 -5122512
37839 -5122512 -7932187 -6142024 2473382 14317863 21236197 18731870 10762136 4299165
37831D299165k662315q25381m7853Q72762k9529l118966m371910j698623R00130
37822f682520M17156P95260N184824P294147k68993j1816792j3466335k528721
37814b1071974Q292573Q588927K587466l91952R45052K418962L059977M063142
37806H492173L848901R26880j945607k423632l440098p003444p446680P74912
37798h216595J1443527J2515963L298297m166722k674103Q17172k168706q089402
37790B759431p649216k63970N727132N145736J112739j661277k506917k496825
37782A66833j671509q74456k353217n560341n554689N22693P527438P798048K106050
37773B106850n07425M335639R192023N190332m517741q527852l026438L639026
$$ plain form
37831 4299165 1636850 811469 763616 1636378 1606849 -1512117 -5884027 -7582650 -6682520
37822 -6682520 -6265364 -5470104 -285280 7008867 6739874 -5076918 -18543253 -21071974
37814 -21071974 -12779401 -4190474 -1603008 -1994960 -1049908 1369054 4429031 8492173
37806 8492173 12341074 13267954 11322347 8898715 5458617 -1544827 -8991507 -8216595
37798 -8216595 3226932 15742895 19041192 14874470 12200367 13017539 10848833 2759431
37790 2759431 -4889785 -5153755 573377 5719113 6831852 5170575 2663658 166833
37782 166833 -1504676 -2379132 -4732349 -10292690 -15847379 -15324686 -7797248 800 2106850
37773 2106850 1599425 5935064 15127087 20317419 15799678 7271826 4245388 7884414
37765G884414L500919j086437l607348l326142l483732l765654j240161K917024
37757b207117L917709O94351k271127j262849K423215N400401O033800M365996
37749A7094379R73172k805850n099793m784014k121499J062446J459615k904253
37741B874203q369317p682057N15010P914641O840730P71936j448963J287503
37733B703686K984441K332847M116743Q085827O572562l067495j2333380j3082996
37725a687765q058328m380204k964194p59989J876816K945847L820928N981809
37717c225080O400239K516618j996223l196835m455398r882789j3893626p666236
37709c5399330N341640J1453177N756800j387380j80667N818616P906743N029430
$$ plain form
37765 7884414 11385333 10298896 6691548 3365406 -118326 -3883980 -5124141 -2207117
37757 -2207117 1710592 2404943 133816 -1129033 1294182 6694583 12728383 17094379
37749 17094379 18067551 15261701 10161908 5377894 3256395 4318841 5778456 2874203
37741 2874203 -5495114 -13177171 -12662161 -4747520 2093210 2865146 1416183 2703686
37733 2703686 5688127 8020974 12137717 20223544 26796106 23728611 11395231 -1687765
37725 -1687765 -9746093 -14126297 -17090491 -17850480 -15973664 -13027817 -9206889 -3225080
37717 -3225080 3175159 5691777 3695554 498719 -3956679 -13839468 -27733094 -35399330
37709 -35399330 -30057690 -18604513 -12847713 -14235093 -14415760 -8597144 -690401 4339029
37701D339029J577067j459457n555122q682992p484915l403395o20545N79795
37693b0710535K861307N626043N537104K751799J026082J319069O56822j665305
37685b597614k051009J117110L781192J850223k916505n984252o375338o325778
37677a9501971o270505l932260J726908Q209873J1352842Q462221Q74222n259426
37669d338096l269793N887732J2077364P025565m542584j0289915o183208j87547
37661c820482R73758N60952L195669N431059K359893k178595j326654K299378
37653G494978K77402o404555o854218K823002J2165413J0364694l38378j0063863
37645I464475j3016943q875905L55263Q755284Q293418p24055o777266k229995
$$ plain form
37701 4339029 5916096 4456639 -1098483 -9781475 -17266390 -20669785 -21290330 -20710535
37693 -20710535 -17849228 -12223185 -6686081 -3934282 -2908200 -1589131 -932309 -2597614
37685 -2597614 -4648623 -3531513 249679 2099902 -816603 -6800855 -13176193 -19501971
37677 -19501971 -25772476 -29704736 -27977828 -19767955 -8415113 47108 921330 -4338096
37669 -4338096 -7607889 -1720157 10357207 17382772 12840188 2550273 -3632935 -3820482
37661 -3820482 -2846724 -2285772 909897 6340956 8700849 6522254 5195600 7494978
37653 7494978 7772380 1367825 -5486393 -2663391 9502022 19866716 19528338 9464475
37645 9464475 -3552468 -12428373 -12073110 -3317826 4975592 4251537 -2525729 -4755724
37637d755724M472050R16847r735698j2539430k195975J0433249J3790203P824733
37629H210255p63679o697527p344569l340816n4248j915130m717805j074043O600919
37620a1096643Q313335K784197L3907M177218N828549j680510r821711p947394
37612i409052K84339M141254K307713R70657J051424q21436k462229O71231M728122
37603A462023K117632l941405k186945P956669J2871557M221614q695311j2185187
37595A620647n627065J013949J324615k529989n297836l580400K546939Q836914
37587a692226R636853M208655j765009l180478j502913j475676m271882o439165
37579f481841m211231K631545R884698J1623809N981684j791505m750799k339352
$$ plain form
37637 -4755724 -283674 633173 -9102525 -21641955 -23837930 -13404681 385522 8210255
37629 8210255 7446576 749049 -6595520 -9936336 -9990584 -11905714 -16623519 -17697562 -11096643
37620 -11096643 -2783308 889 34796 4212014 10040563 8360053 -1461658 -9409052
37612 -9409052 -9124713 -4983459 -2675746 -1705089 -653665 -1475101 -3937330 -3266099 1462023
37603 1462023 3579655 -361750 -2548695 5407974 18279531 22501145 13805834 1620647
37595 1620647 -4006418 -2992469 -1667854 -4197843 -9495679 -13076079 -10529140 -1692226
37587 -1692226 7944627 12153282 10388273 7207795 5704882 4229206 -42676 -6481841
37579 -6481841 -10693072 -8061527 1823171 13446980 19428664 17637159 12886360 10547008
37571A0547008L48479N33212Q5170J304j613052m743189o134577m606669k727097
37562h309411j716700n0505J606716M89007j488126J469295Q476690J0361565
37554A0838531L201231m605037m744548o19794O22643o8017J218079J332629l978880
37545C196837r349182o807321Q8232J482800j762662K97608Q328107J1058422
37537F532841L675845m301683m423536q53931k03942k14367L523766P663272O225440
37528A7623705K3448n892069r192925r009548l532874M970438Q601033L988834
37520G580042j559970r06071K123442R34176j264334K181197P174509L775979
37512B0038970o328843j0323460l628865L399753J929970l076211k981215J045746
$$ plain form
37571 10547008 10895487 11428699 11513869 11515173 9902121 5158932 -975645 -5582314 -8309411
37562 -8309411 -10026111 -10076616 -8469900 -7980893 -9469019 -7999724 476966 10838531
37554 10838531 14039762 9434725 4690177 4070383 4693026 4625009 5843088 7175717 3196837
37545 3196837 -6152345 -12959666 -12871434 -11388634 -13151296 -12853688 -4525581 6532841
37537 6532841 10208686 5907003 1483467 629536 425594 211227 3734993 11398265 17623705
37528 17623705 17647153 11755084 2562159 -6447389 -9980263 -5009825 3591208 7580042
37520 7580042 6020072 5114001 7237443 8171619 6907285 9088482 16262991 20038970
37512 20038970 13710127 3386667 -242198 3157555 5087525 2011314 -969901 75845
37504G5845K290025K00774j18671L021292O138284O443987M232373M13278l922597
37495A8774590o151153m265487k72013J645793K15271k362207m580824p123910
37487d119940r481678q218200j166339P837515J1387547O630743j140653n064482
37479c335487n220252o853578j0511237r581609n59517R369897J0629256M108303
37471a1954224q10268L21944K714573J791823l47285k41245J413996K743378L825252
37462e42056L471183j700856j0522811j4563502p970104L352465Q423634M895888
37454a5156159K36832O50466M899394Q930257J0683247R052591L103012n275461
37446A7124179j1200607j1532008p888234l787980p24610J905127M727971P337544
$$ plain form
37504 75845 2365870 2566644 2447973 5469265 11607549 18051536 22283909 22697187 18774590
37495 18774590 12623437 8357950 8085937 9731730 9947001 7584794 3003970 -4119940
37487 -4119940 -13601618 -21819818 -22986157 -15148642 -3761095 2869648 1728995 -3335487
37479 -3335487 -8555739 -15409317 -25920554 -35502163 -36061680 -26691783 -16062527 -11954224
37471 -11954224 -12764492 -12442548 -9727975 -7936152 -8283437 -8524682 -7110686 -4367308 -542056
37462 -542056 2929127 1228271 -9294540 -23858042 -31828146 -28475681 -20052047 -15156159
37454 -15156159 -14919327 -14268861 -9369467 -439210 10244037 19296628 22399640 17124179
37446 17124179 5923572 -5608436 -13496670 -17284650 -18009260 -16104133 -11376162 -4038618
37438d038618Q326940O193409J382043k894159l578913j370291K78360n85559
37430C713212l056721n745456p912803q173348m941073P48841N037777N298324
37422a5031247L111105K094073L634609N609731M906671Q81202l568826m892185
37414c254867l153860k033955l470394m204868j42371P123856J1414625R468967
37406A1747133M313193O82668j62894j41320j136969l246416m846980l977677
37398C230738r39699Q88488j062582m297269l817710R09949M889714M421251J575996
37389E798876J460o42026l040844o751126p702690l458697K933928N446519J491541
37380e923059m559984n526163K25674O335629O155076R00233k871316k068423
$$ plain form
37438 -4038618 4288322 10481731 11863774 8969615 5390702 4020411 4298771 3713212
37430 3713212 656491 -5088965 -13001768 -21175116 -26116189 -25367348 -20329571 -15031247
37422 -15031247 -11920142 -9826069 -6191460 -581729 4324942 5206144 1637318 -3254867
37414 -3254867 -6408727 -8442682 -11913076 -16117944 -16260315 -9136459 2278166 11747133
37406 11747133 16060326 16742994 16580100 16438780 15301811 12055395 7208415 3230738
37398 3230738 2291039 3179527 2116945 -2180324 -5998034 -5088085 -198371 4222880 5798876
37389 5798876 5800336 5158310 2117466 -4633660 -12336350 -15795047 -12861119 -7414600 -5923059
37380 -5923059 -10483043 -16009206 -15783532 -9447903 -3292827 -2392594 -5263910 -7332333
37372g332333Q58407L334521M816773L864822p86348n265348l134303M884252
37364A240443J0061208P409841J715883j674133m372430p660444n902022L807171
37356D625517J1977523Q148776j946281l398434M985015Q704231P48064p274742
37348B6569669l902261M062209K476608q642076j5920954j1721190k248947L066910
37340f260032K046560j673954m307343l995959j158236J570901K055094J615278
37332a0107691L113528O547142R036991Q693275O086823K588672l51616j241836
37324B4365288m22471p97640l993302p083883o142265j696685K521687M581275
37316A1332004M416422J059599n088752q793315n097197K253005M031387j894553
$$ plain form
37372 -7332333 -6473926 -3139405 1677368 5542190 4755842 -509506 -3643809 1240443
37364 1240443 11301651 18711492 20427375 18753242 14380812 6720368 818346 4625517
37356 4625517 16603040 24751816 22805535 19407101 24392116 33096347 33844411 26569669
37348 26569669 22667408 26729617 29206225 20564149 4643195 -7077995 -9326942 -6260032
37340 -6260032 -4213472 -5887426 -10194769 -14190728 -15348964 -13778063 -11722969 -10107691
37332 -10107691 -6994163 -447021 8589970 17283245 23370068 25958740 25607124 24365288
37324 24365288 23942817 23145177 19151875 12067992 5925727 4229042 6750729 11332004
37316 11332004 15748426 16808025 11719273 2925958 -2171239 81766 4113153 2218600
37308B218600p763746p404782l618885j056288J344360N918385J0079731J0490279
37300A0207654R032249Q580181O676991J72035o872261p568342l079459j317471
37292A5831577m632053o422923j980328L944565L929052k315563q547555r591965
37284i785193n483049P0190L160310K628893N42049p82030j315120j463924J09673
37275a2318201L586406N197251K088369j802683n99624L987795M931647J247923
37267F318883r52361N21483R17677j211244n20377M155653N349606j69282l766636
37258A0643402J310969P385674M026888n180883r516748q530663q870889q364449
37250a7096699P83112J4211078J7492238Q284484P64379L378691P001869K047568
$$ plain form
37308 2218600 -5545146 -12949928 -16568813 -17625101 -16280741 -10362356 -282625 10207654
37300 10207654 19239903 27820084 34497075 34669110 27796849 20228507 17149048 15831577
37292 15831577 11199524 4776601 2796273 6740838 10669890 8354327 -193228 -9785193
37284 -9785193 -15268242 -15198052 -12037742 -9408849 -8866800 -9648830 -10963950 -12427874 -12318201
37275 -12318201 -8731795 -3534544 -1446175 -3248858 -3848482 139313 5070960 6318883
37267 6318883 5366522 5888005 6805682 5594438 5074061 9229714 14579320 14410038 10643402
37258 10643402 11954371 19340045 23366933 18186050 8669302 138639 -8732250 -17096699
37250 -17096699 -16313587 -2102509 15389729 23674213 24438592 27817283 34819152 36866720
37242C6866720o431801r749776r630506j0719764r285444j206566O724248N699188
37234B266299p98844l240269j440717j807950l651401j086903M169154N010611
37226e80020K688656N198804J1740321J2056010L343299m859492o088585n104181
37218A8394812o097448m859531O92861L335177j574543o365158k850097L826179
37210D502252L715065j512982k257648K437923M007043n31491l799063n62766
37202E998333M173102L478597j663379n114605m034362r89671j2837k686676o410377
37193g261875o000781N82975Q158647R284978L530652k124567k916156j783535
37185A470338l064801n019999k689677M043505R461636Q808070L175337k540750
$$ plain form
37242 36866720 30434919 20685143 11054637 334873 -8950571 -10157137 -3432889 2266299
37234 2266299 1467455 -1772814 -3213531 -5021481 -8672882 -9759785 -5590631 -580020
37226 -580020 2108636 7307440 19047761 31103771 34447070 29587578 23498993 18394812
37218 18394812 12297364 7437833 8130694 11465871 9891328 3526170 676073 4502252
37210 4502252 8217317 6704335 4446687 6884610 10891653 10360162 6561099 5998333
37202 5998333 10171435 13650032 11986653 6872048 2837686 1848015 1835178 -851498 -7261875
37193 -7261875 -13262656 -12679681 -4521034 4763944 8294596 6170029 3253873 1470338
37185 1470338 -1594463 -6614462 -9304139 -5260634 4201002 13009072 16184409 13643659
37177A3643659m368774j652509L240802O536174N532389Q22542m011767n728424
37169A4014092m709588m346550o617594q875639o467867R95021P452388O246272
37161b309465j881747q280057n066466O062163J4876604J2957566K223834p672010
37153A0910422r577981m747606Q34835K836320L78263m804205q230137m939050
37145a7339139M097833J0484024Q214719K507139K443614O843163O221975j177429
37137B2295899n923541l268237j541331p683534j4003374r495282K457503R149407
37129h012490O990898L058825Q91425k587923o347368m407110K086233L943134
37121d384376j291548n014098k629374j236139n390117o581612K975776J5011653
$$ plain form
37177 13643659 9274885 7622376 10863178 17399352 22931741 23754283 19742516 14014092
37169 14014092 9304504 4957954 -1659640 -10535279 -17003146 -16008125 -8555737 -2309465
37161 -2309465 -4191212 -12471269 -17537735 -11475572 3401032 16358598 18582432 10910422
37153 10910422 1332441 -3415165 -2580330 255990 634253 -4169952 -12400089 -17339139
37145 -17339139 -13241306 -2757282 5457437 7964576 10408190 17251353 23473328 22295899
37137 22295899 16372358 13104121 11562790 3879256 -10124118 -19619400 -17161897 -8012490
37129 -8012490 -1021592 2037233 2928658 340735 -6006633 -10413743 -8327510 -4384376
37121 -4384376 -5675924 -10690022 -13319396 -14555535 -19945652 -26527264 -23551488 -8539835
37113h539835J5762082O252649l77948R78650K162682l070127r359109q278874
37105d469830N72287R975931J2315111N470465m895650r620103o182924k100935
37097A064352l562954n083892J386628J0606361Q829652n246196j6107278j1810244
37089a9923571J142171Q649011O506782Q05544k563721j940002K125380O839617
37081A641211Q072331N441693L069566K327927q64044p703109j1897673r093028
37073i005126m748664n372689p336583l194600M901175Q040797M780446K310434
37065i624810L466821K683532k898903p376881n392611o20545J80431k774398
37057b2357364k987043L584999J3533287J8862585J4187957K678088n793051n061455
$$ plain form
37113 -8539835 7222247 13474896 13096948 14075598 16238280 13168153 3809044 -4469830
37105 -4469830 -3897543 6078388 18393499 23863964 18968314 9348211 3165287 1064352
37097 1064352 -2498602 -7582494 -6195866 4410495 13240147 7993951 -8113327 -19923571
37089 -19923571 -18781400 -10132389 -3625607 -2820063 -5383784 -7323786 -5198406 1641211
37081 1641211 9713542 15155235 18224801 20552728 19688684 11985575 87902 -9005126
37073 -9005126 -13753790 -19126479 -26463062 -29657662 -24756487 -16715690 -11935244 -9624810
37065 -9624810 -6157989 -3474457 -6373360 -13750241 -19142852 -19763397 -19582966 -22357364
37057 -22357364 -25344407 -21759408 -8226121 10636464 24824421 27502509 21709458 16648003
37049A6648003M7908N90197m201562p170746m770304j169749j3288N34247K001155
37040B495861J668462j900631n067672m777041l069930k226890m34109L453182
37032i858768N603239K617564k600162n201831n178935n096093m464770j563637
37024b5743393J807372K512318J089131K41830L95100O60277J686679L583372
37016a3767314L924846J952385J285259L798633M908438Q38949l564624j709339
37008b332767L393062L274453k435842n825431l598117p96473o55793M8846K975310
36999e952752L995930Q91656j773333O9367L335141K676592k145661p122486q668942
36990a4694488n365403J080244N460771M339627K015177M829438R281616M997632
$$ plain form
37049 16648003 16695911 17286108 13084546 5913800 1143496 -26253 -39541 494706 2495861
37040 2495861 4164323 2263692 -2803980 -7581021 -10650951 -12877841 -13311950 -9858768
37032 -9858768 -4255529 -1637965 -4238127 -9439958 -14618893 -19714986 -24179756 -25743393
37024 -25743393 -23936021 -21423703 -20334572 -20092742 -19697642 -19037365 -17350686 -13767314
37016 -13767314 -9842468 -7890083 -6604824 -2806191 2102247 2941196 -623428 -2332767
37008 -2332767 1060295 4334748 1898906 -3926525 -7524642 -8321115 -8976908 -8928062 -5952752
36999 -5952752 -1956822 -1065166 -2838499 -2769132 566009 3242601 1096940 -6025546 -14694488
36990 -14694488 -20059891 -18979647 -13518876 -9179249 -7164072 -2334634 6946982 11944614
36982A1944614p850972j4744172o630842O154726Q594079J524657l290330k486890
36974f785130k744096n924774n802686n34797L240758J854691L92560K900899
$$ plain form
36982 11944614 4093642 -10650530 -17281372 -11126646 -2532567 -1007910 -4298240 -6785130
36974 -6785130 -9529226 -15454000 -21256686 -21791483 -18550725 -16696034 -16303474 -13402575
$$ [...]
##END NTUPLES=NMR SPECTRUM
##END=
