##TITLE=31Pdec_16-2025
 DMSO-d6, 24 sc
 28.1.2025
##JCAMPDX= 6.0         $$ Bruker NMR JCAMP-DX V2.0
##DATA TYPE= NMR SPECTRUM
##DATA CLASS= NTUPLES
##ORIGIN= UXNMR, Bruker Analytische Messtechnik GmbH
##OWNER= root
$$ XWIN-NMR		Version 3.5
$$ Tue Jan 28 14:56:07 2025 Russian Standard Time (UT+4h)  she@DPX200
##.OBSERVE FREQUENCY= 81.013821
##.OBSERVE NUCLEUS= ^31P
##.ACQUISITION MODE= SIMULTANEOUS
##.ACQUISITION SCHEME= undefined
##.AVERAGES= 24
##.DIGITISER RES= 17
##SPECTROMETER/DATA SYSTEM= spect
##.PULSE SEQUENCE= zgpg30
##.SOLVENT NAME= CDCl3
##.SHIFT REFERENCE= (INTERNAL, CDCl3, 0, 198.062)
##AUDIT TRAIL= $$ (NUMBER, WHEN, WHO, WHERE, WHAT)
$$ ##TITLE= Audit trail, XWIN-NMR		Version 3.5
$$ ##JCAMPDX= 5.01
$$ ##ORIGIN= Bruker BioSpin GmbH
$$ ##OWNER= she
$$ F:/spectra/data/she/nmr/P31/2/pdata/1/auditp.txt
$$ ##AUDIT TRAIL=  $$ (NUMBER, WHEN, WHO, WHERE, WHAT)
(   1,<2025-01-28 14:55:04.14 +0400>,<she>,<DPX200>,
      <created by zg, POWCHK disabled, PULCHK disabled
       configuration hash MD5:
       00 E9 B6 7A A2 85 ED C7 34 08 36 98 17 FE 4E 26
       data hash MD5: 32K
       5C AE B5 D0 10 67 2D 5A 8D 8C 2B 21 28 72 45 11>)
(   2,<2025-01-28 14:55:06.60 +0400>,<she>,<DPX200>,
      <Start of raw data processing
       efp BC_mod = 2 LB = 1.5 FT_mod = 6 PKNL = 1 PHC0 = 1049.227 PHC1 = 1748.69 SI = 64K 
       data hash MD5: 64K
       5C E6 C0 65 D5 EF B6 37 1F 2B 8F D9 7E 4D FA AF>)
(   3,<2025-01-28 14:55:29.64 +0400>,<she>,<DPX200>,
      <pk PHC0 = 494.7648 PHC1 = -1219.2 
       data hash MD5: 64K
       4C 4E BD 98 73 8A 12 A3 D4 95 5F 84 01 BC 57 87>)
(   4,<2025-01-28 14:55:32.90 +0400>,<she>,<DPX200>,
      <abs ABSG = 5 
       data hash MD5: 64K
       AA 38 7C E8 0C CA 66 2E B9 79 2A C8 B1 2C 7E 3D>)
$$ ##END=
$$ 
$$ hash MD5
$$ 84 AD B2 F3 BF 59 80 2D 18 1F 79 2B 24 AA 6F 86
##$RELAX= 
##$RELAX= 
##$RELAX= 
##$RELAX= 
##$RELAX= 
##$RELAX= 
##$RELAX= 
##$RELAX= 
$$ Bruker specific parameters
$$ --------------------------
##$DU= <F:/spectra>
##$EXPNO= 2
##$NAME= <P31>
##$PROCNO= 1
##$TYPE= <nmr>
##$USER= <she>
##$AMP= (0..31)
100 100 100 100 100 100 100 100 100 100 100 100 100 100 100 100 100 100 
100 100 100 100 100 100 100 100 100 100 100 100 100 100 
##$AQSEQ= 0
##$AQ_mod= 1
##$AUNM= <au_zg>
##$AUTOPOS= <>
##$BF1= 81.014009
##$BF2= 200.13
##$BF3= 200.13
##$BF4= 200.13
##$BF5= 200.13
##$BF6= 200.13
##$BF7= 200.13
##$BF8= 200.13
##$BYTORDA= 1
##$CFDGTYP= 0
##$CFRGTYP= 5
##$CHEMSTR= <none>
##$CNST= (0..31)
1 1 145 1 1 1 1 1 1 1 1 1 1 1 1 1 1 1 1 1 1 1 1 1 1 1 1 1 1 1 1 1 
##$CPDPRG= <waltz16>
##$CPDPRG1= <>
##$CPDPRG2= <waltz16>
##$CPDPRG3= <>
##$CPDPRG4= <mlev>
##$CPDPRG5= <mlev>
##$CPDPRG6= <mlev>
##$CPDPRG7= <mlev>
##$CPDPRG8= <mlev>
##$CPDPRGB= <>
##$CPDPRGT= <>
##$D= (0..31)
0 1 0 0 0 0 0 0 0 0.06 0 0.03 2e-05 3e-06 0 0 0.0002 0 0 0 0 0 0 0 0 0 
0 0 0 0 0 0 
##$DATE= 1738061703
##$DBL= (0..7)
120 120 120 11 120 120 24 19 
##$DBP= (0..7)
150 150 150 150 150 150 150 150 
##$DBP07= 0
##$DBPNAM0= <>
##$DBPNAM1= <>
$$ [...]
##$SUBNAM3= <"">
##$SUBNAM4= <"">
##$SUBNAM5= <"">
##$SUBNAM6= <"">
##$SUBNAM7= <"">
##$SUBNAM8= <"">
##$SUBNAM9= <"">
##$SW= 400.765351723535
##$SWIBOX= (0..15)
0 1 3 0 0 0 0 0 0 0 0 0 0 0 0 0 
##$SW_h= 32467.5324675325
##$TD= 32768
##$TD0= 1
##$TE= 0
##$TE2= 300
##$TE3= 300
##$TEG= 300
##$TL= (0..7)
0 120 53 12 22 120 120 120 
##$TP= (0..7)
150 150 150 150 150 150 150 150 
##$TP07= 0
##$TPNAME0= <>
##$TPNAME1= <>
##$TPNAME2= <>
##$TPNAME3= <>
##$TPNAME4= <>
##$TPNAME5= <>
##$TPNAME6= <>
##$TPNAME7= <>
##$TPOAL= (0..7)
0.5 0.5 0.5 0.5 0.5 0.5 0.5 0.5 
##$TPOFFS= (0..7)
0 0 0 0 0 0 0 0 
##$TUNHIN= 0
##$TUNHOUT= 0
##$TUNXOUT= 0
##$USERA1= <user>
##$USERA2= <user>
##$USERA3= <user>
##$USERA4= <user>
##$USERA5= <user>
##$V9= 5
##$VALIST= <valist>
##$VCLIST= <CCCCCCCCCCCCCCC>
##$VD= 0
##$VDLIST= <DDDDDDDDDDDDDDD>
##$VPLIST= <PPPPPPPPPPPPPPP>
##$VTLIST= <TTTTTTTTTTTTTTT>
##$WBST= 1024
##$WBSW= 4
##$XGAIN= (0..3)
0 0 0 0 
##$XL= 0
##$YL= 0
##$YMAX_a= 10907
##$YMIN_a= -3626
##$ZGOPTNS= <>
##$ZL1= 120
##$ZL2= 120
##$ZL3= 120
##$ZL4= 120
##$ABSF1= 198.0616
##$ABSF2= -202.7028
##$ABSG= 5
##$ABSL= 3
##$ALPHA= 0
##$AQORDER= 0
##$ASSFAC= 0
##$ASSFACI= 0
##$ASSFACX= 0
##$ASSWID= 0
##$AUNMP= <proc_1d>
##$AZFE= 0.1
##$AZFW= 0.5
##$BCFW= 0
##$BC_mod= 2
##$BYTORDP= 0
##$COROFFS= 0
##$CY= -3
##$DATMOD= 1
##$DC= 0
##$DFILT= <>
##$DTYPP= 0
##$F1P= 0
##$F2P= 0
##$FCOR= 1
##$FTSIZE= 65536
##$FT_mod= 6
##$GAMMA= 0
##$GB= 0
##$INTBC= 1
##$INTSCL= 9.790993e-09
##$ISEN= 30
##$LB= 1.5
##$LEV0= 0
##$LPBIN= 0
##$MAXI= 10000
##$MC2= 0
##$MEAN= 0
##$ME_mod= 0
##$MI= 50
##$NCOEF= 0
##$NC_proc= -9
##$NLEV= 6
##$NOISF1= 182.463
##$NOISF2= 159.3651
##$NSP= 0
##$NTH_PI= 0
##$NZP= 0
##$OFFSET= 198.0616
##$PC= 4
##$PHC0= 1543.992
##$PHC1= 529.49
##$PH_mod= 1
##$PKNL= yes
##$PPARMOD= 0
##$PSCAL= 0
##$PSIGN= 0
##$REVERSE= no
##$SF= 81.0140089999434
##$SI= 65536
##$SIGF1= 159.3651
##$SIGF2= -187.1042
##$SINO= 113.3802
##$SIOLD= 16384
##$SREGLST= <1H.CDCl3>
##$SSB= 0
##$STSI= 65536
##$STSR= 0
##$SW_p= 32467.5324675325
##$SYMM= 0
##$S_DEV= 0
##$TDeff= 32768
##$TDoff= 0
##$TI= <>
##$TILT= no
##$TM1= 0
##$TM2= 0
##$TOPLEV= 0
##$USERP1= <user>
##$USERP2= <user>
##$USERP3= <user>
##$USERP4= <user>
##$USERP5= <user>
##$WDW= 1
##$XDIM= 65536
##$YMAX_p= 391992780
##$YMIN_p= -88954345
$$ End of Bruker specific parameters
$$ ---------------------------------
##NTUPLES= NMR SPECTRUM
##VAR_NAME=  FREQUENCY,     SPECTRUM/REAL,   SPECTRUM/IMAG
##SYMBOL=    X,             R,               I
##VAR_TYPE=  INDEPENDENT,   DEPENDENT,       DEPENDENT
##VAR_FORM=  AFFN,          ASDF,            ASDF
##VAR_DIM=   65536,         65536,           65536
##UNITS=     HZ,            ARBITRARY UNITS, ARBITRARY UNITS
##FACTOR=    0.49542278885378, 1,            1
##FIRST=     16045.7642231865, 0,            0
##LAST=      -16421.768244346, 0,            0
##MIN=       -16421.768244346, -88954345,    0
##MAX=       16045.7642231865, 391992780,    0
$$ Real data points
##PAGE= N=1
##DATA TABLE= (X++(R..R)), XYDATA
$$ [...]
$$ plain form
37606 5706013 5091215 4211470 2305478 -174126 -997719 938280 4447572 7861429 9999739
37597 9999739 9714074 6802659 3249351 1296264 309102 -2319625 -7162653 -11649913
37589 -11649913 -12942339 -10219056 -4572025 1513950 5335005 6764570 8883861 13352642
37581 13352642 16617436 14285840 8129122 4222613 4459491 5021001 3892040 4245203
37573 4245203 8131164 11993414 11934428 9300463 7115022 4481573 -880790 -7027395
37565 -7027395 -9660091 -8518357 -7553501 -9085509 -11431581 -12172506 -10544131 -6752387
37557 -6752387 -2000537 948797 372225 -1236766 236870 4586622 7354619 6383123
37549 6383123 4460917 3938523 2642389 -1825138 -6700109 -7147188 -3560107 -1647081
$$ packed form
37606E706013o14798q79745j905992k479604q23593J935999L509292L413857K138310
37597I999739k85665k911415l553308j953087r87162k628727m843028m487260
37589a1649913j292426K723283N647031O085975L821055J429565K119291M468781
37581A3352642L264794k331596o156718l906509K36878N61510j128961L53163
37573D245203L885961L862250n8986k633965k185441k633449n362363o146605
37565g027395k632696J141734R64856j532008k346072p40925J628375L791744
37557f752387M751850K949334n76572j608991J473636M349752K767997r71496
37549F383123j922206n22394j296134m467527m874971m47079L587081J913026
$$ plain form
37541 -1647081 -4947732 -10784445 -14748671 -16014622 -16105933 -15020926 -11878174 -8247627
37533 -8247627 -7288942 -9338585 -11283834 -10893251 -8859291 -5719166 -379347 6093528
37525 6093528 8764516 4748891 -1460259 -3014028 173823 1978440 -747094 -4634017
37517 -4634017 -6188816 -6664376 -8453943 -10810892 -11896692 -11900375 -11517715 -10151565 -8137009
37508 -8137009 -7966594 -10560838 -12888366 -12112953 -9584734 -7749125 -5841918 -2403630
37500 -2403630 295685 -1145992 -5510876 -8160009 -7443019 -6030339 -6225096 -7708404
37492 -7708404 -9792982 -12170268 -13154194 -10645514 -5392377 -389448 3159023 6344402
37484 6344402 9129871 9926856 9013852 8873854 10236138 10952352 9740502 7941282 6537021
$$ packed form
37541a647081l300651n836713l964226j265951r1311J085007L142752L630547
37533h247627R58685k049643j945249L90583K033960L140125N339819O472875
37525F093528K670988m015625o209150j553769L187851J804617k725534l886923
37517d634017j554799m75560j789567k356949j085800l683L82660J366150K014556
37508h137009J70415k594244k327528P75413K528219J835609J907207L438288
37500b403630K699315j441677m364884k649133P16990J412680j94757j483308
37492g708404k084578k377286r83926K508680N253137N002929L548471L185379
37484F344402K785469P96985r13004j39998J362284P16214j211850j799220j404261
$$ plain form
37475 6537021 4597158 2004029 646981 1252703 1757771 504732 -1507758 -3164347
37467 -3164347 -5263387 -7990042 -8988336 -6574927 -3022103 -2037063 -4102975 -6376111
37459 -6376111 -6239606 -3383716 454620 2344412 97349 -5090575 -9200011 -9993522
37451 -9993522 -9571944 -10784382 -12800631 -12491684 -9162060 -5605954 -4680602 -6387971 -8257609
37442 -8257609 -7752194 -4633902 -1306225 -116179 -580662 -878791 -1539536 -4580136 -8719957
37433 -8719957 -9534679 -6145858 -3691343 -6202105 -10783792 -12767903 -13133525 -15520514
37425 -15520514 -18306204 -16146212 -9104920 -4036712 -5420197 -9782531 -11265766 -8657337
37417 -8657337 -4609010 -1371830 -3489 -1210214 -4255408 -6669612 -7096480 -6999219 -8022155
$$ packed form
37475F537021j939863k593129j357048O05722N05068j253039k012490j656589
37467c164347k099040k726655r98294K413409L552824R85040k065912k273136
37459f376111J36505K855890L838336J889792k247063n187924m109436p93511
37451i993522M21578j212438k016249L08947L329624L556106R25352j707369j869638
37442h257609N05415L118292L327677J190046m64483k98129o60745l040600m139821
37433h719957q14722L388821K454515k510762m581687j984111l65622k386989
37425a5520514k785690K159992P041292N068208j383485m362334j483235K608429
37417h657337M048327L237180J368341j206725l045194k414204m26868R7261j022936
$$ plain form
37408 -8022155 -9424681 -9824039 -9693321 -10058605 -10085950 -8176102 -4709126 -1747370 -263713
37399 -263713 902703 3293472 6667684 8465642 5742229 -1185598 -7415910 -8020215
37391 -8020215 -4105835 -1483376 -2539320 -3141441 187942 3939513 2616318 -2610329
37383 -2610329 -5521079 -4117417 -2668050 -3853317 -4322987 -566939 5057342 7689768
37375 7689768 6614275 4914656 4231435 3588263 2752794 3174952 5141571 6832222 7136929
37366 7136929 7219315 8133127 8720690 7494798 5496451 5444739 8160961 11204991 11467689
37357 11467689 8342306 3865864 274969 -1838250 -3095620 -4066910 -5047624 -6407217
37349 -6407217 -8051215 -8722945 -7116802 -3928157 -1491914 -847556 -596581 360279 507439
$$ packed form
37408h022155j402526l99358J30718l65284k7345J909848L466976K961756J483657
37399b63713J166416K390769L374212J797958k723413o927827o230312o04305
37391h020215L914380K622459j055944o02121L329383L751571j323195n226647
37383b610329k910750J403662J449367j185267m69670L756048N624281K632426
37375G689768j075493j699619o83221o43172q35469M22158J966619J690651L04707
37366G136929Q2386R13812N87563j225892j998347n1712K716222L044030K62698
37357A1467689l125383m476442l590895k113219j257370r71290r80714j359593
37349f407217j643998o71730J606143L188645K436243O44358K50975R56860J47160
$$ plain form
37340 507439 -2102966 -6355002 -8823109 -7636025 -3743809 1243746 6316047 10293572
37332 10293572 12195624 12688557 12882136 11431087 5739196 -2970845 -8886134 -7894873
37324 -7894873 -2287495 2737332 4731789 3928765 578144 -3908043 -5368241 -1097936
37316 -1097936 5164016 6917030 3459290 450459 1680729 4985267 7554011 10469152
37308 10469152 15253345 19675164 20340414 17050247 11832243 5937958 518580 -2066451
37300 -2066451 -840636 1636392 2777106 3932984 7625758 12590194 15544942 16681393
37292 16681393 18852656 21652087 21171757 16466767 11565044 9180050 6669882 1087287
37284 1087287 -5276619 -8091000 -7324407 -6303622 -5774329 -3354025 935249 2888361
$$ packed form
37340E07439k610405m252036k468107J187084L892216M987555N072301L977525
37332A0293572J902052M92933J93579j451049n691891q710041n915289R91261
37324g894873N607378N024827J994457q03024l350621m486187j460198M270305
37316a097936O261952J753014l457740l008831J230270L304538K568744K915141
37308A0469152M784193M421819O65250l290167n218004n894285n419378k585031
37300b066451J225815K477028J140714J155878L692774M964436K954748J136451
37292A6681393K171263K799431m80330m704990m901723k384994k510168n582595
37284A087287o363906k814381P66593J020785N29293K420304M289274J953112
$$ plain form
37276 2888361 -211511 -5123641 -6602479 -4259279 -2495526 -3877776 -5579230 -3677977
37268 -3677977 1156218 4557795 4216688 2249810 1545540 2074737 2123132 1376071 704854
37259 704854 -209324 -2684384 -6365587 -8749616 -8124337 -5587977 -3283837 -1737633 -34644
37250 -34644 2051567 3364728 2826480 790251 -1346062 -2540691 -2904847 -3216894 -3820800
37241 -3820800 -4127781 -3253893 -1100496 1237645 2173006 971951 -1305466 -2359781 -579015
37232 -579015 3574136 8288491 12009192 13668928 12142579 7198742 969079 -3444994
37224 -3444994 -5330380 -6403178 -6890000 -4325160 1788606 6766452 5732396 603845
37216 603845 -1908351 576626 2938626 45166 -5888342 -8203488 -4232692 2227551
$$ packed form
37276B888361l099872m912130j478838K343200J763753j382250j701454J901253
37268c677977M834195L401577l41107j966878p04270N29197M8395p47061o71217
37259G04854r14178k475060l681203k384029O25279K536360K304140J546204J702989
37250c4644K086211J313161n38248k036229k136313j194629l64156l12047o03906
37241c820800l06981Q73888K153397K338141R35361j201055k277417j054315J780766
37232e79015M153151M714355L720701J659736j526349m943837o229663m414073
37224c444994j885386j072798m86822K564840O113766M977846j034056n128551
37216F03845k512196K484977K362000k893460n933508k315146L970796O460243
$$ plain form
37208 2227551 6388075 7513555 7624949 7315495 5051700 418945 -3894679 -4625214 -1745729
37199 -1745729 1594055 2778412 1985359 644354 -644697 -1880562 -2841549 -3561590 -4437175
37190 -4437175 -4990146 -3985427 -1759655 -590267 -1360613 -1938399 -736622 433608 -379455
37181 -379455 -1562567 -864056 332522 132016 1528992 8669382 18121355 20603558 13110979
37172 13110979 3235514 -1397158 -2283218 -4604547 -7822685 -7567364 -3883838 -1393481
37164 -1393481 -2124641 -3405775 -2961374 -1729064 -980457 -234311 1027184 2361257 3895436
37155 3895436 6423168 9162980 9655752 7058087 3984787 3901686 7386742 11498884 12430994
37146 12430994 8946356 3840180 1615825 3936419 7845155 9178423 6941307 3504647
$$ packed form
37208B227551M160524J125480J11394l09454k263795m632755m313624p30535K879485
37199a745729L339784J184357p93053j341005j289051j235865r60987p20041q75585
37190d437175n52971J004719K225772J169388p70346n77786J201777J170230q13063
37181c79455j183112O98511J196578k00506J396976P140390R451973K482203p492579
37172A3110979r875465m632672q86060k321329l218138K55321L683526K490357
37164a393481p31160j281134M44401J232310P48607P46146J261495J334073J534179
37155C895436K527732K739812M92772k597665l073300q3101L485056M112142R32110
37146A2430994l484638n106176k224355K320594L908736J333268k237116l436660
$$ plain form
37138 3504647 1661131 2770228 6609361 11226326 13593382 12172877 8633600 5907910
37130 5907910 5163645 5743680 7032184 8830587 10590376 11585816 11188662 8287837 2069080
37121 2069080 -5517700 -10249780 -10432612 -9078606 -9238042 -9785372 -8715585 -7681186 -8947044
37112 -8947044 -10116452 -7242821 -2063796 -344014 -3018738 -4928407 -3468043 -2523227
37104 -2523227 -5250943 -8231129 -6614217 -1280594 3206738 5249294 6935786 9576052
37096 9576052 11802279 11592006 8190774 2724515 -2012479 -3790284 -3765871 -4957826 -7137171
37087 -7137171 -6393384 -1490355 2822417 1714424 -3406759 -7790455 -9977988 -11584691
37079 -11584691 -12368002 -10125890 -5121731 -696702 829073 -31000 -2103238 -4605392
$$ packed form
37138C504647j843516J109097L839133M616965K367056j420505l539277k725690
37130E907910p44265N80035J288504J798403J759789R95440l97154k900825o218757
37121B069080p586780m732080j82832J354006j59436n47330J069787J034399j265858
37112h947044j169408K873631N179025J719782k674724j909669J460364R44816
37104b523227k727716k980186J616912N333623M487332K042556J686492K640266
37096I576052K226227k10273l401232n466259m736994j777805K4413j191955k179345
37087g137171P43787M903029M312772j107993n121183m383696k187533j606703
37079a1584691p83311K242112N004159M425029J525775q60073k072238k502154
$$ plain form
37071 -4605392 -5997420 -4720402 -1622674 630145 922256 532856 684163 1336179 2287167
37062 2287167 3271020 3100302 996793 -1414633 -1890436 -1071901 -1334754 -2271164 -827379
37053 -827379 3465500 7204765 8579179 10324693 14479893 17327193 13523498 3859294
37045 3859294 -4971977 -8231554 -7522283 -6818248 -7107674 -6590883 -4207208 -745390 2890576
37036 2890576 6490448 9362199 10059041 8408256 6812154 7876143 10803090 11736107
37028 11736107 8319385 2739725 -581919 619718 5118137 10062792 12965190 12738900
37020 12738900 10174698 6941936 3345934 -1723496 -7534039 -10256010 -7591937 -3288587
37012 -3288587 -3505013 -8860650 -13623325 -13373489 -9928567 -7248031 -5849331 -3829392
$$ packed form
37071d605392j392028J277018L097728K252819K92111l89400J51307O52016R50988
37062B287167R83853j70718k103509k411426m75803Q18535k62853r36410J443785
37053h27379M292879L739265J374414J745514M155200K847300l803695r664204
37045C859294q831271l259577P09271P04035k89426N16791K383675L461818L635966
37036B890576L599872K871751O96842j650785j596102J063989K926947R33017
37028A1736107l416722n579660l321644J201637M498419M944655K902398k26290
37020A2738900k564202l232762l596002n069430n810543k721971K664073M303350
37012c288587k16426n355637m762675K49836L444922K680536J398700K019939
$$ plain form
37004 -3829392 -1059680 592050 153360 -1561056 -3175454 -3328781 -1282488 1360378
36996 1360378 1106624 -2975064 -6623061 -5038773 682057 4967547 5352447 4998049 6759589
36987 6759589 8395180 6254962 1472278 -809109 2031598 6927839 8973271 6620646
36979 6620646 2196673 -1430558 -3284215 -3775386 -3282719 -2024638 -738543 -473521 -1552782
36970 -1552782 -3349820 -5236637 -7057193 -8327426 -7780095 -4568641 347452 4704793
36962 4704793 6744456 6218894 4096135 1857807 630808 313588 -25185 -304864 1091787
36953 1091787 4794354 8332403 8583108 6036518 4194359 4273663 3150622 -1935055 -8850647
36944 -8850647 -12957089 -12524621 -9347682 -5118314 -201429 4229095 6022023 4932609
$$ packed form
37004c829392K769712J651730m38690j714416j614398j53327K046293K642866
36996A360378k53754m081688l647997J584288N720830M285490L84900l54398J761540
36987F759589J635591k140218m782684k281387K840707M896241K045432k352625
36979F620646m423973l627231j853657m91171M92667J258081J286095K65022j079261
36970a552782j797038j886817j820556j270233N47331L211454M916093M357341
36962D704793K039663n25562k122759k238328j226999l17220l38773k79679J396651
36953A091787L702567L538049K50705k546590j842159P9304j123041n085677o915592
36944h850647m106442M32468L176939M229368M916885M430524J792928j089414
$$ plain form
36936 4932609 3260568 2476356 1252081 -1917402 -6043600 -9014807 -9888670 -8401715
36928 -8401715 -4305915 658585 2156585 -2209475 -8724278 -11066207 -7604037 -2283730
36920 -2283730 1213020 2536374 1879276 -1395843 -5714311 -6914481 -3632067 85342
36912 85342 485442 -567256 343712 1544738 -1206115 -6761363 -8867590 -5289397 -1604181
36903 -1604181 -3474042 -8875887 -11214159 -7865680 -2362990 832301 738637 -906005
36895 -906005 -2428640 -3363045 -3913089 -4206439 -4166740 -3956423 -4067274 -4461033 -4133088 -2557881
36885 -2557881 -1134252 -1647535 -3401402 -3754903 -1796655 605542 2095740 3769598
36877 3769598 6326841 7552122 5130313 671498 -1778023 -817877 1164797 1975210
$$ packed form
36936D932609j672041p84212j224275l169483m126198k971207q73863J486955
36928h401715M095800M964500J498000m366060o514803k341929L462170N320307
36920b283730L496750J323354o57098l275119m318468j200170L282414L717409
36912H5342M00100j052698R10968J201026k750853n555248k106227L578193L685216
36903a604181j869861n401845k338272L348479N502690L195291r3664j644642
36895i06005j522635r34405n50044k93350L9699K10317j10851l93759L27945J575207
36885b557881J423629n13283j753867l53501J958248K402197J490198J673858
36877C769598K557243J225281k421809m458815k449521R60146J982674Q10413
$$ plain form
36869 1975210 2322236 3680572 5251135 4609492 939969 -3415312 -4969841 -2643359
36861 -2643359 825221 1454238 -1869721 -6488778 -9310171 -9808215 -8937760 -6637258 -2527216
36852 -2527216 1399052 1306177 -4152465 -11334884 -14799118 -12803184 -8835755 -7485085
36844 -7485085 -9254028 -10242452 -7371675 -2965877 -2345313 -6699017 -10622742 -8386420
36836 -8386420 -1079042 4810950 5167692 1977195 -760311 -2056535 -3508516 -5742245
36828 -5742245 -7387795 -7305724 -6425389 -6900763 -9725446 -13361411 -14938925 -13069064 -9232323
36819 -9232323 -6009747 -4333232 -3103280 -1089924 1718116 4481051 6388367 7350525
36811 7350525 8491649 11372538 15682407 18459272 17274591 13753010 11864397 12686353
$$ packed form
36869A975210L47026J358336J570563o41643l669523m355281j554529K326482
36861b643359L468580O29017l323959m619057k821393m98044Q70455K300502M110042
36852b527216L926268r2875n458642p182419l464234J995934L967429J350670
36844g485085j768943r88424K870777M405798O20564m353704l923725K236322
36836h386420P307378N889992L56742l190497k737506j296224j451981k233729
36828e742245j645550Q2071Q80335m75374k824683l635965j577514J869861L836741
36819i232323L222576J676515J229952K013356K808040K762935J907316R62158
36811G350525J141124K880889M309869K776865j184681l521581j888613Q21956
$$ plain form
36803 12686353 13117281 10369733 5526341 1578792 -5710 667421 3306035 6716669
36795 6716669 8015434 5071510 -462798 -4432034 -4534422 -2057157 506628 1979182
36787 1979182 2451552 2141859 1028193 -846029 -2917789 -3913136 -2838102 -741525 -397248
36778 -397248 -2905203 -5565062 -5096636 -2447905 -1882433 -4982919 -8220443 -7727391 -4102554
36769 -4102554 -396731 2752538 6833015 10878599 10728284 4334171 -4405618 -9297188
36761 -9297188 -8533020 -5846625 -5186833 -6156387 -5571183 -2264660 1190095 1486177 -1825980
36752 -1825980 -6240123 -9074512 -9486943 -7860525 -4299236 1269383 7590790 11725176
36744 11725176 11116617 6077171 -265069 -4695481 -6408131 -6797222 -7222651 -7424821 -6167019
$$ packed form
36803A2686353M30928k747548m843392l947549j584502O73131K638614L410634
36795F716669J298765k943924n534308l969236j02388K477265K563785J472554
36787A979182M72370l09693j113666j874222k071760r95347J075034K096577L44277
36778c97248k507955k659859M68426K648731N65472l100486l237524M93052L624837
36769d102554L705823L149269M080477M045584j50315o394113q739789m891570
36761i297188P64168K686395O59792r69554N85204L306523L454755K96082l312157
36752a825980m414143k834389m12431J626418L561289N568619O321407M134386
36744A1725176o08559n039446o342240m430412j712650l89091m25429k02170J257802
$$ plain form
36735 -6167019 -3134568 180213 1752840 1136689 -62949 48810 1864958 4493598
36727 4493598 7024844 8758393 8750439 6493531 3107876 653117 28291 639883 2133823
36718 2133823 4750658 7498619 8027360 5637676 2737017 1681401 1644450 440099 -2046904
36709 -2046904 -4518465 -6919559 -9518479 -10360321 -7252396 -2219659 -263800 -2851688
36701 -2851688 -5964740 -5787324 -3096981 -493414 1364481 2474480 1542318 -1616031
36693 -1616031 -3981068 -2838570 257601 2017762 2251573 2828620 3294681 1625164 -1117848
36684 -1117848 -1065245 2904429 7414071 9391207 9538437 9736183 9751010 8290704 5418093
36675 5418093 2331009 42180 -746693 181422 1768593 2456944 2233292 2321549 2610826
$$ packed form
36735f167019L032451L314781J572627o16151j199638J11759J816148K628640
36727D493598K531246J733549p954k256908l385655k454759o24826O11592J493940
36718B133823K616835K747961N28741k389684k900659j055616l6951j204351k487003
36709b046904k471561k401094k598920q41842L107925N032737J955859k587888
36701b851688l113052J77416K690343K603567J857895J109999r32162l158349
36693a616031k365037J142498L096171J760161K33811N77047M66061j669517k743012
36684a117848N2603L969674M509642J977136J47230J97746J4827j460306k872611
36675E418093l087084k288829p88873R28115J587171O88351k23652Q8257K89277
$$ plain form
36666 2610826 1547102 -888725 -2588399 -2710295 -3119163 -4945337 -6123629 -4310346
36658 -4310346 -266646 3595249 6115818 6891514 5142064 1803874 860335 5175618
36650 5175618 11851240 14806309 11517051 4559092 -2645773 -8255093 -10612207 -8426499
36642 -8426499 -3378339 536410 1539155 1523071 2139508 2356731 1431391 1423861 4239723
36633 4239723 8031045 9170898 6861050 3660635 2175068 3068685 5605855 8195113
36625 8195113 8873512 7203009 5504621 6378135 8994346 9684954 6587262 2056769 -263830
36616 -263830 461049 1909783 1436449 -1619690 -5924287 -9589969 -11585422 -12001161 -11104180
36607 -11104180 -8653018 -4717845 -674285 1832399 2954683 4346797 6368883 7091051
$$ packed form
36666B610826j063724k435827j699674j21896m08868j826174j178292J813283
36658d310346M043700L861895K520569P75696j749450l338190r43539M315283
36650E175618O675622K955069l289258o957959p204865n609320k357114K185708
36642h426499N048160L914749J002745j6084O16437K17223r25340p530K815862
36633D239723L791322J139853k309848l200415j485567Q93617K537170K589258
36625H195113O78399j670503j698388Q73514K616211O90608l097692m530493k320599
36616b63830P24879J448734m73334l056139m304597l665682j995453m15739Q96981
36607a1104180K451162L935173M043560K506684J122284J392114K022086P22168
$$ plain form
36599 7091051 5277159 3140210 4107361 8004806 10500942 8160729 2629165 -1427904
36591 -1427904 -1665570 25288 490353 -1304438 -3963830 -5387180 -4340897 -1462015
36583 -1462015 659858 -460534 -4026558 -5790774 -2554585 3598186 7183415 5459796
36575 5459796 1096435 -1650899 -1686699 -966651 -1153410 -2139121 -3209542 -3842891 -3449739
36566 -3449739 -2067062 -1567208 -4251904 -9195261 -11676251 -8188491 -1197103 3358344
36558 3358344 3336810 2776739 5944767 11135334 12641318 7928377 358220 -5198579 -7046580
36549 -7046580 -6282674 -4113614 -1396999 451340 181749 -1804815 -3915872 -5096202
36541 -5096202 -5272025 -4697184 -3878893 -3427991 -2805981 -137900 5135148 10325890 12302185
$$ packed form
36599G091051j813892k136949R67151L897445K496136k340213n531564m057069
36591a427904k37666J690858M65065j794791k659392j423350J046283K878882
36583a462015K121873j120392l566024j764216L236189O152771L585229j723619
36575E459796m363361k747334l5800P20048j86759r85711j070421o33349L93152
36566c449739J382677M99854k684696m943357k480990L487760O991388M555447
36558C358344k1534n60071L168028N190567J505984m712941p570157n556799j848001
36549g046580P63906K169060K716615J848339k69591j986564k111057j180330
36541e096202j75823N74841Q18291M50902O22010K668081N273048N190742J976295
$$ plain form
36532 12302185 11541077 10937866 11128648 10204670 8144421 7555172 8602480 7252823 1489940
36523 1489940 -4025860 -3572434 1390377 4089233 1731786 -1676364 -2224586 -1435246 -2962571
36514 -2962571 -7285372 -12041444 -15456953 -17106185 -16615149 -13747964 -9293157 -4632259
36506 -4632259 -916151 897558 551892 -205066 1425367 5597720 8591773 7121294
36498 7121294 2783880 175894 1203896 3370524 3629181 2015647 975320 2410368
36490 2410368 5997701 9733865 11794412 12116369 11988029 11965090 11050584 8491484 5245276
36481 5245276 2571476 244467 -2401177 -4693045 -5765828 -6654466 -8906977 -11409332
36473 -11409332 -11119828 -7312533 -2828375 -529879 -606315 -1961397 -3876878 -5234064
$$ packed form
36532A2302185p61108o03211J90782r23978k060249n89249J047308j349657n762883
36523A489940n515800M53426M962811K698856k357447l408150n48222P89340j527325
36514b962571m322801m756072l415509j649232M91036K867185M454807M660898
36506d632259L716108J813709l45666p56958J630433M172353K994053j470479
36498G121294m337414k607986J028002K166628K58657j613534j040327J435048
36490B410368L587333L736164K060547L21957j28340k2939r14506k559100l246208
36481E245276k673800k327009k645644k291868j072783q88638k252511k502355
36473a1409332K89504L807295M484158K298496p6436j355082j915481j357186
$$ plain form
36465 -5234064 -4488575 -2089803 -921172 -2458283 -4305680 -3685152 -1634289 -1045397 -1878805
36456 -1878805 -1621192 44058 688085 -155849 735377 5381415 10480250 10766226 5372010
36447 5372010 -1380073 -5047404 -4961051 -3157262 -1478828 -644119 -827740 -1581572 -1360028
36438 -1360028 1423228 6103283 9410444 8704328 5386842 3669797 5586827 8664546
36430 8664546 9305167 6947800 3589484 770302 -884647 -385934 2497334 5291394
36422 5291394 5151178 3432703 4611931 9537817 13138773 11007643 5369659 1550113
36414 1550113 758668 24161 -1954797 -2861956 -693680 3678647 8322603 11731861 12048532
36405 12048532 7984513 1761165 -1758272 -785881 752703 -1633993 -7091703 -11103044
$$ packed form
36465e234064P45489K398772J168631j537111j847397O20528K050863N88892q33408
36456a878805K57613J665250O44027q43934Q91226M646038N098835K85976n394216
36447E372010o752083l667331Q6353J803789J678434Q34709j83621p53832K21544
36438a360028K783256M680055L307161p06116l317486j717045J917030L077719
36430H664546O40621k357367l358316k819182j654949M98713K883268K794060
36422E291394j40216j718475J179228M925886L600956k131130n637984l819546
36414A550113p91445p34507j978958r07159K168276M372327M643956L409258L16671
36405A2048532m064019o223348l519437R72391J538584k386696n457710m011341
$$ plain form
36397 -11103044 -11721245 -11161818 -11355989 -10734885 -6688926 158696 5581431 5721379 1017570
36388 1017570 -4097803 -5612399 -3830266 -2377343 -3698108 -6752217 -9261551 -10571538
36380 -10571538 -11261040 -11141186 -9158665 -5021030 -9959 3753448 4701131 3124398
36372 3124398 1148124 390000 -217494 -2567182 -5432927 -5182169 -1312759 2011492 1963224
36363 1963224 1123112 2255363 2429181 -2381196 -8785003 -8593878 -403756 7517702 7908466
36354 7908466 2802422 -1697672 -4069982 -6606581 -9577709 -11106532 -11066825 -10671400 -9165900
36345 -9165900 -4966546 414723 3421111 3461549 3370546 4495075 4718837 2388557 -768004
36336 -768004 -2266478 -2326086 -3060101 -5535923 -8995740 -12131391 -14064103 -14523575 -13707993
$$ packed form
36397a1103044o18201N59427j94171O21104M045959O847622N422735J39948m703809
36388A017570n115373j514596J782133J452923j320765l054109k509334j309987
36380a0571538o89502J19854J982521M137635N011071L763407R47683j576733
36372C124398j976274p58124o07494k349688k865745K50758L869410L324251m8268
36363A963224q40112J132251J73818m810377o403807J91125Q190122P921458L90764
36354G908466n106044m500094k372310k536599k971128j528823L9707L95425J505500
36345i165900M199354N381269L006388M0438r1003J124529K23762k330280l156561
36336g68004j498474n9608p34015k475822l459817l135651j932712m59472Q15582
$$ plain form
36327 -13707993 -11839040 -8943037 -5404267 -2183547 167792 1913013 2744003 1387640
36319 1387640 -1846462 -3763500 -2170634 125659 -1306156 -5545889 -6847705 -3043521
36311 -3043521 708340 -1075079 -6669504 -9793767 -7821392 -3997604 -2207116 -2524746
36303 -2524746 -2356802 -102025 3095838 4628675 3212130 278960 -1926797 -3115356
36295 -3115356 -4251174 -4524274 -1833875 3014320 5809623 4598937 3040070 5354727
36287 5354727 10214952 12960377 12193084 10343334 8558877 5189088 -260530 -5252669
36279 -5252669 -7447370 -7262927 -6291242 -5350990 -4852702 -4996022 -4927702 -3707082 -2508895
36270 -2508895 -3456135 -5695584 -5511789 -1628235 2430669 3202530 1986171 2164762 3864817
$$ packed form
36327a3707993J868953K896003L538770L220720K351339J745221Q30990j356363
36319A387640l234102j917038J592866K296293j431815m239733j301816L804184
36311c043521L751861j783419n594425l124263J972375L823788J790488l17630
36303b524746J67944K254777L197863J532837j416545k933170k205757j188559
36295c115356j135818k73100K690399M848195K795303j210686j558867K314657
36287E354727M860225K745425p67293j849750j784457l369789n449618m992139
36279e252669k194701J84443R71685R40252M98288j43320O8320J220620J198187
36270b508895r47240k239449J83795L883554M058904P71861j216359J78591J700055
$$ plain form
36261 3864817 4383127 2836440 1162597 582264 -90282 -1928043 -3823648 -3987638 -2178340
36252 -2178340 535618 3452546 6846734 11087807 15422591 17709957 16025604 11239438
36244 11239438 7356149 7920421 12046026 15237976 14374409 10571482 6579691 2863486
36236 2863486 -2185674 -8810438 -14528866 -16606216 -14591264 -9824364 -3741036 2219039
36228 2219039 6223483 7564708 8220865 10688201 13928371 13876313 9118704 3656207 1895256
36219 1895256 2859915 2298338 -784487 -3357237 -3853760 -4424820 -6553160 -7967691 -6208170
36210 -6208170 -2822302 -1463344 -3269967 -6288939 -8266354 -8000205 -5115566 -764708
36202 -764708 2203115 1952181 84344 -596684 -189915 -1291956 -4602964 -7301892 -6452097
$$ packed form
36261C864817N18310j546687j673843n80333o72546j837761j895605j63990J809298
36252b178340K713958K916928L394188M241073M334784K287366j684353m786166
36244A1239438l883289N64272M125605L191950q63567l802927l991791l716205
36236B863486n049160o624764n718428k077350K014952M766900O083328N960075
36228B219039M004444J341225O56157K467336L240170n2058m757609n462497j760951
36219A895256R64659n61577l082825k572750m96523n71060k128340j414531J759521
36210f208170L385868J358958j806623l018972j977415K66149K884639M350858
36202g64708K967823k50934j867837o81028M06769j102041l311008k698928Q49795
$$ plain form
36193 -6452097 -2320010 2411333 5437517 6172178 5322444 3913656 2466575 1070907
36185 1070907 389627 1673680 4750732 6898501 5511418 1685504 -619979 791326
36177 791326 4057546 5826947 4648395 1410486 -2152027 -4629945 -5560959 -5557712 -5434883
36168 -5434883 -5271822 -4910025 -4729166 -4623144 -2818166 2256838 8851120 12696390 11504680
36159 11504680 7014866 2220769 -1417367 -3393326 -3270026 -2069173 -2767158 -7238977
36151 -7238977 -13336194 -16501064 -13961648 -6643321 2109014 8798024 11838795 12543246
36143 12543246 13421268 14969171 15371152 13930509 12747041 13430230 13993115 11323657 5684710
36134 5684710 497271 -1693842 -992053 1383330 4051763 5218137 3886815 1607781
$$ packed form
36193f452097M132087M731343L026184P34661q49734j408788j447081j395668
36185A070907o81280J284053L077052K147769j387083l825914k305483J411305
36177G91326L266220J769401j178552l237909l562513k477918r31014L247J22829
36168e434883J63061L61797J80859J06022J804978N075004O594282L845270j191710
36159A1504680m489814m794097l638136j975959J23300J200853o97985m471819
36151g238977o097217l164870K539416P318327Q752335O689010L040771P04451
36143A2543246Q78022J547903M01981j440643j183468O83189N62885k669458n638947
36134E684710n187439k191113P01789K375383K668433J166374j331322k279034
$$ plain form
36126 1607781 1116589 2982468 5223063 6245130 6424045 6790008 8043045 10913268 15389948
36117 15389948 19276290 19672519 16554937 12955906 10952345 9462312 6771056 3126614
36109 3126614 -259828 -2809733 -3940975 -2786388 -1916 1955425 1897823 1445908 1884329
36100 1884329 1659411 -579268 -2406310 -394347 4466387 7451161 6061047 2323765
36092 2323765 -948922 -3127464 -4317014 -3937342 -2300620 -1483825 -2900911 -5230815
36084 -5230815 -5923330 -3717688 957585 6584951 10775567 11576588 9689838 7957548
36076 7957548 7723928 7516311 6490120 6790644 10114966 13703479 12880273 7057545 532391
36067 532391 -2534004 -1530096 2032098 6608181 10710098 13247970 14707434 16274979
$$ packed form
36126A607781m91192J865879K240595J022067J78915L65963J253037K870223M476680
36117A5389948L886342L96229l117582l599031k003561j490033k691256l644442
36109C126614l386442k549905j131242J154587K784472J957341n7602m51915M38421
36100A884329k24918k238679j827042K011963M860734K984774j390114l737282
36092B323765l272687k178542j189550L79672J636722Q16795j417086k329904
36084e230815o92515K205642M675273N627366M190616Q01021j886750j732290
36076G957548k33620k07617j026191L00524L324322L588513q23206n822728o525154
36067E32391l066395J003908L562194M576083M101917K537872J459464J567545
$$ plain form
36059 16274979 17332549 15901876 12255217 9691169 10306094 11992187 11367553 8110551
36051 8110551 4590442 2533051 1960091 2393747 3217574 3653730 4074890 6273514 10407298
36042 10407298 12870082 10117791 4280791 1809236 5791835 12208926 14962596 12466990
36034 12466990 7851596 4505131 3299453 3149249 2485093 471689 -2051709 -3084658
36026 -3084658 -1732537 396156 792490 -1243592 -4025552 -5245994 -3875675 -696519
36018 -696519 2639804 5271873 7773208 10687347 12973794 13250908 12331141 12526464 13951071
36009 13951071 13689023 9942503 5155881 3177392 4626583 7033522 8541041 9251792
36001 9251792 9462978 8935187 8110587 8151233 9259163 10286060 10332346 9601896 8549041
$$ packed form
36059A6274979J057570j430673l646659k564048O14925J686093o24634l257002
36051H110551l520109k057391n72960M33656Q23827M36156M21160K198624M133784
36042A0407298K462784k752291n837000k471555L982599O417091K753670k495606
36034A2466990m615394l346465j205678j50204o64156k013404k523398j032949
36026c084658J352121K128693L96334k036082k781960j220442J370319L179156
36018f96519L336323K632069K501335K914139K286447K77114r19767J95323J424607
36009A3951071k62048l746520m786622j978489J449191K406939J507519P10751
36001I251792K11186n27791q24600M0646J107930J026897M6286p30450j052855
$$ plain form
35992 8549041 7401828 6752527 7455651 9532157 11907160 13298891 12756425 9840776 5474857
35983 5474857 2164542 1761364 3111405 3589949 2914659 3358053 5728672 7470708 6204385
35974 6204385 3487941 3152519 6596752 11329596 13971406 13493659 11469184 10017678
35966 10017678 9787293 9646582 8216201 5516083 2710373 411885 -1907301 -4575999
35958 -4575999 -6613529 -6596926 -4383146 -1571891 -124145 -253060 328465 4167102 10419280
35949 10419280 14503770 12784146 6871854 1642415 -330075 -226655 613025 2786637
35941 2786637 6655804 10693701 13305125 14365898 13904110 11364496 7531872 5080866
35933 5080866 5414816 6635130 6410392 5253432 5063697 5939699 6544814 6398579 5737164
$$ packed form
35992H549041j147213o49301P03124K076506K375003J391731n42466k915649m365919
35983E474857l310315m03178J350041M78544o75290M43394K370619J742036j266323
35974F204385k716444l35422L444233M732844K641810m77747k024475j451506
35966A0017678k30385j40711j430381k700118k805710k298488k319186k668698
35958d575999k037530J6603K213780K811255J447746j28915N81525L838637O252178
35949A0419280M084490j719624n912292n229439j972490J03420Q39680K173612
35941B786637L869167M037897K611424J060773m61788k539614l832624k451006
35933E080866L33950J220314k24738j156960j89735Q76002O05115j46235o61415
$$ plain form
35924 5737164 4276984 2257278 1572321 3528087 6387810 7484819 6882847 6439010 6121148
35915 6121148 4271836 1238925 -370799 483432 1735759 1075922 -1683208 -5313603
35907 -5313603 -8104191 -7961573 -4009502 1420080 4613256 4769904 4315309 4633939 4142770
35898 4142770 1471667 -1972945 -3893656 -3484475 -848486 3798992 9054890 12520234
35890 12520234 13569595 14175632 15588851 15990447 13039210 7235203 1223803 -2931287
35882 -2931287 -4544624 -3938686 -2682673 -2777792 -4284286 -5121533 -4204718 -2911034 -2309090
35873 -2309090 -1354614 331674 355586 -3164176 -8064221 -10683843 -10557952 -9925752 -9909523
35864 -9909523 -9974605 -9984586 -9842479 -8114154 -4087012 -322595 85788 -1895479 -2739501
$$ packed form
35924E737164j460180k019706o84957J955766K859723J097009o01972m43837l17862
35915F121148j849312l032911j609724Q54231J252327o59837k759130l630395
35907e313603k790588J42618L952071N429582L193176J56648m54595L18630m91169
35898D142770k671103l444612j920711M09181K635989M647478N255898L465344
35890A2520234J049361O06037J413219M01596k951237n804007o011400m155090
35882b931287j613337O05938J256013r5119j506494q37247R16815J293684O01944
35873b309090R54476J686288K3912l519762m900045k619622J25891O32200J6229
35864i909523o5082r981J42107J728325M027142L764417M08383j981267q44022
$$ plain form
35855 -2739501 -1696851 -709997 549373 4712624 10907804 13775947 10615531 5677072
35847 5677072 4538731 7252674 10021450 11001878 10969338 10116731 8033814 6127930 6472909
35838 6472909 8010638 6880922 1467588 -5024495 -8236047 -7506238 -5738037 -5101092
35830 -5101092 -4392624 -1259801 3823384 7364567 7106509 4828088 3283327 1810648
35822 1810648 -1991964 -6614085 -6672035 -221639 7364249 9655064 6946693 4588772
35814 4588772 5306001 7053325 7828255 8399635 9372538 9065093 6244836 2758293 1483683
35805 1483683 2971220 5549369 7538973 7994690 6514692 4091146 3368563 6118513
35797 6118513 10536701 12614574 10374738 5520364 851377 -2410988 -4227249 -4323339
$$ packed form
35855b739501J042650R86854J259370M163251O195180K868143l160416m938459
35847E677072j138341K713943K768776R80428l2540q52607k082917j905884L44979
35838F472909J537729j129716n413334o492083l211552P29809J768201O36945
35830e101092P08468L132823N083185L541183k58058k278421j544761j472679
35822A810648l802612m622121n7950O450396P585888K290815k708371k357921
35814D588772P17229J747324P74930N71380R72903l07445k820257l486543j274610
35805A483683J487537K578149J989604M55717j479998k423546p22583K749950
35797F118513M418188K077873k239836m854374m668987l262365j816261r6090
$$ plain form
35789 -4323339 -2593142 -133217 1589060 2433188 3351649 4661437 5749793 6387555 6881788
35780 6881788 6746070 4886995 1735168 -534850 -963465 -1228362 -2560109 -3057665 -565691
35771 -565691 2992293 3308506 -415696 -4259589 -4775614 -2701464 -663502 252508 418710
35762 418710 432989 1344505 4077514 7359522 8454329 7406726 7963725 12127434 16343678
35753 16343678 16051119 11986990 8626293 8013547 8987071 11305738 15852232 20638314
35745 20638314 21380015 17593250 14195735 14863870 16988278 15763804 10641218 4791309
35737 4791309 226808 -3134589 -4696166 -3164729 451082 2870742 2686214 2398285
35729 2398285 5004641 10036003 14494690 16788824 17901646 18704916 17951641 14076955
$$ packed form
35789d323339J730197K459925J722277Q44128R18461J309788J088356O37762M94233
35780F881788j35718j859075l151827k270018m28615k64897j331747m97556K491974
35771e65691L557984L16213l724202l843893n16025K074150K037962R16010J66202
35762D18710J4279R11516K733009L282008J094807j047603N56999M163709M216244
35753A6343678k92559m064129l360697o12746R73524K318667M546494M786082
35745B0638314P41701l786765l397515O68135K124408j224474n122586n849909
35737D791309m564501l361397j561577J531437L615811K419660j84528k87929
35729B398285K606356N031362M458687K294134J112822Q03270p53275l874686
$$ plain form
35721 14076955 8055853 2892032 264668 -853899 -1725324 -1540493 949899 4379211
35713 4379211 5363116 2528010 -1422090 -2448895 609768 5108378 7538107 6928624
35705 6928624 5185418 4222670 3573432 1857270 30787 932766 4947011 8651893 9623975
35696 9623975 10223593 13628605 17844882 17624946 11857782 4997040 813433 -1142101
35688 -1142101 -1816533 97781 4581017 7595284 5601560 629667 -2497423 -2441993 -1661718
35679 -1661718 -1748826 -1992161 -2130902 -3142791 -4865438 -5495240 -4151342 -1990617 -316552
35670 -316552 683179 990042 280454 -1129238 -2333514 -3226789 -4460522 -5652648 -5087197
35661 -5087197 -1895990 2509566 5921647 7657624 8859805 10671065 12351091 11619888
$$ packed form
35721A4076955o021102n163821k627364j118567q71425J84831K490392L429312
35713D379211R83905k835106l950100j026805L058663M498610K429729o09483
35705F928624j743206r62748o49238j716162j826483R01979M014245L704882R72082
35696I623975N99618L405012M216277k19936n767164o860742m183607j955534
35688a142101o74432J914314M483236L014267j993724m971893l127090N5430P80275
35679a661718q7108k43335j38741j011889j722647o29802J343898K160725J674065
35670c16552R99731L06863p09588j409692j204276q93275j233733j192126N65451
35661e087197L191207M405556L412081J735977J202181J811260J680026p31203
$$ plain form
35653 11619888 7702070 3761560 4256423 8906905 11602668 7593445 66883 -3410194
35645 -3410194 9784 6227259 10488014 11865305 10857566 6879863 748007 -3251674
35637 -3251674 -1108443 6103857 13436058 17254888 17325423 14748187 10469433 6087340
35629 6087340 4011425 5561720 9484010 12989060 14070118 12559709 9248321 4744319
35621 4744319 -188576 -3689277 -3826465 -1270409 623460 -110017 -1219132 461060
35613 461060 4097373 6194919 6262520 7460075 10990415 13605999 12516233 9638007 8490174
35604 8490174 9243509 9500547 8149737 5831493 3170267 1204562 2050524 6090119 9611334
35595 9611334 8554500 4094237 1274434 2299661 4518954 5299932 5347729 6057871 6831048
$$ packed form
35653A1619888l917818l940510M94863M650482K695763m009223p526562l477077
35645c410194L419978O217475M260755J377291j007739l977703o131856l999681
35637c251674K143231P212300P332201L818830P0535k577236m278754m382093
35629F087340k075915J550295L922290L505050J081058j510409l311388m504002
35621D744319m932895l500701j37188K556056J893869p33477j109115J680192
35613D61060L636313K097546O7601J197555L530340K615584j089766k878226j147833
35604H490174P53335K57038j350810k318244k661226j965705Q45962M039595L521215
35595I611334j056834m460263k819803J025227K219293P80978M7797P10142P73177
$$ plain form
35586 6831048 7053076 8433918 13032540 20100893 26585491 29902774 29069701 24337263
35578 24337263 17314210 10742362 6686269 5165861 5250905 6621863 9039651 11291137
35570 11291137 12261737 12602171 13715707 15150875 14644823 11303936 7418248 5994316
35562 5994316 6996404 7130493 3529971 -2990246 -8654196 -10209166 -7271105 -1798525
35554 -1798525 3617026 6858092 7104963 5638266 5055232 6401625 7395285 4760105 -1730701
35545 -1730701 -8700801 -12595074 -12360555 -8825337 -3460512 1308354 2476031 -768816
35537 -768816 -5222271 -6384764 -2973752 2545333 7569573 11518925 13982066 13073539
35529 13073539 7796396 1102886 -1982515 80252 3457110 3696550 1037796 -480455
$$ packed form
35586F831048K22028J380842M598622P068353O484598L317283q33073m732438
35578B4337263p023053o571848m056093j520408Q5044J370958K417788K251486
35570A1291137R70600L40434J113536J435168n06052l340887l885688j423932
35562E994316J002088J34089l600522o520217n663950j554970K938061N472580
35554a798525N415551L241066K46871j466697n83034J346393R93660k635180o490806
35545a730701o970100l894273K34519L535218N364825M768866J167677l244847
35537g68816m453455j162493L411012N519085N024240L949352K463141r08527
35529A3073539n277143o693510l085401K062767L376858K39440k658754j518251
$$ plain form
35521 -480455 1763936 6513442 10923956 13128852 12247443 8165019 2671244 -719427
35513 -719427 152284 3653131 6046675 5212675 2164137 -248543 442130 4185356 7696670
35504 7696670 7261223 3179311 -300313 -634916 -202283 -1792622 -3561927 -2051556 1688814
35495 1688814 3601010 3491810 5290112 9783251 12122073 8579936 1618728 -4258206
35487 -4258206 -7954426 -10134831 -9600768 -5207428 769444 4865021 6579170 7283576
35479 7283576 6836944 4792278 3281000 4544686 6573330 5582386 2514421 2443071 6859261
35470 6859261 11111352 11296107 9731893 10813975 14262838 15777408 13104408 8641520
35462 8641520 6226714 7181078 9646386 10808067 9598507 7461679 6391391 6691025
$$ packed form
35521d80455K244391M749506M410514K204896q81409m082424n493775l390671
35513g19427Q71711L500847K393544q34000l048538k412680O90673L743226L511314
35504G696670m35447m081912l479624l34603M32633j590339j769305J510371L740370
35495A688814J912196j09200J798302M493139K338822l542137o961208n876934
35487d258206l696220k180405N34063M393340N976872M095577J714149P04406
35479G283576m46632k044666j511278J263686K028644r90944l067965p1350M416190
35470F859261M252091J84755j564214J082082L448863J514570k673000m462888
35462H641520k414806R54364K465308J161681j209560k136828j070288K99634
$$ plain form
35454 6691025 7426870 8315939 9525972 10112602 8935635 7243298 7881239 11218675 14134713
35445 14134713 13983009 11340210 7813847 3728688 -316564 -2182417 -1054453 339461
35437 339461 -648541 -1962102 935126 8473603 15563883 17284589 13789772 8960871
35429 8960871 6085120 5741648 6524854 6751848 6028783 5669418 7208769 10465499 13577238
35420 13577238 14814359 13805212 11332875 8726606 7154014 6662162 6179915 5192964
35412 5192964 4817344 6161392 8307784 9448252 9604453 10331204 11591447 10935647 6765538
35403 6765538 1102304 -2060559 -620450 4048122 8783610 11305263 11575911 11014836
35395 11014836 10434054 9149447 6713623 4928366 6564517 11646417 16294749 16299119 11414979
$$ packed form
35454F691025P35845Q89069J210033N86630j176967j692337O37941L337436K916038
35445A4134713j51704k642799l526363m085159m045252j865853J127964J393914
35437C39461r88002j313561K897228P538477P090280J720706l494817m828901
35429H960871k875751l43472P83206K26994p23065l59365J539351L256730L111739
35420A3577238J237121j009147k472337k606269j572592m91852m82247r86951
35412E192964l75620J344048K146392J140468J56201P26751J260243o55800m170109
35403F765538n663234l162863J440109M668572M735488K521653K70648n61075
35395A1014836n80782j284607k435824j785257J636151N081900M648332M370m884140
$$ plain form
35386 11414979 5464880 2414868 2746891 3573551 2182478 -527694 -569133 4640580 12754550
35377 12754550 18455149 18791023 15520320 12272384 10830885 10628183 10461496 9647583 8237486
35368 8237486 7019120 6932540 7949378 8986482 9283897 9197630 9200964 8916569 7822732
35359 7822732 6224753 4711415 3175607 1272258 -427822 -616378 1322108 4485030
35351 4485030 7057574 7557055 5723751 2530206 -643712 -2797853 -3327366 -2013698
35343 -2013698 194583 1084933 -581921 -2893328 -2749912 -441322 -157130 -4676221 -11277538
35334 -11277538 -14635640 -12535278 -7007069 -1058210 3505310 5830339 6164707 6250407
35326 6250407 7489696 8782833 8318339 7298434 8963713 13282197 15772339 13361745
$$ packed form
35386A1414979n950099l050012L32023Q26660j391073k710172m1439N209713Q113970
35377A2754550N700599L35874l270703l247936j441499k02702j66687q13913j410097
35368H237486j218366q6580J016838J037104K97415q6267L334k84395j093837
35359G822732j597979j513338j535808j903349j700080j88556J938486L162922
35351D485030K572544M99481j833304l193545l173918k154141n29513J313668
35343b013698K208281Q90350j666854k311407J43416K308590K84192m519091o601317
35334a1277538l358102K100362N528209N948859M563520K325029L34368Q5700
35326F250407J239289J293137m64494j019905J665279M318484K490142k410594
$$ plain form
35318 13361745 8684750 6039461 5367598 3722973 1361373 1969008 6244379 9250466
35310 9250466 6419790 -280135 -4674753 -3319309 2287695 9079742 14874459 17691617
35302 17691617 15967760 10773378 5613980 2493849 -211208 -4477973 -8839275 -9904162
35294 -9904162 -6690300 -1355518 3693248 7128281 7616363 4439250 70202 -507944
35286 -507944 4914423 12384798 15454110 11817166 5215911 1206436 2059199 5617309
35278 5617309 8276660 8667008 8168645 7824619 6104310 1447273 -3845816 -5288617 -2361441
35269 -2361441 167215 -1123305 -3191874 -972380 5096973 9678488 9957536 8768085
35261 8768085 9829041 12959048 15286434 15055766 12808131 10074584 8028549 6765850
$$ packed form
35318A3361745m676995k645289o71863j644625k361600O07635M275371L006087
35310I250466k830676o699925m394618J355444N607004O792047N794717K817158
35302A7691617j723857n194382n159398l120131k705057m266765m361302j064887
35294i904162L213862N334782N048766L435033M88082l177113m369048n78146
35286e07944N422367P470375L069312l636944o601255m009475Q52763L558110
35278E617309K659351L90348m98363l44026j720309m657037n293089j442801K927176
35269b361441K528656j290520k068569K219494O069353M581515K79048j189451
35261H768085J060956L130007K327386k30668k247635k733547k046035j262699
$$ plain form
35253 6765850 5467045 3854904 3262192 5149681 8808587 11876955 12948711 12318275
35245 12318275 10623967 8579184 7588811 8248386 8287091 4712377 -1482527 -5419806 -4008195
35236 -4008195 1058260 6857153 12613569 17644191 19100108 15103958 8471226 3983655
35228 3983655 2615348 1314464 -1780883 -4719375 -4805862 -2136841 852957 2169559
35220 2169559 1883116 1566306 2427371 3907798 4573697 4508960 5606773 8689679 11662145
35211 11662145 11972615 10049842 8772315 10058611 13300950 16626517 18431695 18257232
35203 18257232 17447733 18334266 21435849 24129120 23457718 19486803 14416345 9498985
35195 9498985 5035552 2614480 4423999 9894845 15324030 17656737 17042272 15197760
$$ packed form
35253F765850j298805j612141n92712J887489L658906L068368J071756o30436
35245A2318275j694308k044783r90373O59575L8705l574714o194904l937279J411611
35236d008195N066455N798893N756416N030622J455917l996150o632732m487571
35228C983655j368307j300884l095347k938492q6487K669021K989798J316602
35220B169559k86443l16810Q61065J480427O65899o4737J097813L082906K972466
35211A1662145L10470j922773j277527J286296L242339L325567J805178j74463
35203A8257232q09499Q86533L101583K693271o71402l970915n070458m917360
35195I498985m463433k421072J809519N470846N429185K332707o14465j844512
$$ plain form
35187 15197760 13103427 11252301 10670554 12343402 16103829 20660218 24296653 25519939
35179 25519939 23912339 20664853 17646876 15777592 14712317 13850546 12984936 12232719
35171 12232719 11963219 12454290 13246454 13669059 14369623 16758961 20105833 21374146 19693629
35162 19693629 18573447 20848321 23714725 22883292 20145765 21586444 28190415 33630349
35154 33630349 33048491 29280062 27749908 29297433 31480836 33682057 36636894 38700556
35146 38700556 36893781 31507327 26509173 25010576 26491795 28847984 31434735 35314436
35138 35314436 41107811 47160333 50541790 50712538 51326004 56208850 63795137 68500099
35130 68500099 68160573 66719010 68150689 71508879 74688559 79586349 89278781 101967531
$$ packed form
35187A5197760k094333j851126n81747J672848L760427M556389L636435J223286
35179B5519939j607600l247486l017977j869284j065275q61771q65610p52217
35171A2232719k69500M91071P92164M22605P00564K389338L346872J268313j680517
35162A9693629j120182K274874K866404q31433k737527J440679O603971N439934
35154C3630349n81858l768429j530154J547525K183403K201221K954837K063662
35146C8700556j806775n386454m998154j498597J481219K356189K586751L879701
35138C5314436N793375O052522L381457J70748O13466M882846P586287M704962
35130F8500099l39526j441563J431679L358190L179680M897790R692432J2688750
$$ plain form
35122 101967531 112129728 117291529 120270128 124950386 132835914 143512449 155469449
35115 155469449 166282675 174641073 182466721 192699862 204900278 215557704 223192825
35108 223192825 230729383 241783519 256184447 270044564 279344492 283182432 284371049
35101 284371049 286970165 292818292 300944635 310359598 321482301 333835223 344784446
35094 344784446 352714594 359375075 366573682 372710732 375775723 377730241 381892636 387369812
35086 387369812 390444438 390618726 390756473 391775931 391992780 391422903 391372662 389479208 381102586
35077 381102586 366946240 353219994 342063533 328181144 308515651 288919081 275730922
35070 275730922 265771004 251408055 232262865 214688407 201247644 188005675 172512820
$$ packed form
35122A01967531J0162197N161801K978599M680258P885528J0676535J1957000
35115A55469449J0813226Q358398P825648J0233141J2200416J0657426P635121
35108B23192825P536558J1054136J4400928J3860117R299928L837940J188617
35101B84371049K599116N848127Q126343R414963J1122703J2352922J0949223
35094C44784446P930148O660481P198607O137050L064991J954518M162395N477176
35086C87369812L074626J74288J37747J019458K16849n69877n0241j893454q376622
35077C81102586j4156346j3726246j1156461j3882389j9665493j9596570j3188159
35070B75730922r959918j4362949j9145190j7574458j3440763j3241969j5492855
$$ plain form
35063 172512820 157793579 146553951 136850453 126286099 116408256 109667610 104762488
35056 104762488 98418663 90447656 84021907 81136804 80049393 77699566 73211486 68073383
35048 68073383 63515376 58983884 53641802 48317958 44597192 42328283 39770044 36485755
35040 36485755 34266503 34383444 35603456 35951238 34808605 32180026 27854522 23024148
35032 23024148 20895966 23346541 28123651 31569770 33035473 34200997 34992334 33144506
35024 33144506 27886897 21602130 17285779 15989042 16952818 18766280 20272464 21564262
35016 21564262 23929000 27664694 30489423 29562693 24677811 18224742 12787790 10138472
35008 10138472 11268526 15163250 18393493 18348769 16398157 15708354 16826625 18094123
$$ packed form
35063A72512820j4719241j1239628r703498j0564354r877843o740646m905122
35056A04762488o343825p971007o425749k885103j087411k349827m488080n138103
35048F8073383m558007m531492n342082n323844l720766k268909k558239l284289
35040C6485755k219252J16941J220012L47782j142633k628579m325504m830374
35032B3024148k128182K450575M777110L446119J465703J165524P91337j847828
35024C3144506n257609o284767m316351j296737R63776J813462J506184J291798
35016B1564262K364738L735694K824729r26730m884882o453069n436952k649318
35008A0138472J130054L894724L230243m4724j950612o89803J118271J267498
$$ plain form
35000 18094123 19520065 22709032 26976961 29130399 27785727 24697829 21023600 15661381
34992 15661381 8690610 3269732 2067426 4136556 7035629 9742576 11776792 11959117
34984 11959117 10331939 9281982 10389083 11839261 11226003 9237844 8122290 8143285
34976 8143285 8420769 9824909 13476306 17012465 16293896 11434055 7558752 8062948 10212890
34967 10212890 9853261 8054262 9496688 14920450 18949186 16784763 10473153 6185029
34959 6185029 6593273 8632263 8599702 6684936 5435809 5984280 7511967 8958504 9442395
34950 9442395 8148330 5717868 4767867 6863848 9654629 9299753 5358598 1000373
34942 1000373 -1299574 -1748870 -1068060 804705 3303290 5047575 5763947 6230596 6044535
$$ packed form
35000A8094123J425942L188967M267929K153438j344672l087898l674229n362219
34992A5661381o970771n420878j202306K069130K899073K706947K034216J82325
34984A1959117j627178j049957J107101J450178o13258j988159j115554K0995
34976H143285K77484J404140L651397L536159p18569m859841l875303N04196K149942
34967A0212890l59629j798999J442426N423762M028736k164423o311610m288124
34959F185029M08244K038990l2561j914766j249127N48471J527687J446537M83891
34950I442395j294065k430462r50001K095981K790781l54876l941155m358225
34942A000373k299947m49296O80810J872765K498585J744285P16372M66649j86061
$$ plain form
34933 6044535 4077462 1509973 1208059 3117971 3643787 1159677 -1225426 -563286 1472882
34924 1472882 1789532 773848 843743 2366165 4323192 7091519 10997065 13656450 12574447
34915 12574447 9447857 8168456 9138433 9264360 7294984 5345521 4918083 5169155 5782149
34906 5782149 7817008 10408248 10148956 5876620 1318051 462224 2175224 1965296 -1970265
34897 -1970265 -6825766 -8924107 -7342286 -3582118 721384 4700870 7484034 7933451
34889 7933451 6025054 3894683 4042184 6199649 7385713 5691963 2515908 178414
34881 178414 -852049 -1008954 2051 1712221 1646628 -1597026 -5390148 -6218147 -4606025
34872 -4606025 -3590729 -3465525 -2177869 -328397 -868912 -3292574 -3123690 1193503 5536595
$$ packed form
34933F044535j967073k567489l01914J909912N25816k484110k385103O62140K036168
34924A472882L16650j015684O9895J522422J957027K768327L905546K659385j082003
34915A2574447l126590j279401R69977J25927j969376j949463m27438K51072O12994
34906E782149K034859K591240k59292m272336m558569q55827J713000k09928l935561
34897a970265m855501k098341J581821L760168M303502L979486K783164M49417
34889G933451j908397k130371J47501K157465J186064j693750l176055k337494
34881A78414j030463j56905J011005J710170o5593l243654l793122q27999J612122
34872d606025J015296J25204J287656J849472n40515k423662J68884M317193M343092
$$ plain form
34863 5536595 6484817 6028611 6917698 7475161 5046641 1296107 -534571 -1275384 -3838743
34854 -3838743 -7043277 -6604305 -2151724 1507933 1016442 -1617520 -3049842 -3162167 -3797983
34845 -3797983 -5549122 -7755996 -9854641 -10931295 -9393987 -4935176 -10873 2205578
34837 2205578 1085921 -1107575 -1702220 279758 3930536 7378430 8918444 7884723
34829 7884723 4796838 869024 -2487317 -4139131 -4021393 -3493771 -4138122 -5851895 -6652365
34820 -6652365 -4823914 -1051788 1985468 2308819 819803 416620 2631572 5623805
34812 5623805 6382634 4647483 3231473 4205111 6470149 8094767 9382558 11818636
34804 11818636 14993553 16704683 15888005 13649306 11388439 9547198 8344229 8101674
$$ packed form
34863E536595R48222m56206Q89087N57463k428520l750534j830678p40813k563359
34854c838743l204534M38972M452581L659657m91491k633962j432322j12325o35816
34845c797983j751139k206874k098645j076654J537308M458811M924303K216451
34837B205578j119657k193496n94645J981978L650778L447894J540014j033721
34829G884723l087885l927814l356341j651814J17738N27622o44351j713773q00470
34820f652365J828451L772126L037256L23351j489016m03183K214952K992233
34812E623805P58829j735151j416010R73638K265038J624618J287791K436078
34804A1818636L174917J711130q16678k238699k260867j841241j202969k42555
$$ plain form
34796 8101674 8350833 7882876 6157831 3665015 702387 -3015572 -7254147 -10912866
34788 -10912866 -13036211 -13045077 -10008332 -3492071 4292235 9071771 8547592 4669991 906224
34779 906224 -1330387 -2290331 -1697773 729312 3468956 4457397 3988021 3869091 3530269
34770 3530269 -49288 -7169249 -12948654 -12790457 -8736895 -7044141 -9743883 -12153209
34762 -12153209 -9810494 -4569158 -1303149 -945278 -423204 1330904 1345468 -2393224 -7106350
34753 -7106350 -8486965 -5845655 -1847941 1459459 3879340 4973427 3418899 -865704
34745 -865704 -5551018 -7740762 -6395154 -2751604 972170 3185888 3838521 3842154 3488454
34736 3488454 2141171 29145 -778795 1426727 5455565 8384515 8905896 8072474 7115119
$$ packed form
34796H101674K49159m67957j725045k492816k962628l717959m238575l658719
34788a0912866k123345q866L036745O516261P784306M779536n24179l877601l763767
34779I06224k236611r59944N92558K427085K739644R88441m69376j18930l38822
34770C530269l579557p119961n779405J58197M053562J692754k699742k409326
34762a2153209K342715N241336L266009L57871N22074J754108J4564l738692m713126
34753g106350j380615K641310L997714L307400K419881J094087j554528m284603
34745h65704m685314k189744J345608L643550L723774K213718O52633L633l53700
34736C488454j347283k112026q07940K205522M028838K928950N21381q33422r57355
$$ plain form
34727 7115119 6203015 5139463 3495364 197685 -5001195 -9601302 -10163993 -6528905
34719 -6528905 -2138717 281763 1020802 844947 -784844 -3488549 -4916297 -4167956 -3723480
34710 -3723480 -5395074 -6891635 -5712071 -4100480 -5700075 -8731930 -7849442 -2865531
34702 -2865531 -46677 -2891668 -6673700 -5502781 -895476 1093871 -1117442 -3328590
34694 -3328590 -2491527 -414888 88201 -1008568 -2511661 -4508727 -7226940 -9149842
34686 -9149842 -8408403 -5357156 -2253514 -755269 -775890 -1347380 -1591788 -1205991 -977092
34677 -977092 -2537167 -6561115 -11286130 -13848609 -13225340 -10901996 -8386923 -5170745
34669 -5170745 68296 7050864 13859074 18999467 22177056 22835437 19547853 12262434
$$ packed form
34727G115119r12104j063552j644099l297679n198880m600107n62691L635088
34719f528905M390188K420480P39039j75855j629791k703705j427748P48341M44476
34710c723480j671594j496561J179564J611591j599595l031855Q82488M983911
34702b865531K818854k844991l782032J170919M607305J989347k211313k211148
34694c328590Q37063K076639N03089j096769j503093j997066k718213j922902
34686i149842P41439L051247L103642J498245k0621n71490k44408L85797K28899
34677i77092j560075m023948m725015k562479O23269K323344K515073L216178
34669e170745N239041O982568O808210N140393L177589O58381l287584p285419
$$ plain form
34661 12262434 4363081 463134 1548550 3755524 3066236 118735 -1317412 -108051
34653 -108051 342399 -3154377 -8750233 -11449057 -9245445 -5419548 -4333402 -6502763
34645 -6502763 -8847267 -8834423 -6938094 -5111143 -4166079 -3425091 -2401707 -1830143 -2638773
34636 -2638773 -4310795 -4979356 -3514238 -1184893 -635035 -3100418 -7110359 -10100581
34628 -10100581 -10749927 -9403553 -6961773 -4308024 -2502061 -2336230 -3448836 -4804115
34620 -4804115 -6315765 -8862154 -12057076 -13301597 -10537334 -5319172 -1457996 -671305
34612 -671305 -1248909 -1283015 -1269155 -2380990 -3792394 -3620994 -1855011 -425611 -333271
34603 -333271 -317378 1136570 3636962 5360678 4985021 2732186 42844 -1568858 -1882655
$$ packed form
34661A2262434p899353l899947J085416K206974o89288k947501j436147J209361
34653a08051M50450l496776n595856k698824K203612L825897J086146k169361
34645f502763k344504J2844J896329J826951R45064P40988J023384N71564q08630
34636b638773j672022o68561J465118K329345N49858k465383m009941k990222
34628a0100581o49346J346374K441780K653749J805963J65831j112606j355279
34620d804115j511650k546389l194922j244521K764263N218162L861176P86691
34612f71305n77604l4106J3860j111835j411404J71400J765983J429400R2340
34603c33271J5893J453948K500392J723716l75657k252835k689342j611702l13797
$$ plain form
34594 -1882655 -2240833 -3793088 -5624133 -5712137 -3803929 -1944449 -1619870 -1734700 -391325
34585 -391325 2373574 4783233 5580483 5062774 4358411 4539314 5979245 7850240 8770412
34576 8770412 8510470 8249211 8554729 8330172 6730760 4763593 3625540 2882729 2066076
34567 2066076 2496665 4939492 6668960 4234825 -1206819 -4934833 -5438066 -6358747 -10237030
34558 -10237030 -13889937 -12624507 -6553186 163463 4726210 7544276 9736583 11541469
34550 11541469 12931286 13688006 12976455 10397172 7057867 4146268 1135846 -2843568
34542 -2843568 -6455487 -6985891 -3606036 1798627 6748440 9470992 8658974 4322502
34534 4322502 -828652 -3041617 -1502979 697230 248911 -2926211 -6459198 -8555030
$$ packed form
34594a882655l58178j552255j831045q8004J908208J859480L24579j14830J343375
34585c91325K764899K409659P97250n17709p04363J80903J439931J870995R20172
34576H770412k59942k61259L05518k24557j599412j967167j138053p42811q16653
34567B066076M30589K442827J729468k434135n441644l728014n03233r20681l878283
34558a0237030l652907J265430O071321O716649M562747K818066K192307J804886
34550A1541469J389817P56720p11551k579283l339305k911599l010422l979414
34542b843568l611919n30404L379855N404663M949813K722552q12018m336472
34534D322502n151154k212965J538638K200209m48319l175122l532987k095832
$$ plain form
34526 -8555030 -9403167 -10310718 -12140221 -14381490 -15693978 -15674632 -15677818 -17092691 -19141391
34517 -19141391 -19381821 -16288417 -10557481 -4180944 936762 3947754 5668530 7723929
34509 7723929 10187008 11014812 9034256 6115849 4449419 3118594 245869 -2549824
34501 -2549824 -1700437 2277921 4474629 2599521 454976 2104861 5789883 6759590
34493 6759590 4021452 949312 252738 1323573 2204630 1772961 61388 -1688312 -1452102
34484 -1452102 1395988 4521904 4887704 2448084 12122 -543916 -263815 -978422 -2688726
34475 -2688726 -3937608 -3972791 -3592193 -3893034 -4779668 -5179984 -4648477 -3960490 -3645790
34466 -3645790 -2965181 -1551656 -1009481 -2748453 -4829377 -3835183 -57750 2444440 1957011
$$ packed form
34526h555030q48137r07551j829503k241269j312488J9346l186j414873k048700
34517a9141391k40430L093404N730936O376537N117706L010992J720776K055399
34509G723929K463079Q27804j980556k918407j666430j330825k872725k795693
34501b549824Q49387L978358K196708j875108k144545J649885L685022R69707
34493F759590k738138l072140o96574J070835Q81057m31669j711573j749700K36210
34484a452102K848090L125916L65800k439620k435962n56038K80101p14607j710304
34475b688726j248882l5183L80598l00841q86634m00316N31507O87987L14700
34466c645790O80609J413525N42175j738972k080924R94194L777433K502190m87429
$$ plain form
34457 1957011 1750866 4543090 7667816 6996823 3165567 84692 -1139111 -2764489
34449 -2764489 -5666461 -7990550 -8564320 -8130660 -6915190 -4348173 -1736814 -1807223 -4522807
34440 -4522807 -6485446 -5905991 -5272961 -7280484 -10707436 -12609591 -12543095 -12016899 -11149236
34431 -11149236 -8733726 -5292546 -3512105 -4944977 -7779994 -8817086 -7072125 -4690575
34423 -4690575 -4286311 -5912439 -7273430 -6837051 -5671977 -5603470 -6632680 -7349267 -7072972
34414 -7072972 -6196357 -5052467 -3831022 -2839019 -1393740 2196716 7291481 9116786
34406 9116786 3970555 -4356666 -7693366 -3643351 1673907 2415472 -18900 -1463064
34398 -1463064 -2075929 -4652087 -8663573 -10806984 -10300773 -9386371 -9072859 -8247744 -6923224
$$ packed form
34457A957011k06145K792224L124726o70993l831256l080875j223803j625378
34449b764489k901972k324089n73770M33660J215470K567017K611359p0409k715584
34440d522807j962639N79455O33030k007523l426952j902155O6496N26196Q67663
34431a1149236K415510L441180J780441j432872k835017j037092J744961K381550
34423d690575M04264j626128j360991M36379J165074O8507j029210p16587K76295
34414g072972Q76615J143890J221445R92003J445279L590456N094765J825305
34406I116786n146231q327221l336700M050015N317258P41565k434372j444164
34398a463064o12865k576158m011486k143411N06211R14402L13512Q25115J324520
$$ plain form
34389 -6923224 -6729651 -7823194 -8555144 -8714594 -9937315 -12104636 -12452389 -9584418 -5684596
34380 -5684596 -3193970 -1672268 268343 2029322 2202368 1257823 938141 1761602 2786056
34371 2786056 3187683 2757370 1648210 844506 1762802 3925195 4408336 1779488 -566822
34362 -566822 1994193 8565995 12791808 10532934 4593832 276273 -1011332 -1265412
34354 -1265412 -1367990 -715034 -390321 -2595283 -6236588 -6732428 -2045653 3918586 6304306
34345 6304306 5407349 4834394 5287171 4086500 694297 -1226487 1321343 6567081 10609202
34336 10609202 12087489 12066313 10728065 6896025 826348 -4617969 -6494025 -4717356
34328 -4717356 -1909687 -596490 -946822 -1423323 -1332757 -1692313 -2914496 -2931864 335652
$$ packed form
34389f923224J93573j093543p31950j59450j222721k167321l47753K867971L899822
34380e684596K490626J521702J940611J760979J73046r44545l19682Q23461J024454
34371B786056M01627m30313j109160q03704R18296K162393M83141k628848k346310
34362e66822K561015O571802M225813k258874n939102m317559j287605k54080
34354a265412j02578O52956L24713k204962l641305m95840M686775N964239K385720
34345F304306q96957n72955M52777j200671l392203j920784K547830N245738M042121
34336A0609202J478287k1176j338248l832040o069677n444317j876056J776669
34328d717356K807669J313197l50332m76501R0566l59556j222183j7368L267516
$$ plain form
34319 335652 5018128 6342670 2320189 -3906559 -8481486 -11194802 -13604961 -15094494
34311 -15094494 -13721044 -9864728 -6032327 -3288956 -518893 2647181 4640192 4289824
34303 4289824 2385340 201636 -1964192 -4217797 -6441615 -8664971 -10660313 -10923007
34295 -10923007 -7794839 -2196721 2434286 3723696 2380218 24765 -3031589 -6586144
34287 -6586144 -9019384 -9017346 -7817178 -7820201 -9499266 -11284313 -11983218 -11626475 -10282053
34278 -10282053 -7921492 -5612385 -5153453 -6943971 -9313507 -10330769 -9342758 -6691227
34270 -6691227 -3266137 -711258 -653972 -2932811 -5611017 -7333790 -8403257 -8762008 -6625138
34261 -6625138 -865778 6375801 11596412 13891845 14854406 14932342 12744037 8578129 5565351
$$ packed form
34319C35652M682476J324542m022481o226748m574927k713316k410159j489533
34311a5094494J373450L856316L832401K743371K770063L166074J993011l50368
34303D289824j904484k183704k165828k253605k223818k223356j995342k62694
34295a0923007L128168N598118M631007J289410j343478k355453l056354l554555
34287f586144k433240K038J200168l023j679065j785047o98905L56743J344422
34278a0282053K360561K309107M58932j790518k369536j017262R88011K651531
34270f691227L425090K554879N7286k278839k678206j722773j069467l58751K136870
34261f625138N759360P241579N220611K295433R62561P7936k188305m165908l012778
$$ plain form
34252 5565351 5554218 6131719 4170542 680641 -783590 290695 560593 -2153242 -5761314
34243 -5761314 -6678945 -3628628 2149824 8456489 12740698 12956434 9400055 4680633
34235 4680633 768584 -2796275 -6741566 -9628336 -9409533 -6676214 -4511273 -5068492
34227 -5068492 -7426635 -8892330 -7719720 -4604113 -1928792 -1426790 -2604477 -3906510
34219 -3906510 -4904856 -6013141 -6503123 -5067486 -2556402 -1427692 -1571910 259610 5085315
34210 5085315 8877834 7923361 4301713 2473356 2623199 1722175 -267140 -321390 1689513
34201 1689513 2152502 12471 -713600 2961038 7917213 8730608 4260177 -1912142 -5863900
34192 -5863900 -6175028 -3951724 -1880662 -2154438 -4051916 -4740977 -3211696 -1556992 -1395535
$$ packed form
34252E565351j1133N77501j961177l489901j464231J074285K69898k713835l608072
34243e761314r17631L050317N778452O306665M284209K15736l556379m719422
34235D680633l912049l564859l945291k886770K18803K733319K164941n57219
34227e068492k358143j465695J172610L115607K675321N02002j177687j302033
34219c906510r98346j108285m89982J435637K511084J128710j44218J831520M825705
34210E085315L792519r54473l621648j828357J49843r01024j989315n4250K010903
34201A689513M62989k140031p26071L674638M956175Q13395m470431o172319l951758
34192e863900l11128K223304K071062k73776j897478o89061J529281J654704J61457
$$ plain form
34183 -1395535 -1349215 249945 2254054 2458597 926963 -593008 -1424909 -2134830 -2862889
34174 -2862889 -3317156 -3682140 -3911370 -2841670 435777 4848623 8179047 9044647 7283791
34165 7283791 3482004 -900818 -4071383 -5533269 -6100581 -5871199 -4067938 -1487915
34157 -1487915 -507450 -1429029 -1712269 -523851 -651527 -3257571 -4378633 -738258 3919660
34148 3919660 3443244 -1572304 -4767959 -3475256 -1576224 -2492855 -4672369 -5545576 -5410874
34139 -5410874 -5363636 -5060769 -4542153 -5130650 -6720598 -7043225 -5212425 -3196468 -2389976
34130 -2389976 -1755058 -854735 -1539715 -4811055 -8955086 -12377827 -15072167 -15868412 -12447258
34121 -12447258 -6417494 -3785184 -6845834 -9971696 -7937894 -4299100 -5657502 -10754145
$$ packed form
34183a395535M6320J599160K004109K04543j531634j519971q31901p09921p28059
34174b862889m54267l64984k29230J069700L277447M412846L330424Q65600j760856
34165G283791l801787m382822l170565j461886n67312K29382J803261K580023
34157a487915R80465r21579k83240J188418j27676k606044j121062L640375M657918
34148C919660m76416n015548l195655J292703J899032r16631k179514q73207J34702
34139e410874M7238L02867N18616n88497j589948l22627J830800K015957Q06492
34130b389976O34918R00323o84980l271340m144031l422741k694340p96245L421154
34121a2447258O029764K632310l060650l125862K033802L638794j358402n096643
$$ plain form
34113 -10754145 -12202196 -7685474 -2497956 -980757 -1990118 -3735558 -6766417 -10188698
34105 -10188698 -10617532 -7629722 -5395700 -5923395 -5237260 106166 6641338 8381982
34097 8381982 4763104 17876 -3236369 -5567315 -7289955 -7691022 -7423232 -8319061 -10615781
34088 -10615781 -12593175 -12694431 -10305610 -5568140 -485501 1333777 -1225010 -4313713
34080 -4313713 -3778516 -883313 181363 -889525 -829201 626339 -101071 -3756649 -6087337
34071 -6087337 -4603725 -2651488 -3400315 -4004255 -337026 5301635 6478889 1669187
34063 1669187 -3742131 -4762501 -2199898 105166 195539 -1311128 -3064606 -3823646 -2883648
34054 -2883648 -1069580 -434331 -1952678 -4196672 -5150893 -4781282 -4838127 -6195030 -7319130
$$ packed form
34113a0754145j448051M516722N187518J517199j009361j745440l030859l422281
34105a0188698m28834K987810K234022n27695O86135N343426O535172J740644
34097H381982l618878m745228l254245k330946j722640m01067K67790q95829k296720
34088a0615781j977394j01256K388821M737470N082639J819278k558787l088703
34080d313713N35197K895203J064676j070888O0324J455540p27410l655578k330688
34071f087337J483612J952237p48827o03940L667229N638661J177254m809702
34063A669187n411318j020370K562603K305064R0373j506667j753478p59040R39998
34054b883648J814068O35249j518347k243994r54221L69611n6845j356903j124100
$$ plain form
34045 -7319130 -6136281 -3189134 -1655706 -3283388 -5421542 -4097069 427480 3890865
34037 3890865 4181755 3954436 5533886 6639214 4263771 162064 -1564109 -790105 -927165
34028 -927165 -2834076 -3697285 -2261759 -783281 -679233 -280038 1427911 2522107 1761639
34019 1761639 1186403 2491275 3569401 1633931 -2260828 -4762947 -4801254 -3895198 -3138158
34010 -3138158 -2667889 -3388208 -6436250 -10809136 -13462997 -12243724 -8058422 -4444813
34002 -4444813 -5059706 -10094052 -14694797 -13062876 -5195899 2665843 5489076 4512852
33994 4512852 3178488 1676067 -1054141 -3058487 -1885210 348878 -715066 -5042956
33986 -5042956 -8561268 -9767186 -11045927 -12953303 -12230329 -7235019 -1227788 1911004
$$ packed form
34045g319130J182849K947147J533428j627682k138154J324473M524549L463385
34037C890865K90890k27319J579450J105328k375443m101707j726173P74004j37060
34028i27165j906911q63209J435526J478478J04048L99195J707949J094196p60468
34019A761639n75236J304872J078126j935470l894759k502119l8307R06056P57040
34010c138158M70269p20319l048042m372886k653861J219273M185302L613609
34002d444813o14893n034346m600745J631921P866977P861742K823233r76224
33994D512852j334364j502421k730208k004346J173277K234088j063944m327890
33986e042956l518312j205918j278741j907376P22974M995310O007231L138792
$$ plain form
33978 1911004 2049324 1080489 -9305 -295763 1902256 6405178 9759049 8731557 3853795
33969 3853795 -1890950 -6034852 -6999090 -3949201 1613196 5902949 6489543 4503358
33961 4503358 1885282 -1440072 -5741787 -8967543 -8674299 -5277125 -1247685 1771894
33953 1771894 3221871 2583045 440624 -698953 787663 2919218 2680588 550099
33945 550099 -217521 1501634 3221917 2615849 552793 -307293 1528607 5298890 8714037
33936 8714037 9507121 7175273 3324058 -175459 -2833055 -4714908 -5051770 -3101313
33928 -3101313 140223 2450986 2435275 335959 -2502754 -4211518 -3503937 -1285840 -111127
33919 -111127 -1020878 -2276973 -2334562 -2170085 -2942914 -3461172 -2510097 -1856189 -3764075
$$ packed form
33978A911004J38320r68835j089794k86458K198019M502922L353871j027492m877762
33969C853795n744745m143902r64238L049889N562397M289753N86594j986185
33961D503358k618076l325354m301715l225756K93244L397174M029440L019579
33953A771894J449977o38826k142421j139577J486616K131555k38630k130489
33945E50099p67620J719155J720283o06068k063056q60086J835900L770283L415147
33936H714037P93084k331848l851215l499517k657596j881853l36862J950457
33928c101313L241536K310763j5711k099316k838713j708764P07581K218097J174713
33919a11127r09751j256095n7589J64477p72829n18258R51075O53908j907886
$$ plain form
33910 -3764075 -6821952 -7685616 -6154201 -4953592 -4998110 -4660908 -3613061 -3348296 -3523612
33901 -3523612 -1978333 686818 922660 -1687776 -2481184 1518645 6692006 7970648
33893 7970648 5653582 3235591 1126135 -2725093 -7253811 -8293244 -4565888 262150
33885 262150 2601881 3018441 4013717 6185412 8285555 9605123 10642894 11848117 12573221
33876 12573221 11283186 7027506 1218105 -2726455 -2755196 -740851 -109818 -1296009
33868 -1296009 -1637527 131643 1878906 1655139 901934 2059165 4601206 5905513 5165471
33859 5165471 3775951 2098012 -1129317 -5295808 -6726644 -3144962 2505482 5355302
33851 5355302 4831720 4713378 6990571 8730355 6362004 758984 -3931634 -5112612
$$ packed form
33910c764075l057877q63664J531415J200609m4518L37202J047847K64765j75316
33901c523612J545279K665151K35842k610436p93408L999829N173361J278642
33893G970648k317066k417991k109456l851228m528718j039433L727356M828038
33885B62150K339731M16560R95276K171695K100143J319568J037771J205223P25104
33876A2573221j290035m255680n809401l944560k8741K014345O31033j186191
33868a296009l41518J769170J747263k23767p53205J157231K542041J304307p40042
33859E165471j389520j677939l227329m166491j430836L581682N650444K849820
33851E355302n23582j18342K277193J739784k368351n603020m690618j180978
$$ plain form
33843 -5112612 -3373452 -271655 3248837 6352166 8173499 8630270 8237061 7099842
33835 7099842 5255201 3790445 4032523 5451597 5946131 4659986 3085792 2806772 3507749
33826 3507749 3913816 3388871 1803379 -799718 -3204563 -2846971 1692789 8313436 12745693
33817 12745693 12356599 8118456 3296662 885253 1683763 3737036 3838653 657781
33809 657781 -3476982 -4724416 -1955001 1733482 2106291 -1879064 -7190242 -10064619
33801 -10064619 -9704425 -8174008 -7032363 -5420788 -2203579 1288029 2413210 670942
33793 670942 -2023891 -4674014 -8537869 -14024315 -18252562 -17845116 -13405101 -9264063
33785 -9264063 -8762136 -11151657 -13293023 -13175574 -11284826 -9372567 -8757033 -9851309 -12739508
$$ packed form
33843e112612J739160L101797L520492L103329J821333M56771l93209j137219
33835G099842j844641j464756K42078J419074M94534j286145j574194k79020P00977
33826C507749M06067n24945j585492k603097k404845L57592M539760O620647M432257
33817A2745693l89094m238143m821794k411409P98510K053273J01617l180872
33809F57781m134763j247434K769415L688483L72809l985355n311178k874377
33801a0064619L60194J530417J141645J611575L217209L491608J125181j742268
33793F70942k694833k650123l863855n486446m228247M07446M440015M141038
33785i264063N01927k389521k141366J17449J890748J912259O15534j094276k888199
$$ plain form
33776 -12739508 -17304015 -22270919 -24898738 -23029890 -17599516 -11947029 -8434696 -6967905
33768 -6967905 -6854365 -7967852 -9064297 -7218345 -1220511 5657248 8709692 7235456
33760 7235456 4908059 4973631 7133242 9226276 9858832 8746408 6244208 3516029 1995008
33751 1995008 1875701 2006284 1710496 1653202 2408376 3347164 3736107 4016386 5172690
33742 5172690 7503750 10593108 13643651 15157187 13321947 8016923 2050462 -818982
33734 -818982 680730 4402314 7247886 8111162 8349910 9632085 11492200 11413412 7828598
33725 7828598 2567788 -958335 -2056102 -3520095 -7312777 -11272434 -11859829 -8887762
33717 -8887762 -5223932 -2519334 -60858 1970946 1308513 -2633034 -6149885 -5027894
$$ packed form
33776a2739508m564507m966904k627819J868848N430374N652487L512333J466791
33768f967905J13540j113487j096445J845952N997834O877759L052444j474236
33760G235456k327397O5572K159611K093034O32556j112424k502200k728179j521021
33751A995008j19307J30583k95788n7294P55174R38788L88943K80279J156304
33742E172690K331060L089358L050543J513536j835240n305024n966461k869444
33734h18982J499712L721584K845572Q63276K38748J282175J860115p8788l584814
33725G828598n260810l526123j097767j463993l792682l959657n87395K972067
33717h887762L663830K704598K458476K031804o62433l941547l516851J121991
$$ plain form
33709 -5027894 8892 3960178 3402256 -324965 -3827427 -5528860 -6032078 -6043059 -5252785
33700 -5252785 -3134304 -313951 1173701 -310040 -3506579 -4646924 -1749329 2180212
33692 2180212 2159037 -2759581 -8518483 -11101596 -10127332 -7005054 -2550318 1861077 3361045
33683 3361045 497698 -4228812 -6978358 -6707891 -4897809 -2690532 -728808 -452605
33675 -452605 -2486575 -4405628 -3152007 612349 3480142 4250406 4516572 4349288 1500676
33666 1500676 -3860950 -7467322 -6242206 -2330918 538780 2071618 3917162 5294653
33658 5294653 3591475 -1480975 -7347847 -12016196 -15550504 -17977021 -18022922 -14802936
33650 -14802936 -9396428 -3888875 514183 3853035 6199727 6703152 4489886 698075
$$ packed form
33709e027894N036786L951286n57922l727221l502462j701433n03218j0981P90274
33700e252785K118481K820353J487652j483741l196539j140345K897595L929541
33692B180212k1175m918618n758902k583113R74264L122278M454736M411395J499968
33683C361045k863347m726510k749546K70467J810082K207277J961724K76203
33675d52605k033970j919053J253621L764356K867793P70264K66166j67284k848612
33666A500676n361626l606372J225116L911288K869698J532838J845544J377491
33658E294653j703178n072450n866872m668349l534308k426517m5901L219986
33650a4802936N406508N507553M403058L338852K346692N03425k213266l791811
$$ plain form
33642 698075 -1435661 179320 3637338 4927749 2359118 -2456553 -7275416 -10377356
33634 -10377356 -9624350 -4087015 2593558 4265039 -340161 -5343550 -5004772 -304715
33626 -304715 4185676 6819258 8727519 9624294 7991494 4439524 1301541 -576306
33618 -576306 -1771180 -1905064 -317040 1675831 2204608 1957060 3054181 5470701 7354462
33609 7354462 8194253 8863056 9351889 9413151 10466678 13539669 16218673 15331506 11989055
33600 11989055 10043423 10003952 8734346 5120094 1544525 -753582 -3297515 -6323596
33592 -6323596 -7353658 -5271658 -2163470 184749 2101565 3349883 2486350 91110
33584 91110 -1277327 -1573582 -3575850 -7487206 -9968663 -10281935 -12122929 -16656336 -19109230
$$ packed form
33642F98075k133736J614981L458018J290411k568631m815671m818863l101940
33634a0377356P53006N537335O680573J671481m605200n003389L38778M700057
33626c04715M490391K633582J908261Q96775j632800l551970l137983j877847
33618e76306j194874j33884J588024J992871N28777k47548J097121K416520J883761
33609G354462Q39791O68803M88833O1262J053527L072991K679004q87167l342451
33600A1989055j945632l9471j269606l614252l575569k298107k543933l026081
33592f323596j030062K082000L108188K348219J916816J248318q63533k395240
33584I1110j368437k96255k002268l911356k481457l13272j840994m533407k452894
$$ plain form
33575 -19109230 -16073619 -11210788 -9119808 -8136603 -4749812 -1312825 -2862555 -8579526
33567 -8579526 -12829889 -13469389 -13041560 -12400528 -9421517 -4641991 -2408715 -4626460 -7837142
33558 -7837142 -8481093 -7426674 -7206579 -7728103 -7121357 -5113360 -3547330 -4131598 -6554056
33549 -6554056 -8637423 -8657153 -7882789 -9516474 -14050769 -17546486 -16430666 -12071212 -8117795
33540 -8117795 -5458420 -3196451 -2561123 -5190147 -8489673 -7849619 -3794445 -2032690
33532 -2032690 -5192601 -9032903 -8889671 -6016663 -4768758 -6131533 -6822536 -3582339
33524 -3582339 3255334 9572094 10519136 5391494 -699160 -2379079 -823199 -1580394
33516 -1580394 -5750327 -8231098 -6321049 -4852904 -9027935 -16007794 -18473769 -14525644
$$ packed form
33575a9109230L035611M862831K090980R83205L386791L436987j549730n716971
33567h579526m250363o39500M27829O41032K979011M779526K233276k217745l210682
33558g837142o43951J054419K20095n21524O06746K007997J566030n84268k422458
33549f554056k083367j9730P74364j633685m534295l495717J115820M359454L953417
33540h117795K659375K261969O35328k629024l299526O40054M055174J761755
33532b032690l159911l840302J43232K873008J247905j362775o91003L240197
33524c582339O837673O316760R47042n127642o090654j679919J555880p57195
33516a580394m169933k480771J910049J468145m175031o979859k465975L948125
$$ plain form
33508 -14525644 -9287809 -7312202 -7671754 -7180815 -5203732 -3877996 -5195776 -8717803
33500 -8717803 -11484317 -10461065 -6061322 -2555537 -3492184 -7238876 -8845872 -6195183
33492 -6195183 -2419568 -1689653 -4065523 -5639532 -3388791 958775 2385103 -1925727
33484 -1925727 -8979866 -12724228 -10445990 -5368462 -2490604 -3060324 -4131994 -2687138
33476 -2687138 1212349 5271693 7833487 9335037 11095499 13113771 13707360 11618420
33468 11618420 7729192 3898056 813695 -1820842 -3725070 -4473718 -5146506 -7327980
33460 -7327980 -10134017 -10434965 -6997120 -2669622 -1347665 -4062576 -8909771 -13412250
33452 -13412250 -15949165 -16133803 -14886230 -13263238 -10680682 -5596339 1465615 7199132
$$ packed form
33508a4525644N237835J975607l59552M90939J977083J325736j317780l522027
33500h717803k766514J023252M399743L505785r36647l746692j606996K650689
33492f195183L775615P29915k375870j574009K250741M347566J426328m310830
33484a925727p054139l744362K278238N077528K877858n69720j071670J444856
33476b687138L899487M059344K561794J501550J760462K018272N93589k088940
33468A1618420l889228l831136l084361k634537j904228p48648o72788k181474
33460g327980k806037l00948L437845M327498J321957k714911m847195m502479
33452a3412250k536915j84638J247573J622992K582556N084343P061954N733517
$$ plain form
33444 7199132 8774344 6388363 1816116 -3665796 -8597272 -10526881 -8050373 -2787306
33436 -2787306 2308061 5866943 8102114 9059470 8626149 7597899 7066671 6978523 6399714
33427 6399714 4807031 2294786 -727938 -3115367 -3188463 -558363 2891344 4832017
33419 4832017 4718598 3602875 2760366 3206069 5261551 7588681 7872622 5478183 2220302
33410 2220302 -275520 -2287896 -4156417 -4986475 -4839386 -5919220 -9238350 -12077661
33402 -12077661 -11538625 -9000346 -7931528 -8493643 -7740559 -4521957 -675519 2501583
33394 2501583 5376313 7111663 5238022 -462057 -6350081 -8931357 -8548799 -7578630
33386 -7578630 -6637415 -4438228 -608507 2968427 3754542 1016309 -3261061 -5977044
$$ packed form
33444G199132J575212k385981m572247n481912m931476j929609K476508N263067
33436b787306N095367L558882K235171R57356m33321j028250n31228q8148n78809
33427F399714j592683k512245l022724k387429p3096K630100L449707J940673
33419D832017j13419j115723q42509M45703K055482K327130K83941k394439l257881
33410B220302k495822k012376j868521q30058J47089j079834l319130k839311
33402a2077661N39036K538279J068818n62115P53084L218602L846438L177102
33394B501583K874730J735350j873641n700079n888024k581276L82558R70169
33386g578630R41215K199187L829721L576934P86115k738233m277370k715983
$$ plain form
33378 -5977044 -5741646 -3813408 -1979392 -519557 833850 1222216 -195566 -2108575
33370 -2108575 -2165569 -217185 1266305 158849 -3240588 -6943688 -8863765 -8170207 -6511430
33361 -6511430 -7189879 -11236517 -14872375 -13067308 -5433034 3429217 9064271 10375240
33353 10375240 8222492 3955920 -52224 -1174012 850771 3600822 4758080 3661217
33345 3661217 361091 -4348191 -7747987 -6870907 -2248744 2315067 4320604 4475613
33337 4475613 3717503 1690892 -658776 -566388 2264798 3888776 1381906 -2502330 -2940716
33328 -2940716 424264 3545422 3416626 668602 -2545788 -4710822 -5284940 -4845476 -4636762
33319 -4636762 -4673177 -3248618 176406 2966947 2289769 -999417 -3716923 -4632813 -4862689
$$ packed form
33378e977044K35398J928238J834016J459835J353407L88366j417782j913009
33370b108575n6994J948384J483490j107456l399437l703100j920077O93558J658777
33361f511430o78449m046638l635858J805067P634274Q862251N635054J310969
33353A0375240k152748m266572m008144j121788K024783K750051J157258j096863
33345C661217l300126m709282l399796Q77080M622163M563811K005537J55009
33337D475613p58110k026611k349668R2388K831186J623978k506870l884236m38386
33328b940716L364980L121158j28796k748024l214390k165034n74118M39464K08714
33319d636762l6415J424559L425024K790541o77178l289186k717506r15890k29876
$$ plain form
33310 -4862689 -4762962 -3462650 -1524400 -1164648 -3066080 -5270770 -6114997 -6229763 -6565832
33301 -6565832 -6266485 -4000790 -269333 3028718 4654680 4515293 2746788 -190939
33293 -190939 -2477837 -1511900 3313501 8830883 10392421 6491094 376358 -3521775
33285 -3521775 -3977708 -2928478 -2193752 -2152639 -3168204 -5765079 -8813051 -9843296 -8299919
33276 -8299919 -6526384 -6281784 -6289725 -4865047 -2934470 -2167363 -1760433 68151 2276560
33267 2276560 1738638 -2119990 -5943263 -6287328 -3057610 1307744 4468730 5477721
33259 5477721 4774883 3557769 2544080 1317395 -629638 -2894893 -5132740 -7948702
33251 -7948702 -11170324 -12197902 -8548650 -1920973 2771117 2980809 1100489 818766
$$ packed form
33310d862689R9727J300312J938250L59752j901432k204690q44227j14766l36069
33301f565832K99347K265695L731457L298051J625962j39387j768505k937727
33293a90939k286898R65937M825401N517382J561538l901327o114736l898133
33285c521775m55933J049230P34726M1113j015565k596875l047972j030245J543377
33276h299919J773535K44600p941J424678J930577P67107M06930J828584K208409
33267B276560n37922l858628l823273l44065L229718M365354L160986J008991
33259E477721p02838j217114j013689j226685j947033k265255k237847k815962
33251g948702l221622j027578L649252O627677M692090K09692j880320k81723
$$ plain form
33243 818766 2909154 5574689 7113521 6933661 5395259 4080352 5047559 8264996 10662119
33234 10662119 9516107 6490368 6527741 12238460 20581698 25909433 25663498 22261550
33226 22261550 19783847 20018130 22069453 24528436 26621556 27755861 27707716 27551818 28729790
33217 28729790 30392465 29230743 23413561 15837571 11996835 14803737 22156822 28937840
33209 28937840 30807749 27249246 22091551 20196638 22597959 25836940 26746886 25934061
33201 25934061 25093154 23462157 20009875 17282457 18875311 23404680 25127172 21347176
33193 21347176 15612561 12264897 11219693 10202555 9211929 9733417 11088416 10630986
33185 10630986 7429452 3628884 1776710 2079279 2884724 3312334 4599323 8232226
$$ packed form
33243H18766K090388K665535J538832j79860j538402j314907R67207L217437K397123
33234A0662119j146012l025739L7373N710719Q343238N327735k45935l401948
33226B2261550k477703K34283K051323K458983K093120J134305m8145j55898J177972
33217B8729790J662675j161722n817182p575990l840736K806902P353085O781018
33209B8937840J869909l558503n157695j894913K401321L238981R09946q12825
33201B5934061q40907j630997l452282k727418J592854M529369J722492l779996
33193B1347176n734615l347664j045204j017138r90626N21488J354999m57430
33185A0630986l201534l800568j852174L02569Q05445M27610J286989L632903
$$ plain form
33177 8232226 12995730 15389433 13876529 11168606 10609340 11804476 12276751 11986292 12621480
33168 12621480 13101535 10232069 4492665 736539 1377003 2900911 1579094 -1114054
33160 -1114054 -1975531 -1667760 -2750932 -4304311 -2914783 1801437 6455386 8437242
33152 8437242 8134919 6838026 5283353 4183121 3573823 1695923 -3027117 -8991643
33144 -8991643 -12785698 -13376482 -12405309 -10523591 -6554378 -966412 2760682 1880625 -2187892
33135 -2187892 -5482502 -5563067 -3323227 -1666582 -2638151 -5090909 -5617585 -2912816 -154275
33126 -154275 -935762 -3772011 -3766395 307595 4067424 3639311 510941 -1487837 -1424282
33117 -1424282 -1210979 -2079699 -3362928 -3878389 -2956220 -878843 741903 233235 -1668231
$$ packed form
33177H232226M763504K393703j512904k707923n59266J195136M72275k90459O35188
33168A2621480M80055k869466n739404l756126O40464J523908j321817k693148
33160a114054q61477L07771j083172j553379J389528M716220M653949J981856
33152H437242l02323j296893j554673j100232o09298j877900m723040n964526
33144h991643l794055n90784R71173J881718L969213N587966L727094q80057m068517
33135b187892l294610q0565K239840J656645r71569k452758n26676K704769K758541
33126a54275p81487k836249N616M073990L759829m28113l128370j998778O3555
33117a424282K13303q68720j283229n15461R22169K077377J620746n08668j901466
$$ plain form
33108 -1668231 -2259516 -714807 683236 578870 1157160 4135549 6489479 3982759 -2103864
33099 -2103864 -5854340 -4463814 -1274710 -54222 156439 2269625 5872838 7702971
33091 7702971 6302976 3576400 1870371 1587604 2029429 2984580 4620093 6536265 7635254
33082 7635254 6818529 3814381 -221373 -2911656 -2280669 1151478 4230364 3991444 899447
33073 899447 -1342302 170184 3978857 5574005 2432732 -3105997 -6633431 -6619555 -5374233
33064 -5374233 -5254552 -5569035 -4235252 -1344355 771166 995393 1099027 2975561 5550085
33055 5550085 6096397 4141511 2324628 3186322 6535164 10312123 12569667 12096209 8912393
33046 8912393 5338826 4800791 7641579 9442308 5927524 -1186383 -5866057 -5005213
$$ packed form
33108a668231n91285J544709J398043j04366N78290K978389K353930k506720o086623
33099b103864l750476J390526L189104J220488K10661K113186L603213J830133
33091G702971j399995k726576j706029k82767M41825R55151J635513J916172J098989
33082G635254q16725l004148m035754k690283O30987L432147L078886k38920l091997
33073H99447k241749J512486L808673J595148l141273n538729l527434J3876J245322
33064e374233J19681l14483J333783K890897K115521K24227J03634J876534K574524
33055E550085N46312j954886j816883Q61694L348842L776959K257544m73458l183816
33046H912393l573567n38035K840788J800729l514784p113907m679674Q60844
$$ plain form
33038 -5005213 -1140127 2253685 4823716 7343137 8752541 7754285 5539733 4454626
33030 4454626 5072802 6582532 8730021 11091388 11722123 9397531 6480142 6519970 9183382
33021 9183382 10656113 9364968 8053175 9116982 10930037 10674884 8489897 6591204
33013 6591204 5864704 5477542 4772748 3544369 1193133 -2517850 -6259564 -8165959 -7718501
33004 -7718501 -5548026 -2191093 1592154 4178952 4619719 4425383 6100397 10001563
32996 10001563 14006788 15947155 14959988 11056030 5317123 331475 -1622973 -1087185
32988 -1087185 -502370 -872382 -1211482 -1098404 -1236901 -1141384 853827 4117621 4996906
32979 4996906 1530112 -3145316 -4226479 -638794 4799053 8952034 10016420 7329622
$$ packed form
33038e005213L865086L393812K570031K519421J409404r98256k214552j085107
33030D454626O18176J509730K147489K361367O30735k324592k917389L9828K663412
33021I183382J472731j291145j311793J063807J813055k55153k184987j898693
33013F591204p26500l87162p04794j228379k351236l710983l741714j906395M47458
33004g718501K170475L356933L783247K586798M40767j94336J675014L901166
32996A0001563M005225J940367r87167l903958n738907m985648j954448N35788
32988a087185N84815l70012l39100J13078j38497R5517J995211L263794Q79285
32979D996906l466794m675428j081163L587685N437847M152981J064386k686798
$$ plain form
32971 7329622 2450375 -504754 1307870 5396362 6391615 2677735 -2082511 -4441695
32963 -4441695 -5295478 -7106728 -9280252 -8588874 -3567268 3163556 7218143 6656379 3764898
32954 3764898 2345125 3058406 2560650 -1655503 -6947276 -8466445 -5850047 -3854634
32946 -3854634 -5611391 -8195725 -6697329 -610016 5972983 9295610 9084412 7450302
32938 7450302 6380725 6218512 5710280 3787527 1466353 821067 1676017 1142445 -2352395
32929 -2352395 -6325429 -7307585 -5289516 -3075637 -2264411 -2138007 -1897705 -1588249 -877411
32920 -877411 895289 3171288 4443437 4275932 3404337 1800571 -1327969 -5212318 -7451432
32911 -7451432 -7451040 -8025800 -11640595 -16027042 -15731563 -8364039 2070955 8863627 9000752
$$ packed form
32971G329622m879247k955129J812624M088492R95253l713880m760246k359184
32963d441695q53783j811250k173524O91378N021606O730824M054587n61764k891481
32954C764898j419773P13281m97756m216153n291773j519169K616398J995413
32946c854634j756757k584334J498396O087313O582999L322627k11198j634110
32938G450302j069577j62213n08232j922753k321174o45286Q54950n33572l494840
32929b352395l973034r82156K018069K213879Q11226J26404K40302L09456P10838
32920h77411J772700K275999J272149j67505q71595j603766l128540l884349k239114
32911g451432L92n74760l614795m386447K95479P367524J0434994O792672J37125
$$ plain form
32902 9000752 5138090 1658718 249719 38318 459510 1642788 2328082 446226 -2969209
32893 -2969209 -3156640 2567792 10033213 12165470 7033887 -721264 -6040663 -8076324
32885 -8076324 -8573176 -8838053 -9608244 -11495426 -13708104 -13673800 -9539642 -2532936 3922513
32876 3922513 6931821 5883129 2556912 -234927 -1010329 -573551 145296 2043759 5551120
32867 5551120 7570051 4463524 -1614167 -3545602 1720261 8538054 9705342 5346500
32859 5346500 1374980 1305391 3392716 4692951 4170708 2130416 -79996 133106 3907708
32850 3907708 7870547 7063011 1582059 -2883878 -2327328 781622 1700906 -337040 -2538358
32841 -2538358 -3075524 -2120427 530655 5494580 11203837 14044085 12231054 7824883
$$ packed form
32902I000752l862662l479372j408999k11401M21192J183278O85294j881856l415435
32893b969209j87431N724432P465421K132257n131583p755151n319399k035661
32885h076324m96852k64877p70191j887182k212678L4304M134158P006706O455449
32876C922513L009308j048692l326217k791839p75402M36778P18847J898463L507361
32867E551120K018931l106527o077691j931435N265863O817793J167288m358842
32859E346500l971520o9589K087325J300235n22243k040292k210412K13102L774602
32850C907708L962839q07536n480952m465937N56550L108950R19284k037946k201318
32841b538358n37166R55097K651082M963925N709257K840248j813031m406171
$$ plain form
32833 7824883 3893324 1286488 -495915 -903739 880092 3448815 4197282 3324718 4240491
32824 4240491 8536324 12791428 12759509 9184186 6398534 5884992 4899559 2000180 99066
32815 99066 1882555 5066010 5174552 1463984 -2766233 -4819916 -4806881 -3633768 -1544765
32806 -1544765 942164 2722543 3352617 3270021 2655169 1563654 1307870 3971935 9775474
32797 9775474 15901501 18563950 15968457 9634979 3565890 1403057 3073615 4738405
32789 4738405 3408099 793514 620527 2891639 3674431 758939 -3495977 -6046792
32781 -6046792 -7159076 -8617340 -9942803 -8804809 -4444245 1150037 5245137 6519893
32773 6519893 5794333 5546901 7972889 12404283 15173379 13123398 7037557 867329
$$ packed form
32833G824883l931559k606836j782403m07824J783831K568723P48467q72564R15773
32824D240491M295833M255104l1919l575323k785652n13542r85433k899379j901114
32815I9066J783489L183455J08542l710568m230217k053683J3035J173113K089003
32806a544765K486929J780379O30074q2596o14852j091515k55784K664065N803539
32797I775474O126027K662449k595493o333478o069089k162833J670558J664790
32789D738405j330306k614585j72987K271112P82792k915492m254916k550815
32781f046792j112284j458264j325463J137994M360564N594282M095100J274756
32773F519893p25560k47432K425988M431394K769096k049981o085841o170228
$$ plain form
32765 867329 -2154163 -2113210 -1592420 -2819545 -5418052 -6910414 -5900868 -4317770 -5118833
32756 -5118833 -7876791 -8748318 -5710841 -1812628 -1444082 -4638939 -7116747 -5596502
32748 -5596502 -1415983 1218408 -439796 -5217500 -9440709 -10891668 -11120818 -12924621
32740 -12924621 -15975732 -17044647 -14801799 -11600906 -9268738 -6311131 -1847708 698373
32732 698373 -2095449 -7473726 -9329825 -6605346 -4014240 -4116298 -3999611 -1693860 -707282
32723 -707282 -4444030 -9880881 -11502081 -9393928 -8534955 -10756725 -12178059 -9348549
32715 -9348549 -3929434 385377 2512354 3370847 2846016 -26676 -4691925 -8953562
32707 -8953562 -11071665 -10767532 -8552697 -5337813 -2537167 -1377673 -1903216 -3227626
$$ packed form
32765H67329l021492M0953N20790j227125k598507j492362J009546J583098q01063
32756e118833k757958q71527L037477L898213L68546l194857k477808J520245
32748e596502M180519K634391j658204m777704m223209j450959k29150j803803
32740a2924621l051111j068915K242848L200893K332168K957607M463423K546081
32732F98373k793822n378277j856099K724479K591106j02058J16687K305751R86578
32723g07282l736748n436851j621200K108153Q58973k221770j421334K829510
32715i348549N419115M314811K126977Q58493n24831k872692m665249m261637
32707h953562k118103L04133K214835L214884K800646J159494n25543j324410
$$ plain form
32699 -3227626 -4473710 -4699838 -2492324 2749282 8849753 11788069 9777252 5640208
32691 5640208 3858274 5537540 7622566 7340640 6030771 7269564 11637509 15023275
32683 15023275 13098233 6674495 1149456 487423 3163929 4886765 3938713 1961935
32675 1961935 145797 -2539522 -6304195 -8227174 -5492869 104182 3667291 3351972
32667 3351972 2478700 4502731 8071774 9032833 6087319 2078765 -172954 -1022744 -2088655
32658 -2088655 -2906775 -1357147 2894757 7143593 8668545 8093100 8496531 11315361 14373426
32649 14373426 14522839 11312086 7122368 4231493 2859909 1980879 929740 -157870
32641 -157870 -874134 -1209196 -1935263 -4055536 -7347492 -9959790 -10426757 -9644446 -9514938
$$ packed form
32699c227626j246084k26128K207514N241606O100471K938316k010817m137044
32691E640208j781934J679266K085026k81926j309869J238793M367945L385766
32683A5023275j925042o423738n525039o62033K676506J722836r48052j976778
32675A961935j816138k685319l764673j922979K734305N597051L563109l15319
32667C351972q73272K024031L569043R61059k945514m008554k251719q49790j065911
32658b088655q18120J549628M251904M248836J524952n75445M03431K818830L058065
32649A4373426J49413l210753m189718k890875j371584q79030j051139j087610
32641a57870p16264l35062p26067k120273l291956k612298m66967P82311J29508
$$ plain form
32632 -9514938 -9916855 -8776170 -5306542 -1272568 1566716 3352273 4515029 4264022
32624 4264022 2227610 -88078 -1390318 -2758118 -5483659 -7860954 -6935772 -3316892
32616 -3316892 -1501922 -4511854 -10017060 -12901270 -10750116 -6132651 -4009027 -7078519
32608 -7078519 -13196795 -17514250 -17464100 -14748980 -11788037 -8064829 -2126899 4264180
32600 4264180 7281025 6137877 3816422 2253412 78175 -3760410 -7341037 -8602829
32592 -8602829 -8082992 -6703161 -3507314 1621884 5371037 4747054 2017913 2019111 5011989
32583 5011989 6161521 2598558 -2715520 -5576248 -5840188 -6022721 -6954001 -7479640 -7224845
32574 -7224845 -7036572 -7009353 -6331996 -5390282 -6121316 -9321699 -12785240 -13381237 -10659948
$$ packed form
32632i514938m01917J140685L469628M033974K839284J785557J162756k51007
32624D264022k036412k315688j302240j367800k725541k377295R25182L618880
32616c316892J814970l009932n505206k884210K151154M617465K123624l069492
32608g078519o118276m317455N0150K715120K960943L723208N937930O391079
32600D264180L016845j143148k321455j563010k175237l838585l580627j261792
32592h602829N19837J379831L195847N129198L749153o23983k729141J198K992878
32583E011989J149532l562963n314078k860728k63940j82533r31280n25639K54795
32574g224845J88273K7219O77357R41714p31034l200383l463541n95997K721289
$$ plain form
32565 -10659948 -7372880 -6326036 -7575758 -9146890 -9715876 -9616635 -9548621 -9549805 -9496434
32556 -9496434 -9479837 -9114934 -7508810 -4783869 -2814741 -3418720 -6314107 -9657591 -11872851
32547 -11872851 -12080335 -9887363 -6426879 -4763545 -7015793 -11146518 -12795866 -10641693
32539 -10641693 -7821185 -7417697 -8807515 -9693096 -9562390 -9144530 -8076044 -5653794 -3171933
$$ packed form
32565a0659948L287068J046844j249722j571132n68986R9241O8014j184N3371
32556i496434J6597L64903J606124K724941J969128o03979k895387l343484k215260
32547a1872851k07484K192972L460484J663334k252248m130725j649348K154173
32539a0641693K820508M03488j389818q85581J30706M17860J068486K422250K481861
$$ [...]
##END NTUPLES=NMR SPECTRUM
##END=
