##TITLE=31Pdec_14-2026
 CDCl3, 64 sc
 10.2.2026
##JCAMPDX= 6.0         $$ Bruker NMR JCAMP-DX V2.0
##DATA TYPE= NMR SPECTRUM
##DATA CLASS= NTUPLES
##ORIGIN= UXNMR, Bruker Analytische Messtechnik GmbH
##OWNER= root
$$ XWIN-NMR		Version 3.5
$$ Tue Feb 10 14:14:25 2026 Russian Standard Time (UT+4h)  she@DPX200
##.OBSERVE FREQUENCY= 81.013821
##.OBSERVE NUCLEUS= ^31P
##.ACQUISITION MODE= SIMULTANEOUS
##.ACQUISITION SCHEME= undefined
##.AVERAGES= 64
##.DIGITISER RES= 17
##SPECTROMETER/DATA SYSTEM= spect
##.PULSE SEQUENCE= zgpg30
##.SOLVENT NAME= DMSO
##.SHIFT REFERENCE= (INTERNAL, DMSO, 0, 198.062)
##AUDIT TRAIL= $$ (NUMBER, WHEN, WHO, WHERE, WHAT)
$$ ##TITLE= Audit trail, XWIN-NMR		Version 3.5
$$ ##JCAMPDX= 5.01
$$ ##ORIGIN= Bruker BioSpin GmbH
$$ ##OWNER= she
$$ F:/spectra/data/she/nmr/P31/2/pdata/1/auditp.txt
$$ ##AUDIT TRAIL=  $$ (NUMBER, WHEN, WHO, WHERE, WHAT)
(   1,<2026-02-10 14:13:47.32 +0400>,<she>,<DPX200>,
      <continue with go, POWCHK disabled, PULCHK disabled
       configuration hash MD5:
       00 E9 B6 7A A2 85 ED C7 34 08 36 98 17 FE 4E 26
       data hash MD5: 32K
       35 60 8C FC AC 07 DB F8 97 22 93 61 FA DA 56 79>)
(   2,<2026-02-10 14:13:51.68 +0400>,<she>,<DPX200>,
      <Start of raw data processing
       efp BC_mod = 2 LB = 1.5 FT_mod = 6 PKNL = 1 PHC0 = 1343.43 PHC1 = 173.3009 SI = 64K 
       data hash MD5: 64K
       66 92 F6 B4 18 0A 9F B4 22 2B 2C B5 8C 78 3D D6>)
$$ ##END=
$$ 
$$ hash MD5
$$ B6 6A 20 30 D3 A6 77 B8 C0 26 17 3D 2C 1F C5 12
##$RELAX= 
##$RELAX= 
##$RELAX= 
##$RELAX= 
##$RELAX= 
##$RELAX= 
##$RELAX= 
##$RELAX= 
$$ Bruker specific parameters
$$ --------------------------
##$DU= <F:/spectra>
##$EXPNO= 2
##$NAME= <P31>
##$PROCNO= 1
##$TYPE= <nmr>
##$USER= <she>
##$AMP= (0..31)
100 100 100 100 100 100 100 100 100 100 100 100 100 100 100 100 100 100 
100 100 100 100 100 100 100 100 100 100 100 100 100 100 
##$AQSEQ= 0
##$AQ_mod= 1
##$AUNM= <au_zg>
##$AUTOPOS= <>
##$BF1= 81.014009
##$BF2= 200.13
##$BF3= 200.13
##$BF4= 200.13
##$BF5= 200.13
##$BF6= 200.13
##$BF7= 200.13
##$BF8= 200.13
##$BYTORDA= 1
##$CFDGTYP= 0
##$CFRGTYP= 5
##$CHEMSTR= <none>
##$CNST= (0..31)
1 1 145 1 1 1 1 1 1 1 1 1 1 1 1 1 1 1 1 1 1 1 1 1 1 1 1 1 1 1 1 1 
##$CPDPRG= <waltz16>
##$CPDPRG1= <>
##$CPDPRG2= <waltz16>
##$CPDPRG3= <>
##$CPDPRG4= <mlev>
##$CPDPRG5= <mlev>
##$CPDPRG6= <mlev>
##$CPDPRG7= <mlev>
##$CPDPRG8= <mlev>
##$CPDPRGB= <>
##$CPDPRGT= <>
##$D= (0..31)
0 1 0 0 0 0 0 0 0 0.06 0 0.03 2e-05 3e-06 0 0 0.0002 0 0 0 0 0 0 0 0 0 
0 0 0 0 0 0 
##$DATE= 1770718344
##$DBL= (0..7)
120 120 120 11 120 120 24 19 
##$DBP= (0..7)
150 150 150 150 150 150 150 150 
##$DBP07= 0
##$DBPNAM0= <>
##$DBPNAM1= <>
##$DBPNAM2= <>
##$DBPNAM3= <>
##$DBPNAM4= <>
##$DBPNAM5= <>
##$DBPNAM6= <>
##$DBPNAM7= <>
##$DBPOAL= (0..7)
0.5 0.5 0.5 0.5 0.5 0.5 0.5 0.5 
##$DBPOFFS= (0..7)
0 0 0 0 0 0 0 0 
##$DE= 6
##$DECBNUC= <off>
##$DECIM= 4
##$DECNUC= <off>
##$DECSTAT= 4
##$DIGMOD= 1
##$DIGTYP= 9
##$DL= (0..7)
0 0 52 120 120 21 21 25 
##$DP= (0..7)
$$ [...]
##$SUBNAM2= <"">
##$SUBNAM3= <"">
##$SUBNAM4= <"">
##$SUBNAM5= <"">
##$SUBNAM6= <"">
##$SUBNAM7= <"">
##$SUBNAM8= <"">
##$SUBNAM9= <"">
##$SW= 400.765351723535
##$SWIBOX= (0..15)
0 1 3 0 0 0 0 0 0 0 0 0 0 0 0 0 
##$SW_h= 32467.5324675325
##$TD= 32768
##$TD0= 1
##$TE= 0
##$TE2= 300
##$TE3= 300
##$TEG= 300
##$TL= (0..7)
0 120 53 12 22 120 120 120 
##$TP= (0..7)
150 150 150 150 150 150 150 150 
##$TP07= 0
##$TPNAME0= <>
##$TPNAME1= <>
##$TPNAME2= <>
##$TPNAME3= <>
##$TPNAME4= <>
##$TPNAME5= <>
##$TPNAME6= <>
##$TPNAME7= <>
##$TPOAL= (0..7)
0.5 0.5 0.5 0.5 0.5 0.5 0.5 0.5 
##$TPOFFS= (0..7)
0 0 0 0 0 0 0 0 
##$TUNHIN= 0
##$TUNHOUT= 0
##$TUNXOUT= 0
##$USERA1= <user>
##$USERA2= <user>
##$USERA3= <user>
##$USERA4= <user>
##$USERA5= <user>
##$V9= 5
##$VALIST= <valist>
##$VCLIST= <CCCCCCCCCCCCCCC>
##$VD= 0
##$VDLIST= <DDDDDDDDDDDDDDD>
##$VPLIST= <PPPPPPPPPPPPPPP>
##$VTLIST= <TTTTTTTTTTTTTTT>
##$WBST= 1024
##$WBSW= 4
##$XGAIN= (0..3)
0 0 0 0 
##$XL= 0
##$YL= 0
##$YMAX_a= 2740
##$YMIN_a= -22539
##$ZGOPTNS= <>
##$ZL1= 120
##$ZL2= 120
##$ZL3= 120
##$ZL4= 120
##$ABSF1= 0
##$ABSF2= 0
##$ABSG= 0
##$ABSL= 0
##$ALPHA= 0
##$AQORDER= 0
##$ASSFAC= 0
##$ASSFACI= 0
##$ASSFACX= 0
##$ASSWID= 0
##$AUNMP= <proc_1d>
##$AZFE= 0.1
##$AZFW= 0.5
##$BCFW= 0
##$BC_mod= 2
##$BYTORDP= 0
##$COROFFS= 0
##$CY= -3
##$DATMOD= 1
##$DC= 0
##$DFILT= <>
##$DTYPP= 0
##$F1P= 0
##$F2P= 0
##$FCOR= 1
##$FTSIZE= 65536
##$FT_mod= 6
##$GAMMA= 0
##$GB= 0
##$INTBC= 1
##$INTSCL= 9.790993e-09
##$ISEN= 30
##$LB= 1.5
##$LEV0= 0
##$LPBIN= 0
##$MAXI= 10000
##$MC2= 0
##$MEAN= 0
##$ME_mod= 0
##$MI= 50
##$NCOEF= 0
##$NC_proc= -9
##$NLEV= 6
##$NOISF1= 182.463
##$NOISF2= 159.3651
##$NSP= 0
##$NTH_PI= 0
##$NZP= 0
##$OFFSET= 198.0616
##$PC= 4
##$PHC0= 1343.43
##$PHC1= 173.3009
##$PH_mod= 1
##$PKNL= yes
##$PPARMOD= 0
##$PSCAL= 0
##$PSIGN= 0
##$REVERSE= no
##$SF= 81.0140089999434
##$SI= 65536
##$SIGF1= 159.3651
##$SIGF2= -187.1042
##$SINO= 113.3802
##$SIOLD= 16384
##$SREGLST= <1H.CDCl3>
##$SSB= 0
##$STSI= 65536
##$STSR= 0
##$SW_p= 32467.5324675325
##$SYMM= 0
##$S_DEV= 0
##$TDeff= 32768
##$TDoff= 0
##$TI= <>
##$TILT= no
##$TM1= 0
##$TM2= 0
##$TOPLEV= 0
##$USERP1= <user>
##$USERP2= <user>
##$USERP3= <user>
##$USERP4= <user>
##$USERP5= <user>
##$WDW= 1
##$XDIM= 65536
##$YMAX_p= 335462792
##$YMIN_p= -370933790
$$ End of Bruker specific parameters
$$ ---------------------------------
##NTUPLES= NMR SPECTRUM
##VAR_NAME=  FREQUENCY,     SPECTRUM/REAL,   SPECTRUM/IMAG
##SYMBOL=    X,             R,               I
##VAR_TYPE=  INDEPENDENT,   DEPENDENT,       DEPENDENT
##VAR_FORM=  AFFN,          ASDF,            ASDF
##VAR_DIM=   65536,         65536,           65536
##UNITS=     HZ,            ARBITRARY UNITS, ARBITRARY UNITS
##FACTOR=    0.49542278885378, 1,            1
##FIRST=     16045.7642231865, 0,            0
##LAST=      -16421.768244346, 0,            0
##MIN=       -16421.768244346, -370933790,   0
##MAX=       16045.7642231865, 335462792,    0
$$ Real data points
##PAGE= N=1
##DATA TABLE= (X++(R..R)), XYDATA
$$ [...]
9406 14074262 10201140 6666845 4512083 4003232 3653354 202727 -8630250 -21006277
9398 -21006277 -31306645 -34335112 -29752283 -22471920 -18068139 -17454895 -16640431 -11658671
9390 -11658671 -2455436 8108396 16874691 21306036 20663525 18068045 18532682 22390927
9382 22390927 23609671 18043834 10258217 7222649 7828523 5432611 -21313 -481725
9374 -481725 7384364 15152874 13379275 4547366 -606482 2617835 8087833 8511116 5374236
9365 5374236 6871347 17357533 30939073 36597046 29513152 15796813 5154305 1160476
9357 1160476 1234623 3576753 8824916 15079499 17090745 12625414 5580893 605269 -1749662
9348 -1749662 -2472927 -671423 4329192 10513082 15474177 18388342 17779369 11517812 2255853
9339 2255853 -1588138 4684358 14553972 17595851 12312161 6363961 5459170 7826696
9331 7826696 9529213 9393413 7188453 1753736 -6309333 -12881291 -13843258 -9460185 -4288447
9322 -4288447 -3274820 -7530288 -12780105 -12876744 -6499828 772522 3098040 1611334 2264518
9313 2264518 7741910 14957379 19800400 20545931 16704459 8519131 -1475112 -9451831
9305 -9451831 -13595602 -14043134 -10166391 -1830285 6685894 9012161 4573023 -303333
9297 -303333 -1469098 -2836107 -9799362 -20436156 -27685323 -28127365 -24188464 -18858726
9289 -18858726 -12780187 -6673405 -2592593 -1385152 -1417614 -1016369 -401968 -434611 -1182572
9280 -1182572 -2568312 -4777843 -6952113 -6931639 -3788494 182683 1369887 -1583687 -6983250
9271 -6983250 -12151783 -14998169 -14172818 -9801455 -4572276 -2220433 -3720409 -6291812
9263 -6291812 -7414666 -8319249 -11494762 -15934186 -17696944 -15030827 -10116918 -5365144
9255 -5365144 -944806 2974983 4586620 3132134 1021144 1055196 3200176 6001549 9279702
9246 9279702 13207116 16624113 18745847 20503285 21300849 16962015 5431715 -6970939
9238 -6970939 -10670714 -4869632 523305 -3182573 -13612616 -21614266 -21925441 -16738333
9230 -16738333 -11110664 -7968152 -6747007 -4978749 -1656587 523696 -2036309 -8351840
9222 -8351840 -12886131 -12439336 -10162098 -10525422 -12982165 -13666795 -11334895 -7978196 -4673764
9213 -4673764 -671269 3501023 5677332 5639778 5985721 7900946 8512276 4738424 -1428641
9204 -1428641 -4001195 234467 7641802 11728489 10643015 8715680 9598233 10119632 4447397
9195 4447397 -5908899 -10924629 -3752091 9578117 16407835 12058135 3779056 351688
9187 351688 2517706 5170095 4747855 1482814 -2913448 -6581653 -8134983 -8536386 -10759038
9178 -10759038 -15079838 -16819593 -12294495 -5195042 -2351072 -4016291 -4009667 -82140 2249456
9169 2249456 -1006674 -5235289 -4400356 -719304 -793008 -4908614 -7254149 -5691104 -4053575
9160 -4053575 -4246796 -3284261 -270229 447993 -3307660 -6729494 -5093972 -900607 1046902
9151 1046902 1617456 4598002 8915856 9990746 7454049 5396553 5178840 3664684 -659155
9142 -659155 -4700789 -5303926 -3067005 -393291 1316785 1712230 1295043 1544350 3015329
9133 3015329 3824740 2570401 1467944 3089939 5436418 4709838 1714735 99478 -797575
9124 -797575 -4645824 -9508852 -8194127 625072 8849741 9870652 6468736 3959320
9116 3959320 2196972 -347263 -797348 3088703 6872294 5664126 2863409 5325812
9108 5325812 12409823 17278717 17328113 15742235 13650746 8657134 1668086 -2204661 -1227771
9099 -1227771 584144 274211 -506064 -192150 108224 331973 2040524 3565340 831814
9090 831814 -4579258 -5066636 1446905 6458711 2994643 -3330708 -2772634 3584332 6308683
9081 6308683 3101488 2218965 8978970 16949169 16565614 7448724 -1954028 -4039101 1784905
9072 1784905 10302967 15018675 12936406 7095561 3584702 5083820 8802686 11228173
9064 11228173 12088199 12161129 10415002 6304708 2571190 2264308 4514111 6673284 8952637
9055 8952637 12437790 13687673 7521566 -3506464 -8522087 -956743 12541248 20087727
9047 20087727 18005323 11486175 5059011 -806747 -4567360 -2694254 3829542 7908136
9039 7908136 4790625 -1745009 -4986921 -3789434 -1984408 -2172678 -4200999 -7876591
9031 -7876591 -12781331 -16134802 -14968211 -10669211 -8038949 -9270299 -11596595 -11544414 -9073830
9022 -9073830 -6569170 -5536858 -5238181 -3652971 277754 4566090 5370319 2029776 -484310
9013 -484310 2704736 8802195 9444987 1087903 -10609285 -18401062 -21492057 -22896015
9005 -22896015 -22234739 -16332220 -6293659 951102 -91093 -7468071 -14697614 -17622426
8997 -17622426 -16630778 -13883707 -10899065 -8341571 -5878664 -2034609 3938126 9690987
8989 9690987 11258775 7787155 2972323 581796 389325 238374 70614 1017842 1841639
8980 1841639 48613 -3326180 -3451101 2807232 13475341 23839339 29517523 27361672
8972 27361672 17565828 6225944 1545623 4928237 9221866 8256859 4367396 3268686
8964 3268686 5445131 7259979 7596357 7966885 7756030 4877247 661501 -811892 1606846
8955 1606846 5086071 7219043 7746671 6511076 3776014 2012305 3083464 4232426
8947 4232426 1444895 -3776536 -6048809 -4094125 -1570878 -213859 1485352 2395517
8939 2395517 -1278597 -8564980 -13510714 -14745118 -17667641 -23729004 -25723546 -19245280
8931 -19245280 -11360899 -10712411 -15087589 -16845311 -15569281 -16103272 -17463371 -13731360
8923 -13731360 -4909604 2454379 5779399 9044027 13835438 16051611 13679119 10373744
8915 10373744 8569009 6094739 2990054 4596827 12943365 20958635 21215270 16088129
8907 16088129 12984067 12705161 9490831 1385576 -6199746 -8209314 -5997161 -3726394
8899 -3726394 -2432125 -103812 4411347 9772978 13662338 14759535 13647544 12269970
8891 12269970 12042943 12307028 11175337 8049224 4823470 4395943 7960327 13352621 15955870
8882 15955870 12204414 3154095 -5803621 -9698774 -8464069 -6211607 -6303283 -7740520
8874 -7740520 -6401785 471943 10916134 19314748 21333253 17889212 13507032 10839335
8866 10839335 8485509 4911241 2175584 3224980 6747147 8068625 5245699 937917
8858 937917 -2541184 -6158243 -9886829 -9453988 -1909645 7832810 11693224 9367697 8837617
8849 8837617 14804165 22368731 24780590 21755743 15951936 6746571 -5963957 -15708920
8841 -15708920 -15294535 -7315276 -984028 1180012 5109228 12619324 16447639 11914148
8833 11914148 5331594 4606661 7655617 7053856 1467944 -4770514 -9755155 -13937619
8825 -13937619 -14601851 -8718582 -383683 2654961 197894 -331108 3885703 6532890
8817 6532890 2615914 -3556230 -5110205 -2109537 180259 -1354323 -6275976 -13344791
8809 -13344791 -20346550 -23325349 -19843252 -11711476 -1925875 8880491 19936911 26916704
8801 26916704 25548597 17846856 10745134 8422473 9141953 9744953 9811914 10186547 10177256
8792 10177256 8403378 5162028 1931464 -1207144 -5772393 -11630547 -14859252 -11015275
8784 -11015275 -904920 8915385 12841058 11972358 11415322 13306184 15126660 14110264
8776 14110264 10324810 5519866 1762971 1229606 4358682 7956059 8128449 5378356
8768 5378356 3630100 4197742 4853975 5371538 8703003 14446484 16310105 9959694 -383799
8759 -383799 -7153300 -8002512 -5170477 252617 8070195 15133212 17468485 15696592 13594627
8750 13594627 11778804 7591754 1095031 -3986724 -6297546 -9212091 -15332707 -22228422
8742 -22228422 -25676189 -24428657 -20073528 -14604530 -9793805 -6863154 -5142242 -2680695
8734 -2680695 637957 2346436 904933 -1838734 -3099045 -2557777 -1783344 -1233615 744859
8725 744859 6161838 15033811 24277118 29222468 27653009 22446867 18623769 17487429
8717 17487429 15514830 9764222 2572249 -577021 2871879 9467365 12380327 7166877
8709 7166877 -4015737 -13781901 -16134638 -11802700 -6211986 -3034367 -1660215 -283061
8701 -283061 1654968 4578977 9159173 14050239 15808171 12935319 7969894 3807989
8693 3807989 267778 -3297747 -4330717 149642 7857181 12296100 10393867 6176705
8685 6176705 5430789 8863812 12315704 12263171 9034424 5132463 2402549 1254964 1254028
8676 1254028 1578451 1587001 1714326 3358085 7108462 11491187 14421401 15558582 15886188
8667 15886188 15111016 11493747 5073729 -884849 -3295459 -2721337 -1734146 -1319653 -1386177
8658 -1386177 -3540918 -9591794 -16952170 -19297326 -13798141 -5300937 -1086827 -2992960
8650 -2992960 -6749064 -7803523 -5361452 -1167477 3113039 6393473 7404772 4718270
8642 4718270 -2074418 -10932626 -17339544 -17144174 -10802388 -4242637 -3750131 -9387289 -14620471
8633 -14620471 -13505363 -7661589 -4640623 -8992722 -16470006 -18700078 -12832126 -4112955
8625 -4112955 1368985 3435283 5387051 7583727 7245701 3797757 363674 -905948
8617 -905948 -1847895 -5137238 -10294883 -14190468 -13931912 -8619720 -416380 5331556 3826025
8608 3826025 -3571096 -9816401 -10214907 -7579267 -7037293 -8464967 -8028405 -5672661 -6152785
8599 -6152785 -11869614 -18474507 -19348673 -12223529 -241433 11214559 17278973 15587456
8591 15587456 8287456 1482004 387546 4446789 8084216 6413235 -342093 -7698196
8583 -7698196 -11062428 -8961193 -3417091 1843888 3995868 3145172 2160795 3723274 7027926
8574 7027926 8157305 4602555 -1147475 -3822089 -1229388 3190924 4003316 -745115
8566 -745115 -7741047 -11299530 -8134382 -353505 6146084 7221356 4322147 1666045
8558 1666045 207362 -3119509 -9699207 -15585716 -15507978 -9022225 -915528 3536813 2477520
8549 2477520 -1973960 -5416998 -4548475 -592377 1455496 -1508159 -6772050 -9144383
8541 -9144383 -7091021 -3547359 -1492739 -1096968 -1075316 -695349 -74903 26320 -1485656
8532 -1485656 -4739592 -7871442 -8327846 -5196376 308614 6019397 9773537 10303785 8319963
8523 8319963 5805442 3486029 606756 -1913848 -916305 4054146 7933512 5897407
8515 5897407 51670 -3788907 -4608678 -6410361 -10125210 -10921938 -5485050 2458903 6800798
8506 6800798 6497199 5726079 8239024 13531572 17698222 17047856 11513506 4390020 -2017155
8497 -2017155 -8666427 -15503419 -17812552 -11936777 -3060142 -561777 -5249670 -8352135
8489 -8352135 -4994494 -1005625 -2482029 -5897773 -4481204 1357398 6578348 9726332
8481 9726332 11466892 8989250 50962 -9851924 -12608352 -8604347 -5043051 -4348769
8473 -4348769 -2756188 -202105 -2068386 -8974273 -13688781 -11874283 -8215030 -7517049
8465 -7517049 -6883513 -2303047 3012083 3520627 673674 1114365 7904502 18359828 28184352
8456 28184352 33396047 30925530 22138017 13671957 10438847 9895593 7102977 2353607
8448 2353607 -1009592 -3102205 -5895514 -7770634 -6351525 -4842896 -8166342 -13669474
8440 -13669474 -13483869 -6468383 -11028 1387322 1449185 3471524 4005310 -554915 -7209729
8431 -7209729 -10798033 -10290963 -6695399 74536 7751737 10470830 6538027 2987386
8423 2987386 6507114 13795237 17073058 15176531 11964055 7268940 -1738620 -11897650
8415 -11897650 -16102423 -14317252 -13874772 -17481437 -19429848 -16181999 -12323306 -11980012
8407 -11980012 -11864975 -8066332 -3382750 -2079042 -2731320 -2512789 -3831073 -9618532 -15610496
8398 -15610496 -14995406 -8776904 -4131509 -3544331 -2971219 -707591 -500199 -4137198 -7464909
8389 -7464909 -6586528 -3182597 -1107346 -1642446 -4074310 -7110013 -8127290 -5209879 -1424048
8380 -1424048 -2152460 -6221236 -5583217 2673429 10189812 8819992 2973404 2936121 9244094
8371 9244094 12544825 8319800 2822951 2346952 4379767 3574273 627202 -144351 1496709
8362 1496709 1847755 -411493 -2512960 -1800823 1715957 6713850 11450003 13343201 10629503
8353 10629503 5278849 2115153 3796576 7702895 8590791 3842929 -4054289 -9671285
8345 -9671285 -9372183 -4585373 -293798 25603 -2738048 -5884223 -8570224 -11110668 -12005572
8336 -12005572 -8750094 -1817804 4755987 7440226 5697303 180589 -8237171 -16162948
8328 -16162948 -18109614 -12705842 -6142803 -5300654 -8808153 -9617253 -5895643 -3437940
8320 -3437940 -5598079 -6976510 -1762499 6018231 7163484 603417 -4861427 -3082067
8312 -3082067 1528598 1755245 -1875895 -3358139 -1020217 910245 148441 107123 3992899
8303 3992899 9412290 11854958 10743922 8616763 6177785 2286088 -1623954 -1639095 2664972
8294 2664972 6099516 4368958 -110101 -2262754 -1961757 -3006760 -5578950 -5454294 -1837372
8285 -1837372 -134527 -3602711 -7289419 -5460643 -1307997 -2439724 -8308440 -9711211
8277 -9711211 -1815353 9183570 15039428 15145637 13582240 11803616 9406050 8390139
8269 8390139 10777272 13824365 12870048 8053558 3837577 2896764 4759968 9111931 15252591
8260 15252591 19128143 16879390 11741818 11505165 17856110 23943697 24154314 20126643
8252 20126643 14544377 5983780 -5123153 -11628704 -7974330 425240 3575165 456796
8244 456796 -1379245 1370523 3700381 2108875 367326 2060185 4005299 2050282
8236 2050282 -1358355 -1048500 2377632 3703477 1588272 431686 3136753 6370991
8228 6370991 5042320 -835614 -5648706 -3891269 4214710 12321115 13426636 6620573
8220 6620573 -2003071 -5925475 -4666361 -2352560 -1389226 -449863 1630253 3369622 3155131
8211 3155131 1613754 -32014 -1783329 -3374750 -3230421 -1333183 -1202338 -5631338 -11363450
8202 -11363450 -11865738 -5723339 1569796 5545925 8545248 14508236 21122039 22054277
8194 22054277 16274902 10120547 8656048 9122257 5884348 -966009 -5900630 -5787911
8186 -5787911 -3406982 -2535870 -3035562 -2836598 -2342560 -3680905 -6158621 -5594087 636652
8177 636652 9791452 16674336 19254890 19395738 18536549 15463628 9462104 3247095 300460
8168 300460 516239 1219659 1849336 4229808 7842279 8805965 5709228 3045295 5332260
8159 5332260 10156222 11480287 8802689 7989650 12412942 18241973 20782863 21120432 22610339
8150 22610339 23718384 19276104 8222994 -4084503 -11725172 -13114128 -9691651 -3447705
8142 -3447705 2672436 5318262 4630203 5452027 11292470 18186477 18309119 9918147 125690
8133 125690 -3632794 -1825880 -239711 -1827125 -4808035 -7631760 -11299539 -15841923
8125 -15841923 -18374946 -16951676 -13611804 -10989695 -8256381 -3785848 -6878 -1098746
8117 -1098746 -6126760 -9097440 -6948359 -3186391 -1497406 62425 4851556 10787995
8109 10787995 12573727 9505141 6274162 5898297 6221144 4445989 1167145 -1984029
8101 -1984029 -5301278 -8982263 -10702486 -8271046 -3146036 1612785 5701739 10678298
8093 10678298 15312487 15566704 10205803 3560989 986770 3294526 7054815 8664761
8085 8664761 6340720 -307656 -9813112 -17918686 -19477113 -12541817 4904 12996681
8077 12996681 22300064 26020802 24559529 20563752 17336221 15684906 13085156 7357512
8069 7357512 345258 -4001216 -4778506 -4878828 -6096592 -6131462 -2189968 4441067 9925128
8060 9925128 12899967 15252448 18257482 20859220 22163031 22590151 21336190 15872323
8052 15872323 6622433 -373122 567115 7027580 10955510 9193890 7027722 9220479
8044 9220479 12060569 9024362 1906255 67220 7687901 17163958 18473661 11629097
8036 11629097 5504257 5974599 9993997 11680879 9721576 6572702 3750562 1471189
8028 1471189 1380351 5708387 13304824 19509878 21275677 20364986 19928565 19624081 16437305
8019 16437305 9683131 2683386 -1062399 -1412334 -205391 1931092 5304339 8346924
8011 8346924 7772699 2778782 -2491174 -2710478 2518430 7943539 8646254 5508693 3497443
8002 3497443 5105604 7275706 5543652 -95477 -5170541 -6372111 -5246035 -5235026 -6603542
7993 -6603542 -6454390 -3427569 45546 1133993 532273 1476972 5639834 11206731 14523069
7984 14523069 12916944 6972178 1141001 785464 6696928 13420047 15170428 12671873
7976 12671873 11389566 13346379 14361044 10573952 4315125 981692 2220445 4839831
7968 4839831 5153110 1974813 -3664163 -9285334 -11986741 -10976918 -8836763 -8390413 -8920988
7959 -8920988 -7704500 -4692103 -2766981 -3191499 -3831054 -2869430 -1455876 -937582 123981
7950 123981 3652207 8241896 10511129 9909504 9426492 10784411 11182224 6585474 -2800229
7941 -2800229 -12276529 -17742068 -19212485 -18786433 -17151397 -13871911 -9801198 -6663080
7933 -6663080 -4581376 -2602159 -1652910 -3794787 -7652804 -8103403 -2651799 4884752 9691620
7924 9691620 11989788 14339526 15800590 13565971 8718945 5156957 3511319 1348736
7916 1348736 -963412 -447542 1983450 1619803 -1746810 -2221059 2323897 5175654 514165
7907 514165 -6990925 -8296886 -2046585 5569410 10257215 12598690 13367078 12386832 11648450
7898 11648450 13715457 16791851 16418563 12147054 7552496 3727772 -1569999 -7695456
7890 -7695456 -10025133 -6788903 -1509276 3434494 10098267 18936152 24964261 24184792
7882 24184792 19504008 15696291 12242601 6415129 554156 48533 4860696 8624492
7874 8624492 6858219 1892920 -1373494 -1338168 -167277 -901207 -5113483 -11497272 -15822648
7865 -15822648 -13809251 -5188929 5381464 11588442 9823324 1708806 -6789631 -10221912
7857 -10221912 -8988898 -8427346 -11276958 -13362733 -9410804 -1208374 3759076 1147609
7849 1147609 -6200752 -12705807 -15054329 -12839658 -8098973 -5063275 -6820730 -10914992
7841 -10914992 -11442115 -6878614 -2367855 -2216989 -3716562 -1702928 3533147 7141171
7833 7141171 7162466 6723092 8741261 12356132 15680582 18732755 21544530 21766642 17074649
7824 17074649 9168114 2693945 -103815 -1367139 -3170099 -3294752 1684336 9611652
7816 9611652 12678667 6128324 -5325762 -12728168 -13180581 -11247784 -10425451 -8013048
7808 -8013048 -803214 7957952 11631086 8951138 5715596 7346785 12740623 16411750
7800 16411750 14539643 7852701 309531 -3781724 -2486010 2609701 8205751 12397312
7792 12397312 15184647 16162361 13704087 7420362 -81521 -5193313 -6161250 -3287146
7784 -3287146 1970492 6695363 7366244 3753342 790261 3199594 8466562 8892835 1594610
7775 1594610 -7229864 -10062258 -6663541 -1712311 3047425 9076789 14442887 13087653
7767 13087653 3058823 -8631440 -12818056 -7873192 63705 4714681 4490790 961386
7759 961386 -3755010 -7505146 -8690043 -7692197 -6707435 -7761774 -11569903 -17667179 -24079337
7750 -24079337 -27477785 -25880187 -21068021 -16111667 -10949238 -3801639 2800953 2332062
7742 2332062 -6354202 -13975496 -10457431 1779011 9663961 5336573 -4679511 -8441902
7734 -8441902 -2881524 4566456 6561330 3747322 1642153 2846439 4372697 1957419
7726 1957419 -4268463 -8888271 -6282579 3301511 13558988 18658519 18969368 18929875 20259668
7717 20259668 20039799 16014321 10841303 8727831 9460115 8790193 4542256 -611751 -3338270
7708 -3338270 -3939186 -4541378 -5067663 -4050886 -2686237 -4438816 -9530772 -12843678 -9768363
7699 -9768363 -2470709 2419422 1627270 -2069350 -4839587 -6259710 -7536225 -8102686 -6524426
7690 -6524426 -3402022 -871320 262504 854571 1384461 1786094 3065895 6582438 11288729
7681 11288729 14091669 13896465 13141893 14068843 15510128 15072525 12676038 9711503 6008762
7672 6008762 297540 -6636689 -11488765 -11378231 -6087399 2003193 8731243 10083362
7664 10083362 5926114 1414442 1922741 6526162 9296291 7106474 2551439 -1710156
7656 -1710156 -7051859 -14476469 -19964240 -18921291 -13408201 -9848909 -9741488 -7655897
7648 -7655897 141355 9552303 14059978 13107879 11318836 11155246 10637214 8155278 5244566
7639 5244566 3108594 90150 -4528484 -6984292 -3520345 2650755 3665873 -2856993
7631 -2856993 -10429333 -12481750 -10207830 -8067128 -5616003 68295 5915809 4619077
7623 4619077 -3750988 -8995289 -3711254 6206619 9258799 3182078 -3727123 -4498642
7615 -4498642 -685788 2606828 3517002 3318848 3384053 4743076 8237858 12783102 15022369
7606 15022369 12755838 7825364 4021220 2796253 2481634 1329252 -219796 -705072
7598 -705072 -24777 522573 648136 2209404 6452738 10548169 9138830 449948 -10637416
7589 -10637416 -16956124 -15601739 -9436003 -3695468 -2175264 -4714910 -6687064 -2995305
7581 -2995305 5309838 10785644 8898109 4892972 6798849 13441757 15572821 9121424
7573 9121424 858391 -1583470 204699 -648619 -6175642 -12217277 -15145898 -15216610 -13568028
7564 -13568028 -9856714 -3991159 2032069 5433322 5367825 4017343 4784749 8691814 12670416
7555 12670416 12710626 8682420 4168855 1348066 -1213488 -4442938 -5379157 -693687 7922844
7546 7922844 14750039 16036956 12925922 8721874 5463243 3737408 4159621 7292850
7538 7292850 11731127 13341711 8460049 -1094302 -7834716 -5655085 3634032 12855524
7530 12855524 17530892 18715849 19005529 19779830 22273068 26892254 30662504 29713161 25417617
7521 25417617 23391815 24857023 24284588 18208445 10955544 7933645 8417174 9539260
7513 9539260 12270732 17452420 20288903 16123564 9029256 7183928 11052300 13390739
7505 13390739 10541476 6661677 6161715 8316229 10456463 10880896 7644043 -29745
7497 -29745 -8080406 -10797039 -8737712 -7888516 -9827938 -9164627 -3134145 2663100 2064380
7488 2064380 -3086816 -6453737 -5669682 -3515772 -3517508 -7362694 -13945177 -18644764 -16705778
7479 -16705778 -9408613 -3287685 -1371771 154827 4128107 6935613 5066047 1732768
7471 1732768 1231734 1030735 -3810494 -11311646 -14811775 -13063292 -11176791 -11803866 -11903533
7462 -11903533 -9059234 -5193408 -2408645 10598 2534234 3382327 1706635 -383364
7454 -383364 -941133 -814096 -1475566 -2437905 -2577375 -2484716 -3855443 -7072532 -10102332
7445 -10102332 -9823059 -5250986 50732 674264 -3840432 -7114128 -3664998 3560881
7437 3560881 7433468 6877877 7508219 11969018 15548843 13751372 9343902 7952369 9633637
7428 9633637 9247786 4419311 -497906 634703 8352760 16128994 16504874 8800320 10782
7419 10782 -2841246 -145030 2302950 1426234 -464682 -1119411 -2240392 -5788393 -9470469
7410 -9470469 -9111030 -4267561 1259396 4268298 5466622 7560652 11216117 13765123
7402 13765123 12193990 7145797 2690503 1311597 828666 -1617296 -4205734 -2744682
7394 -2744682 2151596 4657800 1648944 -3099676 -4682206 -3303376 -2009065 -1602925
7386 -1602925 -1427300 -2473224 -5437777 -7478351 -5538681 -2182502 -3441540 -10390138
7378 -10390138 -16953189 -17295605 -12046834 -5742865 -1024023 2739790 7180085 13042341
7370 13042341 19019016 21392100 16943573 7767565 1082657 2058284 8292156 13540287
7362 13540287 15342466 15965785 16677913 15037765 9204648 2143960 -972245 1204225
7354 1204225 4633387 4518535 436871 -3715725 -4586690 -3383484 -4203573 -8469220 -12566365
7345 -12566365 -12195330 -7874100 -4160003 -4022848 -6388747 -9124183 -11423649 -12399661 -10668460
7336 -10668460 -7637548 -8415251 -15946439 -25628674 -29353690 -24626954 -16732796 -12099439
7328 -12099439 -12517906 -15816508 -18780976 -18599405 -14517314 -9387879 -7236577 -8351035
7320 -8351035 -9097999 -7153449 -4017146 -1591219 348641 2029621 2629734 2957160 5261788
7311 5261788 8322010 7285493 1590879 -1793386 2185150 8250233 7898611 1588162
7303 1588162 -3300711 -4541876 -6909373 -12055946 -14818194 -11791329 -6803177 -4943211
7295 -4943211 -6646482 -10271081 -14981011 -18076760 -15089849 -6508804 468000 1107611
7287 1107611 -529889 982549 3409685 1270533 -4267516 -6790273 -4201320 -411636
7279 -411636 1819127 3640133 5628550 6317645 6208042 8213601 12467571 14728141 11682066
7270 11682066 4715864 -2698506 -8229913 -10341142 -8117891 -3078372 1304811 2981052
7262 2981052 2132347 -1247245 -7125201 -12504271 -13079772 -9294751 -6604230 -7751463 -9013083
7253 -9013083 -6686889 -2789968 -494404 1892653 7178777 12600002 12978166 9063053
7245 9063053 6669829 7990059 9785037 10408024 12058090 14512698 13487305 8729411
7237 8729411 7373907 13683038 20440262 17879716 8444920 4408846 10787268 18598457
7229 18598457 17648649 9230610 1719969 -1210715 -2087558 -2480872 -1094104 1271978 761479
7220 761479 -3720417 -7857854 -7537370 -4347045 -2907837 -4614452 -6873033 -7735393 -8351375
7211 -8351375 -10178132 -11857631 -10468610 -5191236 1712358 7562353 11479073 13257603
7203 13257603 11558600 5345512 -3076683 -8745714 -8680467 -4330234 1152094 5865685
7195 5865685 8172374 5654680 -1645747 -8310538 -7692227 566842 9804575 13634391
7187 13634391 11718185 7809251 4462735 989893 -4568716 -12187136 -18036809 -16794970
7179 -16794970 -7656565 2762746 6394268 2533895 -2326264 -3674683 -4242729 -8644025
7171 -8644025 -16203984 -21734702 -21408481 -15664106 -7889108 -2138618 -794437 -2738416
7163 -2738416 -4676646 -4974709 -4744287 -4915162 -4696660 -3563212 -1919122 909132 5808237
7154 5808237 10090678 9292601 4904416 4912079 12675281 20459443 19734713 13516846 11162448
7145 11162448 13905887 14347230 9757657 6817626 10871259 18067806 21889029 21581811
7137 21581811 20012761 17980189 15165063 13096557 12683776 11465738 7510860 3895451
7129 3895451 5095781 10393770 14961688 16720573 18218822 21669077 25489604 26524694
7121 26524694 23414377 17166831 10128794 4872917 2868204 3917175 7280877 12367320
7113 12367320 17338575 18811751 15450315 10970162 10574464 14215359 16105903 11690136
7105 11690136 2768705 -5319688 -9406555 -9963963 -8940219 -8257971 -9214292 -11268470 -12302592
7096 -12302592 -12076704 -14232712 -21842495 -31406529 -35070018 -29840101 -21133462 -15423062
7088 -15423062 -12915441 -10263999 -6825130 -3682189 692581 7683460 12656134 8904914
7080 8904914 -1592111 -8319448 -5701050 192192 2299307 3218793 8937947 17335416
7072 17335416 21230545 19997544 19369286 20553693 18520688 12350379 8533338 10339405
7064 10339405 11348878 5079762 -4352071 -7724533 -3828321 -531192 -3515256 -9726007
7056 -9726007 -13039129 -11921010 -9087135 -6357640 -3105960 569484 1898185 -1584938
7048 -1584938 -7936709 -11814749 -10274370 -5979062 -3537585 -4085635 -4882697 -2832686 3150193
7039 3150193 11444715 17250922 14989115 4554223 -6105271 -8152998 -866559 9397240
7031 9397240 17390364 22003020 22969914 20335779 16998009 16172292 15945112 11860085 5253065
7022 5253065 2575453 5187251 6856875 3976873 1097433 2188932 3132616 -1297820
7014 -1297820 -8145514 -10379405 -6843458 -2133044 952469 3326671 5786972 8100588
7006 8100588 10550014 12551188 11499509 6448667 800875 -1824617 -1749419 -452648 2485940
6997 2485940 6197605 7020837 4700111 4834112 9388715 10552376 1997896 -8786006
6989 -8786006 -9404431 -691738 4816558 1247053 -4736412 -6650185 -5734628 -3866214 484084
6980 484084 5860483 7039807 4567816 5795595 11893927 13451939 5256254 -3685709
6972 -3685709 -3197151 2389965 1231386 -8373385 -17138583 -18732961 -15277753 -10189721
6964 -10189721 -4215075 986523 2618610 1553595 1957358 5085479 8016983 9117940
6956 9117940 10245858 12691476 14968591 15590706 14635675 11915421 6880728 1013947 -2695407
6947 -2695407 -3369210 -2909165 -2932713 -3497070 -4534359 -5655750 -4870439 -790235 3937323
6938 3937323 4736181 695319 -5264378 -11403604 -17885379 -22293962 -20118191 -11924885
6930 -11924885 -4717298 -2457923 -72595 7685996 15149715 11216137 -4409440 -18098432
6922 -18098432 -18322815 -8952696 -1952929 -1151204 81025 6430985 13479335 15353839
6914 15353839 13692707 14073447 16673184 16203794 10619554 4718072 3634112 6370852
6906 6370852 7770390 4525770 -2469839 -9787797 -13794563 -12850578 -8711639 -4780837
6898 -4780837 -2383801 -320130 1701741 1962242 224116 -649809 1307178 4068956 4936814
6889 4936814 4500961 4250003 2425236 -3750005 -12648785 -18913867 -19514305 -15958192 -10583104
6880 -10583104 -4075262 2764489 8040863 10903660 12364576 12819481 10820369 5654226
6872 5654226 -400379 -3679002 -2149381 3570279 10869606 16386370 18202491 17744986
6864 17744986 18450288 21912377 26307687 28836352 28267093 24665321 18488488 11260984
6856 11260984 5920172 4938536 8278263 13607484 17749220 17762392 12520579 4829571 670935
6847 670935 3912691 11694490 16973467 16148565 12434280 10800619 11562000 11302513 9143734
6838 9143734 8594902 11960697 15872100 15287493 10420224 6133452 4676074 2976445 -1465610
6829 -1465610 -5754589 -5907569 -3725590 -5122294 -11653106 -17478905 -16445663 -9844346
6821 -9844346 -4674416 -4872455 -6704980 -3935344 3821712 10087249 9241424 3235081 -1108654
6812 -1108654 -100829 4034006 7659437 9623751 10029264 8494283 5588332 3579255
6804 3579255 3592820 3858416 2747686 1687834 2849118 5679231 8171257 10029520 11987724
6795 11987724 13371831 13103224 11955884 11036839 9214219 5119336 654884 -864512
6787 -864512 658159 2723023 4647656 7378280 9439363 7934837 4265528 3914647 8589818
6778 8589818 12906558 11716516 7282438 5774370 8883272 12202959 10790818 3944919
6770 3944919 -4468294 -8572163 -4877154 3552708 8354021 3574595 -8227157 -18939626
6762 -18939626 -22862295 -20010380 -12888781 -3151275 7776394 16766358 19596647 14173927
6754 14173927 3265266 -6578782 -10009963 -7117586 -2120572 1593606 3618749 4424734
6746 4424734 4047805 3554616 4801305 7031115 6365968 1131007 -4423693 -4759247 -222007
6737 -222007 3447014 2257963 -2287043 -6654055 -9651903 -12360557 -15664965 -19265553
6729 -19265553 -22375619 -24502137 -25633958 -25739248 -24031177 -19330818 -11592610 -2352190
6721 -2352190 6725475 14474412 18767135 16638928 8150255 -1352374 -5909188 -5485715
6713 -5485715 -4891152 -6371548 -7096953 -5195902 -4251863 -8469425 -15775069 -19851786 -18412116
6704 -18412116 -15506798 -15002688 -15491288 -13700942 -10102369 -7992124 -8414882 -9319142 -9460518
6695 -9460518 -9828043 -10455911 -8986439 -4431839 -221997 -920371 -6749300 -13368449 -16426455
6686 -16426455 -14570309 -8843904 -1531296 4469260 7286692 7539702 6869031 5415799
6678 5415799 2605393 -156177 -445244 1119288 655498 -3995558 -10571783 -16033453 -20239163
6669 -20239163 -23862394 -25178893 -22346664 -17709575 -16056851 -18212550 -19553173 -16278608
6661 -16278608 -10637992 -7623436 -7953075 -7410183 -3356340 1144957 1762082 -483712 -318344
6652 -318344 4254589 8973434 9156036 5513738 1941163 159152 -315788 984776 4445018
6643 4445018 7062075 4775415 -1338003 -5190808 -3197390 1757455 5122298 5979284
6635 5979284 5696066 4467418 1761199 -1822966 -5126552 -7148268 -6159176 -932518 5566098
6626 5566098 7182240 2180367 -2989388 -1151585 6258785 11013454 8081087 239177
6618 239177 -6676174 -9579407 -8919750 -6703374 -5022116 -5081133 -6529800 -7674881 -6303414
6609 -6303414 -1097407 6135824 10226008 7538967 1293223 -1579951 477980 2235571
6601 2235571 721223 -253270 1911928 2505549 -2337427 -6645857 -2286042 7311043 10511329
6592 10511329 4007721 -3393036 -4926107 -4681240 -8554627 -14150967 -15178745 -10636605
6584 -10636605 -4364907 577274 2236860 -1952137 -11766352 -21050462 -22825259 -16758019
6576 -16758019 -8299592 -1962480 1101813 614351 -3259854 -8027936 -10235757 -9364175
6568 -9364175 -8105627 -8719745 -11117250 -14286613 -17446892 -19707569 -20331101 -19458190 -17480281
6559 -17480281 -14310403 -10666169 -9168697 -12047980 -17841165 -22062695 -21307764 -15662848
6551 -15662848 -7575677 50928 4740122 5159392 1890777 -2773660 -5958740 -5433820
6543 -5433820 -885978 5335629 9709225 10764443 10285528 10800461 12884636 15584773 18042200
6534 18042200 19389885 18351065 14804185 11074054 9805387 10694769 10860921 8483026
6526 8483026 4764594 2170253 1907234 3449438 5458415 6447099 5167472 1493285 -2619498
6517 -2619498 -3773172 -14653 6632356 11701263 12918717 11853271 10104486 6347103
6509 6347103 -207569 -5626078 -5007016 82350 2867061 1031223 133641 4872648 11396535
6500 11396535 12246606 5925769 -2707000 -9514869 -14006301 -16087433 -14491100 -9377850
6492 -9377850 -3637977 -529485 -1294548 -4833603 -8225777 -8338386 -4904220 -1417622 -1101240
6483 -1101240 -2843672 -3314218 -2107203 -1902409 -3897685 -6202293 -7233637 -7904771 -9253234
6474 -9253234 -9941294 -7678161 -2231717 4132219 9102784 12689561 16579265 20674730
6466 20674730 21369554 15562567 6151906 62107 -305278 286263 -1901437 -3263697 871191
6457 871191 7461672 9530286 6803976 5776675 9381455 13230840 13115666 9978395 5702283
6448 5702283 227498 -4302542 -2600744 6135354 14336736 14751515 9598701 6232210
6440 6232210 6675756 6921537 4719720 2176681 735431 -1297301 -5023746 -8288387 -8093866
6431 -8093866 -3759859 2493854 6428222 4241419 -3210616 -9642823 -10081213 -7523527
6423 -7523527 -8760933 -13962653 -15853951 -10759746 -4852468 -5578226 -11151306 -13874437
6415 -13874437 -11378408 -8363822 -7579807 -5600764 125083 5399065 4820535 98866
6407 98866 -2082973 778985 4774753 6389409 6687240 7341001 6913028 3769669 -682997
6398 -682997 -4730057 -9343108 -14866106 -17528414 -14085091 -8160052 -6341382 -8395276
6390 -8395276 -7343148 -195790 7492825 10231598 9985525 10955601 11841614 8813787 3126344
6381 3126344 -170599 244211 1245470 1596914 3559970 7494596 9891389 8634084 6242846
6372 6242846 5712651 6498410 7077408 8361087 11197239 12719223 9457589 3711282 2669526
6363 2669526 9529476 18155414 19196324 10645455 -107974 -4915898 -3309305 -1163781
6355 -1163781 -2873429 -7142809 -9693397 -7541132 -689943 7684935 12303292 10000863
6347 10000863 3993306 965185 2501830 3043068 -1110929 -4857438 -1079451 8379642
6339 8379642 14507628 13137506 9260289 8629824 10551748 11021239 8575464 4523070 773858
6330 773858 -350415 2678111 7443296 8769757 5258840 1499505 1448250 3045205 2357631
6321 2357631 -360085 -2549594 -4421030 -7774452 -11683916 -13591012 -13304128 -12099259
6313 -12099259 -9537480 -5375331 -2888338 -5264937 -9773254 -10880947 -8608998 -7961731
6305 -7961731 -10007385 -10140851 -6757257 -4918556 -7942052 -10997826 -7812549 73125
6297 73125 5366922 3747117 -3341052 -12083305 -18537945 -19626387 -15996310 -12610454 -13115290
6288 -13115290 -15009530 -13446020 -8040587 -2667810 -461122 -2406012 -8343501 -14927368
6280 -14927368 -15064938 -5256523 7635423 12980409 9464668 5514996 6503318 8468432
6272 8468432 6457972 2377111 813904 2218306 4365117 6708224 9448385 11541126
6264 11541126 13013573 15971684 20022911 20318675 13996967 5169732 -606052 -3398764
6256 -3398764 -5957182 -7482566 -6186494 -4943163 -7413827 -10427846 -7807290 -1170502
6248 -1170502 1094879 -3387050 -7186663 -4686632 -113389 268043 -2268305 -2707283 -1196620
6239 -1196620 -1933104 -5378509 -7202962 -4587224 278298 2874186 259380 -6572182
6231 -6572182 -12212163 -10700582 -2492418 4477772 3653102 -2379108 -6442269 -6740962 -7434891
6222 -7434891 -10477160 -12545400 -10953988 -7791128 -6079039 -5215000 -2533909 2757657
6214 2757657 8994092 13762286 14949869 11707518 5660076 93992 -2780758 -2858290 -667537
6205 -667537 3191457 7013238 8727657 8453321 8347415 9267660 9737919 8968471 8344421
6196 8344421 8513292 7459522 3573115 -1193047 -3505511 -2789294 -1155772 -195738 158173
6187 158173 303647 468706 1237859 3033016 5247204 6946265 8021804 8931280 10212904
6178 10212904 12967729 18238294 24593387 28120938 26889733 23947618 23409270 24715998
6170 24715998 23652132 18469116 12058004 8135117 7968229 10750564 14193959 14532310
6162 14532310 9350412 1617050 -2002469 1444486 7559019 9725101 5986429 -215504
6154 -215504 -3930542 -2198301 3767134 8309588 5870415 -2164529 -7647916 -5017813
6146 -5017813 2070867 6157217 5150181 2204573 -1065375 -5710474 -10295984 -10386791 -4986224
6137 -4986224 604164 783045 -3983188 -8548598 -8700137 -3891095 3567205 10288413 14013729
6128 14013729 15097249 14867177 12793364 7701668 1903287 581155 5400878 11649234
6120 11649234 13807477 11380029 6931812 1229466 -6047541 -12441280 -13653095 -8506235
6112 -8506235 -301068 6906469 11273389 12590440 11169752 8170762 5919605 7308359
6104 7308359 14538638 26855366 38707168 42509223 35828261 24744521 17735197 17161929
6096 17161929 19037263 19649296 18832987 17245198 14539086 11275303 9382947 9167108 8361874
6087 8361874 5803768 3896464 5299668 8401379 8304771 2442881 -5963514 -10709043 -9019362
6078 -9019362 -4905272 -5163015 -11716241 -19349757 -21905101 -18821777 -13804209 -9141954
6070 -9141954 -4429482 370044 4253090 7388029 10813698 13921440 15140373 14832585
6062 14832585 14286122 12361682 7277371 1692916 1108166 6142815 11293891 12992893
6054 12992893 13629764 14939196 13041420 4742817 -5560407 -10886175 -10782541 -9888957
6046 -9888957 -9514359 -6854744 -1944019 979736 339859 200130 3926702 8699630 9400443
6037 9400443 5741766 2459192 2938549 4898944 3271967 -3101420 -8680176 -6469525
6029 -6469525 3716605 13978154 16465623 11187868 4195386 -29435 -1626023 -2082221
6021 -2082221 -1506672 330874 2806169 5226816 7269512 8149328 6738120 3001146 -1637849
6012 -1637849 -5581198 -8054788 -9044088 -8898007 -7619282 -4198028 2280935 10193000 15419497
6003 15419497 15021643 9991552 3916214 458939 2122558 8308075 13631116 12289980
5995 12289980 6461914 5821502 14728962 24355642 23483934 13762617 6761576 7543057 9665462
5986 9665462 7157606 2801587 1120310 359280 -3191235 -7589391 -7679850 -2942356 1588437
5977 1588437 1281395 -4082628 -11092778 -15285164 -14272702 -10152065 -7478300 -7710347 -7695828
5968 -7695828 -4722271 -228872 3172903 5218738 6093090 4090509 -1474498 -7301781
5960 -7301781 -9700885 -9679001 -10912974 -13671538 -14435537 -11434384 -7228932 -5080336 -5218027
5951 -5218027 -5758858 -5714490 -5851384 -7035849 -8556160 -8666977 -7033530 -5683930 -6195073
5942 -6195073 -6770615 -4436103 196274 3355684 3598803 3356296 3880435 2513684 -2622016
5933 -2622016 -8567474 -11280999 -10808336 -9316486 -6233836 558081 9694476 16349763
5925 16349763 17456056 14318291 10041839 6450869 3537144 443338 -2920084 -4807495
5917 -4807495 -3534806 -758309 -103529 -1392533 49579 5832574 10243312 7647929
5909 7647929 784770 -3545476 -4535599 -6912546 -11693367 -14349110 -13003664 -12097812 -15430778
5900 -15430778 -20364696 -21762656 -18147840 -11586525 -4712396 -248544 -408610 -3875457
5892 -3875457 -5498536 -1716316 4978216 8901506 7388151 2850903 -39128 1731668
5884 1731668 6853798 10223340 8084536 3195558 2143703 6569166 10626253 9373872
5876 9373872 5912477 6104991 8820554 6948658 -2023918 -11605372 -14308842 -10379729
5868 -10379729 -5864076 -4440015 -4451601 -3089418 -172800 2793661 4726681 4769883 2014680
5859 2014680 -2495213 -4803459 -1923701 3406887 4751799 -229549 -6491609 -7833479
5851 -7833479 -4370894 -1383981 -2069390 -4420381 -5222088 -4404873 -4296595 -6076607 -8391621
5842 -8391621 -9355671 -9193988 -10147264 -13216278 -15816806 -14483884 -9856867 -6516513 -6998118
5833 -6998118 -8581724 -7681954 -4859407 -3093783 -3372206 -4921583 -7822834 -11811181 -13758874
5824 -13758874 -10240036 -2387145 4913577 8380864 8188134 5497122 1822344 370379
5816 370379 3772759 9662346 11931772 7576826 -165462 -6041962 -7659570 -5785074
5808 -5785074 -2403602 702546 3024081 4907417 5037564 486565 -7948736 -12982539
5800 -12982539 -8023166 4272260 15351715 21137283 23385700 22327209 15873692 6907603
5792 6907603 3182664 6908448 11114637 9770272 5386081 2918646 2216770 1020216
5784 1020216 60058 294581 -324747 -2772143 -4194655 -3563603 -4808045 -9132511 -9755573
5775 -9755573 -1022384 11739224 18685271 18099882 15277864 12378752 7868093 3779167
5767 3779167 4594940 9447381 13339177 15598547 19096065 21427453 15943272 2991441
5759 2991441 -8366120 -12336260 -12441986 -12931422 -11981799 -7442906 -2280309 665595 3540969
5750 3540969 8060553 10444417 7266319 2065348 455229 2076302 3035488 3377532 5969430
5741 5969430 9726789 10152217 6315771 1983531 -528845 -2878522 -6125158 -7837232
5733 -7837232 -5694714 -1286748 1524933 597075 -2992608 -5974214 -4885700 1154189
5725 1154189 8515996 11149565 6105253 -3230755 -10330546 -11981949 -10841386 -11359533
5717 -11359533 -14283355 -16690386 -17120974 -18116846 -22132472 -26941768 -27832768 -23560029 -17372199
5708 -17372199 -12416726 -9009046 -6703869 -6027869 -6906323 -7527717 -6043275 -2057505 3850307
5699 3850307 10176187 13935223 12645541 7586089 2614965 -960712 -5493915 -11843700
5691 -11843700 -16192000 -14131248 -5818204 4700911 13264786 17207783 15769867 11131473
5683 11131473 7070670 4655020 1417001 -3396833 -5927924 -3313593 600973 -230449
5675 -230449 -5264211 -8229207 -6864287 -6453080 -11388647 -17482233 -16911981 -9210028 -2854923
5666 -2854923 -4895369 -12186360 -15637280 -11707455 -6017108 -4822570 -6549230 -4803907
5658 -4803907 2373639 10330003 14315605 14036193 11059532 5821858 -606862 -4824248
5650 -4824248 -4160756 -292895 2140455 -51242 -6218884 -12635053 -15297421 -13596746
5642 -13596746 -11240867 -11563534 -12622912 -10366223 -6131148 -5842780 -10655424 -14089022
5634 -14089022 -11239766 -5384383 -1422968 1966736 7867525 12880233 10579450 1869887
5626 1869887 -4484125 -1889408 8026252 18912845 24767328 22096287 12064530 1229766
5618 1229766 -3667499 -2376895 -111630 -672972 -3673355 -7138120 -8763900 -5775236
5610 -5775236 1813324 8534477 8863525 4705008 2543984 3898917 4493530 2692367 1935766
5601 1935766 3659099 4657391 3777666 4658475 8522826 10324306 6363286 738319 -377707
5592 -377707 3203325 7749362 11840980 15668080 17233256 14447765 9272660 5592058
5584 5592058 4480069 4835086 6354764 8170135 7021856 1293711 -4777933 -5327063 -415701
5575 -415701 4186529 3714210 -2118313 -10390286 -16073100 -14028189 -4490375 4845240 6691721
5566 6691721 2781456 72477 324359 -306954 -2186982 -370799 6363211 11504506 9573815
5557 9573815 3999320 2149960 5950499 11336484 14486361 14756991 12967122 10165782
5549 10165782 7503478 5058144 1456113 -3852869 -9254107 -13363871 -16912888 -20258244
5541 -20258244 -21088802 -17619795 -12743676 -11407008 -13951640 -15412469 -12231016 -6770729
5533 -6770729 -3685684 -4247458 -6559413 -9731888 -14655239 -20577127 -23878636 -21882441
5525 -21882441 -16238947 -10731952 -6826334 -3487171 -652630 65245 -1186893 -970959
5517 -970959 3808034 12123596 20041872 24530991 24979781 22424565 18768319 15634521 12776053
5508 12776053 8939037 5194857 4991561 8957372 12271105 10309389 4858643 1021899
5500 1021899 -331281 -2385660 -5376941 -5068311 631515 7905890 11842079 11805755 10267765
5491 10267765 9100847 8883884 9649993 10709668 11305608 11949922 13017436 12224541 6961708
5482 6961708 -487597 -4178678 -2108001 1676654 3998314 6450657 9685956 9344524
5474 9344524 2461996 -6324422 -10564064 -10833003 -11853048 -13343556 -10817846 -4770182
5466 -4770182 -1797958 -5051898 -9462113 -8973681 -4022676 981058 4135822 6932705
5458 6932705 10725140 14907026 17726252 17565845 14197289 9285318 4734014 611986
5450 611986 -4179063 -9853591 -15773630 -21182746 -23963674 -20941564 -12913489 -7047995
5442 -7047995 -9043054 -14353973 -13766374 -7340789 -4742967 -9786280 -13473885 -7697606
5434 -7697606 1552273 2351516 -6525426 -15394260 -17467187 -14652814 -10540997 -5828224
5426 -5828224 -1849322 -1512419 -4225502 -5409415 -3558166 -2876389 -6251947 -10425342 -11671285
5417 -11671285 -12050674 -15422844 -20064654 -20284044 -14358431 -6584888 -1526282 274667
5409 274667 559135 512626 668621 1311616 1733458 640496 -1681388 -3004350 -2187501
5400 -2187501 -1416352 -3609642 -7811911 -9121440 -4281159 3813947 8917829 8522128 6177140
5391 6177140 6045873 7247779 5696883 367319 -5103855 -7273332 -6867224 -6825235 -8169338
5382 -8169338 -9381298 -9117365 -8246414 -9091381 -12810882 -17415383 -19112905 -16697076 -13763114
5373 -13763114 -14592070 -18344160 -20076157 -17640456 -14192336 -12722506 -11821492 -9391885
5365 -9391885 -7162387 -7548795 -8275386 -4990162 1284068 4035700 -459909 -8529735 -14253216
5356 -14253216 -16119512 -16706252 -18278198 -21010370 -24003976 -25861031 -24948706 -20701750
5348 -20701750 -14466549 -8373639 -3752274 -620830 2250859 6423248 11237395 12717274
5340 12717274 7839465 -88551 -4085056 -2613606 -1741683 -5788490 -10462259 -9739109
5332 -9739109 -5704034 -5261904 -9077944 -10968090 -8393530 -6339680 -8562587 -11399434
5324 -11399434 -10095740 -6175960 -3770541 -2414407 1100512 5986769 8112962 6720356
5316 6720356 5626809 7321054 9706060 9546584 6263951 1612712 -2117707 -3236690
5308 -3236690 -2008328 -780372 -826820 43563 3911865 7797685 6425418 148698 -4280171
5299 -4280171 -2257810 3317622 7276869 9004372 10969551 13291456 13579139 11066315
5291 11066315 7845906 6323387 7431536 10752241 14536063 16034531 13509567 8109418
5283 8109418 3237312 2226560 6041205 11787232 14242926 11605967 9286049 13994962
5275 13994962 23688165 28553092 23935466 16626374 14644279 16436387 15813957 12609140
5267 12609140 10897773 10014038 6072827 1030629 1054002 5342872 5622714 -1045858 -7549280
5258 -7549280 -8266954 -7029890 -8527718 -9564833 -5945554 -1858998 -3774220 -8798060
5250 -8798060 -8188102 -1028579 4260885 2696735 -558402 1502991 8459394 14213961
5242 14213961 14046661 7907651 137061 -2576887 3388961 13333654 17678913 12612044
5234 12612044 4103781 -709925 -2417711 -6062079 -11786351 -13667033 -7701940 2953831
5226 2953831 11874042 15889409 16132169 14241724 9992938 3268165 -3019494 -3919950 2717265
5217 2717265 13168491 20870845 22542974 20397492 18442815 17925100 16868033 13043184
5209 13043184 6622947 358498 -2498741 -965798 2621507 4679588 3678302 1173485
5201 1173485 -131401 1283479 4973823 8891337 10318018 7544696 1482463 -4465019
5193 -4465019 -6459325 -2737673 4773218 10927777 11011948 5594975 877084 2291120 8371753
5184 8371753 13215651 14404204 15048691 17319630 18019412 13586775 6778902 4014769 6514331
5175 6514331 8130751 3233140 -6231584 -13557017 -15158496 -13133475 -10865620 -8847031
5167 -8847031 -5497924 -264984 5406871 9533892 11153298 10699910 9293381 7497564
5159 7497564 4860690 1233561 -1860516 -2632233 -1895602 -2530149 -5219746 -6903731 -5043102
5150 -5043102 -1130419 2417476 6313954 11411264 13555984 7172851 -5525213 -14490106
5142 -14490106 -13290521 -6205202 -1267424 -532058 -882588 -745471 -1130134 -1985148 -1996868
5133 -1996868 -993620 887296 4845154 10541055 13468224 9907804 3468751 1672325
5125 1672325 6215986 11513135 13030348 11694626 8863217 2549429 -8246387 -19512666
5117 -19512666 -26127363 -27278814 -25067716 -20052998 -11663463 -1934462 4499940 4721338
5109 4721338 365304 -4151091 -5583492 -4024705 -1435537 1529234 5993527 11561358
5101 11561358 14525771 11663107 4763476 -1014098 -2473341 99634 5017752 9482060
5093 9482060 9627860 5087219 2532428 8796370 20045998 24133471 15695328 2752388
5085 2752388 -5015923 -8595073 -14940912 -24333825 -29213489 -24554762 -13969873 -4910730
5077 -4910730 -1252758 -1256387 -526831 3800481 10900503 17894663 22883891 24886744 21945646
5068 21945646 13070792 2365990 -3292970 -2459995 -881461 -3033584 -6502895 -7731528
5060 -7731528 -8345481 -11102240 -13706504 -12539852 -9925486 -11535579 -17645552 -22469429
5052 -22469429 -21936686 -17424940 -11852915 -6468481 -1874413 1501532 4404744 7235325
5044 7235325 7737608 3427476 -3772438 -8513337 -7836281 -3435795 1532512 5016537 5638349
5035 5638349 2742155 -2481927 -7641694 -10884877 -11138448 -8345590 -5181365 -6061726 -11482866
5026 -11482866 -15480069 -12257087 -3673166 3502027 6287080 7690439 11488665 18336886
5018 18336886 25654569 28133101 20881010 6478684 -3779371 -1522543 7528452 10311442
5010 10311442 3222360 -4719021 -5224410 310379 6534847 11343852 14070534 12515699
5002 12515699 6256575 -548815 -3123783 -690920 4513414 10070471 13845928 14517282
4994 14517282 13073155 11673240 10813877 10049131 10517264 12951463 14287375 11194387 6219961
4985 6219961 4634049 5624531 3665423 -721286 327560 9646930 18781225 18683498 11127704
4976 11127704 4877841 4967915 9992768 16005686 18924825 16331106 10441785 6523768
4968 6523768 6103533 5466404 2749777 1332007 3156024 4180760 821084 -3750755 -4469679
4959 -4469679 -1706077 737536 1427912 903374 -935796 -2814827 -1055316 5106451 10651719
4950 10651719 11437586 9932598 9899447 9786639 7104706 5282642 8942993 14626467 13664254
4941 13664254 4070636 -6604187 -10940214 -9242552 -6478247 -5573560 -5519636 -4314602
4933 -4314602 -2475811 -3106242 -7421384 -11250756 -9299538 -2611812 2649968 3934718
4925 3934718 3937216 2690472 -4274072 -16579830 -25412350 -24506094 -18453876 -14572997 -12538684
4916 -12538684 -8385457 -3400006 -2033240 -4825583 -9334068 -14353031 -18348824 -18448975
4908 -18448975 -15745949 -15879816 -19409432 -18640101 -9994688 -1577959 -891715 -3078648 -178905
4899 -178905 5893925 9420632 11810754 15340853 13851368 2393875 -10552638 -13569692
4891 -13569692 -8844057 -5457117 -3476765 920894 2235352 -5873704 -15689562 -16308388
4883 -16308388 -12355001 -13634150 -14971743 -7981068 -3029926 -12912027 -24299137 -17820025
4875 -17820025 -6703934 -11718630 -1347449 84516765 232693688 335462792 310498298
4868 310498298 200982962 112347862 83713317 74520577 53607883 36981468 38295618
4861 38295618 39867215 28522983 18045262 18426525 16379296 3901935 -2678624 9085572
4853 9085572 24434293 25073151 16404549 12848597 12978856 8047577 1861541 3570769
4845 3570769 10042583 12005430 10841073 14746868 23463005 29339904 29400140 26018137 19961211
4836 19961211 11947276 6741356 7328543 9187998 7415738 4490992 4274233 4370121 1908697
4827 1908697 720980 4494845 8499341 6901743 3268798 4620033 9269536 10063734
4819 10063734 6633006 5045806 7088396 8554744 7273672 5193055 3145322 421278
4811 421278 -1116492 970805 4022665 2719800 -2808972 -6611443 -4641295 1574059
4803 1574059 8407354 12912462 12795870 7820871 916845 -5171999 -10939890 -16848880
4795 -16848880 -19640958 -16255229 -9431423 -4915262 -4553762 -6073299 -7620073 -8085881
4787 -8085881 -5016378 2632313 10726339 13602240 10816564 6579714 3963949 3543547
4779 3543547 5758894 9879209 12040735 9065759 3249642 -807251 -2588630 -4520068
4771 -4520068 -6489451 -6793711 -6847665 -8924937 -10070826 -4579051 7212654 18312184
4763 18312184 23840815 25194191 25035490 23705584 21711783 20448446 18800507 13869486
4755 13869486 6851061 3490772 6446082 11385468 13097601 11619713 9636242 7465532
4747 7465532 4193431 1374836 1840679 5465857 8640098 7948929 3255950 -2420960 -5315134
4738 -5315134 -3702975 1036281 6035427 9220150 9994400 9167946 9073815 11863395 16000491
4729 16000491 16342367 10015618 600326 -5974376 -7970571 -7539643 -5951516 -2963872
4721 -2963872 260813 1705819 1753878 2582780 4614428 6474875 7749085 8711951 8235134
4712 8235134 5286905 1776936 762918 2606332 5484508 7938042 8172918 3968985
4704 3968985 -2631823 -4233699 2600388 10422265 10397372 5595952 5945772 11932413 13831928
4695 13831928 7381719 -655062 -4628477 -6942989 -9267520 -7469795 -857907 3216925
4687 3216925 833387 -975965 4307560 11611000 13186017 11478075 13247719 16425577
4679 16425577 13590563 5175715 -1150988 -2275044 -1145918 1807556 8555175 14986811
4671 14986811 12822217 1916398 -7952897 -10051636 -7997154 -7687140 -9116115 -9496075
4663 -9496075 -8431628 -6465442 -3286005 -163841 368160 -557682 1446003 6254812 7189318
4654 7189318 55203 -10429785 -16745887 -16922133 -13430105 -8177659 -2743535 297614
4646 297614 867465 2997813 8463699 12104229 8866391 2764314 2269784 7871179 11135365
4637 11135365 7025518 669260 -972135 1061799 766422 -2890387 -4235819 961640
4629 961640 9511785 14569138 13422438 9798229 9106565 12785568 17295097 17642619 11662803
4620 11662803 1724233 -7181181 -11448453 -11349904 -9341389 -6389584 -1491706 4978716
4612 4978716 9775388 10375473 8506264 7849370 9186984 10196366 9421872 7794567 6342981
4603 6342981 5193034 5357309 8812595 15333287 20807956 20112496 11478668 -1580389
4595 -1580389 -11749874 -12606244 -4345039 5601729 10146566 10150205 11503089 15670819 18031403
4586 18031403 16203002 14416684 16748978 20612506 21077002 18473919 17302225 19591181
4578 19591181 23509448 27138189 29492422 28571006 22472620 12712805 3448488 -2683976
4570 -2683976 -5566632 -5194540 -1587373 2847001 4125383 931536 -3768090 -5599837
4562 -5599837 -1841791 7334150 17908642 22985018 18369994 7888434 282464 76575
4554 76575 3958370 6396476 5556698 2710119 -780635 -3765735 -4861828 -3607429 -601898
4545 -601898 4252805 11240839 17599435 18045718 10955048 1698112 -2770641 -962273 3700775
4536 3700775 8393989 12802336 16812109 19467951 19974080 17606916 11431404 2369431
4528 2369431 -5456293 -8257401 -6984297 -5541081 -5149072 -3609537 -82781 2923505
4520 2923505 3275320 1935914 683595 -291311 -1024080 -397263 2017740 4570383 5742822
4511 5742822 6170886 6920514 7631849 8282682 10691342 15361216 18321367 14820185 6042497
4502 6042497 -1333789 -3043890 -1611531 -1446119 -2464280 -1150680 3697890 9183534
4494 9183534 11931587 11192689 8110742 3849641 -776807 -5117952 -9014077 -12504961
4486 -12504961 -14568019 -13106916 -7369931 26469 4853410 5513889 4731294 6201905
4478 6201905 9795465 11100027 6467476 -1921922 -7304216 -5230682 1759978 7453631
4470 7453631 9005066 8621201 8466105 6983480 2042760 -4662219 -9347983 -11137686 -12087108
4461 -12087108 -12590987 -10489836 -5701057 -2183414 -2993200 -5810721 -5944111 -2150739 2904625
4452 2904625 6550457 8007287 7648996 6926942 7882189 10075944 9412181 3497018 -2915661
4443 -2915661 -2295642 5674858 12909984 12761962 6942229 1212748 -1550777 -1800652 -950815
4434 -950815 -1492064 -5746945 -11239700 -11135327 -3512040 3370445 498406 -9723162 -16768401
4425 -16768401 -15865638 -11799404 -9050415 -5516266 1613242 9698673 13990719 13298724
4417 13298724 9421882 4217086 -208412 -1575007 -405564 -273326 -2875352 -5657661
4409 -5657661 -6266356 -5887176 -5759892 -4263467 -738591 1615260 757367 245095 3864190
4400 3864190 8807514 9668293 6956398 5717892 7222942 8333249 8407703 10222007 13733429
4391 13733429 15480245 15256572 16870407 20430943 20526800 15133326 10095851 10591979 13602193
4382 13602193 13725809 11532651 10244097 8151627 1447613 -7449676 -11587568 -9368373
4374 -9368373 -6477043 -7000705 -8172520 -5992532 -1653560 540654 -927511 -3551487
4366 -3551487 -4287741 -2733060 -1287424 -2418990 -5208310 -5450971 -581301 6659074 11461940
4357 11461940 12448385 11167595 7774617 1598819 -4433955 -5192123 -649802 2665713
4349 2665713 -79753 -5978114 -9166528 -8207947 -5420272 -1829324 3037143 8024965
4341 8024965 11199468 13127598 15587222 17343194 15094315 9181427 4706305 5411098
4333 5411098 9186177 11486771 10992560 9683592 9003750 8797873 9560557 12784336 18003649
4324 18003649 21412308 19238275 11972437 3881591 -1497309 -4092677 -5568825 -6569425
4316 -6569425 -6567661 -5166115 -2301553 1839194 5705997 6331516 2646339 -1612084 -970489
4307 -970489 5306368 12144290 14814920 13729388 11834427 9869518 6722639 2883239
4299 2883239 687868 1602909 5360425 11082242 16885788 19013259 14557202 5690746
4291 5690746 -1608059 -4298947 -5294303 -8024223 -10467743 -7746005 422462 8498443
4283 8498443 11910229 11867971 11712434 11192969 7497754 748111 -5120394 -7336222 -7156195
4274 -7156195 -6788663 -6291454 -5177638 -4425410 -4396823 -2917010 1512564 6196299 7414139
4265 7414139 6048721 6262208 9116783 11599738 11855600 10740093 7626027 80647 -10184595
4256 -10184595 -16366505 -15179191 -11891983 -12244888 -13318972 -8452751 1183972 6857853
4248 6857853 4079933 -2056186 -4767096 -3429008 -845469 3023706 10411444 20435617
4240 20435617 27997734 28383745 21535802 11759246 4247599 2064039 5550044 13170847
4232 13170847 21864247 27464444 27284690 23089886 19452496 18032204 15635546 9411318
4224 9411318 1498409 -3728330 -4799034 -2972075 787552 5425633 8315798 7840091
4216 7840091 6225170 6458077 7732721 7382739 5666290 4603455 3645963 1193421 -664517
4207 -664517 2046545 9005619 15788815 19638206 20465346 17429488 10392293 4005228 3661467
4198 3661467 7217490 7447989 3027969 -334011 -376256 -1254461 -3944168 -3054523 2492757
4189 2492757 4600065 -1787139 -9036378 -6982787 2735709 10098326 10449469 7535616
4181 7535616 5557513 4862574 4107886 1745562 -3153775 -8098954 -7807838 -747646 8182412
4172 8182412 14047263 16738353 17433598 16183327 15524703 19065904 23241797 19407972 8394788
4163 8394788 2311881 5839363 7915166 464388 -7917065 -8102900 -6006171 -7868337
4155 -7868337 -5487602 5193440 6825128 -13676139 -38673242 -52462991 -86257132 -182123981
4147 -182123981 -309534258 -370933790 -314322587 -198889944 -117989891 -92354779 -78244869
4140 -78244869 -51582751 -31563529 -30276413 -29892357 -18058092 -7680277 -8949544 -11429438
4132 -11429438 -7096479 -5940489 -14414853 -19935507 -12206257 -2105552 -3532216 -11136425
4124 -11136425 -12057096 -7851847 -8525407 -13586994 -14781530 -11791129 -10950967 -12271405 -10477827
4115 -10477827 -6214537 -4635213 -4664062 -393311 7512363 11381502 7750407 1120956
4107 1120956 -3612793 -5446683 -3973625 1349666 7817057 10867336 9549737 6367208
4099 6367208 2449638 -2084267 -3795086 1937855 13596980 23458362 26189957 23419082
4091 23419082 18680697 12087870 2291282 -9004730 -16949931 -17450589 -10761546 -1764482
4083 -1764482 4036396 5737406 6996759 9867112 11273836 7920916 1899847 -2279884
4075 -2279884 -4243184 -7052375 -11194830 -13856449 -13831485 -12651687 -10595531 -6110027 -236350
4066 -236350 2740533 1090342 -1400581 -691002 2020895 2729566 511272 -2005300 -3127720
4057 -3127720 -4289857 -7599878 -13045661 -18515191 -21353695 -19731112 -13962509 -7268727
4049 -7268727 -3846997 -4483292 -4755583 3546 7573423 9502167 872887 -12791931
4041 -12791931 -21264304 -20682130 -15435304 -10291514 -5516631 -304263 3938762 5973758
4033 5973758 6700343 6450532 3573400 -1999780 -6957512 -8638577 -7445367 -3018385 7249661
4024 7249661 21720896 31029926 27383028 15082144 5701234 4220199 6184275 7688866
4016 7688866 10650020 16482940 21184221 20433122 15484201 10613682 7542620 5108605
4008 5108605 2088961 -2041202 -7168265 -11435755 -12126189 -9422077 -7093303 -7450996 -7799611
3999 -7799611 -4326518 2300094 7965609 10488213 11038527 10708652 8699208 4679993 801620
3990 801620 -192089 1749578 3636093 2540445 -1335169 -5085454 -6561063 -6719416 -8043826
3981 -8043826 -11387946 -15360253 -18069442 -17897560 -13086698 -3012902 9382237 18437458
3973 18437458 20475855 16634507 10207987 2807838 -5234453 -12056426 -14592536 -12049976
3965 -12049976 -7090850 -2637987 1106554 5280037 9221614 10848760 10197797 10329476
3957 10329476 13225913 16113737 13991018 5687318 -4344244 -10591625 -11447521 -9312915
3949 -9312915 -7287763 -6649691 -6745388 -6580638 -6563850 -8152338 -11082012 -12298469 -9732826
3940 -9732826 -5998137 -5090027 -5992454 -4000986 941378 2598097 -2059041 -6654059 -3545170
3931 -3545170 5146843 10336648 8221208 3914738 2821367 3907746 3462928 1497915
3923 1497915 1356255 4545740 8331127 8743812 5475107 3008340 5472763 10562955 11465890
3914 11465890 5897274 -479708 -2159932 -1202777 -2110780 -2968106 1668200 10429989 14888619
3905 14888619 10803026 3841366 1960260 6393724 12280782 14804076 12815229 8917321
3897 8917321 7152149 8729935 10324224 8922105 6696397 7133692 8417307 6672404
3889 6672404 4567829 8953769 19126533 25494387 22564311 15808032 12105175 10706317
3881 10706317 8375316 6463530 6678850 5633162 501018 -4435088 -3823173 -5713
3873 -5713 1220142 118259 761740 2121713 -245344 -5059573 -6430022 -4207554 -5059138
3864 -5059138 -11655013 -17941879 -17640854 -11575340 -4030433 2947950 8824213 12542956
3856 12542956 14103914 14952892 14965778 12389024 8129633 6132662 7754543 9854296 10545965
3847 10545965 12469691 17331674 21196243 19198615 12203369 4907712 -601173 -5544224
3839 -5544224 -10091596 -12075282 -9826683 -3873139 3543956 8729995 7949638 1547434
3831 1547434 -4398591 -3835986 2170496 7154059 7811428 7234409 8770828 10296642 7067535
3822 7067535 -1706172 -11503956 -16675110 -14279886 -5187002 6139268 13567764 13849226
3814 13849226 9839790 7237924 7745308 7717360 4249583 -284503 -1690914 505040 3651491
3805 3651491 6068947 7106872 4607686 -3085664 -12341946 -15815065 -10417510 -672632
3797 -672632 7118702 10919471 11882976 10964388 9196706 8639381 10386842 13466490 17284449
3788 17284449 22351724 26722824 25460996 17035999 7239362 2959436 4618464 8466055
3780 8466055 13105937 18476540 20890523 15847078 5567475 -2267201 -4015664 -3095526
3772 -3095526 -2699445 -992402 4317261 11136388 15380182 15115897 10603665 3522192 -2146670
3763 -2146670 -2098403 2930486 6710846 4973174 767979 -204144 2778459 5712091 6321292
3754 6321292 6760329 9494688 12727841 11404316 2923163 -8564168 -14781575 -11284537
3746 -11284537 -1920060 5745019 7892794 5595805 950488 -4105377 -6554154 -4676250
3738 -4676250 -1585677 -1795880 -4077109 -2899090 2109203 4011485 -1571829 -9847458
3730 -9847458 -13919875 -14065107 -15318010 -18938048 -21178709 -18942340 -12571865 -4072149
3722 -4072149 4110264 9624757 12631202 16695721 24408509 32997191 36961459 34233811
3714 34233811 27305269 19312405 11765610 5481370 947315 -2379558 -5227143 -6895792
3706 -6895792 -5774453 -1308386 5220376 11177325 13579900 11229397 6496582 3258277
3698 3258277 2565068 2502735 2542964 4663426 9046697 12313140 11857531 8529103 3349676
3689 3349676 -4171893 -12063607 -15083048 -11622967 -7080754 -6244987 -6880881 -5703877 -5566613
3680 -5566613 -9848029 -13970287 -10944974 -2835459 2165994 2690564 4685194 8882422
3672 8882422 8027191 -694531 -9721099 -11985216 -9898986 -8399080 -6094802 287377
3664 287377 8148257 12662484 14338580 16197843 16428863 11113936 2787910 -1131412 986775
3655 986775 2327521 -2360032 -9267451 -11173883 -7126687 -2880454 -3322537 -7790432 -12645780
3646 -12645780 -15523839 -15849312 -13229052 -7790349 -1750915 1760135 2132598 1585114 1452929
3637 1452929 909247 675461 4131046 11363145 15819122 12299773 5722832 5090127 9916225
3628 9916225 10787085 4281305 -1465621 468023 5604290 6106654 2171441 -1239666 -3307271
3619 -3307271 -5341460 -4520201 1555559 7046611 4026678 -4770157 -8749969 -5063082
3611 -5063082 -1737938 -3658283 -5579789 -3272614 -1992363 -6698736 -11176268 -6116446
3603 -6116446 5686742 11250521 3760691 -10295765 -20688321 -23741051 -21662364 -17100499
3595 -17100499 -11371734 -5236364 799614 5657888 6990532 3622303 -1291145 -2587944
3587 -2587944 774393 4836813 6554417 7223529 8739077 10186349 10687069 12335338 16615918
3578 16615918 20037859 17571304 9823222 3079908 2076359 5798848 10522408 13538222
3570 13538222 13082412 8297316 1599289 -1483465 2257266 9592994 14456671 14720896
3562 14720896 13152991 12456051 12232749 11176658 9636703 8612697 7795649 6208540 4090180
3553 4090180 2773758 2812745 3127326 2071798 -1081430 -5457527 -8861732 -9224456 -6744147
3544 -6744147 -4348196 -4681120 -6521778 -6073173 -2856497 -2170456 -8957861 -20239810 -27200104
3535 -27200104 -25184747 -18062601 -11487076 -6084059 -372191 3619550 3100211 905130
3527 905130 2959913 9327690 13701188 13073720 12014952 14529493 17040421 13877173 5955179
3518 5955179 -763658 -2866245 -1050606 3497220 9042394 10932494 4978329 -6134022
3510 -6134022 -14075265 -13576006 -6977191 -44435 3306597 1851696 -3428327 -9110681
3502 -9110681 -11305920 -9354246 -5946582 -3360819 -1791059 -1421810 -3296863 -7411213
3494 -7411213 -12215676 -16364198 -18789673 -17535108 -11869532 -5652354 -4683805 -9639328
3486 -9639328 -15119283 -16871346 -16310398 -16290199 -16172121 -13601845 -8280725 -1601950 4886153
3477 4886153 8636332 6806039 544720 -4098076 -2635454 2502070 5789011 5553365
3469 5553365 4013866 2482503 323431 -2373815 -4618142 -6585560 -8931375 -10477793
3461 -10477793 -9471965 -7026953 -6603681 -9715687 -14204616 -17079570 -17405411 -16189527
3453 -16189527 -14866901 -14281970 -14458481 -15370665 -17917702 -22883675 -28411659 -30267986 -25970404
3444 -25970404 -17466044 -8773427 -2548004 92745 -1358561 -5969147 -11247590 -15560000
3436 -15560000 -19122357 -21425213 -20227148 -15088874 -9287934 -5672522 -3087406 283717
3428 283717 2768317 2033630 -403080 -1893161 -4020842 -10135359 -18192938 -21241215 -15795534
3419 -15795534 -5713639 3076600 8156875 10090436 9715371 7481484 3495453 -2341949
3411 -2341949 -8563060 -11103732 -6784858 2329415 10692271 15165233 16632536 16601538 15641065
3402 15641065 14829046 15045781 14708764 11708712 7611653 6117834 7071291 6055181 705915
3393 705915 -6444432 -12273067 -16258189 -18332845 -17702244 -15418166 -14272518 -14236926 -11549240
3384 -11549240 -4294052 4404304 10557148 13291581 12912509 8880214 2351495 -2630210
3376 -2630210 -3454675 -1921121 -626398 684415 2722675 3819196 2668137 1359789
3368 1359789 2400329 4590302 4760591 2098259 -1420721 -3108215 -455961 7261175
3360 7261175 16056457 18870375 12986051 3496977 -2764965 -3719502 -374864 6806726
3352 6806726 15849235 21453504 20292340 15466669 11235075 6645805 -115400 -4577269
3344 -4577269 -870921 7603022 10456587 4075516 -3976533 -6136332 -4121085 -4330967
3336 -4330967 -9258566 -16674886 -23166134 -25223279 -20266989 -10123205 -1408774 331350
3328 331350 -4244341 -9985849 -11838967 -6952033 4159242 16003449 20384571 13621611
3320 13621611 757271 -9180422 -11113092 -6232053 1175810 6686265 6838527 447861
3312 447861 -9959181 -18687745 -19979036 -12281626 -717705 6033116 3779220 -2622442
3304 -2622442 -4990779 -1287931 3733421 6474480 8378466 11223874 13674540 14906033
3296 14906033 17169847 21350574 23707718 21088451 16367514 14080646 12867753 7519109
3288 7519109 -2373255 -11142310 -14811689 -15189993 -14730151 -11863751 -4526943 4668958 10584995
3279 10584995 11859909 11879168 13454720 15382095 15390577 14227942 14361984 15345682 13360560
3270 13360560 6417365 -2220728 -7818410 -9856685 -11348020 -13409655 -13852605 -11343545
3262 -11343545 -7509017 -3743525 812711 6204478 9638505 9396571 8489698 11002334
3254 11002334 16082176 18940001 17206807 13062227 9268811 6517700 5333629 7249179
3246 7249179 12084159 16084329 15144976 9424325 3180733 -20108 -798683 -2111904 -4671174
3237 -4671174 -5798464 -3629156 -797675 -1359607 -4488237 -4746151 217983 5836442 7077877
3228 7077877 5625833 6781796 11322922 15019354 15345033 13921236 12194810 9419968
3220 9419968 6042405 4762395 6389891 8281271 8766289 9476182 11033084 10332133 5547486
3211 5547486 656733 741875 4781151 7354670 6251015 4090366 2973513 1995586 731978
3202 731978 1370632 5774639 12697597 18867929 21074560 17210506 7876320 -2615129
3194 -2615129 -9384189 -11607986 -11576725 -9494402 -3407573 4816573 8706682 5807924 2922192
3185 2922192 7809753 18170172 24375791 22119116 16513589 13000724 9977948 3323561
3177 3323561 -5987949 -12891229 -14876917 -13988475 -12869417 -11799911 -9775428 -6315721
3169 -6315721 -1701079 3211275 7149822 9542657 11565887 14863010 18939833 21133319
3161 21133319 20028736 17951858 18516220 21552212 22047403 15611600 4387376 -4618048
3153 -4618048 -7652099 -8382316 -12212027 -18565077 -22050010 -20339314 -16959194 -15817603
3145 -15817603 -16786519 -17998676 -18724265 -17808548 -12948717 -4674489 2168044 4666870 6524211
3136 6524211 11756329 16562230 14077377 6094897 2301277 6440006 10810752 8233379
3128 8233379 2799905 2855333 8081759 10883453 8441753 5896472 7187625 9369648 8457669
3119 8457669 6050328 6537947 10246660 12613692 9473637 1441904 -6409295 -8492351
3111 -8492351 -3445500 4257950 8497723 7758415 5707454 5169619 4149310 -185609 -5806826
3102 -5806826 -7675702 -4976265 -2886353 -5603372 -10235060 -10377417 -4668445 1335359
3094 1335359 2193178 -1391844 -5135183 -7236512 -8909724 -10195363 -9124908 -5550796
3086 -5550796 -2366687 -1455623 -1332182 -658790 -1144768 -4174022 -7155078 -6995523 -5491540
3077 -5491540 -6872960 -10562775 -10904477 -4728920 4678898 12069839 15010667 13177605
3069 13177605 7087329 -228255 -3915682 -2649829 -655066 -1660959 -3463610 -1610122
3061 -1610122 3840725 8702381 9926088 7035362 297899 -8298794 -13672557 -12170392
3053 -12170392 -7240977 -5881896 -9064530 -10468957 -5876735 994261 4275449 3287680
3045 3287680 919765 -1918011 -6176923 -10788917 -12806030 -11290651 -8611432 -7718334
3037 -7718334 -9360070 -11666097 -11908965 -9638863 -8156927 -10849446 -15846295 -17481692
3029 -17481692 -14016951 -9791276 -7465970 -3090613 6392171 14941982 13903318 5134838
3021 5134838 -122460 3426846 8131253 4991667 -3547716 -7486288 -2690288 4852255
3013 4852255 7376097 3818411 -633395 -909233 3275001 8422960 11988519 14818545
3005 14818545 17848331 18093651 11442495 -373614 -9384881 -9654415 -3109125 4435442
2997 4435442 9842951 12977056 13801618 12777675 12058921 12625564 11613660 6066034 -1640497
2988 -1640497 -5791112 -4432861 -1026978 1163898 3060064 7164733 13363056 18558492
2980 18558492 19407154 15119544 8494375 3986989 3978378 7576241 13201743 19811172 24275407
2971 24275407 21442519 10820022 481576 -1000089 4606919 7805973 4436320 196957
2963 196957 1169824 5753104 8510593 7090543 2289060 -4389039 -9689038 -9049433 -2469865
2954 -2469865 2793349 -65500 -8599401 -14178311 -12870212 -9222667 -9347803 -13899023
2946 -13899023 -18749364 -20084077 -17671464 -14398900 -13291095 -14515949 -15420520 -13766848
2938 -13766848 -10200815 -7214489 -6729006 -8894421 -11689923 -11439950 -5891440 2485647
2930 2485647 8432887 9763168 8759338 7448613 5490740 4072235 6795530 13260838
2922 13260838 16444121 11594571 4275732 3444150 8588602 10400817 3894664 -5504844
2914 -5504844 -10097882 -8763137 -5713632 -4581987 -6066797 -8780226 -10765468 -11806185
2906 -11806185 -14215561 -19064920 -22640659 -20487842 -14519813 -11466847 -13814711 -17020487
2898 -17020487 -16651772 -13266569 -8623917 -2416031 4420651 8058705 7140924 5691284
2890 5691284 6710637 6634161 797977 -8655298 -15534458 -18188922 -19960298 -22164770 -22205368
2881 -22205368 -19061961 -15779564 -15025826 -15793748 -16082064 -15872912 -15654145 -14327733 -10711757
2872 -10711757 -5819783 -1761621 1066515 4102224 7788626 9877024 7682128 1908251
2864 1908251 -3151785 -4150937 -2199780 -278920 1404503 4451183 7385434 6054464
2856 6054464 40430 -5303589 -5230841 -473009 6240480 14008229 20578117 20061658 9820726
2847 9820726 -2946625 -7843296 -3456341 2848022 6168907 8121934 9387169 6177266
2839 6177266 -2537628 -10560311 -11853487 -8128224 -4745196 -2863846 -553290 1410555
2831 1410555 749855 -698862 1506278 6939101 9607059 6463039 2381041 3797932
2823 3797932 10172961 15135679 14859869 11809440 9804131 8532088 5295808 688638
2815 688638 -880266 2760887 7663170 8286977 4391852 477368 -945009 -1919432 -4288144
2806 -4288144 -6078247 -4818892 -1744208 199587 915005 2747904 6245343 9007343
2798 9007343 8733654 5448736 887602 -2476439 -2096623 2759846 9460998 14046861 15178965
2789 15178965 14784626 14883205 15392882 15074146 12874883 8258292 2208334 -1783093 -140282
2780 -140282 6180521 11361725 10458509 4158673 -3168997 -8249036 -9986264 -7793121 -2065525
2771 -2065525 3917275 5572185 1679953 -4072732 -7127702 -6476091 -4290287 -2397315
2763 -2397315 -602364 1688506 3471892 2668733 -1228723 -5537795 -6424690 -3180422 245957
2754 245957 -925864 -7252883 -14952069 -20361973 -22575073 -21420463 -15562367 -4858042
2746 -4858042 6731087 13435521 13290143 9700743 7007105 6128830 5256730 3024134 -648623
2737 -648623 -5738007 -11852887 -16629040 -16529611 -10753584 -3402471 46976 -1487882 -3990663
2728 -3990663 -3908933 -2601738 -3580185 -6773753 -8543914 -7337952 -5786365 -5628542 -4117069
2719 -4117069 935027 4930827 670088 -10961723 -19592116 -17094368 -7050505 705275
2711 705275 2169105 1594469 3269247 5861112 6134688 4602570 4745647 7861142 10783166
2702 10783166 8891038 862122 -9396218 -15624391 -14763876 -9799817 -6562946 -7999367
2694 -7999367 -12352506 -16117954 -16820159 -13124977 -5046998 4559927 10796447 11096084 7824918
2685 7824918 4839145 2566593 -1240935 -6500111 -9487884 -7465732 -2553959 425987
2677 425987 -1230129 -6592268 -13048400 -17965717 -19178712 -16191033 -11464870 -8825269
2669 -8825269 -9460747 -10361942 -7674721 -1062696 5994775 9673012 8803663 5066495 1324727
2660 1324727 -411786 -300726 30055 -130596 361577 2203755 3591034 2439202 64918
2651 64918 -8000 2632724 3795713 -73634 -7121164 -12205032 -12297062 -8230337 -2696111
2642 -2696111 1421422 1969812 -724239 -3442520 -3358792 -1246991 387782 1391890 3445227
2633 3445227 5798632 4736756 -1732313 -10914949 -18050810 -19932735 -15458149 -5541967
2625 -5541967 5618556 11582212 9004494 1432238 -4297871 -5116992 -3465897 -2525030
2617 -2525030 -2220450 -871871 1072483 1007841 -2200690 -6162341 -7588657 -6391543 -5759162
2608 -5759162 -7811457 -10505245 -10055298 -5802170 -1330259 -740249 -4650641 -9794556 -11977499
2599 -11977499 -9875048 -6508468 -6078540 -8510810 -8692449 -2971945 5049113 8069705
2591 8069705 3801829 -2893157 -6305025 -4907350 45843 6773485 12168232 12391635
2583 12391635 6944162 -59565 -4576157 -6311118 -6306098 -4239456 -618286 1791789 2186629
2574 2186629 4154730 9469105 12283880 5405826 -8793233 -19857402 -21929683 -19091498
2566 -19091498 -16785817 -14058725 -7832611 -285177 2877526 -380119 -6604892 -11136942
2558 -11136942 -11497910 -7691425 -1871850 2865697 5457405 7918541 11649460 14093516
2550 14093516 11861363 6431233 3376581 5388963 9055013 10004467 8801281 9245230
2542 9245230 11989015 12759571 7552404 -2396966 -12176952 -18533709 -21900006 -23695240
2534 -23695240 -23966573 -22422002 -19781810 -16620522 -12373209 -7255688 -3729979 -3549826
2526 -3549826 -4250784 -1737915 3489076 5845750 1508386 -6763080 -13013822 -14169354
2518 -14169354 -11289754 -6852376 -2713228 625775 4343773 9680348 14919422 16019520
2510 16019520 11917566 6942921 5499854 6391526 5503444 2319250 -253723 -1655101
2502 -1655101 -4615793 -9704408 -13181683 -12070621 -8059908 -4262983 -900048 3214873
2494 3214873 6993761 7908110 5720748 3052336 2462364 4415235 7544209 9519988 8301663
2485 8301663 3998926 -901632 -4228211 -6253061 -7866265 -7623077 -2663219 7317720
2477 7317720 18258796 24067592 20612084 8855966 -4561054 -11185201 -7477091 2445887
2469 2445887 11898077 18085228 21638703 22013633 17750318 11055784 7401812 8997360
2461 8997360 12299215 13657415 13598071 13091739 9672538 1503138 -7380513 -10740763 -7914694
2452 -7914694 -3587149 -624798 2218025 5586425 7625918 8096895 9854898 13996740
2444 13996740 17199905 16391767 12846730 8916402 3879890 -3269693 -9323482 -9632454
2436 -9632454 -4576922 735309 3169874 4291093 5856331 6200458 3029932 -2354800
2428 -2354800 -5826928 -4904794 -1370002 475336 -1977886 -6917269 -9989616 -9206100 -6647665
2419 -6647665 -4267138 -248174 7322074 14402344 13268031 2201197 -10657439 -15623085
2411 -15623085 -11549703 -5451868 -3866922 -7068667 -10754337 -10878114 -6861021 -1750033
2403 -1750033 637307 -455587 -2213844 -2175705 -1321907 -1843479 -3185525 -2540890 1241143
2394 1241143 6254146 9671785 9378813 4144831 -5011750 -13357390 -15210002 -9505852
2386 -9505852 -751917 6469791 11770526 16538729 19910082 19756052 16182583 11331976
2378 11331976 6582996 2603051 1387010 4753024 10353047 12617441 9444961 5478214
2370 5478214 6475585 12052388 16411772 15436273 10824206 7498379 8840224 14447755 20823079
2361 20823079 23846062 21751935 16167800 9964327 4751100 1154579 99895 1770836
2353 1770836 3990773 3929178 1356321 -1666887 -3914417 -5564865 -6200523 -5210036 -4071091
2344 -4071091 -4883496 -6504312 -6150664 -5346735 -8997136 -16408645 -19028648 -11582104 -670099
2335 -670099 3667081 1463703 961425 5292380 8840403 7019903 2204541 -1956220 -5613921
2326 -5613921 -9224739 -10438190 -7981021 -4499401 -2474865 -1160488 -282934 -2364400
2318 -2364400 -7871318 -12415858 -13163571 -14127373 -19871193 -27003590 -27762943 -20282617 -9750730
2309 -9750730 -659228 6460841 11375371 13277415 13984790 16425453 18974706 16690472
2301 16690472 9650737 4468487 4802956 5518555 342732 -8596993 -13752648 -12305824
2293 -12305824 -8350165 -5882383 -4530429 -2928497 -2011301 -2521299 -1887511 3078050 10813381
2284 10813381 15209565 12273219 4743414 -1525338 -4189829 -4900936 -4472559 -1870269
2276 -1870269 1463553 1383901 -2025961 -2021372 5530256 14183608 14552322 7544024 2467847
2267 2467847 2720574 1998359 -3581741 -8475452 -7340212 -4106077 -4893283 -7449878 -5278194
2258 -5278194 1070963 4518679 1780958 -3699031 -8403742 -11793632 -12825828 -9925583
2250 -9925583 -5365390 -3861859 -5527683 -5643400 -2743750 -1112616 -3139131 -5101340
2242 -5101340 -3728709 -1478891 -1359738 -1694460 -889547 -2544117 -9534374 -16685775 -16648867
2233 -16648867 -11100686 -8548523 -11582082 -14053352 -11788951 -8246995 -6891629 -5505644
2225 -5505644 -2740170 -3724441 -12327389 -22075425 -22520892 -13122679 -3732349 -1367822 -3115165
2216 -3115165 -3338386 -1638100 -671546 -820748 -752386 -261311 619555 2876877 6072417
2207 6072417 7136758 4635251 1848042 2166510 3627467 2038500 -2338503 -6014083
2199 -6014083 -8902310 -13867199 -19374191 -19006320 -10925483 -2361279 -412441 -2295738
2191 -2295738 31289 7716497 13201912 10707062 3751653 464762 4433538 12241441
2183 12241441 18201513 19322775 16226575 11250911 6807938 5239771 8637479 16856375
2175 16856375 25617730 28819343 24317047 16229343 10177521 7618325 6442074 5207951
2167 5207951 3768906 853071 -4983973 -11495640 -13503263 -9192212 -2852724 697965
2159 697965 1975311 4364354 7656035 7922976 3975998 345615 1776975 6735365 9123206
2150 9123206 6125043 1688699 1146738 4628654 8306233 10920645 15154719 21490844
2142 21490844 24559515 19033125 7277771 -2646017 -5964267 -4485868 -1142976 4103807
2134 4103807 11039387 15840705 14574168 8367987 2116740 -1006645 -1323730 -130325
2126 -130325 1484692 1618358 -1306346 -5321563 -5333763 1467355 11941765 20307354 24219022
2117 24219022 25847851 27354669 27614172 24619910 19509423 15723578 14182543 11931228
2109 11931228 6945370 1928429 638501 1927673 1052538 -3320822 -7304446 -7809482
2101 -7809482 -6481324 -5805615 -5134474 -3611180 -3696050 -7577323 -12310902 -13307798 -11523552
2092 -11523552 -12059182 -15496889 -15807670 -8619292 2553614 10731548 12997918 11083808
2084 11083808 7051300 1559331 -4736545 -10693476 -15395167 -18067048 -18064415 -16131280 -14623940
2075 -14623940 -14981951 -15620843 -13646251 -8298659 -1813155 2781516 4249470 4105938 5145937
2066 5145937 8152067 10260289 8148896 2796404 -1047301 -522498 2463610 4547334
2058 4547334 4427227 2166753 -1896108 -5810359 -6611759 -4541307 -3767729 -6243279 -7945693
2049 -7945693 -4852526 185379 1265960 -1649237 -2791870 1084630 7405176 12798487
2041 12798487 16450273 17673790 15018948 9712596 6195983 7208849 11164946 15516684
2033 15516684 19283389 20961632 18029010 11087382 5215843 4320678 6574750 7855324
2025 7855324 7093928 5575016 3445851 19661 -4231714 -8611260 -13264478 -16964044
2017 -16964044 -16397568 -10914540 -5630473 -5801970 -9801394 -11984470 -11232444 -11561283 -14378052
2008 -14378052 -15599495 -12203989 -7155580 -4977361 -5637480 -6177577 -6370291 -8846774 -13780466
1999 -13780466 -17054332 -15596161 -12524041 -13903750 -20161384 -23816049 -18174054 -6361886
1991 -6361886 1946383 2214840 -839668 -1402002 197204 886680 726699 1067502 396052
1982 396052 -2793872 -5360547 -3300468 1253705 2569262 107310 -1453090 -1324966 -5059966
1973 -5059966 -15519092 -26907774 -31167200 -26431109 -16434977 -5591903 2046884 2841386
1965 2841386 -2708988 -8111666 -6788925 834895 8778357 12799224 13418439 12556436 10248634
1956 10248634 5317284 -2098425 -9200819 -11995843 -9244889 -4748249 -3572277 -5912459
1948 -5912459 -7517192 -6496555 -5717830 -6996820 -7558363 -5453205 -4214191 -7411043 -11769454
1939 -11769454 -11453447 -7481514 -6681611 -11346033 -16014516 -16120947 -14374262 -15311640 -17531501
1930 -17531501 -15746483 -8747293 -1016324 3579964 5994223 8398460 9256141 5239225
1922 5239225 -2677625 -8691276 -9003662 -6106015 -3915219 -1699683 3120723 8540037
1914 8540037 10273915 9910551 13805507 22202485 26509463 21307151 12935902 10692603
1906 10692603 14381691 17027218 16294382 15998705 18162463 20519234 21253406 20171526 15827309
1897 15827309 7538575 -222331 -1764953 1539694 3244282 1980600 2280128 4439690
1889 4439690 2036033 -7170971 -15533122 -15782428 -11118819 -9581867 -13012746 -17201966
1881 -17201966 -19231570 -18796408 -14908317 -7203062 782920 4731487 5281952 6549490
1873 6549490 9766344 12360551 12625501 11291328 8667326 3958717 -2210810 -7539672
1865 -7539672 -10636830 -11587381 -10166525 -6000840 -497024 3754704 5835792 7148869
1857 7148869 9322606 12801457 16876101 19614561 18655108 13833893 8243516 5072862
1849 5072862 4418616 4759920 5851565 7697613 8160230 4813116 -1250916 -6187432 -7807594
1840 -7807594 -7018619 -5367997 -3527945 -1934565 -813205 89407 161552 -2346501 -6870921
1831 -6870921 -8552841 -3481825 4822710 8329581 4188794 -2347949 -5446215 -5238657
1823 -5238657 -5218548 -6507815 -7335220 -6276714 -3675758 -761582 1127617 1042535 -993218
1814 -993218 -4233511 -7832616 -10304590 -9214819 -3442369 4612655 11238192 15392174
1806 15392174 18008139 18185891 14037854 7644655 4626898 6844550 9378240 7397755
1798 7397755 2632574 -308165 -1197971 -3533574 -8063504 -11277875 -10448762 -6927151 -3886360
1789 -3886360 -3208532 -5135116 -8928760 -12987532 -15428324 -15102102 -11790605 -6265032 -1075674
1780 -1075674 167331 -3590847 -8732041 -10712060 -9368574 -8018069 -7802742 -6335389
1772 -6335389 -2530252 789975 955219 -727183 -1538844 -1364839 -1410279 -1050031 509147
1763 509147 956945 -2326858 -6602691 -5876813 112233 3864979 -163422 -7915996 -11541961
1754 -11541961 -9349588 -5121179 -290533 6702532 13976305 16227549 13006646 10856928
1746 10856928 13903821 17313367 14376902 6234548 -377079 -2459606 -2720918 -3673702
1738 -3673702 -4792689 -5266486 -5235350 -4008603 -642746 3463528 5804891 6631851 8218582
1729 8218582 10237517 9613890 5604520 1365577 -559061 -854747 -402044 1619032 4532350
1720 4532350 4375848 -1752296 -11429740 -19376858 -22821692 -22624048 -20662902 -18286541 -16499085
1711 -16499085 -15801890 -15899328 -16186093 -16066076 -14850223 -12480131 -10120591 -8504171 -6383344
1702 -6383344 -3105397 -1930729 -6791475 -15281583 -19382708 -15082437 -7236985 -2364904
1694 -2364904 -665657 1194867 3017212 1860473 -1938275 -4599013 -4422061 -3246576
1686 -3246576 -2142594 569947 5962788 11992951 15696750 16172416 14434940 11516702
1678 11516702 7526762 2190526 -3863618 -8589346 -10325144 -10125155 -10361009 -10430525 -6595137
1669 -6595137 2064005 10060377 10739512 3729969 -5179430 -10130033 -8921377 -2733338
1661 -2733338 4515308 7723284 4972185 115886 -1264924 2413355 8993817 16270951
1653 16270951 22081592 22934541 17284861 9348699 5211263 5572676 6446363 6024981 5764871
1644 5764871 5365526 2821930 -153257 625144 3700202 2095248 -5548565 -10941981 -7923719
1635 -7923719 -2060588 -2236521 -7439437 -9287313 -4847445 684319 3014560 3220606 2933975
1626 2933975 1778953 1061208 3992146 9770849 12517706 9236823 4700229 4821683 8469115
1617 8469115 9956147 7486876 4782290 5113196 7564836 9294826 8313776 3730412 -3572020
1608 -3572020 -9502585 -9048246 -2065340 5293288 7333800 5558288 5906823 10151684 13512630
1599 13512630 11376398 5021681 -1139181 -5177623 -7666263 -8145025 -5472290 -1259309
1591 -1259309 948071 758854 1746870 5468228 7777629 3974428 -4346616 -10862650 -12039780
1582 -12039780 -9775560 -6650303 -2277381 3891225 8904963 8611182 3097403 -2628392
1574 -2628392 -3847835 -332185 5173471 10646545 15189292 17018412 14031290 7273604
1566 7273604 1786441 2100484 7426866 12616470 13607742 10974869 8498503 9281607 13016880
1557 13016880 16127899 14837755 8937340 2191137 -1684055 -2697387 -3338698 -4867269
1549 -4867269 -6609612 -8087490 -9547875 -10565492 -10324047 -9388398 -9107936 -9154796 -7991705
1540 -7991705 -6171471 -6570878 -10232692 -14186118 -14907544 -12439572 -9843438 -9766054 -12319762
1531 -12319762 -15017319 -14277146 -8573620 -498001 6043594 10565768 15236585 19412893
1523 19412893 19098899 13423992 7443919 5610341 6118715 5304401 4153677 5658502 8216321
1514 8216321 7273117 2590008 -1369155 -2037624 -764421 1628469 5684661 8798961 5879378
1505 5879378 -2739161 -9187039 -7794867 -3009856 -3025992 -8336026 -11872400 -9362559 -4225934
1496 -4225934 -1509183 -1497692 -1592833 -1514647 -3401687 -7421853 -9931862 -7164983 -15570
1487 -15570 6019818 6169921 1129428 -4318921 -6944407 -7664833 -8172108 -7266674 -2786740
1478 -2786740 3812347 7685113 6115409 1733103 -1151762 -1975613 -3723911 -7823667
1470 -7823667 -11467629 -10911339 -6120788 -914353 963449 -1083480 -4886278 -7829572
1462 -7829572 -8916349 -9485719 -11733732 -15642008 -17920249 -15479463 -9477997 -3783803
1454 -3783803 376634 5154054 10683519 12812616 9133347 4357799 5332983 11819006
1446 11819006 16637393 15130156 10281919 7258746 6683815 5702521 3021112 -1716
1438 -1716 -2004578 -3048794 -4016385 -6033726 -9515946 -12357000 -10414250 -2058344 8316607
1429 8316607 13720525 11900741 7481178 6120793 8037985 8554191 4256645 -2938411
1421 -2938411 -8157759 -8896287 -6968456 -5511521 -5408694 -5302158 -4088001 -2096513 -108957
1412 -108957 1512500 2487252 2306945 658767 -2204931 -5554943 -8446116 -10282447 -11396002
1403 -11396002 -12351253 -12432672 -10302045 -6991909 -6149680 -9240336 -12335456 -10610509 -4727554
1394 -4727554 640237 3417315 4855033 4374932 -440025 -7577503 -10646546 -8390310
1386 -8390310 -8206937 -14963537 -21147315 -15400473 1407596 16136984 19293559 14140212
1378 14140212 8773551 5879351 3730090 2177964 2753061 5035119 6734851 6442658
1370 6442658 4150458 713641 -984866 3520245 15109686 27040999 29691112 20437767
1362 20437767 6774638 -1673898 -3112857 -4182731 -10776441 -19800140 -21911772 -12689711
1354 -12689711 1230102 9220391 8165636 3725800 1329481 807543 671363 2048210
1346 2048210 5058720 6011371 3202637 2142152 8823541 19433949 23534712 17839059
1338 17839059 10358190 8931075 11570255 11669260 7960990 4550606 3964415 4940601 5799764
1329 5799764 6046302 5305942 3923337 4036312 7144917 11153280 12537223 10859351 8487721
1320 8487721 6642519 4786336 3348410 3589001 4679989 4162022 1646474 -896061 -2649312
1311 -2649312 -4460251 -5649808 -4228298 -1275717 -1137535 -5428658 -10277475 -11580889
1303 -11580889 -9866098 -7850713 -6346601 -4976642 -3942726 -2599403 654094 4536438
1295 4536438 4607934 153042 -2606771 1222438 7276459 8067223 4344422 3342624 6797107
1286 6797107 8379261 4335155 -200481 1319293 7857006 12652581 11059802 4054730
1278 4054730 -3674132 -7436117 -6548212 -5591595 -9269437 -15800963 -18689743 -15170897 -8694369
1269 -8694369 -2549051 3664534 9415397 10760464 6165809 572064 -327799 3304588
1261 3304588 7936557 12269775 16409766 18516704 16822304 13159737 10743946 10063983
1253 10063983 9882902 9841307 8857460 3920912 -5457854 -14213669 -17418196 -16515910 -15526115
1244 -15526115 -14045286 -9635160 -4695100 -4209473 -7525129 -8790707 -5521563 -876640
1236 -876640 2510387 4919314 5584062 2815904 -879242 -127346 5221848 9305072 9226254
1227 9226254 8389320 8560540 5815203 -1312717 -6211344 -2901642 4118794 5294742 -1298895
1218 -1298895 -8621083 -10453427 -7016237 -1392062 4588349 10018275 13809552 15084393
1210 15084393 13438826 9180833 4182089 927477 -597488 -3095787 -7602256 -11523786
1202 -11523786 -12911283 -13568066 -15185711 -15656880 -12943802 -9666263 -9246410 -9704765 -6413096
1193 -6413096 336905 5809124 8185841 9961599 11871070 11225891 7843931 6299975
1185 6299975 9315473 12819403 10998848 3816719 -3483625 -6645914 -5589837 -2720373
1177 -2720373 -643284 -965151 -3265919 -5340570 -5749671 -5804570 -7846988 -11883654 -15175739
1168 -15175739 -15253401 -12462067 -9416802 -8755334 -11699730 -17815537 -24953541 -29639256 -29222858
1159 -29222858 -24691474 -20249976 -18776880 -18637656 -16509859 -11984916 -6887943 -1492360
1151 -1492360 4595271 8406111 5835531 -883236 -3552153 1233286 6980439 7132193
1143 7132193 4875704 7039128 12133868 12267800 5467694 -1790917 -4852597 -6471342
1135 -6471342 -10173574 -14175408 -14931139 -12265291 -8262419 -4791575 -4363002 -9481807 -18243572
1126 -18243572 -23751035 -20982909 -12252848 -3915252 2460 -807390 -5026708 -10610474
1118 -10610474 -15197469 -17390094 -16683866 -12398075 -5398511 -451152 -2356579 -8851348
1110 -8851348 -12178111 -9350452 -5680320 -5780610 -7006193 -5877822 -5247369 -9056095 -14159872
1101 -14159872 -14132553 -8634837 -2508193 2466499 7998020 12465889 11028130 3574740
1093 3574740 -3543784 -5521928 -3950418 -2103205 -155412 2659391 5158630 6184114
1085 6184114 6670490 7501017 7475005 5182609 1128010 -3226163 -6880336 -9119833 -9780577
1076 -9780577 -10085065 -11224689 -12002422 -10107701 -5574147 -402030 4716470 9810904 12147263
1067 12147263 8012608 -907537 -7341960 -6591971 -1271028 3730100 6901538 8513770
1059 8513770 7764266 5052610 3660523 5336258 6922670 5061406 1604717 370537
1051 370537 1088873 1232150 1655898 4688376 7516584 3880207 -6250616 -14016665 -11560267
1042 -11560267 -1279391 7414679 8226050 2469124 -4701494 -9737343 -12519428 -14333009
1034 -14333009 -14733829 -11183723 -2897965 5813034 8783197 5264576 1375144 2611075
1026 2611075 6957110 7819127 2597856 -4444885 -7795014 -6510760 -3420588 -613565
1018 -613565 2064184 4624459 5453518 3251736 -825862 -4321269 -6187151 -7106783 -7644973
1009 -7644973 -7806224 -8391682 -10713373 -14105049 -15499644 -12965520 -8619229 -6641854 -9031700
1000 -9031700 -14229098 -18941218 -20204320 -16805110 -10362231 -4486534 -1521229 -590732
992 -590732 159812 537667 -898710 -4002665 -6922535 -8256039 -7675651 -5275288 -2276008
983 -2276008 -1450138 -4300602 -8319350 -9727987 -8639694 -8495004 -10272078 -10622499 -6776359
974 -6776359 -364740 5054298 7841614 8299188 7237115 6124934 6640135 8517495 9612844
965 9612844 9207235 9042963 9957088 10307693 9444360 9573388 11582439 12103205 8290762
956 8290762 3061066 1477670 3747781 6124753 7159051 7949758 7159620 1987492 -5081252
947 -5081252 -6761294 -909112 5306545 5009323 1038864 795304 4636250 5451838 -668231
938 -668231 -8857933 -12107552 -9519264 -5426325 -2651490 243757 5168357 10272680 11006486
929 11006486 5163898 -4362349 -12621583 -17436281 -19671670 -19497633 -15348344 -7453772
921 -7453772 522906 5514661 8558483 11762961 13758484 11683426 6754660 3900536
913 3900536 5340803 7797670 7205791 3651975 415740 131109 2926177 6457974 6873428
904 6873428 1800224 -6352532 -11747609 -10860179 -5434973 592142 4605192 5001875 860624
895 860624 -5708801 -9647867 -8368406 -5109637 -4122943 -4786898 -3990831 -2147897 -2125699
886 -2125699 -3314101 -2031656 1924557 4286832 3182726 2232707 4597578 8177077 9726921
877 9726921 10208213 12258702 14573607 12617335 4189684 -8125847 -19103699 -23806376
869 -23806376 -20341767 -12083938 -5480232 -3407856 -2693221 -452473 358156 -4105923 -10801580
860 -10801580 -12874459 -9671469 -7465285 -9440436 -11122564 -8219354 -3505774 -1806976
852 -1806976 -1995081 1130371 8774569 16299564 19033634 16738001 12313766 8543629 6442579
843 6442579 5302055 4161699 3734188 5889191 10439830 14070139 14051960 11671484 10112943
834 10112943 10083051 9602246 7376628 4308558 1889385 572607 -456969 -2571963 -5738983
825 -5738983 -6852196 -2444076 5483470 9393657 5000117 -2429661 -4471643 -203112
817 -203112 4316129 5807897 7047165 10087948 12461378 12378393 12408873 14623632 16316052
808 16316052 14543494 11772098 12692036 17279042 20851634 19832051 14334443 6473743
800 6473743 -569869 -3076698 -100377 4185397 4680430 1571628 -614408 387677 2324470
791 2324470 2556261 742775 -3015043 -8857063 -14540066 -15420469 -9333458 374335 8300344
782 8300344 11954384 12349574 11780470 12507328 15777706 20296120 22772622 21364890 17650279
773 17650279 14457916 13291028 14711608 19047983 24836418 28231976 26322555 20417776
765 20417776 14471169 10976633 9707549 9322636 8437619 5967445 2261915 -514032 -533825
756 -533825 1603523 3828592 4598986 3125781 -441706 -3456924 -1749998 5109162 11512696
747 11512696 12257674 9699947 10161437 14041759 14731541 8223519 -1105016 -6384785 -5923316
738 -5923316 -2593827 742788 2151798 29493 -4790572 -8254639 -7570157 -4869082 -3651060
729 -3651060 -3623611 -2492342 -1094189 -2598263 -7331029 -12263687 -15275158 -16206240 -14117301
720 -14117301 -7996877 -846671 1430133 -2859434 -8517997 -9679297 -5718480 609146
712 609146 7271813 12410010 12853311 7248013 -595380 -4917767 -4166565 -1459241 329208
703 329208 1126553 1601809 1539793 1133964 1870238 4864587 9069748 11747772 10583527
694 10583527 5716849 180853 -2322834 -794755 2530576 5307376 7144149 7721779
686 7721779 5337128 -108954 -4453381 -3280861 1705027 3925143 274665 -5009030
678 -5009030 -6339720 -3780275 -1461127 -697958 1981608 9373521 18314912 21740226 16037276
669 16037276 5115401 -3729417 -7071188 -6766443 -4926293 -1080451 4357969 7775568
661 7775568 7113200 6129533 9226496 13905363 14136792 10524825 10212974 15345998 18811133
652 18811133 15105661 9003130 7819300 10126433 9289420 5127032 4010926 7878128
644 7878128 10733644 7730541 1679068 -1965952 -1845040 216735 2811324 4666631 3929561
635 3929561 732949 -1784286 -1433462 155571 563998 -81205 -965793 -2832996 -5434874
626 -5434874 -5554601 -1320951 3737709 5125190 3997413 4547206 6261713 4948483 1620817
617 1620817 3379523 12653496 21645004 22191059 16558059 12512062 10863559 5357209 -5632588
608 -5632588 -15112461 -17598072 -16659501 -17781402 -18586611 -12641107 -949746 7223820 6007169
599 6007169 19245 -2590326 -324070 1522778 -1602322 -9011342 -16401865 -19149112
591 -19149112 -14899213 -5665320 2854399 6219128 5375370 4238506 4151402 3308894 915239
582 915239 -1641728 -4130145 -8256450 -13570612 -15971386 -12907730 -7599059 -4985524 -5092110
573 -5092110 -3753293 810641 5557666 7138509 6147114 5912724 8704697 13696540 17437644
564 17437644 16416261 10804680 5479632 5212858 8838126 10686971 8053148 4066538
556 4066538 2127309 1187358 -926362 -2881707 -2514760 -1880653 -4712374 -9504001 -10251642
547 -10251642 -4990426 1016607 2448637 93696 -2760891 -6006778 -10587451 -13566003
539 -13566003 -10658011 -2984422 3545289 6028641 7434486 10519692 12985221 11114919
531 11114919 5383738 -228995 -2748644 -1927733 758947 2612379 832178 -4310817
523 -4310817 -8561450 -8375603 -5394031 -3508710 -2697830 308859 5274690 6962139 2510821
514 2510821 -3250819 -3368354 2188748 6785458 5976523 2314920 229206 -566813 -3734240
505 -3734240 -10024599 -15669418 -17104444 -14460004 -9594753 -3584099 1942195 3664322
497 3664322 158959 -4717125 -5747984 -3246408 -2143557 -4051888 -4817259 -1529487 2621496
488 2621496 3491204 2043592 1249369 53689 -4609763 -11585369 -16413076 -17831477 -18540404
479 -18540404 -19484562 -18122141 -13279385 -7665387 -4347117 -4038396 -6583557 -11462517 -15849133
470 -15849133 -15932360 -11664810 -7038270 -4621694 -3287180 -2154311 -2398261 -3492731 -2239342
461 -2239342 1945408 4984436 4153080 1969923 1056805 -333653 -3691021 -5644455 -3146705
452 -3146705 395051 -37517 -2836674 -2362274 2323619 7495655 11916534 17248957 22008406
443 22008406 22132532 18329456 16474081 19178184 22560987 22945986 21254175 18853081 14627403
434 14627403 8948778 5546766 6084199 7027605 5226134 2829194 3229860 5566900 6950041
425 6950041 7265597 8037744 8839682 8389780 7269406 6270278 3888291 -1275307 -7202311
416 -7202311 -10608535 -10917050 -9285125 -5559573 383310 5742055 6987931 4345344 916938
407 916938 -1967171 -5251990 -8461231 -9084734 -6355005 -3018585 -2341164 -4786702 -8041553
398 -8041553 -9340663 -7947641 -5980479 -5818042 -6104850 -2493268 5978412 13643352 14165701
389 14165701 8161735 1980213 167660 2061801 4602279 5192015 2485250 -2515761
381 -2515761 -6577480 -7952343 -8769420 -10967494 -12023631 -9006462 -4956122 -5426677 -9301888
372 -9301888 -9604859 -4400263 -207947 -1933620 -5511873 -4644767 92833 3837698 5538962
363 5538962 8117578 12517089 16513185 18615138 19152039 17985473 14530315 9677549 4883582
354 4883582 -26162 -5547739 -10066802 -11757131 -11932805 -13110529 -14388204 -12493069 -7354468
345 -7354468 -2755400 -748679 995504 5092066 10895490 16488800 21219484 24413607
337 24413607 24262280 20365147 15485260 12541585 11370500 10426559 9907420 10635102 11250542
328 11250542 9641828 6679661 5477845 6663027 7139517 4451021 106346 -2656202
320 -2656202 -2569185 -322318 3678747 9609682 16732974 23039948 26365877 25240162 19366049
311 19366049 10484477 2374911 -1500115 -825213 1723205 3562429 4501457 5858248 7927704
302 7927704 8818674 6032608 -535048 -7479457 -10840137 -10313251 -8944117 -7989419 -4510735
293 -4510735 3620218 12348350 14943695 10572733 5477349 4861129 7266902 8348835 6395740
$$ [...]
##END NTUPLES=NMR SPECTRUM
##END=
