##TITLE=31Pdec_14-2023
 CDCl3, 24 sc
 17.3.2023
##JCAMPDX= 6.0         $$ Bruker NMR JCAMP-DX V2.0
##DATA TYPE= NMR SPECTRUM
##DATA CLASS= NTUPLES
##ORIGIN= UXNMR, Bruker Analytische Messtechnik GmbH
##OWNER= root
$$ XWIN-NMR		Version 3.5
$$ Fri Mar 17 14:55:10 2023 Russian Standard Time (UT+4h)  she@DPX200
##.OBSERVE FREQUENCY= 81.013821
##.OBSERVE NUCLEUS= ^31P
##.ACQUISITION MODE= SIMULTANEOUS
##.ACQUISITION SCHEME= undefined
##.AVERAGES= 24
##.DIGITISER RES= 16
##SPECTROMETER/DATA SYSTEM= spect
##.PULSE SEQUENCE= zgpg30
##.SOLVENT NAME= CDCl3
##.SHIFT REFERENCE= (INTERNAL, CDCl3, 0, 248.564)
##AUDIT TRAIL= $$ (NUMBER, WHEN, WHO, WHERE, WHAT)
$$ ##TITLE= Audit trail, XWIN-NMR		Version 3.5
$$ ##JCAMPDX= 5.01
$$ ##ORIGIN= Bruker BioSpin GmbH
$$ ##OWNER= she
$$ F:/spectra/data/she/nmr/P31/1/pdata/1/auditp.txt
$$ ##AUDIT TRAIL=  $$ (NUMBER, WHEN, WHO, WHERE, WHAT)
(   1,<2023-03-17 14:54:12.71 +0400>,<she>,<DPX200>,
      <created by zg, POWCHK disabled, PULCHK disabled
       configuration hash MD5:
       00 E9 B6 7A A2 85 ED C7 34 08 36 98 17 FE 4E 26
       data hash MD5: 32K
       97 7A BF 99 EB 93 F4 DA 0F A7 C4 C3 C8 B4 D0 C3>)
(   2,<2023-03-17 14:54:19.54 +0400>,<she>,<DPX200>,
      <Start of raw data processing
       efp BC_mod = 2 LB = 1 FT_mod = 6 PKNL = 1 PHC0 = -10732.15 PHC1 = -319.99 SI = 64K 
       data hash MD5: 64K
       6D 8E C8 F2 90 DC BF E9 34 23 9E 1E 56 97 E4 C0>)
(   3,<2023-03-17 14:54:41.39 +0400>,<she>,<DPX200>,
      <pk PHC0 = 22.33861 PHC1 = 0 
       data hash MD5: 64K
       0F 27 C0 28 C4 A0 36 94 4A 16 42 18 C2 79 E7 D7>)
$$ ##END=
$$ 
$$ hash MD5
$$ 1A CD 9B E3 53 E1 E2 F7 43 92 BC EE 73 02 26 C8
##$RELAX= 
##$RELAX= 
##$RELAX= 
##$RELAX= 
##$RELAX= 
##$RELAX= 
##$RELAX= 
##$RELAX= 
##$RELAX= 
$$ Bruker specific parameters
$$ --------------------------
##$DU= <F:/spectra>
##$EXPNO= 1
##$NAME= <P31>
##$PROCNO= 1
##$TYPE= <nmr>
##$USER= <she>
##$AMP= (0..31)
100 100 100 100 100 100 100 100 100 100 100 100 100 100 100 100 100 100 
100 100 100 100 100 100 100 100 100 100 100 100 100 100 
##$AQSEQ= 0
##$AQ_mod= 1
##$AUNM= <au_zg>
##$AUTOPOS= <>
##$BF1= 81.014009
##$BF2= 200.13
##$BF3= 200.13
##$BF4= 200.13
##$BF5= 200.13
##$BF6= 200.13
##$BF7= 200.13
##$BF8= 200.13
##$BYTORDA= 1
##$CFDGTYP= 0
##$CFRGTYP= 5
##$CHEMSTR= <none>
##$CNST= (0..31)
1 1 145 1 1 1 1 1 1 1 1 1 1 1 1 1 1 1 1 1 1 1 1 1 1 1 1 1 1 1 1 1 
##$CPDPRG= <waltz16>
##$CPDPRG1= <>
##$CPDPRG2= <waltz16>
##$CPDPRG3= <>
##$CPDPRG4= <mlev>
##$CPDPRG5= <mlev>
##$CPDPRG6= <mlev>
##$CPDPRG7= <mlev>
##$CPDPRG8= <mlev>
##$CPDPRGB= <>
##$CPDPRGT= <>
##$D= (0..31)
0 1 0 0 0 0 0 0 0 0 0 0.03 2e-05 3e-06 0 0 0 0 0 0 0 0 0 0 0 0 0 0 0 0 
0 0 
##$DATE= 1679050452
##$DBL= (0..7)
120 120 120 11 120 120 24 19 
##$DBP= (0..7)
150 150 150 150 150 150 150 150 
##$DBP07= 0
##$DBPNAM0= <>
##$DBPNAM1= <>
##$DBPNAM2= <>
##$DBPNAM3= <>
##$DBPNAM4= <>
##$DBPNAM5= <>
##$DBPNAM6= <>
##$DBPNAM7= <>
##$DBPOAL= (0..7)
0.5 0.5 0.5 0.5 0.5 0.5 0.5 0.5 
##$DBPOFFS= (0..7)
$$ [...]
##$SUBNAM2= <"">
##$SUBNAM3= <"">
##$SUBNAM4= <"">
##$SUBNAM5= <"">
##$SUBNAM6= <"">
##$SUBNAM7= <"">
##$SUBNAM8= <"">
##$SUBNAM9= <"">
##$SW= 501.771253377433
##$SWIBOX= (0..15)
0 1 3 0 0 0 0 0 0 0 0 0 0 0 0 0 
##$SW_h= 40650.406504065
##$TD= 32768
##$TD0= 1
##$TE= 0
##$TE2= 300
##$TE3= 300
##$TEG= 300
##$TL= (0..7)
0 120 53 12 22 120 120 120 
##$TP= (0..7)
150 150 150 150 150 150 150 150 
##$TP07= 0
##$TPNAME0= <>
##$TPNAME1= <>
##$TPNAME2= <>
##$TPNAME3= <>
##$TPNAME4= <>
##$TPNAME5= <>
##$TPNAME6= <>
##$TPNAME7= <>
##$TPOAL= (0..7)
0.5 0.5 0.5 0.5 0.5 0.5 0.5 0.5 
##$TPOFFS= (0..7)
0 0 0 0 0 0 0 0 
##$TUNHIN= 0
##$TUNHOUT= 0
##$TUNXOUT= 0
##$USERA1= <user>
##$USERA2= <user>
##$USERA3= <user>
##$USERA4= <user>
##$USERA5= <user>
##$V9= 5
##$VALIST= <valist>
##$VCLIST= <CCCCCCCCCCCCCCC>
##$VD= 0
##$VDLIST= <DDDDDDDDDDDDDDD>
##$VPLIST= <PPPPPPPPPPPPPPP>
##$VTLIST= <TTTTTTTTTTTTTTT>
##$WBST= 1024
##$WBSW= 4
##$XGAIN= (0..3)
0 0 0 0 
##$XL= 0
##$YL= 0
##$YMAX_a= 159
##$YMIN_a= -353
##$ZGOPTNS= <>
##$ZL1= 120
##$ZL2= 120
##$ZL3= 120
##$ZL4= 120
##$ABSF1= 0
##$ABSF2= 0
##$ABSG= 0
##$ABSL= 0
##$ALPHA= 0
##$AQORDER= 0
##$ASSFAC= 0
##$ASSFACI= 0
##$ASSFACX= 0
##$ASSWID= 0
##$AUNMP= <proc_1d>
##$AZFE= 0.1
##$AZFW= 0.5
##$BCFW= 0
##$BC_mod= 2
##$BYTORDP= 0
##$COROFFS= 0
##$CY= -3
##$DATMOD= 1
##$DC= 0
##$DFILT= <>
##$DTYPP= 0
##$F1P= 0
##$F2P= 0
##$FCOR= 1
##$FTSIZE= 65536
##$FT_mod= 6
##$GAMMA= 0
##$GB= 0
##$INTBC= 1
##$INTSCL= 6.047779e-11
##$ISEN= 30
##$LB= 1
##$LEV0= 0
##$LPBIN= 0
##$MAXI= 10000
##$MC2= 0
##$MEAN= 0
##$ME_mod= 0
##$MI= 50
##$NCOEF= 0
##$NC_proc= -10
##$NLEV= 6
##$NOISF1= 182.463
##$NOISF2= 159.3651
##$NSP= 0
##$NTH_PI= 0
##$NZP= 0
##$OFFSET= 248.5645
##$PC= 4
##$PHC0= -10709.81
##$PHC1= -319.99
##$PH_mod= 1
##$PKNL= yes
##$PPARMOD= 0
##$PSCAL= 0
##$PSIGN= 0
##$REVERSE= no
##$SF= 81.0140089999694
##$SI= 65536
##$SIGF1= 159.3651
##$SIGF2= -187.1042
##$SINO= 113.3802
##$SIOLD= 16384
##$SREGLST= <1H.CDCl3>
##$SSB= 0
##$STSI= 65536
##$STSR= 0
##$SW_p= 40650.406504065
##$SYMM= 0
##$S_DEV= 0
##$TDeff= 32768
##$TDoff= 0
##$TI= <>
##$TILT= no
##$TM1= 0
##$TM2= 0
##$TOPLEV= 0
##$USERP1= <user>
##$USERP2= <user>
##$USERP3= <user>
##$USERP4= <user>
##$USERP5= <user>
##$WDW= 1
##$XDIM= 65536
##$YMAX_p= 533571559
##$YMIN_p= -45945309
$$ End of Bruker specific parameters
$$ ---------------------------------
##NTUPLES= NMR SPECTRUM
##VAR_NAME=  FREQUENCY,     SPECTRUM/REAL,   SPECTRUM/IMAG
##SYMBOL=    X,             R,               I
##VAR_TYPE=  INDEPENDENT,   DEPENDENT,       DEPENDENT
##VAR_FORM=  AFFN,          ASDF,            ASDF
##VAR_DIM=   65536,         65536,           65536
##UNITS=     HZ,            ARBITRARY UNITS, ARBITRARY UNITS
##FACTOR=    0.620285442955139, 1,           1
##FIRST=     20137.2065510682, 0,            0
##LAST=      -20513.1999529968, 0,           0
##MIN=       -20513.1999529968, -45945309,   0
##MAX=       20137.2065510682, 533571559,    0
$$ Real data points
##PAGE= N=1
##DATA TABLE= (X++(R..R)), XYDATA
$$ [...]
39388b72451O43500J017387q2264j221615r63816m1810K34118Q4416K92138N13263
39378B02866R5298m65980l45243J26440J06233k55398j58625M44305Q35684O13171
39368A198751l0494p95172j356034j288487n41591K71145N44405L85077K69345
39359a343055L01642J88378k37468o98809o28152K30378J197504J094300j91976
39350h7258j158140n53104P74689J062434J85544m39174k22315K4679j00444l503
39340e16592L72017J99643n07925n56383L44921Q34603J08376p38616o02650o3379
39330a125985j2952m8242M26230P84998L26105k68480p9015M12993K82930j47317
39320E51265p4339J69527j61726o13652k84846L82665K51469m86706o18365K1821
$$ y = [-272451, 371049, 1388436, 1306172, 84557, -879259, -921069, -686951, -602535, -310397, 202866, 298164, -167816, -513059, -386619, -280386, -535784, -694409, -250104, 585580, 1198751, 1168257, 373085, -982949, -2271436, -2813027, -2541882, -1997477, -1612400, -1343055, -1041413, -853035, -1090503, -1789312, -2417464, -2187086, -989582, 104718, -87258, -1245398, -1798502, -1023813, 38621, 224165, -215009, -437324, -412645, -513089, -516592, -144575, 55068, -452857, -1009240, -664319, 170284, 278660, -459956, -1062606, -1125985, -1138937, -1187179, -760949, 24049, 350154, 81674, 2659, 415652, 698582, 551265, 476926, 646453, 484727, -128925, -413771, -31106, 220363, -266343, -884708, -862887]
39310h62887M43325L19827K78197L93103L5454o43848o88020o2581J66132k30546
39300h51844j55925P15522R95551j86722j413723r09480P04269J265098K72175
39291D34921n21092Q3365R54875N33483o82114r09202J48306Q27687K6372j178020
39281b81419j201792j96669N13687N22461M80911N06464J1909p97334q22851P0848
39271a193785N50655j08964p81156k96782O80395Q05809J47240k33642j13520
39262e43750p9938r8088L90104J040744P54781m94766j250650n19430Q18356J215687
39252A233050M58085k71797q3037N49170N86894r4466n58182k07982K74425k8632
39242A857528p52002p57719k1699K31571m45341q67700r0833J021659J119799
$$ y = [-862887, -419562, -99735, 178462, 571565, 607019, -36829, -724849, -787430, -621298, -851844, -1007769, -292247, 703304, 516582, -897141, -1806621, -1102352, 162746, 434921, -86171, -2806, 952069, 1485552, 803438, -105764, 42542, 870229, 896601, -281419, -1483211, -1679880, -1166193, -643732, -162821, 343643, 355552, -441782, -1264633, -1193785, -643130, -752094, -1533250, -1830032, -1149637, -343828, -196588, -430230, -543750, -623688, -721776, -331672, 709072, 1463853, 969087, -281563, -800993, 17363, 1233050, 1691135, 1419338, 1336301, 1885471, 2472365, 2377899, 1819717, 1611735, 1886160, 1857528, 1105526, 347807, 326108, 557679, 112338, -755362, -846195, 175464, 1295263]
39233A295263L71395k3183K72406N03843J90569l30020o09845n49591k55333J1897
39223H77401j3266j15951K19868P76469N85953m68932j083106m55479L24181M7340
39213F94478n39258n7390R74761Q99602k64108q46194k98087J23775k66809n03601
39203h2831Q9538O07516J36529p31673r18061l74827K38736N51141M71406j8382
39193c0908m85087k43462N66919R25327M08103j87059j92695m3523k51275m12689
39183E3651o7554L33389K23498q3749j16081k11427p24037r50516j00898J112893
39173e30831J229123K23746m28803j8952M24406p5262q70216p93652k0149K82259
39163e78331k00706n66099k45441J27818j26698n37008k22330O45056J051229
$$ y = [1295263, 1666658, 1643475, 1915881, 2419724, 2610293, 2280273, 1670428, 1120837, 865504, 877401, 864135, 748184, 968052, 1744521, 2330474, 1861542, 778436, 322957, 647138, 694478, 155220, 97830, 1072591, 1972193, 1708085, 861891, 563804, 687579, 420770, -82831, 6707, 614223, 750752, 19079, -898982, -1273809, -1035073, -483932, -12526, -30908, -515995, -759457, -192538, 732789, 1140892, 953833, 761138, 717615, 466340, 53651, -13903, 319486, 542984, 459235, 343154, 131727, -592310, -1542826, -1643724, -530831, 698292, 922038, 493235, 474283, 898689, 823427, -46789, -840441, -860590, -578331, -779037, -1345136, -1590577, -1462759, -1589457, -2126465, -2348795, -1703739, -652510]
39154f52510O57342J51482j138j75258n97208o99062j23017M15695J35860n00310
39144a388124m46227K99627P09145K56158m69589p20217l99245J82482P17725
39135a258265R42548P46015L09023j65391o73843j035276p20785L75491J423765
39126e6718J584295J018953L21640m09102j043660q09117M43386J111047k10752
39117A949972k107413j856242M38423J649683J93024j644411j242701O04811J339371
39108f75483M69202l72613k77775J26992L30883N35207O33722J53337o44717q62413
39098e83658l32046J62968J62720O3525K15192L51207J65493j81139l25211p3625
39088c74574M40250O59549L2383r98703j040204M19672J822090J308572o98669
$$ y = [-652510, 4832, 156314, 155176, -20082, -617290, -1316352, -1439369, -1023674, -887814, -1388124, -1834351, -1534724, -825579, -569421, -1039010, -1759227, -2158472, -1975990, -1258265, -315717, 430298, 739321, 573930, -99913, -1135189, -1855974, -1480483, -56718, 1527577, 2546530, 2868170, 2459068, 1415408, 606291, 1049677, 2160724, 1949972, -157441, -2013683, -1575260, 74423, 267447, -1376964, -2619665, -2014854, -675483, -206281, -578894, -856669, -729677, -398794, 136413, 770135, 923472, 278755, -583658, -915704, -752736, -590016, -526491, -311299, 39908, 205401, 24262, -300949, -374574, 65676, 725225, 757608, -241095, -1281299, -861627, 960463, 2269035, 1570366]
39079A570366j954482j279265K93025J248472J151320L09091p79968j286470o14560
39070a342471M46887L68842q30776j305475j13516J203710R14646l01842n54519
39061a514514L72317J025982O83962M1298l43008o59407q10297k96214N48953
39052i50928O33052j23742m46488K64625R00234M68763l14172l74591j06296m43455
39042d92998r28903l53633J043331J667980R03900j31347m23186k88495l10258
39033F86391l05114n0338K966m19895o54476n5549Q74227J145771O17676q9817
39023A751842n79489p89650n22688K41682P92431L62760o70303j072935l16748
39014h03098Q29265J349473R90447J31164p10330j048741o69804M0095L87347
$$ y = [1570366, -384116, -1663381, -1370356, -121884, 1029436, 1338527, 558559, -727911, -1342471, -895584, -526742, -1357518, -2662993, -2776509, -1572799, -658153, -959995, -1514514, -1142197, -116215, 567747, 609045, 266037, -393370, -1203667, -1499881, -950928, -317876, -441618, -888106, -623481, 276753, 745516, 431344, 56753, -49543, -492998, -1421901, -1775534, -732203, 935777, 1839677, 1708330, 1285144, 996649, 686391, 381277, 330939, 333905, -85990, -740466, -796015, 78212, 1223983, 1841659, 1751842, 1172353, 382703, -139985, 101697, 894128, 1256888, 586585, -486350, -803098, 26167, 1375640, 2366087, 2497251, 1786921, 738180, 68376, 108471, 495818]
39005D95818J52963k57984m73658n07348m10024j16578K14716K47034N2243J10737
38995d92081M64375M59148k45214r56470q49013j95417L2303l75826o01337j08117
38985b867649N28707N29365J04884R4599O27727Q87194L62044l17385k67321L46761
38975B8926N51966j6543o34886n63783J031L60366K30840j30175l62945k28897
38965g64100K64428O43701K97432n76976q74478n5168P98321L42013r06911j038133
38955a869871M92499J827058J130369r00363j983698j185358K60508R45028Q79182
38946d04646O97095L32801n60809j414775j131791K58463J321062J001255q5698
38937A2957p03901o22702l90572q2758N82339J125303O29149o07452r90893K10590
$$ y = [495818, 648781, 390797, -82861, -590209, -1000233, -1116811, -902095, -655061, -602818, -492081, -27706, 431442, 186228, -770242, -1619255, -1814672, -1782369, -2158195, -2759532, -2867649, -2338942, -1809577, -1704693, -1610094, -982367, -95173, 266871, -50514, -317835, 28926, 580892, 564349, -70537, -634320, -633289, -272923, -42083, -172258, -535203, -764100, -499672, 144029, 441461, -135515, -1009993, -1065161, -266840, 75173, -831738, -1869871, -1377372, 449686, 1580055, 679692, -1304006, -2489364, -2228856, -1283828, -404646, 292449, 625250, 64441, -1350334, -2482125, -2223662, -902600, 98655, 12957, -690944, -1313646, -1704218, -1786976, -1204637, -79334, 549815, -57637, -1048530, -837940]
38927h37940J650944J630074K62736r25400r88372k69235M67501P31541L48286
38918B070135m32077r55042q31098m09453j70817m0642J82742K33545q4577k63578
38908g00862J57613O35044L72571l20567m97542j46585r7077m44112l84274J96592
38898a229199L08446m60266j025192l58312R12218J345121N90366l77212o22746
38889i16776j29857N45564Q87550O61400j2553o83550q78766n17069J5503K46841
38879g81713J00348m8240J08865L45855K54657j8233P9180N25930N87604j5714
38869A138539n31106l11587J69016J65899j28376j22681O24k81879o53641l79290
38859i34482L30792N54008J55282r0363J43350L78112L82278M65147O03388L53034
$$ y = [-837940, 813004, 2443078, 2705814, 1780414, 792042, 522807, 990308, 1721849, 2070135, 1638058, 683016, -148082, -557535, -728352, -768994, -586252, -352707, -437284, -700862, -543249, 91795, 464366, 143799, -353743, -500328, -597405, -1041517, -1425791, -1229199, -920753, -1381019, -2406211, -2764523, -1852305, -507184, 83182, -294030, -916776, -1046633, -501069, 386481, 1047881, 1035328, 351778, -526988, -1044057, -1028554, -781713, -681365, -729605, -620740, -274885, -20228, -38461, 40719, 566649, 1154253, 1138539, 607433, 295846, 464862, 630761, 502385, 379704, 380328, 98449, -555192, -934482, -603690, -49682, 105600, 15237, 158587, 536699, 918977, 1384124, 1987512, 2340546]
38849B340546k06258m78977m54586p31261j259109j177208k07075Q25117J174663
38840a74148R34500L92827l30816p85556m24920L76305O18367K12366M9337L42986
38830A211248K80012l41385o22453k37636p2424n12223o37185N1919O61713O09840
38820C91426O72990J185900R29949o38293j713422o84915R99199Q12128r57824
38811I97138j781561q52387J08923O003k27330J06920J52335n45280p48078M31118
38801b352199J699895J364332q1888p63640k26985K20462j41559l88247K59040
38792d10789R14495L46408r35599j208398k8719J074726P86720k51787o72429
38783c85372l94550k48351k59691K14519R06220P85426r4598m65656O4629L42273
$$ y = [2340546, 2134288, 1655311, 1200725, 469464, -789645, -1966853, -2173928, -1348811, -174148, 760352, 1153179, 822363, 36807, -388113, -11808, 606559, 818925, 868262, 1211248, 1491260, 1149875, 527422, 289786, 217362, -294861, -932046, -880127, -218414, 391426, 1064416, 2250316, 3180265, 2541972, 828550, 143635, 1142834, 1954962, 997138, -784423, -1636810, -1527887, -1521884, -1749214, -1642294, -1489959, -2035239, -2783317, -2352199, -652304, 712028, 630140, -133500, -360485, -140023, -281582, -669829, -410789, 503706, 850114, -85485, -1293883, -1322602, -247876, 538844, 287057, -385372, -779922, -1028273, -1287964, -1073445, -167225, 618201, 523603, 57947, 122576, 464849]
38773D64849k81025p61768j83049O29338N26147p9120j22608K01988o8170q35290
38763e08708j046666l85372L62016N32693K38109r9142j28832K85745P42520N41567
38753E33930k28842n15254J71949Q98602P70369L00071K88861L24573k98618r99985
38743A245656p30759K28940P28320M89016L6794m97989j064774q72708M32027
38734e477J405699N36589j160690j398860j49607M40942l35635q04353q7380L60129
38724a198643m77808j147254q6226J672639J945458M78181j020925j269665n06089
38715a610332L67257O69906K53094l55771m13341M1346J88354k70856o02826k59895
38705a993064K48751K54895r3374l15320l10956q8853M37579R11794O55266j77794
$$ y = [464849, 183824, -577944, -760993, -131655, 394492, 315372, 192764, 394752, 326582, -508708, -1555374, -1940746, -1578730, -1046037, -807928, -907070, -1035902, -750157, -7637, 533930, 305088, -210166, -38217, 860385, 1630754, 1930825, 2219686, 2544259, 2245641, 1245656, 514897, 743837, 1472157, 1961173, 1997967, 1499978, 435204, -437504, -5477, 1400222, 1936811, 776121, -622739, -772346, -331404, -667039, -1471392, -1558772, -1198643, -1676451, -2823705, -2909931, -1237292, 708166, 1186347, 165422, -1104243, -1610332, -1243075, -573169, -320075, -675846, -1089187, -1047841, -859487, -1130343, -1733169, -1993064, -1744313, -1489418, -1582792, -1898112, -2209068, -2297921, -1860342, -948548, -293282, -471076]
38695d71076n09611M0595M75763M8773n11556k99490K56232K65873q3783n9635
38685h47915J99545L6277l75451k36916M95614R60419N83768l31079j115708j241298
38675a872744n16091O59392J440827J364237P27757o6872r04038j388494q73584
38666a429610L05214O71669l79686j412094r47105L24726P72814M19563N30936
38657a143573J154336J075187J51371l20940J05826K58992n20990j195468q50630
38648a285889j94335j64253l31013Q9731O80548N97223J05782Q997J49427j36566
38638d80348n13714q0417Q58837R67255j0901p32241l06057M07035K70340m03701
38628b3912n50815n2249L07075J96888O4599J96818L05181J39999j30092k93774
$$ y = [-471076, -980687, -940092, -464329, -415556, -927112, -1226602, -970370, -704497, -788280, -847915, -648370, -612093, -987544, -1224460, -728846, 231573, 815341, 484262, -631446, -1872744, -2388835, -1729443, -288616, 1075621, 1803378, 1736506, 832468, -556026, -1429610, -1124396, -452727, -832413, -2244507, -3191612, -2866886, -2094072, -1674509, -1143573, 10763, 1085950, 1237321, 916381, 1022207, 1281199, 760209, -435259, -1285889, -1480224, -1644477, -1975490, -1885759, -1205211, -607988, -502206, -493209, -343782, -480348, -994062, -1074479, -215642, 751613, 740712, 8471, -297586, 109449, 379789, -23912, -574727, -626976, -319901, -123013, -58414, 138404, 443585, 583584, 453492, 159718]
38618A59718l56612l05390m4077L04190L90235P5437l60730n01261j22811O23439
38608a37862J141189P80128l08310j022346n70613M24026P64796K96683k07079
38599A160612m63652p92479r30540j93979R54563J052340r8658q58161k45491
38590d15445N58627L18091k25890N9262N17055K3216o61762r1202J082758R46111
38580B110821m05838r37657o5333N29500p8998o64392k97786Q7070k66807l94434
38570c83854M70064J203400O25040m62605p27080n06982p92237j105410l56982
38561b036646R10733J107601Q1134p74932p46716m59258l02814J72952R99156
38552a048790J324815P12052j48900m81010l68937l02961m51338o82336p73291
$$ y = [159718, -196894, -502284, -546361, -242171, 148064, 223501, -137229, -638490, -761301, -137862, 1003327, 1783455, 1475145, 452799, -117814, 306212, 1071008, 1367691, 1160612, 696960, -95519, -1026059, -1220038, -265475, 786865, 688207, -169954, -415445, 143182, 461273, 235383, 294645, 811700, 834916, 173154, 81952, 1164710, 2110821, 1704983, 767326, 701993, 1231493, 1152495, 488103, 190317, 277387, 10580, -383854, 86210, 1289610, 1914650, 1452045, 724965, 217983, -574254, -1679664, -2036646, -1125913, -18312, 62822, -712110, -1458826, -1918084, -2220898, -2047946, -1048790, 276025, 988077, 839177, 358167, -10770, -313731, -765069, -1447405, -2220696]
38543b220696m48728K83951Q25013N89750q7341k94542J93900O59045N11954k7308
38533a5002m63701o38844o06356l80356j9233L48950O39038O98193K72933m88041
38523f52419p76450n4717R12164Q10114l68343j138518n48547M69513M63009m26679
38513a310873o75198M03221J599692J396190k9278j110057r65027k99891o9918
38504a061139j43305P5631M06867K50320k01370j78659L62661P03090N80240L58461
38494A152797J3600p68024j400517q25289N55898J043023K89324p1073O56822
38485F46561P80290p68499k009378p82010J514532J788789n2864j192816l55538
38476d30933P53951P13011K85961K81261j7787j090433j839479j317406k25989
$$ y = [-2220696, -2669424, -2385473, -1560460, -970710, -1058051, -1352593, -1158693, -499648, 12306, -15002, -478703, -1117547, -1723903, -2104259, -2123492, -1774542, -1135504, -437311, -164378, -652419, -1428869, -1483586, -571422, 238692, -129651, -1268169, -1816716, -1347203, -884194, -1310873, -1986071, -1582850, 16842, 1413032, 1383754, 273697, -691330, -991221, -1061139, -1204444, -1128813, -721946, -471626, -672996, -851655, -488994, 214096, 794336, 1152797, 1166397, 398373, -1002144, -1827433, -1271535, -228512, 60812, -10261, 646561, 1426851, 658352, -1351026, -2133036, -618504, 1170285, 1117421, -75395, -430933, 323018, 1036029, 1321990, 1603251, 1585464, 495031, -1344448, -2661854, -2887843]
38467b887843M74900J011368J689818J741338O06588p28261r85538l26162K75227
38458H71435M90387L92982k82503j382890j683468l97400J256744J408135R2662
38449G66084q82737m56679N72080R77718N41301j72790o23723n69797p8596M85566
38439E58427P33612N53535N7959n19288p58576l40746L63832N18092n4161n34046
38429E78640k72176L30515N48582L06832o3435m11681o01934m01167j8674m3073
38419d7571l89668k16893N67102Q41888J05451m85769k2288M85562j62608j100869
38409d25663p46822M36360O57806j84551m54224L23446P61220J37270m80895k50875
38399b26928J97457K74315M31867P96360M75169p49192j570950j127088l76305
$$ y = [-2887843, -2412943, -1401575, 288243, 2029581, 2636169, 1907908, 922370, 596208, 871435, 1361822, 1754804, 1472301, 89411, -1594057, -1991457, -734713, 673422, 766084, -116653, -573332, -1252, 976466, 1517767, 1344977, 721254, 151457, 72861, 558427, 1292039, 1845574, 1903533, 1384245, 625669, 284923, 648755, 1166847, 1112686, 578640, 306464, 636979, 1185561, 1492393, 1428958, 1017277, 415343, 14176, -4498, -47571, -437239, -654132, -87030, 754858, 860309, 374540, 352252, 837814, 675206, -425663, -1172485, -736125, -78319, -262870, -717094, -393648, 367572, 504842, 23947, -226928, -29471, 244844, 676711, 1473071, 1948240, 1199048, -371902, -1498990, -1875295]
38390a875295l13416k41009P19283J677310J269060l0629o64216l98415k25780
38381h3107l65455j84582J51053j87551q83583o16565O88740J458216Q36146j15889
38371F97423k98632j72085m90591p33313r1311Q54349Q31806j67566q77023n59266
38361a006209K12994N84373L54469j97238o93605p37046k11324L68272L39407
38352i85907j68797l13275K97192J023730J021408K40378o40268r75153o47727
38343a148419m1222L48618M34761O08668J021655J061981J84561r08480q92961
38334F69162K07244P95648N142q95233l85118R33789J204190L1584j146567j264176
38324A55665p44052k82941R2836L95594L48726J51608M09186Q28862K65629j260373
$$ y = [-1875295, -2188711, -2429720, -1710437, -33127, 1235933, 1205304, 541088, 142673, -83107, -448562, -633144, -482091, -669642, -1553225, -2169790, -1481050, -22834, 813312, 697423, 398791, 226706, -263885, -997198, -1088509, -234160, 597646, 430080, -446943, -1006209, -793215, -208842, 145627, -51611, -745216, -1482262, -1693586, -1325314, -985907, -1154704, -1467979, -1170787, -147057, 874351, 1114729, 474461, -500692, -1148419, -1189641, -841023, -406262, 202406, 1224061, 2286042, 2470603, 1562123, 669162, 876406, 1672054, 1677196, 781963, 396845, 1330634, 2534824, 2566408, 1419841, 155665, -588387, -871328, -778492, -382898, -34172, 117436, 526622, 1355484, 1621113, 360740]
38314C60740j941374o22296J291057J656709M66224m94268k58367M47762O53159
38305A559346K25296l83053n51561R8888R81951Q18174n06758j238675j51558
38296H52050J313901J010809o31630j401273q49671n70227j019045p87006M40422
38287a641670R27436l3321o41128K90963J086060O9554j318391p13169J283677
38278f89989K006252P22306p52597j061987o13128M0341R18531J473435P27364
38269B770528q94702j530904l76960J095607J116810k11648j370347j278391j71578
38260h51585Q48123Q66695J40387j07600O17689J096345Q1454j539629j733301
38251e81422l00039Q02981L53387n96907o70499r5955K33673L38199O54053R01152
$$ y = [360740, -1580634, -2202930, -911873, 744836, 1211060, 716792, 458425, 906187, 1559346, 1784642, 1401589, 850028, 948916, 1930867, 2749041, 2242283, 1003608, 852050, 2165951, 3176760, 2545130, 1143857, 294186, -276041, -1295086, -2082092, -1641670, -714234, -747555, -1388683, -1097720, -11660, 57894, -1260497, -1973666, -689989, 1316263, 2038569, 1285972, 223985, -389143, -348802, 569729, 2043164, 2770528, 1875826, 344922, -32038, 1063569, 2180379, 1968731, 598384, -680007, -851585, -3462, 863233, 1003620, 896020, 1513709, 2610054, 2691508, 1151879, -581422, -881461, -78480, 274907, -322000, -992499, -1088454, -854781, -516582, 137471, 1038623]
38241A038623N82564k4826l53861m65634o19236n24260M1563M35917L3532n41585
38231c97203k41851O13221O72533k94627r31600l86704L88870K46336k91798J7794
38221f05029R32863R81087q6565o66246K32448J254386O45598j008993j590603
38212H8946n82346L62757J17492m16472j42452M57546M13406p9534k53732r6221
38202a30610J3785J63590L61594K9712q49146j080898o9446P96398J93851p30706
38192a301876m3002J680112K095466P57135m62597o01782o71057j109602q13684
38183d70887M06357Q51082k80184j241604m24224J092322J351125M24329k43559
38174A464757k63695l03972m34707j36207M51854O37362K84973j58378m28464
$$ y = [1038623, 1621187, 1596361, 1242500, 776866, 157630, -366630, -325067, 110850, 144382, -397203, -639054, -25833, 646700, 352073, -579527, -966231, -577361, -331025, -622823, -605029, 327834, 1308921, 1222356, 556110, 788558, 2042944, 2688542, 1679549, 88946, -493400, -130643, -13151, -429623, -572075, -114529, 298877, 219343, -34389, -130610, -116825, 46765, 408359, 438071, -411075, -1491973, -1561419, -765021, -571170, -1301876, -1344878, 335234, 2430700, 3187835, 2725238, 2123456, 1452399, 342797, -470887, -64530, 786552, 506368, -735236, -1159460, -67138, 1283987, 1708316, 1464757, 1201062, 897090, 462383, 326176, 778030, 1415392, 1700365, 1541987, 1113523]
38165A113523m87343k44506J47446K50927N7804M3566J75918j35771p25693n65075
38155c69204M78328J156835Q03229K77398J61783k81148j286869j554440m50445
38146a064533N29401J62847l95234J60554P37205j07203j167345m75812J002993
38137f17127P03981j156747j773277k57763J157557Q42240j36232l69209p6832
38128a683409J63815N24240Q93099O17740k7301M6011O22917K30414j097752j401729
38118a111955q3929P75087k01710j258337l54288J466156J821189P18822P9141
38109A850176L53887J57890q69682j217086p7932J095962O65836p63731j229790
38100c4470k14725O97027J66918r49898r12687J95024N08007o37825j406258k44375
$$ y = [1113523, 626180, 381674, 529120, 780047, 837851, 881417, 1057335, 921564, 195871, -369204, 109124, 1265959, 2069188, 2346586, 2508369, 2227221, 940352, -614088, -1064533, -535132, -372285, -767519, -606965, 130240, 23037, -1144308, -1620120, -617127, 86854, -1069893, -2843170, -3100933, -1943376, -1101136, -1237368, -1606577, -1683409, -1519594, -995354, -102255, 515485, 488184, 534195, 1157112, 1387526, 289774, -1111955, -1195884, -420797, -622507, -1880844, -2235132, -768976, 1052213, 1771035, 1850176, 2204063, 2361953, 1492271, 275185, 197253, 1293215, 1959051, 1195320, -34470, -249195, 447832, 614750, -335148, -1247835, -1052811, -544804, -1182629, -2588887, -2833262]
38090b833262J470896J398280j12198o51616L05536P06548m39453j334883m40369
38081a930521R99656J095476K06892j56297J3614l06775r12409o43590M18734
38072a215220R01910L42252j34499L53751J166393J167596K06166q75218j237506
38063F75625p90566j96858j58761n51222n20462L04848J127195R68856j6554p86194
38053E5907p26316j78328K21238K38314R8160J51509M61183O35029K82482l40531
38043H98647n61498k54643k0777j98690l27748L1266N38042O34160L70706J47242
38033A256707M3593n0116j2513K24779K82036j56588o36810m13707L61917N90098
38023A489396l48576j543772j476474L1106J358344J002545m54253j093393k52862
$$ y = [-2833262, -1362366, 35914, -76284, -727900, -422364, 284184, -155269, -1490152, -1930521, -930865, 164611, 371503, 215206, 228820, -77955, -990364, -1633954, -1215220, -313310, 28942, -105557, 248194, 1414587, 2582183, 2788349, 1913131, 675625, -114941, -311799, -470560, -1021782, -1542244, -1237396, -110201, 858655, 842101, 55907, -670409, -848737, -627499, -389185, -291025, -139516, 321667, 956696, 1239178, 898647, 337149, 82506, 61729, -136961, -464709, -433443, 104599, 738759, 1109465, 1256707, 1300300, 1250184, 1237671, 1462450, 1744486, 1587898, 951088, 537381, 899298, 1489396, 1140820, -402952, -1879426, -1848320, -489976, 512569, 58316, -1035077, -1287939]
38014a287939P41943P44655L72825N52248P34877J3858r05639o51649L94666N59476
38004A269321l77016q75750k60640L44179J83264K6660L66529K98046o91494j407378
37994a124279p30361N40185R29201L51810k72274n30247m52848J76620J208868
37985I6675J579832O33284o04073o76513K47527P26460J00246q73847j244107
37976a4516q42884j51715K01216l1806l65811j46701L80954L30361k82120l30755
37966a253777N87509J313453Q93668L2722j91014Q207j43559n15646n33410l33856
37956a35703l16092k26387K45587O61123O23727N69667P52831M22017p56538j485058
37946C55174n89159Q52276Q61618n16821j406118q79170J58520P38692Q56348
$$ y = [-1287939, -545996, 198659, 571484, 1123732, 1858609, 1872467, 966828, 315179, 709845, 1269321, 892305, 16555, -244085, 100094, 283358, 310018, 676547, 974593, 283099, -1124279, -1854640, -1314455, -385254, -33444, -305718, -835965, -1288813, -1112193, 96675, 1676507, 2309791, 1705718, 1029205, 1276732, 2003192, 2103438, 1229591, -14516, -857400, -1009115, -807899, -839705, -1205516, -1352217, -971263, -640902, -923022, -1253777, -666268, 647185, 1540853, 1573575, 1382561, 1390768, 1247209, 731563, 198153, -135703, -451795, -678182, -432595, 228528, 852255, 1421922, 2174753, 2596770, 1840232, 355174, -233985, 618291, 1479909, 963088, -443030, -1322200, -1163680, -424988, 431360]
37937D31360O62255Q3269n55716p05514m95060m53219m39402M3247O20296L79978
37927d28506n67486j083895o71308k3679K50972L93013P02214R00761O55627J29031
37917B56744k48802j98462K13462N36199L47782p3232l5463L45881J15635q30648
37907D29096j165631j32793J026559Q71566n9836l27190O3085M4528m41813n05753
37897a98182l5660K47513J63210M2939k62261q76979r29498K80508J645619J554557
37887A631766L91253j54615J22935o8603r54867j320165p69457k46465j10105
37878a478323K42872O39461J72863p07391m05466J003683J463605K09264r13647
37869B26921m40646N40273N02736j47962k97375j05856k36049l84302k3616M25680
$$ y = [431360, 1093615, 1176884, 621168, -84346, -579406, -1032625, -1472027, -1428780, -808484, -428506, -995992, -2079887, -2751195, -2774874, -2523902, -2130889, -1428675, -527914, 127713, 256744, 7942, -190520, 22942, 559141, 906923, 833691, 798228, 1144109, 1259744, 429096, -736535, -869328, 157231, 1028797, 968961, 641771, 704856, 749384, 307571, -198182, -233842, 13671, 176881, 219820, -42441, -919420, -1848918, -1568410, 77209, 1631766, 2023019, 1868404, 1991339, 1922736, 967869, -352296, -1121753, -1368218, -1478323, -1235451, -595990, -423127, -1130518, -1535984, -532301, 931304, 1140568, 226921, -213725, 326548, 829284, 681322, 383947, 278091, 42042, -342260, -365876, 59804]
37859E9804L88467J32624k0223l97506r57860q11115K07521P76416P6083p41087
37849a286876l93302M42670L93787l19281m96686m6541K06260K02627N11530R09964
37839A24152O60253j6825j88745J88430K75481p6022r3898M16137N89880q5690
37829A793153q78594q39340k4260P89643J107119R62677M97136k09648r15671
37820B282215j208810r33484m73672l24990m16823k51469K18512M31676K06070
37811d70775J60729O02905P97335K08847l33458P8489O99661K35805q44129r59566
37801A75843j43073Q397p48730p46095N75374J387251M25683q27683n36047N98942
37791A69862P16496j82764o09887j94817N7585k34661l56940J3144L23047K56001
$$ y = [59804, 448271, 580895, 560672, 163166, -794694, -1605809, -1398288, -621872, -545789, -1286876, -1680178, -1237508, -843721, -1163002, -1659688, -1706229, -1499969, -1297342, -785812, 124152, 784405, 767580, 578835, 767265, 1042746, 966724, 872826, 1288963, 1878843, 1793153, 914559, 75219, 50959, 840602, 1947721, 2910398, 3407534, 3197886, 2282215, 1073405, 139921, -333751, -658741, -1075564, -1327033, -1108521, -676845, -470775, -310046, 292859, 1090194, 1299041, 965583, 1044072, 1743733, 1979538, 1135409, 175843, 32770, 41167, -707563, -1453658, -878284, 508967, 934650, 106967, -429080, 169862, 886358, 703594, 93707, -101110, -43525, -278186, -635126, -621982, -298935, -42934]
37781d2934J14240k6747m75204j045973r63263L1635J131539J360539O60186j34742
37771F09276k45321K12860L83041k15730r25436p61700J58327P14470L40537l14643
37761d4319m52829n8270M74819Q82386R47705N81210J22001j40055o15805j607939
37751H8904k121048r59290J034995J647265M81446m84817j09018L28485k24858
37742c17936o03435K87683J178201M91845q52282r45051j5377K79081j74652j03180
37732g75103N01824L12112p89971j295257m87313N79165R04024P46425N89222
37723B85128L04554j75663m79261m47174k69797J02237P21540R18916P481j289184
37713c21223j412612j59061R68168R14102L56161L21490O10327L62958m77819
$$ y = [-42934, 71306, 44559, -430645, -1476618, -2439881, -2408246, -1276707, 83832, 744018, 609276, 363955, 576815, 959856, 744126, -181310, -943010, -784683, -70213, 270324, -44319, -497148, -555418, -80599, 801787, 1749492, 2330702, 2452703, 2312648, 1696843, 88904, -2032144, -2991434, -1956439, -309174, 172272, -312545, -421563, -93078, -317936, -921371, -633688, 544513, 1036358, 184076, -760975, -776352, -497271, -671923, -775103, -273279, 38833, -751138, -2046395, -2533708, -1954543, -1050519, -304094, 285128, 589682, 414019, -65242, -512416, -782213, -679976, 41564, 960480, 967961, -321223, -1733835, -1892896, -924728, -10626, 345535, 667025, 1277352, 1640310, 1162491]
37704A162491j018927n20475P16418J509558R08265o57213j622680j052292K34062
37695c40793Q01840M01422p3757j1208L60055N53915K30026o75058j538332j272113
37685a564003K13137J359343Q33086n15888q48904k8457M22243j31197o03606
37676h64246j61270N03417M44712j71526o16591o27750l33699J41669N54579N95286
37666e35419L51409J91756J07062j82549m56032j60269N36669P53998K08679l44245
37656D71059l31953k02285n38478j007394q27284P3037R14825R94882M24027r5344
37646a24908j29895j3640k68577o54284m01858M61817Q46248J60599o64722m96143
37636a285363L72419Q46116O63431L25356p2492o93632j004545l02319R06840
$$ y = [1162491, 143564, -376911, 339507, 1849065, 2757330, 2100117, 477437, -574855, -340793, 461047, 862469, 788712, 777504, 1137559, 1691474, 1921500, 1246442, -291890, -1564003, -1350866, 8477, 841563, 325675, -523229, -551686, -129443, -260640, -864246, -1025516, -522099, -77387, -248913, -865504, -1493254, -1826953, -1685284, -1130705, -535419, -184010, 7746, 114808, -67741, -523773, -684042, -147373, 606625, 815304, 471059, 139106, -63179, -601657, -1609051, -2436335, -2363298, -1448473, -453591, -29564, -124908, -254803, -268443, -537020, -1191304, -1593162, -1131345, -285097, -124498, -789220, -1285363, -912944, -66828, 596603, 921959, 849467, 155835, -848710, -1151029, -244189]
37627b44189J305115N68193l29210o14077m46452j64964R9751L3362n59850j038102
37617a390423n83243M22261Q08854L96975J26482L64685M34702M1352k00469l3971
37607C87205m3919l81731k59095O46118J367839R52284k56120j216195j363268
37598a66882p81708O0533M69231J69640j10901L87338R91752M03383j009719j390554
37588i77887k49226O70682J71925n57733j07612P81428O16078l13393n89911n2517
37578f08166K58739P4986J23658N49589O30147J27343l34534l63698k25157r4676
37568A38231J53798L67440K37225K3885K27169N05826k3386j220434j751203r34730
37558b276179K25962N34041K79489M89934J055998Q12413m91223j444959p90477
$$ y = [-244189, 1060926, 1629119, 1299909, 685832, 239380, 74416, 174167, 207529, -352321, -1390423, -1973666, -1551405, -742551, -345576, -219094, 145591, 580293, 621645, 421176, 387205, 343286, -38445, -297540, 348578, 1716417, 2668701, 2412581, 1196386, -166882, -948590, -888057, -418826, -249186, -360087, 27251, 1019003, 1422386, 412667, -977887, -1227113, -556431, -384506, -942239, -1049851, -268423, 347655, 34262, -555649, -608166, -349427, -274441, -150783, 398806, 1028953, 1156296, 821762, 458064, 232907, 138231, 292029, 659469, 896694, 920579, 1147748, 1653574, 1630188, 409754, -1341449, -2276179, -2050217, -1516176, -1236687, -746753, 309245, 1121658, 630435, -814524, -1605001]
37549a605001P59751J379862N11940n49623n48884J65834M32951q3298p43671
37540b80139r63438o47958Q8743Q82981J035000K68819n78130m68123L40176O29192
37530C07123K4879n71950m86767j17083M9260J99796M70031M17500j26147m94076
37520c27434j64360L99943N50816M03929K98714L0606n46973q08672k34350M76749
37510G8968K36260p44080j146204l88546O73081J003090N45488p7618l82684k88021
37500d90266q147J27846L3063Q057K07148J80326m68132j130344p49589N46350
37490a743688J275504N47836o04734o34800L29361P62758O9366n81706j45172
37481g25275O71499N86348j83209k94411M96996Q72191J6684j096023j179892
$$ y = [-1605001, -845250, 534612, 1046552, 496929, -51955, 113879, 546830, 463532, -280139, -1243577, -1891535, -1802792, -919811, 115189, 384008, -194122, -662245, -322069, 307123, 332002, -239948, -726715, -843798, -794538, -594742, -124711, 292789, 166642, -327434, -491794, -91851, 458965, 862894, 1161608, 1192214, 645241, -163431, -397781, 78968, 315228, -428852, -1575056, -1963602, -1290521, -287431, 258057, 180439, -202245, -490266, -498413, -370567, -337504, -329447, -122299, 58027, -410105, -1540449, -2290038, -1743688, -468184, 79652, -525082, -1159882, -830521, -67763, 1603, -580103, -725275, -53776, 532572, 349363, 54952, 551948, 1424139, 1440823, 344800, -835092]
37472h35092l94746K66391N46578Q08593R12191L96519m61301q50889n91302j71805
37462c74863J81634N22547N21564q6370n98819j79189N31519J38422j116781j420470
37452a880806k39920P34627L25772k74163L17757J242541Q81782l88102q63334
37443a43846k42516K50591J32363J33767M22286J98595n97752q48588j08082N57110
37433b46072L16491j26981R7146M79772Q5190p57104r58506m12993k3286j70753
37423a717096l02008q8769P0498j4155J54387P96135J190448O76412k15384m31923
37413A18545Q6123L98266K7967m16849l17159J9881j0669k82935j90027L19044
37403b47813N97946K25723m26152p19898n19683j97807k7697J46587N28290Q38780
$$ y = [-835092, -1229838, -963447, -416869, 391724, 1303915, 1700434, 1239133, 388244, -203058, -374863, -193229, 329318, 850882, 764512, 165693, -13496, 518023, 656445, -460336, -1880806, -2120726, -1386099, -1060327, -1334490, -1016733, 225808, 1107590, 719488, -143846, -386362, -135771, -3408, 130359, 552645, 751240, 153488, -695100, -803182, -246072, 70419, -56562, 40584, 520356, 605546, -151558, -1110064, -1523057, -1546343, -1717096, -2019104, -2107873, -2037375, -2051530, -1897143, -1101008, 89440, 765852, 550468, 118545, 204668, 602934, 630901, 214052, -103107, -83226, -93895, -376830, -566857, -247813, 350133, 575856, 149704, -570194, -1089877, -1287684, -1315381, -1168794, -640504, 198276]
37393A98276N42190k77671p18696k11812M94033K76371n99062p10971L33050J111879
37383D37587M29745q84733j181985k47222P31812R32269N09667j94650q95454
37374c62964r95682j24638R74380J140603L96485j54102k5059J59982j4577j25338
37364H69090O2561K9673n03843r03828n37468K81659P65717N80854j8866n15721
37354A09828m19382K39942O63619J73840o75754p04386J58412P08968K06418p08274
37344b46769j081875p03720J31267R52561J042199J14167p94017l80592Q05207
37335a61572Q79008l87415r87859Q7054J070897K93163j034289q66093L02864
37326h04242M58439m50118n72995N73666J329146O52652m25836p19488n17139
$$ y = [198276, 740466, 462795, -255901, -467713, 26320, 302691, -296371, -1007342, -674292, 437587, 867332, -17401, -1199386, -1446608, -714796, 217473, 727140, 532490, -362964, -1358646, -1483284, -508904, 631699, 1028184, 874082, 849023, 1009005, 994428, 869090, 931651, 961324, 457481, -446347, -983815, -702156, 63561, 644415, 625549, 109828, -309554, -69612, 594007, 767847, 92093, -612293, -453881, 255087, 461505, -246769, -1328644, -2032364, -1901097, -948536, 93663, 207830, -586187, -966779, -161572, 717436, 330021, -657838, -570784, 500113, 793276, -241013, -1107106, -804242, -345803, -795921, -1368916, -795250, 533896, 1186548, 760712, 41224, -475915]
37317d75915n27255n77395k33686K81108N44146N73366M87325K12230r2687m8055
37307A43182J83280m8532p07373q38157k1971P78672N24004m16083q44228l42063
37297a589269M53946Q76597Q04178L53956l29025r12034r94111n58494m8459J30063
37287a812652K9398r949J42555K29641J0765k66905r3080N22263Q51579L56520
37277c9865m85192p19973j42376N29762O78064M54902L15403L40822K66777r9147
37267A099177o81007j171732j183817n68280L46157R94467J063879O29517k2236
37258E06125m58105k49390M77544Q41232J75295q83875j025321o8413O95868L09865
37248C20825n22525n41120K75688Q51568N95857k3886m09323n32496n73908m86330
$$ y = [-475915, -1003170, -1580565, -1814251, -1533143, -988997, -415631, 71694, 283924, 191237, 143182, 326462, 277930, -429443, -1267600, -1289571, -510899, 13105, -402978, -1247206, -1589269, -1135323, -258726, 545452, 899408, 570383, -341651, -1335762, -1894256, -1942715, -1812652, -1783254, -1793203, -1650648, -1421007, -1410242, -1677147, -1770227, -1247964, -396385, -39865, -525057, -1245030, -1387406, -857644, -179580, 275322, 590725, 931547, 1198324, 1099177, 418170, -753562, -1937379, -2505659, -2159502, -1165035, -101156, 528361, 506125, 48020, -201370, 276174, 1117406, 1292701, 408826, -616495, -684908, 10960, 320825, -201700, -742820, -467132, 384436, 980293, 956407, 547084, 14588, -559320, -1045650]
37238a045650j67269L21607Q49413J219910J094330L40951n45117q88356p25496
37229D54323o50430p24550l58372M61752P83796J34986n35788k59035L82517K62573
37219d8228k91215m484J046275J317754K60480p29701n15657Q9168j21837p21836
37209B80719n36182K84383N71807J00836k08758M2592J96353j57323m72301k39696
37199a37570J60121P3277m82832q74315n91537K20461Q38859O84523Q8806o8670
37189h8877K79484J27762r10610j542888n41508J147756J526955M26351m02910
37180B1515p7177L26802q3751n18725q6693N41849K90697m79462n89473P0996
37170e83422M89385J13916n17873o88496k94544K76742N53188L00531k07462l77226
$$ y = [-1045650, -1212919, -891312, -41899, 1178011, 2272341, 2613292, 2068175, 1179819, 454323, -196107, -920657, -1279029, -817277, -33481, 101505, -434283, -693318, -310801, -48228, -339443, -343927, 702348, 2020102, 2280582, 1550881, 1035224, 1124392, 1002555, 280719, -255463, 28920, 600727, 701563, 492805, 535397, 731750, 574427, 102126, -137570, 22551, 95828, -387004, -1261319, -1852856, -1632395, -793536, -109013, -20207, -88877, 190607, 318369, -592241, -2135129, -2676637, -1528881, -1926, 424425, 21515, -55662, 271140, 187389, -331336, -418029, 123820, 414517, -64945, -654418, -583422, -94037, 19879, -497994, -1186490, -1481034, -1204292, -651104, -350573, -558035, -935261]
37160i35261j5855L91667L79942J23525L5146J10459P4183j04090k26251j97557
37150c64092n5779J43679K97952L42215M20405O18834N61144j47631j032377j091996
37140c07646k82256K17082k85560q71179l82253P56826J094730K10326p75665
37131f25595p57932P5233P18482N74526m8871m11047j46867L46536L76321j82211
37121h1425p07136o01680K2365N66799N93921J37614l58778l50452K35792P33743
37111A90763M94245j18948j56877M14767N36480k49471q85442l51126O45762O04470
37101A124623n47497j319663p23709N57244J296936J157030N77884o1716n80848
37092A480284p19363l75601K2286o3101m97381o08213j59970L29646M31866L85323
$$ y = [-935261, -951116, -559449, -179507, -55982, -20836, 89623, 163806, 59716, -166535, -364092, -419871, -276192, 21760, 363975, 784380, 1403214, 1964358, 1816727, 784350, -307646, -589902, -372820, -658380, -1529559, -1911812, -1154986, -60256, 150070, -625595, -1383527, -1308294, -589812, -15286, -64157, -475204, -622071, -275535, 100786, -81425, -788561, -1390241, -1367876, -801077, -207156, -69542, -428320, -778772, -542980, 190763, 685008, 566060, 409183, 823950, 1360430, 1110959, 225517, -125609, 520153, 1124623, 577126, -742537, -1466246, -909002, 387934, 1544964, 2122848, 2061132, 1480284, 760921, 385320, 407606, 344505, -152876, -761089, -921059, -591413, -159547, 225776]
37082B25776M37276K08348n72516j160720o28436N54431Q90173o5696j098866
37073a210230j110938l75407M11519J110304J503287R56897l16917q54971K7143
37064A40687R20608M00012o85618o59494K06790L44730l34844m83915J41125L62771
37054C52852j50542l88918j4930J14765k03522r2973N35290O21124R460j10051
37044F72555M92494M00856q56644j564082m94531R76650J002769Q862l73316Q7366
37034C52979L89167J90554p3638l27626o87576p18065j43232K46801l34755j184850
37024b290241r75103K33465J071860P99730N7565l06684k24063o4135L4580K39726
37014a423300O52206R55492N97913l71887r26325k22649J013156J211808P3070
$$ y = [225776, 663052, 871400, 298884, -861836, -1490272, -935841, -45668, -111364, -1210230, -2321168, -2696575, -2285056, -1174752, 328535, 1285432, 968515, 113544, 140687, 1061295, 1461307, 775689, 116195, 322985, 667715, 332871, -151044, -9919, 352852, 202310, -186608, -201538, -86773, -290295, -383268, 152022, 773146, 782606, 672555, 1165049, 1565905, 709261, -854821, -1349352, -372702, 630067, 638929, 265613, 352979, 742146, 932700, 859062, 531436, -156140, -874205, -1017437, -770636, -1105391, -2290241, -3265344, -3031879, -1960019, -1160289, -1102724, -1409408, -1633471, -1697606, -1663026, -1423300, -771094, 184398, 782311, 410424, -515901, -738550, 274606, 1486414, 1559484]
37005A559484j099872j288717q38658m18578r3863J87685K76930L36936O50171
36996g28482P72652Q7593p71240n75424L30663L56665n59919o37171O55302J463314
36986C93953N98035m95767k86249L69499O9064n84971k77423N55517N65239k21994
36976F84903p58920p51780n13354L9248P80577P98123j28452o20574J79600Q58835
36966E68206q3043j522415j312199L28224J270130P59944O0538O3281K76791K09524
36956F18981N4606j13733m62820o96445l46700L47791P85300Q89621Q21157L90164
36946B287922l50444o72950k93110n6121m97760p54279q5818O27118L05964m54276
36936E6246m53964J15001L00628J57071L18897N81585L82498m6934l11460p08568
$$ y = [1559484, 459612, -829105, -1667763, -2086341, -2180204, -1992519, -1715589, -1378653, -728482, 44170, 131763, -639477, -1214901, -884238, -527573, -1087492, -1724663, -1069361, 393953, 991988, 496221, 209972, 579471, 648535, 63564, -213859, 341658, 906897, 684903, -74017, -825797, -1339151, -1299903, -519326, 278797, 150345, -470229, -290629, 568206, 485163, -1037252, -2349451, -2021227, -751097, 8847, 69385, 132666, 409457, 618981, 673587, 559854, 97034, -599411, -946111, -598320, 186980, 1076601, 1897758, 2287922, 1937478, 1264528, 971418, 915297, 417537, -336742, -422560, 204558, 510522, 56246, -397718, -282717, 17911, 174982, 493879, 1075464, 1457962, 1411028, 1099568, 391000]
36926C91000j215225q40529N93678J428092N88448m46300k3970Q54759L70926
36917A700879q46412q99731R714J41470o07683q01964k16879J25125K35529Q87357
36907b72595J431350N32284j111456j418207k60211M15394j14236m70619J20910
36898a147386O68535M42913L8895q5157k52640l89071L5398O30344L79242m92715
36888a71642o33342K71837J047569Q85353J92585m32441p25851m28076K88718
36879B94710M73120k55327p47197j33984M64059j80471j009012l67221J007283
36870d54040J176088K55767j50370M3176k50081o47196O3392J172336R22881k92256
36860A839697o05626r6650l64526j085870m59371J054282J059436n19255j128332
$$ y = [391000, -824225, -1664754, -1071076, 357016, 945464, 499164, 475194, 1329953, 1700879, 854467, -45264, -35550, 105920, -501763, -1303727, -1520606, -1395481, -1159952, -272595, 1158755, 1691039, 579583, -838624, -1098835, -683441, -797677, -1268296, -1147386, -478851, -35938, 2957, -82200, -334840, -723911, -688513, -58169, 321073, -171642, -804984, -533147, 514422, 1399775, 1592360, 1159919, 434068, 5992, 294710, 767830, 512503, -234694, -368678, 95381, -85090, -1094102, -1461323, -454040, 722048, 977815, 827445, 870621, 620540, -26656, 36736, 1209072, 2131953, 1839697, 1234071, 1137421, 772895, -312975, -772346, 281936, 1341372, 822117, -306215]
36851c06215J3708P73849L8279o88810m69138l48360o44597j29408J028682P93455
36841F1445j037117j852916l44868J426514J518844P62178M45140J66004m32184
36832G13040m17026L92824O04927j69996m27964L11766M33325o00033r15722L04595
36822B29736R73424l15734j604528p45183J111688J558452N00408n25700r11919
36813B70644q52433j90945Q02235R23199j38802q81484k21494Q56331J058214
36804A625465N87405J13644l82686p62783m70823Q4661k04968r37578n37813O97676
36794a87800O84531o25683p63855P94851J275355n53498j847582m24694J423800
36785b24575Q83387o55487l12666J261882J326473j84850r98882n53459l39566
$$ y = [-306215, -292507, 481342, 519621, -169189, -638327, -986687, -1631284, -1760692, -732010, 61445, -975672, -2828588, -3173456, -1746942, -228098, 534080, 979220, 1145224, 713040, 296014, 688838, 1293765, 1123769, 695805, 1007571, 1440896, 840863, -74859, 229736, 1203160, 887426, -717102, -1462285, -350597, 1207855, 1708263, 1182563, 270644, -581789, -772734, 29501, 952700, 813898, -67586, -289080, 567251, 1625465, 2212870, 2326514, 1943828, 1181045, 710222, 794883, 589915, -347663, -885476, -187800, 496731, -128952, -892807, -97956, 1177399, 623901, -1223681, -1648375, -224575, 658812, 3325, -309341, 952541, 2279014, 2094164, 1095282, 541823, 202257]
36776B02257p79788p46554M2838O25131O49101O29299N61177n392p76619j021105
36766f19655p14023k71938K61758Q09225Q38346K54222j79233n4492J01810M8880
36756D74900K69020O08352J21383j026978j300661k46224O63026M73409L3758
36747F9985l7885m42139j209112j001234L04796P58437m26266j193083J8711J582766
36737a575024J374424Q3262l46168J48908L35731J4772k05937l33101n68071n16302
36727a587506l8865K61210K66092O19802J143034P90459k06486l12273N35875
36718A471342N86410m89627p63582M70500J251813L70024o00210k58559L43139
36709B381250L8901m37631l96241n81125j098457o12621Q94028J337848K3532
$$ y = [202257, -577531, -1324085, -1281247, -656116, -7015, 622284, 1183461, 1178069, 401450, -619655, -1333678, -1605616, -1343858, -534633, 303713, 557935, 378702, 324210, 426020, 474900, 743920, 1352272, 1473655, 446677, -853984, -1100208, -437182, 36227, 69985, 32100, -410039, -1619151, -2620385, -2315589, -1557152, -1983418, -3176501, -3157790, -1575024, -200600, -117338, -463506, -314598, 21133, 35905, -170032, -503133, -1071204, -1587506, -1626371, -1365161, -1099069, -479267, 663767, 1454226, 1247740, 935467, 1471342, 2057752, 1568125, 804543, 1275043, 2526856, 2896880, 2296670, 2038111, 2381250, 2420151, 1982520, 1586279, 1005154, -93303, -705924, 188104, 1525952, 1549484]
36700A549484r62338l65635K57962k37618n67852P3920L17438m03016m56252O33742
36690a60165Q85966l06438p18275M54473Q27313n93718j249165J46524R48718
36681B35233m60938j432842O6168J596738P42940o28398k30542M78977k83491
36672H3845r21555N2391O77462m96504j063778O79922J919334K71981j556175
36663c53077n74651J092404L84141j081322n71309M24809l87281j103317N77650
36654a591953K198195P85300j286737m79067J300437L65390j685883r70688J418584
36645E3578J626721Q6646j8998Q58798J05366j230983l32894J519145J084246
36636C751625o44984m11871R90981M77486j037727k97076J871945J864455k85812
$$ y = [1549484, 587146, 221511, 479473, 241855, -325997, -252077, 65361, -337655, -793907, -160165, 725801, 419363, -298912, 155561, 982874, 389156, -860009, -713485, 235233, -225705, -1658547, -1592379, 4359, 747299, 118901, -111641, 367336, 83845, -837710, -785319, -107857, -604361, -1668139, -988217, 931117, 1203098, -353077, -927728, 164676, 548817, -532505, -1103814, -679005, -1066286, -2169603, -1591953, 606242, 1391542, 104805, -374262, 926175, 1291565, -394318, -1365006, 53578, 1680299, 1766945, 1747947, 2606745, 2712111, 1481128, 1148234, 2667379, 3751625, 3106641, 2694770, 3685751, 4163237, 3125510, 2828434, 4700379, 6564834, 6279022]
36627F279022j539559j470814j726391j567123M77129K299331J132958j115013
36619B769540r11954P02288M97054q31428o51826J12192o59420j270485M23770
36610A79731J765530k40560k554236r63495K090035J723284p33162q01285P28413
36601A194255K14393j202659k68928J268737J18223j392559L75865K650936J147839
36592D106102j399005l23978J778326J86743k331824q52242J707500K78957j929961
36583A220618K69496K968694K67919l471361j296454K627532Q09908k629794O9966
36574H36524M226263J213813l795390p68908N291900L150642k736745o00050N164828
36565A1982877K472976l385097Q26557Q858720O025485J91670Q270402J9326848
$$ y = [6279022, 4739463, 3268649, 1542258, -24865, 452264, 2751595, 3884553, 2769540, 1857586, 2559874, 3056928, 2225500, 1573674, 1685866, 1026446, -244039, 179731, 1945261, 1704701, -849535, -1813030, 277005, 2000289, 1267127, 465842, 1194255, 1408648, 205989, -62939, 1205798, 1324021, -68538, 307327, 2958263, 4106102, 2707097, 2383119, 4161445, 4348188, 2016364, 1164122, 2871622, 3150579, 1220618, 1490114, 4458808, 4726727, 1255366, -41088, 2586444, 3396352, 766558, 836524, 5062787, 6276600, 2481210, 1712302, 7004202, 10154844, 7418099, 6818049, 11982877, 14455853, 11070756, 11897313, 20756033, 26781518, 26973188, 35243590, 54570438]
36557E4570438J0846668m555320L684499K4255905K0922186J2749631O1178779
36550A83652786J50402658J63250344L6265771j26696418j74545910r9283816
36544A33045415k1299889j2117248k7353383j5147741M265682k583880j8301697
36537D0507259j3471641L50074j284844j0236541o258802M013448K684596n443475
36529A0860074m770466J613238J024863l771009k338437K190082P80900k932535
36521B656710p44550L141901O88335l679983j743958K427056P46429l043698j081341
36512f33099L007883J217878l291091k363734J786960J488206j736903r87481
36504a511381K424415K113876q85509q74492J160215L31729j772703m07657K254262
$$ y = [54570438, 65417106, 60861786, 64546285, 88802190, 109724376, 122474007, 183652786, 334055444, 497305788, 533571559, 406875141, 232329231, 133045415, 111745526, 99628278, 72274895, 57127154, 61392836, 58808956, 40507259, 27035618, 27385692, 26100848, 15864307, 9605505, 13618953, 16303549, 10860074, 6089608, 7702846, 8727709, 4956700, 2618263, 4808345, 5589245, 2656710, 1912160, 5054061, 5742396, 2062413, 318455, 2745511, 3491940, 448242, -633099, 2374784, 3592662, 301571, -2062163, -275203, 1213003, -523900, -1511381, 913034, 3026910, 2141401, 1266909, 2427124, 2758853, 986150, 578493, 2832755]
36495B832755Q99828k476145k066971J026666J395991m62398j20566J522397L62298
36486B913855k150293j449603J311904J492072l27395j52397J330706O39734r70642
36477B637941L5450J902071N62119k159546j497584J298442J273858q79194k84167
36468B889390K646136K692570p78752k926918j898584q18736j154869q92547L51214
36459A08904N62834j06679L81049J278542Q7395k133858j927672M67552J460743
36450A78810J99253p46898m11905k86165n40761K7154P92194K92789m20864M71374
36440d45019J699910R30657q59229j234080p12000r77273q68128J084995K453024
36431A072857N02795k248368j697210P71666Q97416p57999k81827J903837J747309
$$ y = [2832755, 3732583, 1256438, -810533, 216133, 1612124, 1149726, 1029160, 2551557, 2913855, 763562, -686041, 625863, 2117935, 1790540, 1638143, 2968849, 3608583, 2637941, 2673391, 4575462, 5137581, 2978035, 1480451, 2778893, 4052751, 3173557, 2889390, 5535526, 8228096, 7449344, 4522426, 2623842, 1805106, 650237, -242310, 108904, 671738, 565059, 946108, 2224650, 2312045, 178187, -1749485, -1281933, 178810, 378063, -368835, -780740, -1066905, -1607666, -1580512, -788318, -495529, -916393, -445019, 1254891, 2185548, 1326319, 92239, -619761, -1597034, -2465162, -1380167, 1072857, 1575652, -672716, -2369926, -1598260, -700844, -1458843, -1740670, 163167, 1910476]
36422A910476p85197j626933j7565O22022n77492p48238O40998P36015q45149
36413f91063j034739P66141J441983l528p95755J74055N24887o09902q47421O18496
36403d56846J308798K34857k53063Q63708J211568m47182j775939r84795L48094
36394D9200N22522L43966O67397N12528n96587j268179p43152j52169j41248J43551
36384f62171Q27233P49370j39414m95395j54245k02649l30963P11364J929934
36375B233064R98740j313044j586665O58729J933178M98092j002698l44180P48394
36366B823610J14849j154827j084734k02440j05688o92135r48327q34344o60630
36357b744666r0040Q58282J228899O26858o7558j99093j12709o093L74678O30724
$$ y = [1910476, 1125279, -501654, -519219, 102803, -474689, -1222927, -581929, 154086, -691063, -1725802, -959661, 482322, 478794, -316961, -142906, 381981, -227921, -1075342, -456846, 851952, 1086809, 833746, 1697454, 2909022, 2461840, 685901, -298894, 49200, 571722, 915688, 1583085, 2095613, 1499026, 230847, -512305, -664474, -805722, -662171, 165062, 914432, 775018, 279623, 125378, -77271, -408234, 303130, 2233064, 3231804, 1918760, 332095, 990824, 2924002, 3422094, 2419396, 2075216, 2823610, 2938459, 1783632, 698898, 496458, 390770, -301365, -1249692, -2084036, -2744666, -2834706, -1976424, -747525, -120667, -188225, -387318, -500027, -506120, -131442, 499282]
36347D99282O1428p47656n61471L12793N17367J26444K98043P03477M661j222001
36337g633j005929M55514Q37742l72320j103988l91891K91065P5259k3094L37570
36327i07705L4185q68463p05999O01341R88587j28555p52298P2523O81073J02876
36317h82435k19494N02542P47311k47155p99733L2730N80445j98509n97115N24859
36307e56554J236171r1773j576895q60912R11361J163897R6562k55420K48042
36298C14479J35766n88818n58852K32622M15647k17077m13150K35443O19915L7881
36288B13856p07715n71434L28502R55916N84778l61805p00613M6003Q45710N21060
36278A154258m25281n18914L43421P48022O2826o80208n49872P1803M44175L70000
$$ y = [499282, 560710, -186946, -748417, -435624, 81743, 208187, 506230, 1209707, 1214368, -7633, -1013562, -558048, 279694, -92626, -1196614, -1588505, -1297440, -1222181, -1245275, -907705, -873520, -1741983, -2447982, -1846641, -858054, -986609, -1738907, -1666384, -985311, -882435, -1101929, -599387, 147924, -99231, -898964, -866234, -285789, -484298, -1081413, -556554, 679617, 587844, -989051, -1849963, -938602, 225295, 321857, 66437, 314479, 450245, -138573, -697425, -464803, -49156, -266233, -679383, -443940, 175975, 213856, -493859, -1065293, -736791, 219125, 803903, 442098, -258515, -212512, 633198, 1154258, 728977, 210063, 553484, 1301506, 1364332, 684124, 134252, 206055, 650230, 1020230]
36268A020230j00126o57695m84562O19313J196302j7941j644473j314096N40060
36259h42988J238510J93895l54574O04011J264544M34165n48095o02967o54756
36250G31745j115531n98202J089949J582370k97956k125148j559730M6265K94826
36241a951412l17276M8532J023748J048471M52369N84978J031855N09750m22162
36232B008853k86493M38391L8159j365108j973906j219356k23419L55807Q02451
36223a424621R27016K36642o29663n16832L38235P03964L70693R3809p6727o09452
36213e86936r97994l61528O83306O75233k51128m97040L56288R39937M39014k29082
36203A70070j09219M19175N96755M17034J92697r4621m97704q12551q83393p15451
$$ y = [1020230, 920104, 262409, -222153, 397160, 1593462, 1575521, -68952, -1383048, -842988, 395522, 589417, 234843, 838854, 2103398, 2537563, 1989468, 1386501, 731745, -383786, -981988, 107961, 1690331, 1392375, -732773, -2292503, -2246238, -1951412, -2268688, -2220156, -1196408, -147937, 304432, 889410, 1921265, 2431015, 2008853, 1722360, 2160751, 2198910, 833802, -1140104, -2359460, -2582879, -2227072, -1424621, -497605, -260963, -890626, -1407458, -1069223, -365259, 5434, 99243, 22516, -586936, -1584930, -1946458, -1263152, -587919, -839047, -1336087, -979799, -39862, 399152, 170070, 60851, 480026, 1076781, 1493815, 1686512, 1591891, 1094187, 281636, -601757, -1317208]
36193a317208k98061J71509J51893m73630q44156j74446R76937J421278J007751
36184F21867N65836M39402J87297l36498o62151n26986j59789K61108O60818O82194
36174A733098P8877n84050m73825K63185N93907R459q44948j071410n38162R5381
36164g38488P5972o54136j233103p76129M15644J156301J010421O94164N57167
36155E07813m6117j152666j382546J1920J514093J358711K19593M7565Q97075
36146A975441R79344l17998j514152j394670n23890O7807K29875J98891L778j45406
36136d40980O9397K95400j10590p20726l55321Q93189J395060L89193p30141m77516
36126B06965N55551P73477n0136p63735p19165m19819l92931m24148q5441N83462
$$ y = [-1317208, -1615269, -1443760, -1291867, -1765497, -2609653, -2784099, -1807162, -385884, 621867, 1187703, 1627105, 1814402, 1477904, 815753, 288767, 128978, 390086, 1050904, 1733098, 1811975, 1227925, 754100, 1017285, 1611192, 1620651, 775703, -295707, -833869, -738488, -662516, -1316652, -2549755, -3325884, -2910240, -1753939, -743518, -49354, 507813, 461696, -690970, -2073516, -2061596, -547503, 811208, 1030801, 1078366, 1975441, 2954785, 2636787, 1122635, -272035, -795925, -728118, -498243, -299352, -295574, -440980, -371583, -76183, -186773, -907499, -1262820, -369631, 1025429, 1414622, 684481, 206965, 762516, 1535993, 1485857, 722122, 2957, -416862, -809793, -1233941, -1319382, -735920]
36116g35920J085104Q93121m6105j056059j258346n99864L1148J5067j78398J33752
36106a716500O65544O13422J4216k08760L89958J096468R90775J00114p17732
36097A227505p87966k55694K08792J97442j6981N0377K99782J27621n56346r44795
36087d50263m20259M67366P83608N62607M99518N76932J24530p53916j054463
36078C35660m82134K8487q8088j54015K71673L22690o29284j496474j000851J90942
36068b701394M91622r0620k41582K75753M61285J55990K64061P68067N70488l05216
36058c51546m32368M72351Q17733j36619r09831l80869K75119j96696q18921j86657
36048a848304R47999R94886K41662Q8137M64234K02334o15095q08429k54191P0755
$$ y = [-735920, 349184, 1242305, 1196200, 140141, -1118205, -1718069, -1686921, -1671854, -1850252, -1716500, -1050956, -437534, -423318, -632078, -242120, 854348, 1845123, 1945237, 1227505, 439539, 183845, 392637, 590079, 573098, 623475, 923257, 1050878, 494532, -450263, -870522, -403156, 380452, 943059, 1442577, 2019509, 2144039, 1390123, 335660, -146474, -117987, -206075, -360090, -88417, 234273, -395011, -1891485, -2892336, -2701394, -2209772, -2300392, -2541974, -2266221, -1804936, -1648946, -1384885, -616818, -46330, -351546, -783914, -311563, 506170, 369551, -540280, -921149, -646030, -842726, -1661647, -1848304, -900305, 94581, 336243, 424380, 888614, 1090948, 475853, -332576, -586767, -516012]
36038e16012m1037O8134L58724J83122k49637j74159J92377P8841j81984K72459
36028i172Q90506L27757j084812j545857n69761M21280N01887K70116J69015k22689
36018h51730p45506m29956O65716J166750N73953L6535K78310M59701j22905q09780
36008B21088q71108n70582k12731M14878R87279N91157n43184q68789R5792Q50734
35998I4534L24906m61777k87751L05659K79975o8510P005J63515k16042o35040
35988d93526l44675J95571P4288m92213n77349k2631N83207R20667R88316O36198
35978A467853o3431m44535m5767O27571P65914K41648n12541j052303j025499
35969d1090m32408L815l62598q09836l5729J523850J813037K29647j194031p56681
$$ y = [-516012, -557049, -488915, -130191, 52931, -196706, -370865, -178488, -99647, -281631, -9172, 881334, 1209091, 124279, -1421578, -1991339, -1570059, -1068172, -798056, -629041, -851730, -1597236, -2027192, -1361476, -194726, 379227, 415762, 694072, 1153773, 1030868, 221088, -650020, -1220602, -1433333, -1018455, -31176, 559981, 16797, -851992, -756200, 94534, 419440, -42337, -330088, -24429, 255546, 187036, 194041, 357556, 141514, -493526, -838201, -642630, -568342, -1060555, -1637904, -1660535, -1077328, -156661, 831655, 1467853, 1404422, 959887, 914120, 1541691, 2307605, 2549253, 2036712, 984409, -41090, -473498, -469683, -832281, -1642117, -1677846, -153996, 1659041, 1888688, 694657, -62024]
35959f2024M66258N94206j53613l35004P7249l4748o66705o93344M9148M62277
35949b96300Q9465j96425K44310P97917O63493O1879k33270p7674n9060n07269
35939D87066r06246o23320K6847J28075l23060k07225Q34316J406872L97989r99828
35929B21486r32725K13365N36576k46226o47948k26024j05168n14440l19029N30975
35919a489158O21665k04400l51812M83451N40270o33155r61848M59308J405829
35910a29850K86010r50804j45462J359595J168573j45628m81196P9836N7751l58030
35900G40795n5732L80840k55142j177169r21752j69561l28926n24845P35220K033106
35890D56834R04950j513840j743933L57886J360321M0535q70725K10463J015188
$$ y = [-62024, 404234, 998440, 844827, 509823, 587072, 552324, -114381, -807725, -758577, -296300, -206835, -403260, -158950, 638967, 1302460, 1364339, 1131069, 1053395, 994335, 487066, -419180, -1042500, -1015653, -887578, -1210638, -1417863, -583547, 823325, 1221314, 221486, -711239, -497874, 38702, -207524, -855472, -1081496, -1186664, -1701104, -2020133, -1489158, -867493, -1071893, -1423705, -940254, -399984, -1033139, -1994987, -1535679, -129850, 156160, -794644, -940106, 419489, 1588062, 1442434, 961238, 1041074, 1098825, 740795, 685063, 1065903, 810761, -366408, -1288160, -1457721, -1786647, -2311492, -1576272, 456834, 1361784, -152056, -1895989, -1538103, -177782, -137247, -1007972, -797509, 217679]
35881B17679l01973j772073r79169R44667J351419J31476p81259n77314j236M26619
35871a341164P11254N91411l0045m60759j98055J71714N9357k1509M87769R32695
35861I02668M67554m08157n94797j23445Q3214j95895l12813k2979J56571m8669
35851i6748j87536R4743L47517r8681j024578j303201k78263J127980J331168
35842h7599J60602q11266m10836N78671P51124Q5485m54877n77182n88387k54515
35832a608780P26514J454506P10968r28210j534551n66423M51318L38655k46375
35823a202378l07851k5168L6165R548J75931K97723K33232L25637N59452K88585
35813C90876n35589q79546j76567O15137M78847j0345L06147J148717J173624
$$ y = [217679, -84294, -1856367, -2835536, -1890869, -539450, -407974, -1189233, -1766547, -1767783, -1341164, -629910, -38499, -68544, -529303, -727358, -555644, -496287, -517796, -30027, 902668, 1370222, 962065, 367268, 243823, 327037, 131142, -181671, -204650, -48079, -96748, -284284, -189541, 157976, 59295, -965283, -2268484, -2546747, -1418767, -87599, 73003, -738263, -1149099, -570428, 180696, 266181, -188696, -765878, -1354265, -1608780, -882266, 572240, 1283208, 354998, -1179553, -1745976, -1294658, -956003, -1202378, -1510229, -1535397, -1499232, -1489684, -1313753, -1016030, -782798, -457161, 102291, 390876, -144713, -1024259, -1200826, -585689, -106842, -117187, 188960, 1337677, 2511301]
35804B511301J54478o05040k97052J60973l75183j376535j285913J71002J410495
35795D68526J071740k00675p85469k91815K65323J93719j51193l89679o39413
35786d58936p42520k01995O49280O63549l03585q60941j83365O53162M75497j34401
35776d44255q7767K84551O6871m56217m52257j69038l02100m77767r455N50154
35766a497280L30819r3303K86733Q34608K69564q04202o50844O01550J088569
35757C66214L11268k72735K2934J69617l09559m17357K38854N48377m1056m76032
35747A40525o5671K80305j71853n78525l3070Q72804J095642O24928Q322n52680
35737A620727q60695n33687J51949K82648k44671m30580J22867M75985j7018n98660
$$ y = [2511301, 2665779, 2060739, 1763687, 1924660, 1549477, 172942, -1112971, -941969, 468526, 1540266, 1339591, 554122, 262307, 527630, 721349, 570156, 180477, -458936, -1201456, -1403451, -754171, -90622, -394207, -1255148, -1438513, -785351, -309854, -444255, -532022, -247471, -180600, -636817, -1089074, -1258112, -1560212, -2037979, -2047434, -1497280, -1166461, -1259764, -973031, -138423, 131141, -673061, -1323905, -722355, 366214, 677482, 404747, 427681, 597298, 287739, -129618, 109236, 657613, 616557, 140525, 74854, 355159, 183306, -395219, -428289, 444515, 1540157, 2165085, 2173407, 1620727, 760032, 226345, 378294, 660942, 416271, -14309, 108558, 584543, 567525, -31135]
35727c1135m25340J23975K64443k1138l20263m49697k75188K55757N98000J41067
35717a39519n68861l81764N19603P26331o9774n38639j7852L83483k32004j070786
35707a389782j056504l13623N49531J263765J365373L94746p39901l82814J126338
35698H17129J349801n53215k183302j440277L66604Q52425J87072J35439Q23749
35689C55425Q72873q632p46762q13358o25657l79717J3381K30710P2315J22789
35679i06633O65629P44348l22790j376039r52015L92648R99296O77851N38438
35670D60733P49857L97949n74462j091022p03788j18185J52568L09453L54185
35661f2712p0364p52300r14156l36200L64214O24828M22260J0113j95141K04819
$$ y = [-31135, -456475, -332500, -68057, -89195, -409458, -859155, -1134343, -878586, -280586, -139519, -708380, -1090144, -570541, 155790, 86016, -452623, -470475, -86992, -318996, -1389782, -2446286, -2759909, -2210378, -946613, 418760, 813506, 73605, -309209, 817129, 2166930, 1613715, -569587, -2009864, -1643260, -790835, -603763, -468324, 355425, 1228298, 1219666, 472904, -340454, -966111, -1345828, -1332447, -1101737, -1029422, -906633, -241004, 503344, 180554, -1195485, -2147500, -1754852, -755556, -77705, 460733, 1210590, 1608539, 1034077, -56945, -760733, -878918, -726350, -416897, -62712, -133076, -885376, -1799532, -2135732, -1771518, -1146690, -724430, -714317, -909458, -704639]
35651g04639R07523R40465M8585o77143l75520K51359J94562k17605j78446K2621
35641B11762k57434n39803j03653M03998j9915p62300n05301M22753O02821K9813
35631e17259o5041L40622P2549p53457o20914O41987J302918N52790k81315j81689
35621D91191L090m82223p68964j45709L75981j64190p90950j83763R74278J011375
35611C20116j08276q74093n47279J22159L46243J93331J6311m1570O0948J78252
35601c33858p8938p31145j068213n29223M20699R42084R02318N89943p5882j061610
35591a023825j436669l50432J357527J826856O05665p77984r68805l44516Q1661
35582a030522K00458M23483O09439L69633n6320j73830j57161m91646r11510o56434
$$ y = [-704639, 202884, 1143349, 1191934, 514791, 139271, 390630, 585192, 367587, 189141, 211762, -45672, -585475, -689128, -285130, -305045, -1067345, -1572646, -1149893, -547072, -517259, -582300, -241678, -169129, -922586, -1543500, -901513, 401405, 954195, 672880, 491191, 494281, 12058, -756906, -902615, -526634, -690824, -1481774, -1665537, -691259, 320116, 211840, -662253, -1209532, -1087373, -741130, -547799, -531488, -573058, -512110, -333858, -412796, -1143941, -2212154, -2741377, -2320678, -1378594, -476276, 113667, 37785, -1023825, -2460494, -2810926, -1453399, 373457, 979122, 201138, -767667, -1112183, -1030522, -830064, -406581, 202858, 572491, 516171, 342341, 185180, -306466, -1217976, -1874410]
35572a874410K30633P98665N47623M0766j25811j54961l90781n25068j03485N97575
35562i59254Q36680L84085k25736l62995K0583L38912K560p31198q16262J66096
35552a346529J049512N39983o39889n52579R05765J616961N57979n28749q2759
35543A519695O59404l0641j185024q29788L81908K20307j084034j076608O46828
35534g77953J638687O68134m88060l80113j30031q68923j511638q77904J48156
35525b579645M21432N33761J144669J228855M5568r23535k57621P91487L99324
35516H04295n84765k09068R40948O91017q12417j262531j35104N63142j37207
35507a41690o78540J07792J059014Q33474K1236k10458l6485j99980m71476k00111
$$ y = [-1874410, -1643777, -845112, -297489, -256723, -382534, -537495, -928276, -1453344, -1556829, -959254, -122574, 261511, 35775, -327220, -306637, 32275, 34835, -696363, -1512625, -1346529, -297017, 242966, -396923, -949502, -43737, 1573224, 2131203, 1602454, 1519695, 2179099, 2148458, 963434, 133646, 515554, 735861, -348173, -1424781, -777953, 860734, 1528868, 1040808, 660695, 530664, -338259, -1849897, -2727801, -2579645, -2158213, -1624452, -479783, 749072, 794640, -128895, -386516, 404971, 804295, 219530, 10462, 951410, 1642427, 830010, -432521, -567625, -4483, -141690, -820230, -712438, 346576, 1180050, 1201286, 990828, 954343, 754363, 282887, 82776]
35497H2776L23018K30268n07543r08204k34980R92882J405085L16226j194572
35488E04956j343905m5069P16927l35161j728694j329813M62994J446267R77272
35479f74226M95706P72126Q56723J85619l66024l11958n11561j252361j170387
35470a976343M84175J986670J320064p25695j498161j23885J543002J655175N04395
35461C169397n13657p99153o33357k16272L98191P67524M15810k89331m79208
35452A819944j62932k95638j007873r18354O92791K051360J025300j409375k088210
35443b92987k22659J400866O73795q40247q11903J51769O2153q25296p21117K95583
35433a130043M66260l77487n25985M66571R75953K11553m45903R7263Q89532P26240
$$ y = [82776, 405794, 636062, 128519, -779685, -1014665, -21783, 1383302, 1699528, 504956, -838949, -884018, -167091, -502252, -2230946, -3560759, -3097765, -1651498, -674226, -178520, 593606, 1450329, 1635948, 1269924, 957966, 446405, -805956, -1976343, -1492168, 494502, 1814566, 1088871, -409290, -533175, 1009827, 2665002, 3169397, 2655740, 1856587, 1223230, 1006958, 1405149, 2172673, 2588483, 2299152, 1819944, 1657012, 1361374, 353501, -564853, 127938, 2179298, 3204598, 1795223, -292987, -515646, 885220, 1559015, 718768, -93135, 58634, 120787, -704509, -1425626, -1130043, -663783, -1041270, -1567255, -1100684, -124731, 86822, -359081, -261818, 627714, 1353954]
35423A353954K7543k37935j78791l82777o81808n40238j7383L82371L37624j36860
35413g4300o30386m49475M69120J019048L33000o72105n68231J87095j1891j013435
35403a411560j013543K50875R13507K40092r7397Q33644J334401N0470j391079
35394b90590q96222O88407J071565J50682l29555N7024P9623o15518r19809l39300
35384a343693K67448L50546M46471Q51225Q81086O0273r28125j077679k84212
35375g76660O36164Q25362J60911o27220p14507j69633K09062J62515L23530R33083
35365I62607J146051L43894p25526j040170p71181o36766n27140P063M86636J10623
35355f43909o89913o84518K68931J054480J038221P45013O36259L91565k14838
$$ y = [1353954, 1381497, 1143562, 964771, 581994, -99814, -640052, -657435, -275064, 62560, -74300, -704686, -1154161, -685041, 334007, 667007, -5098, -573329, -386234, -398125, -1411560, -2425103, -2174228, -1260721, -1020629, -1118026, -284382, 1050019, 1100489, -290590, -1186812, -498405, 573160, 723842, 394287, 451311, 530934, -84584, -1004393, -1343693, -1076245, -725699, -279228, 571997, 1453083, 1513356, 585231, -492448, -776660, -140496, 684866, 845777, 218557, -495950, -665583, -456521, -294006, 29524, 962607, 2108658, 2452552, 1727026, 686856, -84325, -721091, -1248231, -1241168, -754532, -643909, -1333822, -2018340, -1749409, -694929, 343292, 1088305, 1724564, 2116129, 1901291]
35346A901291o95575o11558k79046k61901n88063p89337m70138K76376Q63030
35337f54921P59815K27974J10110N68594O40501l31131j454279j401508l05879
35328a840724N36064N75828M45935N47266M37613j18550n54989m03763q957R0638
35318b93639q2862j50440Q5035M92363O84333L02398l86128m86264L04456R03338
35308A372590K34652r55041r83838J88915Q42040K00675m28401M4254O75512J82152
35298A373510q53752r91386k58653J44425o7169j13651J55747P0549k99453r296
35288h49129R54968J242357J90454r88225r62569j40392K62253J05727Q3324K53266
35278A52034J24182j68258q2427J09560l35665j052319p46674O94628J634821
$$ y = [1901291, 1205716, 594158, 315112, 53211, -534852, -1324189, -1794327, -1517951, -654921, 104894, 332868, 442978, 1011572, 1652073, 1320942, -133337, -1534845, -1840724, -1304660, -728832, -282897, 264369, 701982, 583432, 28443, -375320, -384277, -293639, -376501, -526941, -441906, 50457, 734790, 1037188, 651060, 164796, 469252, 1372590, 1607242, 652201, -331637, -142722, 699318, 899993, 471592, 515846, 1191358, 1373510, 519758, -471628, -730281, -585856, -653025, -766676, -610929, -540380, -839833, -849129, 105839, 1348196, 1538650, 550425, -412144, -552536, -290283, -184556, -101232, 152034, 276216, 107958, 25531, 135091, -200574, -1252893, -1999567, -1304939, 329882]
35269C29882R05691n31149r95715k63039O03136Q62100N53956r7213p35845p37614
35259a05810J7395N71037L5923r93669j181240l44060M58376N60913K80418p0225
35249g70942n42852q21460l49664N38550P87019K69206O8769O19437Q44312m6248
35239E96127j077482r49010n7196K21569k70491l59159M90889J318669J047293
35230I61209j12560r87697p00814N75440J767797J756112M36334j039418j407161
35221A249242o59288P2916k9182n87399p35539k96132J39076J66372J42318N60618
35211B3002J140868J035988N067j115977j400454q78648k21920K15436N12858
35202f83780O73600O18676M70278K79544k08245q80548q49775L03095J328427
$$ y = [329882, 1235573, 704424, -291291, -554330, 48806, 910906, 1464862, 1367649, 631804, -105810, -88415, 482622, 518545, -475124, -1656364, -2000424, -1542048, -981135, -700717, -770942, -1313794, -2135254, -2484918, -1946368, -1159349, -890143, -821374, -201937, 642375, 596127, -481355, -1430365, -1487561, -1265992, -1536483, -1895642, -1404753, -86084, 961209, 848649, -139048, -839862, -264422, 1503375, 3259487, 3695821, 2656403, 1249242, 589954, 662870, 633688, 46289, -689250, -985382, -846306, -679934, -537616, 23002, 1163870, 2199858, 2204925, 1088948, -311506, -1190154, -1412074, -1196638, -683780, -10180, 608496, 1078774, 1358318, 1150073, 269525, -580250, -277155, 1051272]
35193A051272P09444r03401j267768J99007J435301P10101r80110j594592q51832
35184a492578J4073L77130O00448P98211O39545K23908j1599j56558n64853q57839
35174d30112l06052P51817J013058O5697q48635n01658O18079J011166J96393
35165A569753p65109p96607j57018J48087j21999k29989K44791O83041M21829
35156I96779j59860k37858J96349M46141K03810k44925o59247q75535n09741M19576
35146d24511R04530J46135r52460q78835J10881L77581l44497n36840L73573R54569
35136b69874K78967m90196k07983L71418K42590K8097N64751J037158L33270q65811
35126A022387j149241n94115k11124p7272K59140L95960j16595m42757K12431
$$ y = [1051272, 1760716, 857315, -410453, -211446, 1223855, 1933956, 953846, -640746, -1492578, -1478505, -1101375, -500927, 297284, 936829, 1160737, 1149138, 992580, 427727, -430112, -736164, 15653, 1028711, 1094408, 245773, -255885, 362194, 1373360, 1569753, 804644, 8037, -148981, -894, -122893, -352882, -108091, 574950, 996779, 836919, 599061, 795410, 1241551, 1445361, 1200436, 541189, -334346, -844087, -424511, 480019, 626154, -326306, -1205141, -1094260, -716679, -1061176, -1598016, -1224443, -269874, 9093, -481103, -689086, -317668, -75078, -46981, 517770, 1554928, 1888198, 1022387, -126854, -720969, -932093, -1009365, -750225, -354265, -470860, -913617, -701186]
35117g01186Q10830M3778j126744p66669P89797J437883P08215J53398L83420
35108A732722K76062n62954r95816n56631k38546m60806l49899L02082M37599
35099d16187j86681l87585J66860J77644p90499j152915O6601J399028J216512
35090I2778J53314l17976j94606k02256j30430L74833N25139l66966j309663r58927
35080b334760K78130J000297Q75326M59565j71483r85672j018845L33552J660713
35071I6823J096883p97485j615125m77164R75920J100465J21012p90807r00167
35062a189645r6800J066557J375114K20891j105902q04042P16224J193404q4192
35053A291609j148597m60339P15474M69195p04413q97108N3835M65237l35708
$$ y = [-701186, 109644, 153422, -973322, -1739991, -950194, 487689, 1195904, 1349302, 1732722, 2008784, 1445830, 450014, -106617, -345163, -805969, -1155868, -853786, -416187, -602868, -990453, -823593, -645949, -1436448, -2589363, -2522762, -1123734, 92778, 246092, -71884, -266490, -468746, -599176, -224343, 300796, -66170, -1375833, -2334760, -2056630, -1056333, -181007, 278558, 107075, -878597, -1897442, -1563890, 96823, 1193706, 396221, -1218904, -1696068, -720148, 380317, 501329, -289478, -1189645, -1286445, -219888, 1155226, 1376117, 270215, -533827, 182397, 1375801, 1291609, 143012, -317327, 398147, 867342, 162929, -734179, -680344, -215107, -550815]
35044e50815j028983n68875K54878L60887J53948N77544J277115J116078J40582
35035A732359m20512j61009o5197o24173p98099J81128J164885O74804o46955
35026A037231r03114O3985M68857m14672j045394k53651P20232K53255r50035
35017a023306r64533L12327J101192M99559m39412n69812r8871K77357M63362
35008d42137N86982M61785O1501j39529J41368M79400L74332n4623l86475m71556
34998F11048l37455L7975M94805O31811L25986o4982l05755o05691r71966q24257
34988a008481J15494J006069P90380k72422q39726k95748N06113N72665O2233
34979F36577k61946k41191k58160l36754j31512K88565M57203L73868N17623P85454
$$ y = [-550815, -1579798, -2148673, -1893795, -1532908, -1378960, -801416, 475699, 1591777, 1732359, 1311847, 1150838, 1085641, 461468, -336631, -155503, 1009382, 1684186, 1037231, 134117, 198102, 666959, 252287, -793107, -1046758, -326526, -73271, -1023306, -1987839, -1675512, -574320, -74761, -514173, -1083985, -1182856, -905499, -442137, 144845, 606630, 668131, 528602, 669970, 1149370, 1523702, 1469079, 1082604, 611048, 273593, 311568, 806373, 1438184, 1764170, 1699188, 1393433, 787742, -184224, -1008481, -892987, 113082, 903462, 631040, -208686, -504434, 1679, 574344, 636577, 374631, 133440, -124720, -461474, -592986, -304421, 152782, 526650, 1044273, 1829727]
34969A829727L64479q00483j372765m24050Q82140P40263n64403r88967J09580
34960b24479R11229l1598j480585j363839J61859J131023O86458j07372k66181
34951e83485q8735m4844J36732O46288R30893N61775l5050l37119m68935n85725
34941A31795l26570L51624N88814j33130q24877k86766Q81478R87690j77910j024380
34931A67768o56220r8454l41238o53669j7003R35854R19694J73184l3508L29336
34921G25744Q6592q08484q89306K95144J054014P0548j394239j292224K09575
34912a942636J183597Q63187L85846O74753J170573J019902K60305o47712j445834
34903A521981j777244j202157k9025P02751N83145L67760O34292Q07874K67439
$$ y = [1829727, 2194206, 1393723, 20958, -403092, 479048, 1219311, 654908, -334059, -224479, 686750, 655152, -825433, -2189272, -2027413, -896390, -209932, -317304, -583485, -672220, -717064, -580332, 65956, 996849, 1558624, 1523574, 1186455, 717520, 131795, -194775, 156849, 745663, 612533, -212344, -499110, 382368, 1370058, 1192148, 167768, -488452, -586906, -928144, -1581813, -1598816, -662962, 256732, 429916, 396408, 725744, 812336, 3852, -885454, -590310, 463704, 534252, -859987, -2152211, -1942636, -759039, 104148, 489994, 1164747, 2335320, 3355222, 3615527, 2967815, 1521981, -255263, -1457420, -1486445, -783694, -200549, 167211, 801503, 1609377, 1876816]
34894A876816m34167m55101j16793l07120q32084o50527L03548Q20310K49860
34885D54742m79077k78609N19259P94663K98589j97690j82571J9715K1880r857
34875I61044J78652L77017K60063l5316j47884j07550k09912l70252j84235K91082
34865A012709M26854l6348m96839l70745J5629k4542m59102o60226l80307O8389
34855i04528M61550P82856P79417J76951o14572p97411l29562J9850m4351J00748
34845c69052P56894J143150N66946l81034o54348k51124J7828j01874j52358k4946
34835E50082j54490n25239m32731L59456R80739N65116m86488j017267o38076
34826g98898n4509J07316R8728L78692P12943N16926j56943o01969m18489N6652
$$ y = [1876816, 1442649, 987548, 870755, 563635, -268449, -918976, -615428, 204882, 454742, -24335, -302944, 216315, 1010978, 1309567, 1111877, 929306, 949021, 970901, 961044, 1139696, 1516713, 1776776, 1741460, 1593576, 1486026, 1276114, 905862, 721627, 1012709, 1439563, 1403215, 906376, 535631, 551260, 526718, 67616, -592610, -972917, -904528, -442978, 339878, 1119295, 1296246, 681674, -115737, -445299, -425449, -469800, -369052, 387842, 1530992, 2097938, 1716904, 1062556, 811432, 829260, 727386, 575028, 550082, 395592, -129647, -562378, -202922, 777817, 1342933, 856445, -160822, -798898, -853407, -746091, -647363, -268671, 444272, 961198, 804255, 202286, -216203, -159551]
34816a59551L48983L33439K7732m73941o88402j08804Q12280R14594O1147l93322
34806F74155L25977R63527J24398j322362j422543j34472P69787N66478K84585
34797H29530M37307K20536m81637m29727O78486J204831J09114j237474j202407
34788A28559l12886M4282l6296L18193Q38316O96430J52944n0744j27843m89314
34778A161641n05168K58066O18043l97872j361195m76055J089291P61517j035157
34769A13111j277419O80904J902120N90806j127202p97664O52611R11990l5204
34760A614053n43505k71749k54484p45793r26150m30039K74955P58245Q28986
34751C04519L13702m87187p22170j75799K32620o6205l04421J47826M58325k00946
$$ y = [-159551, 189432, 522871, 550603, 76662, -611740, -720544, 91736, 1006330, 1067477, 674155, 1000132, 1963659, 2088057, 765695, -656848, -791320, -21533, 544945, 829530, 1266837, 1487373, 1005736, 576009, 1254495, 2459326, 2568440, 1330966, 128559, -184327, -140045, -176341, 141852, 980168, 1676598, 1829542, 1778798, 1650955, 1161641, 656473, 914539, 1532582, 1134710, -226485, -702540, 386751, 1148268, 113111, -1164308, -483404, 1418716, 2009522, 882320, 84656, 737267, 1649257, 1614053, 1070548, 798799, 544315, -201478, -1127628, -1557667, -1282712, -524467, 304519, 618221, 131034, -591136, -766935, -534315, -600520, -904941, -757115, -298790, -499736]
34741d99736r08908l28719R82929J335889N02285j84962j04273j2420l89132o72670
34731b79717m35708m9094J60574L68421N80876M21158j41545n80603n08366k5714
34721d89718N68995Q74070M70318m21010p85355j34245N46925J94492n65760l72971
34711a14259O00774R23499K55867k70789j23504r4758n72563p06018M1516Q58908
34701G98673Q33034J50808n11244p92690m57835M85737J164721O18528m94778
34692A794954m95259O05070Q26780n70651j639825q11657N41883M41311m71013
34683B21593l05375O71807N69004p66824j457150o55246L70478N36354L34326
34674d81033M13512N05734L78627L67352L71134k73985j327489j464140l03745
$$ y = [-499736, -1408644, -1737363, -754434, 581455, 1083740, 898778, 794505, 782085, 392953, -279717, -715425, -764519, -603945, -235524, 345352, 766510, 624965, 44362, -464004, -489718, 79277, 953347, 1423665, 1002655, 217300, 83055, 629980, 824472, 258712, -114259, 486515, 1410014, 1665881, 1395092, 1271588, 1176830, 604267, -101751, -60235, 798673, 1631707, 1782515, 1271271, 478581, 20746, 506483, 1671204, 2289732, 1794954, 1299695, 1904765, 2731545, 2160894, 521069, -290588, 251295, 692606, 221593, -83782, 588025, 1157029, 390205, -1066945, -1722191, -1351713, -815359, -481033, -67521, 438213, 816840, 1184192, 1555326, 1281341, -46148, -1510288, -1814033]
34665a814033P10152L70826n16979m60717N51459J285370J004161J3803j021452
34656A22590j489161j032214p3636L31507j81587o53381j53990Q32889J165403
34647a131580O36612m2438l89870m01401m6216N76715Q84103M91343k8897O2084
34637F10455M44009K81337l05605m54692j00421n0038m58698n09806Q9480N25874
34627G1895K74060p6012m672L1222l23806l98386K90163P97012P7211j039422
34617c00735p70320Q53814J754682P23496q58630j055925m9797M17080k94942
34608D18723r66929n18880M10230N29534j59437m26781L00344J057382P68631
34599A412817j44420m18085P6086J04752q91300j619675p02000J082175J609476
$$ y = [-1814033, -1103881, -733055, -1250034, -1710751, -1159292, 126078, 1130239, 1144042, 122590, -1366571, -2398785, -2472421, -2140914, -2322501, -2975882, -3129872, -2296983, -1131580, -494968, -537406, -927276, -1328677, -1374893, -798178, 85925, 577268, 548371, 610455, 1054464, 1335801, 1030196, 575504, 475083, 425045, -33653, -543459, -453979, 71895, 345955, 269943, 265271, 296493, -27313, -425699, -135536, 661476, 738687, -300735, -1071055, -217241, 1537441, 2260937, 1402307, 346382, 296585, 713665, 418723, -548206, -1067086, -656856, -127322, -286759, -713540, -413196, 644186, 1412817, 1268397, 850312, 926398, 1031150, 139850, -1479825, -2181825, -1099650, 509826]
34590E09826L35256r63589p50068K38184L83493l74894p68596l43973O7824J3903
34580a652634J34378P63045J052162L24465o30205o48406N2774L80202K32063
34571G844N12892J288130J352091J44437j126863j140456l19812J2077l29699
34562D00641m25391L7579M21053M81962P01437R69101L10124j354638k384507
34553h42639j449381M89488J480971J215776R05025R37015M27178p35399j187058
34544A240976j94590R96014R50121K1259o03395p84697r96391r02120j0506Q41135
34534E57806M70394m82881l16574Q37397J029326k11314r09112N4900R48061J04255
34524B082258j165576p74754N47203M90652q91568j319374j61554O59373Q2521
$$ y = [509826, 845082, -118507, -868575, -630391, -246898, -621792, -1390388, -1734361, -1666537, -1652634, -1518256, -755211, 296951, 621416, -8789, -657195, -604421, -224219, 7844, 520736, 1808866, 3160957, 3305394, 2178531, 1038075, 718263, 730340, 400641, -24750, 12829, 433882, 915844, 1617281, 2586382, 2896506, 1541868, -842639, -2292020, -1802532, -321561, 894215, 1799240, 2736255, 3163433, 2428034, 1240976, 1046386, 2042400, 2992521, 3013780, 2410385, 1625688, 629297, -272823, -283329, 557806, 1028200, 545319, 228745, 1066142, 2095468, 1884154, 975042, 1029942, 1978003, 2082258, 916682, 141928, 689131, 1179783, 288215, -1031159, -1192713, -533340, -450819]
34515d50819m19650L97608J394861J073027l7916n75929n19001n60430m70171
34506a68420K34401Q42868L85255n61584o49285L0407J36649o54267j149071n51525
34496b104572M89509J042091R64133N01868j76540o96433n89950l7872K19887
34487c87879m4824k69279p8632J92297J79602n628j72755k87991j56499M06659
34477f24929R24727O01690m07312r10202k68666P14793R88214N80502J51841j05910
34467A644748l97319o45630o23086m48921l30872q9478M52829Q60347N31360l36957
34457F17021q52731n53560O8335K94556N5411j33892Q6001M72295N15689J25627
34447F94752k15591r7026K47405L14650J03135L4307J60649M1025m52196p78867
$$ y = [-450819, -870469, -472861, 922000, 1995027, 1957111, 1381182, 862181, 301751, -168420, 65981, 908849, 1294104, 732520, 83235, 113642, 250291, -403976, -1553047, -2104572, -1615063, -572972, 391161, 893029, 716489, 20056, -569894, -607766, -387879, -432703, -701982, -780614, -588317, -408715, -414343, -587098, -875089, -1031588, -624929, 299798, 901488, 494176, -416026, -684692, 30101, 1018315, 1598817, 1750658, 1644748, 1247429, 601799, -21287, -470208, -801080, -890558, -437729, 422618, 953978, 617021, -235710, -789270, -720935, -426379, -370968, -504860, -418859, 53436, 569125, 694752, 479161, 382135, 629540, 944190, 1047325, 1081632, 1242281, 1283306, 831110, 52243]
34437E2243m99762N6946K82688J05045q2021p3077l7690j33720k28839l9820N22620
34426g5387J106887J094608K45551q64231j328569q47311N9474O96566P53488
34417H41076L42210j40928k94795k13121m65681j135207j311736l28093R13871
34408a792404R68479j6233n25754o1387K54543j80487l75724L48905R48502M01986
34398b9574l97743m1412J004051J063598j64552j276785j241751m23124M34619
34389a072673R85442R75828K84077n56103p61464l32237O1852J35744J18812J1651
34379a49071l33944n26438o6956N81521M50517l61289o93296o6957O81033P79315
34369B94435M60410J50439k34409o69949o36327J8589N51304K84154m27819o95872
$$ y = [52243, -447519, -390573, -107885, -2840, -84861, -157938, -195628, -329348, -558187, -598007, -75387, 1031500, 2126108, 2371659, 1507428, 178859, -668452, -608978, 87588, 841076, 1183286, 1042358, 747563, 534442, 68761, -1066446, -2378182, -2706275, -1792404, -823925, -840158, -1365912, -1427299, -1172756, -1353243, -1728967, -1380062, -431560, -29574, -427317, -468729, 535322, 1598920, 1434368, 157583, -1084168, -1507292, -1072673, -87231, 888597, 1172674, 616571, -144893, -477130, -415278, -279534, -160722, -149071, -483015, -1009453, -1076409, -494888, -44371, -405660, -1098956, -1165913, -484880, 294435, 754845, 905284, 670875, 926, -635401, -616812, -65508, 218646, -209173, -905045]
34359i05045j60341P64813J306224Q43556m69002j505367j218270L9419R31232
34350c72781Q61320M04657K8118m53073r10787o74919K06397O72040K73725n7614
34340b2917L61689P56387K85245m65911n57358k78590l41997l64722L45841J170660
34330H88327R84526J42294m7665L98482J98395q06697j188973l03567O29222N68419
34320A462763K02181M25785O52368j5583r46726q41153J31425N52045q3325p98413
34310G41367q06174m79484l34097j65798K28512L73611q9212n72834l46866K45916
34300a205059K80959k31888l09437M07709R86209N90756k51412m85513n9185K47732
34290b9129J72018J42656J93271k04117r60122j077172j28339Q48593P54572N5849
$$ y = [-905045, -1065386, -300573, 1005651, 1849207, 1380205, -125162, -1343432, -1304013, -372781, 488539, 893196, 921314, 468241, -442546, -1117465, -911068, -239028, 34697, -22917, 338772, 1095159, 1380404, 914493, 357135, 78545, -263452, -628174, -282333, 888327, 1872853, 2015147, 1967482, 2365964, 2564359, 1757662, 568689, 265122, 894344, 1462763, 1664944, 2090729, 2743097, 2727514, 1780788, 939635, 1071060, 1623105, 1539780, 741367, -64807, -544291, -878388, -1044186, -815674, -442063, -531275, -1104109, -1450975, -1205059, -924100, -1155988, -1465425, -1057716, -71507, 519249, 267837, -217676, -276861, -29129, 142889, 285545, 478816, 274699, -685423, -1762595, -1890934, -1042341, -287769, -231920]
34280b31920M699O62842Q76899J73591n05669l17800K23837J54587m55670p22857
34270a37461l34911P6157l8488l87691l59772J11786N60481O79752O09192N01477
34260A280522K03932l39372o55436k43654N19161O08362k52845j035615p54808
34251f69753J49532N30371K47546J50953M52932L28984n04111r90826l19821O20958
34241c235M76478m81355p76991k2327N82483K25056l40079j60285M37948N70056
34231E07749K20519K5193J40449K38960K75474L78963K84899k16334n56630j57555
34221A141687L25135j92525j226442j081139M53712J422866N56401p74838p49322
34212a24465J30217J91909m81183l95163N38914P93096l5052m50854L18682R06994
$$ y = [-231920, -227221, 435621, 1312520, 1486111, 980442, 662642, 886479, 1041066, 585396, -137461, -472372, -396215, -434703, -822394, -1182166, -1070380, -509899, 169853, 779045, 1280522, 1484454, 1145082, 489646, 245992, 765153, 1373515, 1120670, 85055, -669753, -520221, 10150, 257696, 408649, 861581, 1190565, 686454, -304372, -624193, -3235, 473243, -8112, -785103, -807430, -224947, 109, -339970, -500255, -62307, 507749, 728268, 753461, 893910, 1132870, 1408344, 1787307, 2072206, 1855872, 1299242, 1141687, 1466822, 1274297, 47855, -1033284, -579572, 843294, 1399695, 624857, -124465, 5752, 197661, -283522, -678685, -139771, 653325, 618273, 167419, 486101, 1393095]
34202A393095Q5352j170855j245060k82099M06890M35381L88992M22377K28204
34193F62277J2466K02482M54760J37800m58787n59228k61544k24245k66871K95623
34183e267J047319P97808l31877q08865j31123K87949n15277j360707p94333N90639
34173a223734J140516N98440P9940J04360J25692j58461l60133k92739k00373
34164a86492n2835L57620N92700l9938j109975j248810j03913R96477R24829K72391
34154D02054J57389M09613R2821o88340q34305r0037M07969j20707p84205k85704
34144a333452J030079J449895K55839j159242j108844J32039Q31655K90196l79018
34135I147k18487J07882k86384p22131l1914J172336J123606k13655q16774K35756
$$ y = [1393095, 1478447, 307592, -937468, -1219567, -812677, -377296, 11696, 434073, 662277, 674743, 877225, 1331985, 1469785, 1010998, 451770, 190226, -34019, -300890, -5267, 1042052, 1839860, 1507983, 699118, 567995, 855944, 340667, -1020040, -1814373, -1223734, -83218, 515222, 595162, 699522, 825214, 666753, 306620, 13881, -186492, -239327, 118293, 710993, 671055, -438920, -1687730, -1791643, -795166, 129663, 402054, 559443, 969056, 1061877, 373537, -460768, -550805, -142836, -263543, -1047748, -1333452, -303373, 1146522, 1402361, 243119, -865725, -733686, 97969, 388165, 9147, -209340, -101458, -387842, -1109973, -1141887, 30449, 1154055, 940400, 123626, 359382]
34125C59382J164556K76251j258251j201088K60559R45489J49559n38199q5891
34116G2367M06980k14286j196051j159703j90441N78794O99490N59185L25069
34107a18596j21007m41913q9378P03223J015618M67430k97324n45946l61328l13377
34097a02598n44711n79189o5489N90390O70489J68271j59119R929j1383o68749
34087f92159j050855j45473J249138J367267J65900n22948J17225O40051j73439
34078I54707j271497j083949M6789P00880N89481L62905Q7620m56755o71958j760
34068g43537O81073K32830p33843p40251J08544M74263K18532L68099P99550K67009
34058I32269j050265j367474k19910O66522K26348l80719q7509K76535j66941
$$ y = [359382, 1523938, 1800189, 541938, -659150, -398591, 546898, 696457, 158258, 72367, 479347, 265061, -930990, -2090693, -2281134, -1702340, -1002850, -443665, -118596, -239603, -681516, -770894, -67671, 947947, 1415377, 1118053, 572107, 210779, -102598, -647309, -1226498, -1291987, -701597, -31108, 137163, -21956, -12027, -23410, -692159, -1743014, -1888487, -639349, 727918, 893818, 370870, 488095, 1128146, 954707, -316790, -1400739, -1353950, -653070, -63589, 299316, 386936, -69819, -741777, -743537, -62464, 170366, -563477, -1303728, -1195184, -720921, -502389, -134290, 665260, 932269, -117996, -1485470, -1705380, -1038858, -812510, -1193229, -1280738, -1004203, -1171144]
34049a171144n52083J10630J041496J009022K82054k14247m95223q11038n49760
34040a350293N76153J337065O19507p01123j116978p44511n59701m05362L13708
34031b031535Q45908J80619p06351k9956J662663J926860J38444j496888j164048
34022f74284L10302J124224P47435k32797j093872j132598r4043J009752P56449
34013G20568n53637j004942J31184J204534O65514o66387r99275j58766N46987
34004a14220L81358j75826n27827o26499n75814l46218K1696L56533N33412N33896
33994e39509M42452M44833O00134O29624K74736j87817k35814J28980L84380K21731
33984B163730k07934o76567r77006q07384j65443L42729K41296n0832O7060L03846
$$ y = [-1171144, -1723227, -1612597, -571101, 437921, 719975, 505728, 10505, -800533, -1350293, -774140, 562925, 1182432, 481309, -635669, -1380180, -1939881, -2345243, -2031535, -1185627, -1005008, -1711359, -1741315, -78652, 1848208, 1986652, 489764, -674284, -363982, 760242, 1507677, 1274880, 181008, -951590, -1045633, -35881, 720568, 166931, -838011, -706827, 497707, 1163221, 496834, -502441, -661207, -114220, 267138, 91312, -436515, -1063014, -1638828, -1985046, -1963350, -1606817, -1073405, -539509, -97057, 347776, 947910, 1577534, 1852270, 1664453, 1428639, 1557619, 1941999, 2163730, 1955796, 1279229, 302223, -505161, -670604, -327875, -86579, -137411, -70351, 233495]
33974B33495O3950l19759j28075L14491J25840m44647l39141L80556N64079r980
33964D40809l58165j86183k27016m36270J05783J021421O29553j033505j531657
33955a575230L17829K326980K140910N20459n11717q82883j504981j741062n42709
33946a452404R83027R13829k44801l58763O82001Q54743m42311j391298p57418
33937a213395M44658R24109P29288K44511n51499j149499o10603O80438J063131
33928E61139J29739n29528M4145O10411m0762r74870p42614K09245M48552l9863
33918c24406p5518N97710R94735N49358j97910n97149n70908k51731K33731N36698
33908H94610L01868k82823o02872l16126L53175Q97776Q59900J35872p56888j008890
$$ y = [233495, 297445, -22314, -150389, 164102, 289942, -154705, -493846, -113290, 450789, 440809, 82644, -103539, -330555, -766825, -661042, 360379, 989932, -43573, -1575230, -1257401, 1069579, 3210489, 3730948, 3219231, 2336348, 831367, -909695, -1452404, -469377, 444452, 199651, -159112, 522889, 1377632, 935321, -455977, -1213395, -768737, 155372, 884660, 1129171, 577672, -571827, -1182430, -501992, 561139, 690878, 161350, 205495, 815906, 775144, -199726, -942340, -733095, -284543, -324406, -399924, 197786, 1192521, 1741879, 1543969, 946820, 375912, 124181, 357912, 894610, 1196478, 913655, 310783, -5343, 347832, 1245608, 2105508, 2241380, 1484492, 475602]
33898D75602m32548K55076L62743N4644j32403j88008m82497r47523r94895l05365
33888b335174O58962J071072O11868r6523q1589P73645J385272P83243m88137
33879B282639j016263m55458J18791q8503n79845o61507n26106n49565l74042
33870a849859M15534J297268J399401P09656o8762n31218p29497o58261l24683
33861c40421p8389k03096m13892l28405q7688P4265L84555R21398J018078K50327
33851A196732m91135j31739P34711N69455o11980j090839j56454O54158j06037
33842E66872j547674j753741m58378Q87177J239699Q79237L65874k02875o90637
33833g14446o47338J8097O80769P30471L00053m3103l9855J27731K38665K40403
$$ y = [475602, 43054, 298130, 660873, 715517, 583114, 395106, -87391, -1034914, -2029809, -2335174, -1676212, -605140, 6728, -89795, -171384, 602261, 1987533, 2770776, 2282639, 1266376, 810918, 929709, 841206, 261361, -400146, -926252, -1475817, -1849859, -1434325, -137057, 1262344, 1972000, 1903238, 1372020, 642523, -15738, -340421, -418810, -621906, -1035798, -1364203, -1451891, -1377626, -993071, -71673, 946405, 1196732, 705597, 573858, 1308569, 1878024, 1266044, 175205, 18751, 672909, 566872, -980802, -2734543, -3192921, -2305744, -1066045, -186808, 179066, -23809, -714446, -1361784, -1343687, -662918, 67553, 367606, 324503, 284648, 412379, 651044, 891447]
33823H91447J04550k36541o86742q75741m98935J81868M44689l2265o29739n37484
33813a874893P7398K76232k17937n84789k59607J38737l8214j70232O35663J738436
33803b79206J586994J14027r87857p34826j21379k05810l61244L58151J238997
33794F07847Q76413m93699j245798p44262J7700J74557j7806j40666k60696k82717
33784a509127J71507Q59462R88630N35648L46433N64342K72375p61314j392644
33775G5312r45012l43278l99537l67863M88998J205381O17130m95162n87936J12145
33765f39822J96674l52806k54997O10879Q97208Q6796p54161q01183l83996J57921
33755a237487Q64667J180769L60043q59131q54900K30913N18013l93572o05333
$$ y = [891447, 995997, 759456, 72714, -803027, -1301962, -1120094, -675405, -707670, -1337409, -1874893, -1797495, -1521263, -1739200, -2323989, -2583596, -2444859, -2483073, -2653305, -2017642, -279206, 1307788, 1421815, 433958, -300868, -422247, -628057, -989301, -631150, 607847, 1484260, 990561, -255237, -999499, -981799, -807242, -825048, -965714, -1226410, -1509127, -1337620, -478158, 510472, 1046120, 1392553, 1956895, 2229270, 1467956, 75312, -869700, -1212978, -1612515, -1980378, -1491380, -285999, 331131, -164031, -751967, -639822, -443148, -795954, -1050951, -440072, 457136, 543932, -210229, -1011412, -1395408, -1237487, -372820, 807949, 1167992, 308861, -546039, -315126, 202887, -190685, -796018]
33746g96018O65983J387607J26975j173983k22000J648309J372953j027678k511813
33737e29665j582889J2398M49403J98063M07540Q80691P93024J69044l59324m75598
33727c7313j97508L62618Q06531O53220O7444k26664K05J61571j71212o22300
33717G96592o51454l15827p1949j60855l98936l81270J09522P29861Q16903K31653
$$ y = [-796018, -130035, 1257572, 1384547, 210564, -11436, 1636873, 3009826, 1982148, -529665, -2112554, -2100156, -1650753, -1452690, -1045150, -164459, 628565, 797609, 438285, -37313, -234821, 127797, 934328, 1587548, 1654992, 1428328, 1428533, 1590104, 1418892, 796592, 145138, -170689, -242638, -403493, -802429, -1183699, -1074177, -344316, 472587, 704240]
$$ [...]
##END NTUPLES=NMR SPECTRUM
##END=
