##TITLE=31Pdec_13-2026-Bay
 DMSO-d6, 24 sc
 10.2.2026
##JCAMPDX= 6.0         $$ Bruker NMR JCAMP-DX V2.0
##DATA TYPE= NMR SPECTRUM
##DATA CLASS= NTUPLES
##ORIGIN= UXNMR, Bruker Analytische Messtechnik GmbH
##OWNER= root
$$ XWIN-NMR		Version 3.5
$$ Tue Feb 10 14:25:05 2026 Russian Standard Time (UT+4h)  she@DPX200
##.OBSERVE FREQUENCY= 81.013821
##.OBSERVE NUCLEUS= ^31P
##.ACQUISITION MODE= SIMULTANEOUS
##.ACQUISITION SCHEME= undefined
##.AVERAGES= 24
##.DIGITISER RES= 17
##SPECTROMETER/DATA SYSTEM= spect
##.PULSE SEQUENCE= zgpg30
##.SOLVENT NAME= DMSO
##.SHIFT REFERENCE= (INTERNAL, DMSO, 0, 198.062)
##AUDIT TRAIL= $$ (NUMBER, WHEN, WHO, WHERE, WHAT)
$$ ##TITLE= Audit trail, XWIN-NMR		Version 3.5
$$ ##JCAMPDX= 5.01
$$ ##ORIGIN= Bruker BioSpin GmbH
$$ ##OWNER= she
$$ F:/spectra/data/she/nmr/P31/2/pdata/1/auditp.txt
$$ ##AUDIT TRAIL=  $$ (NUMBER, WHEN, WHO, WHERE, WHAT)
(   1,<2026-02-10 14:23:58.65 +0400>,<she>,<DPX200>,
      <created by zg, POWCHK disabled, PULCHK disabled
       configuration hash MD5:
       00 E9 B6 7A A2 85 ED C7 34 08 36 98 17 FE 4E 26
       data hash MD5: 32K
       22 69 B9 74 5F 68 A7 F7 93 FE 45 40 E9 5A B8 F6>)
(   2,<2026-02-10 14:24:01.43 +0400>,<she>,<DPX200>,
      <Start of raw data processing
       efp BC_mod = 2 LB = 1.5 FT_mod = 6 PKNL = 1 PHC0 = 1343.43 PHC1 = 173.3009 SI = 64K 
       data hash MD5: 64K
       3E 49 D0 34 C9 36 E5 5D 95 A5 81 22 29 A9 B0 BB>)
(   3,<2026-02-10 14:24:23.71 +0400>,<she>,<DPX200>,
      <pk PHC0 = 1.132097 PHC1 = 0 
       data hash MD5: 64K
       EC D5 D0 6A F8 5F E1 24 56 60 CF 85 1D 2E 1D A7>)
(   4,<2026-02-10 14:24:27.53 +0400>,<she>,<DPX200>,
      <abs ABSG = 5 
       data hash MD5: 64K
       20 CF 8A 5A 5C B5 AE 0F BF AE F1 68 DF C6 41 6F>)
$$ ##END=
$$ 
$$ hash MD5
$$ 11 00 2A D1 5E D4 64 67 2F 2A 31 29 52 F7 C9 6E
##$RELAX= 
##$RELAX= 
##$RELAX= 
##$RELAX= 
##$RELAX= 
##$RELAX= 
##$RELAX= 
##$RELAX= 
$$ Bruker specific parameters
$$ --------------------------
##$DU= <F:/spectra>
##$EXPNO= 2
##$NAME= <P31>
##$PROCNO= 1
##$TYPE= <nmr>
##$USER= <she>
##$AMP= (0..31)
100 100 100 100 100 100 100 100 100 100 100 100 100 100 100 100 100 100 
100 100 100 100 100 100 100 100 100 100 100 100 100 100 
##$AQSEQ= 0
##$AQ_mod= 1
##$AUNM= <au_zg>
##$AUTOPOS= <>
##$BF1= 81.014009
##$BF2= 200.13
##$BF3= 200.13
##$BF4= 200.13
##$BF5= 200.13
##$BF6= 200.13
##$BF7= 200.13
##$BF8= 200.13
##$BYTORDA= 1
##$CFDGTYP= 0
##$CFRGTYP= 5
##$CHEMSTR= <none>
##$CNST= (0..31)
1 1 145 1 1 1 1 1 1 1 1 1 1 1 1 1 1 1 1 1 1 1 1 1 1 1 1 1 1 1 1 1 
##$CPDPRG= <waltz16>
##$CPDPRG1= <>
##$CPDPRG2= <waltz16>
##$CPDPRG3= <>
##$CPDPRG4= <mlev>
##$CPDPRG5= <mlev>
##$CPDPRG6= <mlev>
##$CPDPRG7= <mlev>
##$CPDPRG8= <mlev>
##$CPDPRGB= <>
##$CPDPRGT= <>
##$D= (0..31)
0 1 0 0 0 0 0 0 0 0.06 0 0.03 2e-05 3e-06 0 0 0.0002 0 0 0 0 0 0 0 0 0 
0 0 0 0 0 0 
##$DATE= 1770719037
##$DBL= (0..7)
120 120 120 11 120 120 24 19 
##$DBP= (0..7)
150 150 150 150 150 150 150 150 
##$DBP07= 0
##$DBPNAM0= <>
##$DBPNAM1= <>
$$ [...]
##$SUBNAM3= <"">
##$SUBNAM4= <"">
##$SUBNAM5= <"">
##$SUBNAM6= <"">
##$SUBNAM7= <"">
##$SUBNAM8= <"">
##$SUBNAM9= <"">
##$SW= 400.765351723535
##$SWIBOX= (0..15)
0 1 3 0 0 0 0 0 0 0 0 0 0 0 0 0 
##$SW_h= 32467.5324675325
##$TD= 32768
##$TD0= 1
##$TE= 0
##$TE2= 300
##$TE3= 300
##$TEG= 300
##$TL= (0..7)
0 120 53 12 22 120 120 120 
##$TP= (0..7)
150 150 150 150 150 150 150 150 
##$TP07= 0
##$TPNAME0= <>
##$TPNAME1= <>
##$TPNAME2= <>
##$TPNAME3= <>
##$TPNAME4= <>
##$TPNAME5= <>
##$TPNAME6= <>
##$TPNAME7= <>
##$TPOAL= (0..7)
0.5 0.5 0.5 0.5 0.5 0.5 0.5 0.5 
##$TPOFFS= (0..7)
0 0 0 0 0 0 0 0 
##$TUNHIN= 0
##$TUNHOUT= 0
##$TUNXOUT= 0
##$USERA1= <user>
##$USERA2= <user>
##$USERA3= <user>
##$USERA4= <user>
##$USERA5= <user>
##$V9= 5
##$VALIST= <valist>
##$VCLIST= <CCCCCCCCCCCCCCC>
##$VD= 0
##$VDLIST= <DDDDDDDDDDDDDDD>
##$VPLIST= <PPPPPPPPPPPPPPP>
##$VTLIST= <TTTTTTTTTTTTTTT>
##$WBST= 1024
##$WBSW= 4
##$XGAIN= (0..3)
0 0 0 0 
##$XL= 0
##$YL= 0
##$YMAX_a= 10997
##$YMIN_a= -10867
##$ZGOPTNS= <>
##$ZL1= 120
##$ZL2= 120
##$ZL3= 120
##$ZL4= 120
##$ABSF1= 198.0616
##$ABSF2= -202.7028
##$ABSG= 5
##$ABSL= 3
##$ALPHA= 0
##$AQORDER= 0
##$ASSFAC= 0
##$ASSFACI= 0
##$ASSFACX= 0
##$ASSWID= 0
##$AUNMP= <proc_1d>
##$AZFE= 0.1
##$AZFW= 0.5
##$BCFW= 0
##$BC_mod= 2
##$BYTORDP= 0
##$COROFFS= 0
##$CY= -3
##$DATMOD= 1
##$DC= 0
##$DFILT= <>
##$DTYPP= 0
##$F1P= 0
##$F2P= 0
##$FCOR= 1
##$FTSIZE= 65536
##$FT_mod= 6
##$GAMMA= 0
##$GB= 0
##$INTBC= 1
##$INTSCL= 9.790993e-09
##$ISEN= 30
##$LB= 1.5
##$LEV0= 0
##$LPBIN= 0
##$MAXI= 10000
##$MC2= 0
##$MEAN= 0
##$ME_mod= 0
##$MI= 50
##$NCOEF= 0
##$NC_proc= -5
##$NLEV= 6
##$NOISF1= 182.463
##$NOISF2= 159.3651
##$NSP= 0
##$NTH_PI= 0
##$NZP= 0
##$OFFSET= 198.0616
##$PC= 4
##$PHC0= 1344.562
##$PHC1= 173.3009
##$PH_mod= 1
##$PKNL= yes
##$PPARMOD= 0
##$PSCAL= 0
##$PSIGN= 0
##$REVERSE= no
##$SF= 81.0140089999434
##$SI= 65536
##$SIGF1= 159.3651
##$SIGF2= -187.1042
##$SINO= 113.3802
##$SIOLD= 16384
##$SREGLST= <1H.CDCl3>
##$SSB= 0
##$STSI= 65536
##$STSR= 0
##$SW_p= 32467.5324675325
##$SYMM= 0
##$S_DEV= 0
##$TDeff= 32768
##$TDoff= 0
##$TI= <>
##$TILT= no
##$TM1= 0
##$TM2= 0
##$TOPLEV= 0
##$USERP1= <user>
##$USERP2= <user>
##$USERP3= <user>
##$USERP4= <user>
##$USERP5= <user>
##$WDW= 1
##$XDIM= 65536
##$YMAX_p= 491035700
##$YMIN_p= -7094453
$$ End of Bruker specific parameters
$$ ---------------------------------
##NTUPLES= NMR SPECTRUM
##VAR_NAME=  FREQUENCY,     SPECTRUM/REAL,   SPECTRUM/IMAG
##SYMBOL=    X,             R,               I
##VAR_TYPE=  INDEPENDENT,   DEPENDENT,       DEPENDENT
##VAR_FORM=  AFFN,          ASDF,            ASDF
##VAR_DIM=   65536,         65536,           65536
##UNITS=     HZ,            ARBITRARY UNITS, ARBITRARY UNITS
##FACTOR=    0.49542278885378, 1,            1
##FIRST=     16045.7642231865, 0,            0
##LAST=      -16421.768244346, 0,            0
##MIN=       -16421.768244346, -7094453,     0
##MAX=       16045.7642231865, 491035700,    0
$$ Real data points
##PAGE= N=1
##DATA TABLE= (X++(R..R)), XYDATA
$$ [...]
38645f00647p1461J1745J26734K07150J49457l806r8777o6080M1543J58060K23864
$$ -600647 -672108 -660363 -533629 -326479 -177022 -180828 -279605 -345685 -304142 -146082 77782
38634G7782J64914m534j30695j20564r8110j83894k38433p0478J92120K39607
$$ 77782 242696 238162 107467 -13097 -111207 -295101 -533534 -604012 -411892 -172285
38624a72285N4075o8405J6761J34084J42046J34960J80050J51023k3239j98611
$$ -172285 -118210 -186615 -169854 -35770 106276 241236 421286 572309 549070 350459
38614C50459k57252k69008k63133j02174K21396M16977K73353J848n8998Q4582
$$ 350459 93207 -175801 -438934 -541108 -319712 97265 370618 372466 313468 398050
38604C98050J70013R6114k5193j25882k10505k05770n6394Q4350L1054j09546
$$ 398050 568063 664177 638984 513102 302597 96827 40433 124783 155837 46291
38594D6291p3346J22412J82121O968j43578o8718P5759O0936o0044r0136l0138
$$ 46291 -27055 95357 277478 284446 140868 72150 147909 208845 148801 58665 28527
38583B8527n1344j87689k66090j65135Q381O6610j7548r0184j5357J68599L14125
$$ 28527 -22817 -210506 -476596 -641731 -633350 -566740 -584288 -674472 -689829 -521230 -207105
38572b07105L42995K99657K35616J28540l7162j83317k16656j58394j07868r1613
$$ -207105 135890 435547 671163 799703 762541 579224 362568 204174 96306 4693
38562D693l9942P3519J55838J09378k7429j19572j06225o8133r6061j48599j15584
$$ 4693 -35249 38270 194108 303486 276057 156485 50260 -17873 -113934 -262533 -378117
38551c78117L329R1454R8188J00080J30568J01464j0667p0858k5915m6361k08974
$$ -378117 -374788 -283334 -185146 -85066 45502 146966 136299 65441 39526 -6835 -215809
38540b15809k48319L8320L19107J30963l25818l70349J08546M10196R0612l31532
$$ -215809 -464128 -425808 -106701 24262 -301556 -671905 -563359 -153163 -62551 -394083
38530c94083j90513L00426M37012J12757j41848o4960M3062m7580j45191n8632
$$ -394083 -584596 -284170 152842 265599 123751 58791 101853 54273 -90918 -149550
38520a49550P9554Q9923J3372m6764p8555n0595R7760K65580K33045k0508k57629
$$ -149550 -69996 19927 33299 -13465 -92020 -142615 -44855 220725 453770 433262 175633
38509A75633k97886j83153j0738J58609K12297O9650j17912j11916N2636J30756
$$ 175633 -122253 -305406 -316144 -157535 54762 124412 6500 -105416 -52780 77976
38499G7976Q6300J10064K01151J27397j06083j63817P2619K51097P4520k55664
$$ 77976 164276 274340 475491 602888 496805 332988 405607 656704 731224 475560
38489D75560l76998k55135p6646P7923J83394J38444l5060q1944J16721K76938
$$ 475560 98562 -156573 -233219 -155296 28098 166542 131482 49538 166259 443197
38479D43197J12859j94122k57217n6225J01626Q4756M4279N9454J3581j42738
$$ 443197 556056 361934 104717 48492 150118 234874 279153 338607 352188 209450
38469B09450k67725k26830m2429J68799K72052J68155p6661k09390o4001J93991
$$ 209450 -58275 -285105 -327534 -158735 113317 281472 204811 -4579 -68580 125411
38459A25411K59331P1011j56169k29442j45348r365N7629j8425j60583j70476
$$ 125411 384742 455753 299584 70142 -75206 -84571 -26942 -45367 -205950 -376426
38449c76426O717J53664P7167r3423j14346k2214n9834k60337l75034k33448M5793
$$ -376426 -369709 -216045 -138878 -232301 -346647 -368861 -428695 -689032 -1064066 -1297514 -1251721
38438a251721K42285K61571J51699L6986M3238J64682K25390R4644j11105j84556
$$ -1251721 -1009436 -747865 -596166 -559180 -515942 -351260 -125870 -31226 -142331 -326887
38428c26887j18620o4673n7667P231J39932K08168J55250R2595J24936K03306
$$ -326887 -445507 -510180 -567847 -560616 -420684 -212516 -57266 35329 160265 363571
38418C63571J91508J4058k48386l71272j85051J66425L04486P2051k44616l03958
$$ 363571 555079 569137 320751 -50521 -235572 -69147 235339 307390 62774 -241184
38408b41184j37097J7248J01645J71672J15522j82225m88292m30807n0993K28543
$$ -241184 -378281 -361033 -259388 -87716 27806 -154419 -642711 -1073518 -1124511 -895968
38398h95968K08624J20452J75780K77005K77702J98731O7080j48902l27122k35117
$$ -895968 -687344 -566892 -391112 -114107 163595 362326 429406 280504 -46618 -281735
38388b81735P3985K28516O8064j12964n0682Q4297L4311q6850k1190J53224J33022
$$ -281735 -207750 20766 88830 -24134 -74816 9481 43792 -43058 -64248 88976 221998
38377B21998j19964l25545k92978j18680K0333N8224J6005m9874o2007N810Q5894
$$ 221998 102034 -223511 -516489 -635169 -614836 -556612 -540607 -590481 -652488 -646678 -560784
38366e60784J15451J10313P2900n2664k27417k59778n7881J78375J98314L8598
$$ -560784 -445333 -335020 -262120 -314784 -542201 -801979 -859860 -681485 -483171 -444573
38356d44573p4293q1045j19209k16722j94628N1982L43523L98994J61054j40470
$$ -444573 -518866 -599911 -719120 -935842 -1130470 -1078488 -734965 -335971 -174917 -315387
38346c15387k32843o9856J51571K31320J71502R7920N1343j1852n3578J5819J20904
$$ -315387 -548230 -618086 -466515 -235195 -63693 34227 85570 73718 20140 35959 156863
38335A56863N6814j71338k65882m2568K74269L52620J90878M0917J8785K8384
$$ 156863 213677 42339 -223543 -266111 8158 360778 551656 592573 611358 639742
38325F39742p311p6415j95370l69091m56371l02053j2149J22169J6617r3333m347
$$ 639742 632431 556016 360646 -8445 -464816 -766869 -779018 -656849 -640232 -733565 -737912
38314g37912J71947J94084L2405j10663p2937Q5394J83955J48649Q4677J07564
$$ -737912 -565965 -371881 -339476 -450139 -523076 -437682 -253727 -105078 -20401 87163
38304H7163J61199J07897j7868j7717J43071K08090j1464l10378l46276j19737
$$ 87163 248362 356259 338391 320674 463745 671835 660371 349993 3717 -116020
38294a16020N9771L8118l4335l0162l0197q9306p9450P1634J84226O5410j80039
$$ -116020 -56249 -18131 -52466 -82628 -112825 -202131 -281581 -209947 -25721 39689 -140350
38283a40350k67256r5145J60850K77010J79573l7530j77332p5118K06247L66311
$$ -140350 -407606 -502751 -341901 -64891 114682 77152 -100180 -175298 30949 397260
38273C97260J92420j47676l03656k04501j09479j69305j91038J5112K75358K86746
$$ 397260 589680 442004 138348 -66153 -175632 -344937 -535975 -520863 -245505 41241
38263D1241Q4428k0814O1072Q4232q1389j97107m2530J94104J82302m9965j83044
$$ 41241 125669 104855 165927 250159 168770 -28337 -70867 123237 305539 255574 72530
38252G2530j01957j7357p9740j62462j13356J2080Q2066P0461K019j19293k23643
$$ 72530 -29427 -46784 -126524 -288986 -402342 -390262 -308196 -237735 -235716 -355009 -578652
38241e78652j77684J0249J34663O4663o6831p0271M3861J54578K34575K93591
$$ -578652 -756336 -746087 -611424 -546761 -613592 -683863 -640002 -485424 -250849 42742
38231D2742K41594J5839k27678k58417q3753O3338M4674l9457m4092K9211Q2105
$$ 42742 284336 300175 72497 -185920 -269673 -206335 -161661 -201118 -245210 -215999 -133894
38220a33894O0085q704o5064p7504n9810k6174M9908J69516K25480J14842n3611
$$ -133894 -73809 -82513 -147577 -225081 -284891 -311065 -261157 -91641 133839 248681 195070
38209A95070l7937J81097L09791J33947j72272k97122j95881m6099O2503J51093
$$ 195070 157133 338230 648021 781968 609696 312574 116693 70594 133097 284190
38199B84190J60088M627k05508k50428j15024N8J124J6464J36632K41093J80970
$$ 284190 444278 448905 243397 -7031 -122055 -121997 -120873 -104409 32223 273316 454286
38188D54286m872j52996j70976j03091m8934m7953k9865Q6631K28468K07126n749
$$ 454286 449414 296418 125442 22351 -26583 -74536 -104401 -17770 210698 417824 412075
38177D12075j77085j17095M8888Q7443Q851p043O6194J04591Q9363R1069M5792
$$ 412075 234990 117895 166783 254226 263077 256034 322228 426819 516182 607251 653043
38166F53043j57779l74308k98552P3912L64813K87455l1322k88884l42277k18056
$$ 653043 495264 120956 -177596 -103684 261129 548584 517262 228378 -113899 -331955
38156c31955o055J48573J27236k756o9490o5726j30410k40781j90065N6453K56867
$$ -331955 -338010 -189437 -62201 -64957 -134447 -200173 -330583 -571364 -761429 -704976 -448109
38145d48109K49633J51355Q6159J477j02759o1028J42967K30535L8071j79331
$$ -448109 -198476 -47121 39038 40515 -62244 -123272 19695 250230 288301 108970
38135A08970j24379Q4507J26981l3967j93619k81584l62002l57665j21820K31009
$$ 108970 -15409 69098 196079 162112 -31507 -313091 -675093 -1032758 -1154578 -923569
38125i23569L70869J71238j34151k39948n4302K83090N11172M21839Q4619j61810
$$ -923569 -552700 -381462 -515613 -755561 -809863 -526773 -15601 406238 490857 329047
38115C29047r7287R3546R8116q4010k07029j69864o5124P7018K80596L98830K29186
$$ 329047 231760 325306 423422 339412 132383 -37481 -102605 -25587 255009 653839 883025
38104H83025j26378l28158k70207j82024k02962j83589k4903J08103Q8877O0918
$$ 883025 756647 428489 158282 -23742 -226704 -410293 -435196 -327093 -238216 -177298
38094a77298J52393K08201O1470j27669r3632J04325J66990N543j72627k15385
$$ -177298 -24905 183296 244766 117097 23465 127790 294780 300323 127696 -87689
38084h7689j97365j97390j45409L174J23530R1338k0938n9646k6001m4269j23591
$$ -87689 -285054 -482444 -627853 -624679 -501149 -409811 -430749 -490395 -516396 -560665 -684256
38073f84256j17454L7848J90725J83237Q5932P4879J34562P8281j19235k18561
$$ -684256 -801710 -763862 -573137 -389900 -303968 -229089 -94527 -16246 -135481 -354042
38063c54042m9996K16646K92293J40463m3286j34123j63979j55043p7467K5508
$$ -354042 -404038 -187392 104901 245364 202078 67955 -96024 -251067 -328534 -303026
38053c03026O0643N3378J15411K19622K00367L1322r5760o2478m862o9707j56171
$$ -303026 -242383 -189005 -73594 146028 346395 377717 281957 219479 214617 144910 -11261
38042a1261q1112J06044J71430K2293j85145k68786k17640j33512p3223j0513
$$ -11261 -92373 13671 185101 207394 22249 -246537 -464177 -597689 -670912 -681425
38032f81425P3123J13389L1233j06785q5646J81604M34661L26183q2067l26246
$$ -681425 -608302 -494913 -463680 -570465 -656111 -474507 -39846 286337 204270 -121976
38022a21976j50989J34232J11491j49118k44972n5550J49848J80677J38595J12648
$$ -121976 -272965 -138733 -27242 -176360 -421332 -476882 -327034 -146357 -7762 104886
38012A04886J4979j46763j57199M5923J81563M7768j16752q418K10130J50763
$$ 104886 119865 -26898 -184097 -138174 43389 91157 -25595 -34013 176117 326880
38002C26880j40497k13736P7624L44880K77584Q9241J09217K52428K10468m4293
$$ 326880 186383 -27353 50271 395151 672735 761976 871193 1123621 1334089 1289796
37992A289796k72935l56288l59182k96641j37448O534j3214j04093m4498J28830
$$ 1289796 1016861 660573 301391 4750 -132698 -126164 -139378 -243471 -287969 -159139
37982a59139J44367o0662k29544j96547r8576n2544O5406L20884M78691L18560
$$ -159139 -14772 -75434 -304978 -501525 -600101 -652645 -587239 -266355 212336 530896
37972E30896r691k08189k37817k31605j61951P3179L17961K73362l6684k32241
$$ 530896 521205 313016 75199 -156406 -318357 -245178 72783 346145 309461 77220
37962G7220r4552J45527J54360p6134k82006k60284k3934K65417M11108L11802
$$ 77220 -17332 128195 282555 206421 -75585 -335869 -359803 -94386 316722 628524
37952F28524O8065j02571j08973o5305q5632j14416m7783P4684J21767O7319J5384
$$ 628524 696589 594018 485045 419740 334108 219692 171909 246593 368360 435679 451063
37941D51063L1096M6461k9669j71247k62407k46395j85463j48496r5806N0230
$$ 451063 482159 528620 498951 327704 65297 -181098 -366561 -515057 -610863 -560633
37931e60633K42835L26086K42094J19912R2296J14407N9674p0565j44467p8359
$$ -560633 -317798 8288 250382 370294 462590 576997 636671 566106 421639 343280
37921C43280P2241J82676J57616l116j78087k18242j28224p7294j57010k33802
$$ 343280 415521 598197 755813 752697 574610 356368 228144 150850 -6160 -239962
37911b39962j54354J3277R6633Q0912P1871P4752K1556k9282M5568J77969J47979
$$ -239962 -394316 -381039 -284406 -203494 -131623 -56871 -35315 -64597 -19029 158940 306919
37900C06919q4714l03085l38835k54415j57326l6700J19403K22356K12594J54894
$$ 306919 222205 -80880 -419715 -674130 -831456 -868156 -748753 -526397 -313803 -158909
37890a58909J13158N9313j6304m1144J1227N9171N2450L7763J8249r3541k90428
$$ -158909 -45751 13562 -2742 -43886 -32659 26512 78962 116725 134974 41433 -248995
37879b48995l94554k81083m7562J43793K61692L39869L51426K69808J47466L7045
$$ -248995 -643549 -924632 -972194 -828401 -566709 -226840 124586 394394 541860 578905
37869E78905n9867j06939m8439K9736m5569k31162k55625m3419J16449K1133j09124
$$ 578905 519038 412099 363660 393396 347827 116665 -138960 -182379 -65930 -44797 -153921
37858a53921k3808R8779l3638k57752j64548K09834L90405J83000q2553j35889
$$ -153921 -177729 -78950 -112588 -370340 -534888 -325054 65351 248351 165798 29909
37848B9909j34978k41562k45488N3759L88677L40603l8512k96640k19959n2749
$$ 29909 -105069 -346631 -592119 -538360 -149683 190920 152408 -144232 -364191 -416940
37838d16940m7160j10027l7100J28109J74263N6698m6904m580J09872J70350J73896
$$ -416940 -464100 -574127 -611227 -483118 -308855 -252157 -299061 -303641 -193769 -23419 150477
37827A50477J62976Q2101j20769k96125k10544R2592K65741J14669j13756r5134
$$ 150477 313453 395554 274785 -21340 -231884 -139292 126449 241118 127362 32228
37817C2228Q9472J10235o8034j35862M7282K21148J34262q6890j66945p7536R960
$$ 32228 121700 231935 163901 28039 75321 296469 430731 343841 176896 99360 109320
37806A09320K4356K2309L576p7075j46728p0961J12958J94508O3754j50806k66461
$$ 109320 133676 155985 159561 82486 -64242 -135203 -22245 172263 236017 85211 -181250
37795a81250k50832j83025j11687l5638L2713P0972J01497J79703L07298L82915
$$ -181250 -432082 -615107 -726794 -762432 -729719 -658747 -557250 -377547 -70249 312666
37785C12666K77921q635k87137l36683j56137J4051j8404j57794j72633k7984
$$ 312666 590587 581952 294815 -41868 -198005 -183954 -202358 -360152 -532785 -560769
37775e60769R1017Q0920N8536J30671K05098J70149J18564J93440K96315J89680
$$ -560769 -469752 -388832 -330296 -199625 5473 175622 294186 487626 783941 973621
37765I73621j14076l13117k39293r7348j43211l06882l26462j36260Q7123J99563
$$ 973621 859545 546428 307135 209787 66576 -240306 -566768 -703028 -615905 -416342
37755d16342K08370J52055O1436L2131J36117K44014J35501j67737l74103k98645
$$ -416342 -207972 -55917 5519 37650 173767 417781 553282 385545 11442 -287203
37745b87203q5113L7619M4010M2767P8330J30516J78418J50832l8197k83748k99250
$$ -287203 -372316 -334697 -290687 -247920 -169590 -39074 139344 290176 251979 -31769 -331019
37734c31019k79K96684K73510M9472l4486O9858J31475P6012M6449M3147j09318
$$ -331019 -331298 -34614 238896 288368 253882 323740 455215 531227 577676 620823 511505
37723E11505l54820l44252L3346L76362K86020p3988k22561k0025K15037J88741
$$ 511505 156685 -187567 -154221 222141 508161 434173 211612 191587 406624 595365
37713E95365m0148k31708k51926j34582j763K5721o6477j48562r6293K7402M5876
$$ 595365 555217 323509 71583 -62999 -64762 -39041 -105518 -254080 -350373 -322971 -277095
37702b77095o8379j24891L6021L12029M35727K74118k7545k07661j66959n7331
$$ -277095 -345474 -470365 -434344 -122315 313412 587530 559985 352324 185365 128034
37692A28034p6062k04048k27297l5315K05095K56962J13960l3007q5978j29712
$$ 128034 51972 -152076 -379373 -414688 -209593 47369 161329 128322 42344 -87368
37682h7368k08116j89132K8902K92782L41536J44731o2323r8979m9711q6346k00796
$$ -87368 -295484 -484616 -455714 -162932 178604 323335 261012 162033 112322 25976 -174820
37671a74820k33374j05793R6415K51530K99649K23226N2527r1381q3813K7107
$$ -174820 -408194 -513987 -417572 -166042 133607 356833 409360 317979 234166 261273
37661B61273N0345p5035j62372m3993J54309J67106l6568k09800j63110J8469
$$ 261273 311618 236583 74211 30218 184527 351633 315065 105265 -57845 -39376
37651c9376J39390J34997O6604k0288j20270j94690j78471o8813N5974J26839
$$ -39376 100014 235011 301615 281327 161057 -33633 -212104 -280917 -224943 -98104
37641i8104J54973J84855J99673J23975n9062k36761k71147j59227k3477N3633
$$ -98104 56869 241724 441397 565372 506310 269549 -1598 -160825 -184302 -130669
37631a30669J03832J70029K26819K43347K30688J76502L6518j40583j94558o3094
$$ -130669 -26837 143192 370011 613358 844046 1020548 1057066 916483 721925 658831
37621F58831Q9216P0198r5078k36193k63314j91081l8945J28047J51008l5870
$$ 658831 748047 818245 723167 486974 223660 32579 -6366 121681 272689 236819
37611B36819k36486k13405k0579J00018R5882J18656J86506J28148r1827k71180
$$ 236819 333 -213072 -233651 -133633 -37751 80905 267411 395559 303732 32552
37601C2552k76248j99381j25043K537J66248J91106K4779j28002j10941l4111
$$ 32552 -243696 -443077 -568120 -565583 -399335 -208229 -183450 -311452 -422393 -456504
37591d56504k2852J1260J42331K06355O3081j13551r2984K1486k9631k06299k21133
$$ -456504 -479356 -468096 -325765 -119410 -56329 -169880 -262864 -241378 -271009 -477308 -698441
37580f98441K55K26658K89064K49936J74304J1744k08756k99975j55958Q1318
$$ -698441 -698186 -471528 -182464 67472 241776 253520 44764 -255211 -411169 -329851
37570c29851J93467J20408l1301j18453o5855P0467J31803K9412j28403j73369
$$ -329851 -136384 -15976 -47277 -165730 -231585 -161118 -29315 97 -128306 -301675
37560c01675r8596k4205Q470N5965J16084J16102N2943m799n1088j34832k24738
$$ -301675 -400271 -424476 -416006 -360041 -243957 -127855 -74912 -79711 -130799 -265631 -490369
37549d90369k23853j13825L8763J84179K69666J98163j6420j43822j5064J77824
$$ -490369 -714222 -828047 -789284 -605105 -335439 -137276 -153696 -297518 -312582 -134758
37539a34758J33689q1078j47214m2751o0215k27818j83758J91792M67815K82184
$$ -134758 -1069 -82147 -229361 -272112 -332327 -560145 -743903 -552111 -84296 197888
37529A97888j03228k26669j00234m9834j15913p3122P9233J07430l620p632J55245
$$ 197888 94660 -132009 -232243 -282077 -397990 -471112 -391879 -284449 -288069 -295701 -140456
37518a40456K39084R9515r8321j71035j35810n0880Q7558J86707O8697k17776
$$ -140456 98628 198143 99822 -71213 -207023 -257903 -170345 16362 85059 -132717
37508a32717l40073j04901K55011L79599K02165p1460k37699k01696K7186K82261
$$ -132717 -472790 -577691 -322680 56919 259084 187624 -50075 -251771 -224585 57676
37498E7676L22667J23338n6934l6927L3503m4100j78581j76641r5468j08698j46570
$$ 57676 380343 503681 446747 409820 443323 399223 220642 44001 -51467 -160165 -306735
37487c06735r808K25354K77416J24904L0537O2511j2242k42236l07083l9028K38275
$$ -306735 -316543 -91189 186227 311131 341668 404179 391937 149701 -157382 -196410 41865
37476D1865J94914Q508K3602J49114M8299k13015k13862J18581L33626J20733
$$ 41865 236779 245287 268889 418003 466302 253287 39425 158006 491632 612365
37466F12365k56218l99011l17165k58421k43759r2547K02430M11274L64140J27497
$$ 612365 356147 -42864 -360029 -618450 -862209 -954756 -752326 -341052 23088 150585
37456A50585j02134j55946K886K12978K24359P7j80927p1955J86752K52633M6974
$$ 150585 48451 -107495 -104609 108369 332728 332805 151878 79923 266675 519308 566282
37445E66282j87945k64580k37619j95248j09591K0853Q9771N9469M7820J19207
$$ 566282 378337 113757 -123862 -319110 -428701 -407848 -318077 -258608 -210788 -91581
37435i1581J47814K9102j17819j26976m4836k0386k8036P3341K45181K82575J53890
$$ -91581 56233 85335 -32484 -159460 -204296 -224682 -252718 -179377 65804 348379 502269
37424E02269Q3688J92739K69957P7879k67073m36588l32332j55322n2904N5310
$$ 502269 585957 778696 1048653 1126532 859459 422871 90539 -64783 -117687 -62377
37414f2377K29934L20684J87110l7635j03516K674N1885r0812k96608l66119k48660
$$ -62377 167557 488241 675351 637716 534200 536874 588759 497947 201339 -164780 -413440
37403d13440k8498J77973K57365J52673m1425j30630m6726N6133O428j54880k33778
$$ -413440 -441938 -263965 -6600 146073 104648 -25982 -72708 -16575 -10147 -165027 -398805
37392c98805j22100R9529K63003K59778J21738l155L108Q4648Q0532m3853j37213
$$ -398805 -520905 -421376 -158373 101405 223143 219988 223096 307744 388276 344423 207210
37381B07210q1888L9667P5906N358p9669r9785k5814J08381J65405J7373k16659
$$ 207210 125322 164989 240895 246253 166584 66799 40985 149366 314771 332144 115485
37370A15485k30652L6480K44320J38158l2704R3761L61881K97050j18172l55580
$$ 115485 -115167 -78687 165633 303791 271087 364848 726729 1023779 905607 550027
37360E50027j31702J75267J33733j08850j47855M127j2211k75850m44138k72982
$$ 550027 418325 593592 727325 618475 470620 474747 462536 186686 -257452 -530434
37350e30434N0311K13566J90321J83925K87458L63223K43532n0221l18815l80177
$$ -530434 -480123 -266557 -76236 107689 395147 758370 1001902 951681 632866 252689
37340B52689k26087M785J67368J98674J14653r522p3042m1349j837n4116j58529
$$ 252689 26602 31387 198755 397429 512082 502560 429518 388169 386332 332216 173687
37329A73687j90182j34696j08581j70401k40130k38978j80807q4043O8706K26328
$$ 173687 -16495 -151191 -259772 -430173 -670303 -909281 -1090088 -1174131 -1105425 -879097
37319h79097K70671K01499J74126K51885K67862P0960k11372l17806j83136K4711
$$ -879097 -608426 -406927 -232801 19084 286946 357906 146534 -171272 -354408 -329697
37309c29697J38933J26748L4562o5583r7753n4241k1046n7066j03314q6879l3053
$$ -329697 -190764 -64016 -29454 -95037 -192790 -247031 -268077 -325143 -428457 -515336 -548389
37298e48389J8008J06702K44645L09450K00979K2659n7852o0653j24345k35030
$$ -548389 -530381 -423679 -179034 130416 331395 354054 296202 235549 111204 -123826
37288a23826k28563o0464J12683J46864N6995o2575j25353o3442J03091K17004
$$ -123826 -352389 -412853 -300170 -153306 -96311 -158886 -284239 -347681 -244590 -27586
37278b7586J58774M6720P4436J74320R4059j65549k83185j02983R9339M1278j21066
$$ -27586 131188 177908 252344 426664 520723 355174 71989 -30994 68345 109623 -11443
37267a1443o0202J74133K20593k2619k38581j77647m910J864j22160j35137L572
$$ -11443 -71645 102488 323081 300462 61881 -115766 -120676 -118812 -240972 -376109 -372537
37256c72537Q8065J2282p3900k5399P0675O0919j1483J6067J43656J88102N6462
$$ -372537 -284472 -272190 -346090 -371489 -300814 -239895 -251378 -235311 -91655 96447 152909
37245A52909j18738j71402j02116j6130L0766L6749j1722j09506j81312j40315
$$ 152909 34171 -137231 -239347 -255477 -224711 -187962 -199684 -309190 -490502 -630817
37235f30817K2712K36772L81980L18762R127l41157m10550j37870J64520K04129
$$ -630817 -608105 -371333 10647 329409 338536 -2621 -413171 -551041 -386521 -182392
37225a82392P3945M7176J39156J23921p0293k47307k42473j09563L2072J33287
$$ -182392 -108447 -61271 77885 201806 131513 -115794 -358267 -467830 -435758 -302471
37215c02471J46251J6842j75785k39189j06059R0463K29569L18507L34302J58521
$$ -302471 -156220 -139378 -315163 -554352 -660411 -569948 -340379 -21872 312430 470951
37205D70951j98220m78349m49034j80701Q1124K10255K28424J57005J6840r0526
$$ 470951 272731 -205618 -654652 -835353 -754229 -543974 -315550 -158545 -141705 -232231
37195b32231o8246L8307J13989J36697J42007Q6935q4774k62777k34818K4806
$$ -232231 -300477 -262170 -148181 -11484 130523 217458 132684 -130093 -364911 -340105
37185c40105K68206K51623K0759j54790r6510R3540J63231l89k46926l40997k21550
$$ -340105 -71899 179724 200483 45693 -50817 42723 205954 205565 -41361 -382358 -603908
37174f03908k7237J00420J41163J34000J12789J24177J85236J94429L2896j95678
$$ -603908 -631145 -530725 -389562 -255562 -142773 -18596 166640 361069 393965 198287
37164A98287k07598P1687L38333K87022M979j95523k00133j25643m4671N5278
$$ 198287 -9311 62376 400709 687731 692710 497187 297054 171411 126740 182018
37154A82018R6090k3360j84222j46413P3007J87576P4081n5566k8873J4921q6672
$$ 182018 278108 254748 70526 -75887 -2880 184696 258777 203211 174338 189259 102587
37143A02587j95946r5099J27935J95565O8614j8805M8046R6006l0674j98301j61541
$$ 102587 -93359 -188458 -60523 135042 203656 184851 232897 328903 298229 99928 -61613
37132f1613Q9121L02762K72651N7590j34008k08860k51133l23548l21222j26108
$$ -61613 27508 330270 602921 660511 526503 317643 66510 -257038 -578260 -704368
37122g04368J53276K52464Q1462j54969k19642r8989O4860J58131J19046p7362
$$ -704368 -551092 -298628 -217166 -372135 -591777 -690766 -625906 -467775 -348729 -426091
37112d26091l21373l79122j63673J03259J68096Q1183N7231J02848M6078j11177
$$ -426091 -747464 -1126586 -1290259 -1187000 -1018904 -937721 -880490 -777642 -731564 -842741
37102h42741j65257n2448P0835J41095K74318M36011L54402l2411l30677j73922
$$ -842741 -1007998 -1060446 -989611 -848516 -574198 -138187 216215 183804 -146873 -320795
37092c20795K55700M88707L90195J96551N2635j10176k60383k16953K910J12803
$$ -320795 -65095 423612 813807 1010358 1062993 952817 692434 475481 478391 591194
37082E91194k7949j96534j65937m7155o8473j93221j96584k8893J24263J23332
$$ 591194 563245 366711 200774 153619 85146 -108075 -304659 -333552 -209289 -85957
37072h5957L6168O22N5291J41161J89024J69260R2770j5386j40602k60536l18373
$$ -85957 -49789 -49167 6124 147285 336309 505569 598339 582953 442351 181815 -136558
37061a36558k71098j63352q2075l3356M7572J53100J84213J15584O0450R5551
$$ -136558 -407656 -571008 -653083 -686439 -638867 -485767 -301554 -185970 -125520 -29969
37051b9969J24726J7873j81305k86321j79438O6787K52591K14767j5640k09316
$$ -29969 94757 112630 -68675 -354996 -534434 -467647 -215056 -289 -15929 -225245
37041b25245j75748n399M9317n7843j02854L8693J69612P1798j46511k11006p5023
$$ -225245 -400993 -406392 -357075 -414918 -517772 -479079 -309467 -237669 -384180 -595186 -670209
37030f70209O6015R2056P6957J03044J41060J33525O6121m8527j55594j55156
$$ -670209 -604194 -512138 -435181 -332137 -191077 -57552 8569 -39958 -195552 -350708
37020c50708k4292J01021Q6818o355k5958L2233M4885j5596m7865J997Q8926J81167
$$ -350708 -375000 -273979 -187161 -193516 -219474 -187241 -142356 -157952 -205817 -203820 -114894 66273
37008F6273K65057K51045N4918k09873k95991j28138R5767J59896O7665k6204
$$ 66273 331330 582375 637293 427420 131429 3291 99058 258954 326619 300415
36998C00415k3740K7051L137j38905k58911j61664J11191K51342P9850j67859
$$ 300415 276675 303726 306863 167958 -90953 -252617 -141426 109916 189766 21907
36988B1907j54819P8826K06361J05224l4715o8715o1334o7126l3639K0572n768
$$ 21907 -132912 -54086 152275 257499 222784 154069 92735 25609 -8030 12542 6774
36977F774p3568l1132Q0072L6981j64071k28088k2188J81592J14304r6169j57167
$$ 6774 -66794 -97926 -17854 19127 -144944 -373032 -395220 -213628 -99324 -195493 -352660
36966c52660l0360J00407J19306L9577r2059j88522j46753n367O6269L0252L7071
$$ -352660 -383020 -282613 -163307 -123730 -215789 -404311 -551064 -556431 -490162 -459910 -422839
36955d22839J24786J15922l8829r6024Q8250K71116J92634r663n7416J0189k6442
$$ -422839 -298053 -182131 -220960 -316984 -228734 42382 235016 225353 167937 178126 151684
36944A51684j37711j13869L8820J16585P1180K8583O720p9624j72593j30096j505
$$ 151684 13973 -99896 -61076 55509 126689 155272 161992 82368 -90225 -220321 -221826
36933b21826M7098N1131J80273L64794L24144J8982k35779k06251l0113L4396
$$ -221826 -174728 -123597 56676 421470 745614 764596 528817 322566 292453 326849
36923C26849o4595k02060k60672j95989m8527N7219L7435k3297J2388J26625J95026
$$ 326849 262254 60194 -200478 -396467 -444994 -387775 -350340 -373637 -361249 -234624 -39598
36912c9598J80521J09269n6320k97755l84486j22044K87628M31710K18538o9417
$$ -39598 140923 250192 193872 -103883 -488369 -610413 -322785 108925 327463 258046
36902B58046k29425l03051k84752o8248K22988K48507l6591k36303q5432J64572
$$ 258046 28621 -274430 -559182 -627430 -404442 -155935 -192526 -428829 -514261 -349689
36892c49689J76719L6400J9734J02214N7653r9697j31172J4680J17117L5115r5033
$$ -349689 -172970 -136570 -116836 -14622 43031 -56666 -187838 -173158 -56041 -20926 -115959
36881a15959q0142O8845J71844J04985n5279j11115K1412J90248J98756P3931
$$ -115959 -196101 -127256 44588 149573 94294 -16821 4591 194839 393595 467526
36871D67526n800k2775j38511l60726m40461k24495R7190K45041J79081L6809
$$ 467526 461726 438951 300440 -60286 -500747 -725242 -628052 -383011 -203930 -167121
36861a67121p8153r1822O9259L13972L61840R7009j94952j75806P5923J93122
$$ -167121 -245274 -337096 -267837 46135 407975 504984 310032 134226 210149 403271
36851D03271L7720j72274k29376j80087j61632j85771j56359j846K36932L97668
$$ 403271 440991 268717 39341 -140746 -302378 -488149 -644508 -646354 -409422 -11754
36841a1754L22673O6536j11303o7151K7635m1324j84598j55458L9315J43821N7121
$$ -11754 310919 377455 266152 199001 226636 185312 714 -154744 -115429 28392 85513
36830H5513m2223l0463l1639j49195k33289j12127R8673J49345M4197K7629J65431
$$ 85513 43290 12827 -18812 -168007 -401296 -513423 -414750 -265405 -221208 -193579 -28148
36819b8148J90759r1186m28740l96545J1463L28215K19524r6920j96725j3173
$$ -28148 162611 71425 -357315 -753860 -742397 -414182 -194658 -291578 -488303 -501476
36809e01476J81495K25841K05026J79623Q5953m9977p5602K3373O3784k8382q6974
$$ -501476 -319981 -94140 110886 290509 376462 326485 250883 274256 338040 309658 222684
36798B22684m089P0503j3890j55014j75470q6693j1637K977m2944j48564j97100
$$ 222684 218595 289098 275208 120194 -55276 -141969 -153606 -150629 -193573 -342137 -539237
36787e39237r701L25187M25473J37770j69732j20307J11017J11283r7586j38618
$$ -539237 -548938 -223751 201722 339492 169760 49453 160470 271753 174167 35549
36777C5549O8950K00184P5198j04683j50365j41296j66752j33674J3254J37009
$$ 35549 104499 304683 379881 275198 124833 -16463 -183215 -316889 -303635 -166626
36767a66626J25923O4884O7525J12563J37286J25292M1036j41128l00188k65839
$$ -166626 -40703 24181 91706 204269 341555 466847 507883 366755 66567 -199272
36757a99272r1335j738l6194j4879Q2711M0090j63124j93346J23496M36320L32221
$$ -199272 -290607 -292345 -328539 -343418 -260707 -220617 -383741 -577087 -453591 -17271 314950
36746C14950n7302k58804j19606Q6475J42434J22437J27727R9445j8256j51584
$$ 314950 257648 -1156 -120762 -34287 108147 230584 358311 457756 439500 287916
36736B87916k21334k29270j66098J447J92317K26755O9739p9979m8210P9796J00866
$$ 287916 66582 -162688 -328786 -327339 -135022 91733 161472 81493 33283 113079 213945
36725B13945j2591r6394m1958O7843R3527J9940n1385m9515j5026k6637q2013
$$ 213945 201354 104960 63002 130845 224372 244312 192927 143412 128386 101749 19736
36714A9736q8184J8907J69508K13112Q9229q5844j41631n3661L1917o895j09422
$$ 19736 -68448 -49541 119967 333079 422308 336464 194833 141172 173089 166194 56772
36703E6772j29706m6968K2447J7929J8082Q5100J39586Q2412m2337j20097j44818
$$ 56772 -72934 -119902 -97455 -79526 -61444 23656 163242 245654 203317 83220 -61598
36692f1598j94537k51742j91604J8917K22962K38565O5160j18528j32722L9152
$$ -61598 -256135 -507877 -699481 -680564 -457602 -219037 -153877 -272405 -405127 -365975
36682c65975K28877K31368K4916j65193r4440J98627L93812K35524j71713m67907
$$ -365975 -137098 94270 119186 -46007 -140447 58180 451992 687516 515803 47896
36672D7896m20123j47364N4435O4557L5138J25620K58090K53117J26137N5461
$$ 47896 -372227 -519591 -465156 -400599 -365461 -239841 18249 271366 397503 452964
36662D52964O7775j1306k25351l46701k13630R439J06927J45343K69221L36229
$$ 452964 520739 509433 284082 -62619 -276249 -266810 -159883 -14540 254681 590910
36652E90910J04156k91129m17079j37476K04726K78910J43245J4448n9267j26412
$$ 590910 695066 403937 -13142 -150618 54108 333018 476263 490711 431444 305032
36642C05032j56220j19284q0341n6090N6853K57708L20783R9973j83758j89842
$$ 305032 148812 29528 -50813 -106903 -50050 207658 528441 628414 444656 254814
36632B54814Q0478K90098K11388k7778j64384j16547k5515n8211k07293k80970
$$ 254814 335292 625390 836778 809000 644616 528069 502554 444343 237050 -43920
36622d3920j24346J49812K53663Q9685j13008j26515m0836p7158j97997j56549
$$ -43920 -168266 -18454 235209 324894 211886 85371 44535 -32623 -230620 -387169
36612c87169P8480K16523O3466j74903j92467l9885k9607k16782k60983O9431
$$ -387169 -308689 -92166 -28700 -203603 -396070 -435955 -465562 -682344 -943327 -873896
36602h73896M81836M96147R4654k55087k34059k8853M8872J561j2413k5057j34757
$$ -873896 -392060 104087 198741 -56346 -290405 -319258 -270386 -268825 -281238 -306295 -441052
36591d41052k00248k1839K45818K46094o444r5212J62691M24329L43217N6024
$$ -441052 -641300 -663139 -417321 -171227 -177671 -272883 -110192 314137 657354 713378
36581G13378r7759q0799r1693j71593j82288r6940m8470j01185j64038j31974
$$ 713378 615619 534820 443127 271534 89246 -7694 -56164 -157349 -321387 -453361
36571d53361Q164J86393K80450K04084L6493l7093J9250M5010k3342j6016J57804
$$ -453361 -445197 -258804 21646 225730 262223 225130 244380 289390 266048 250032 407836
36560D07836K74197J05023k02358l24362k19406j08604r0910p1521j8128Q294
$$ 407836 682033 787056 584698 260336 40930 -67674 -158584 -230105 -248233 -239939
36550b39939M8875J76314K50013O7413k29938k64767j2037J07160j18025l20763
$$ -239939 -191064 -14750 235263 302676 72738 -192029 -204066 -96906 -214931 -535694
36540e35694j26260K28464K29545j44374m05141k57310P1369K52729K68338K58895
$$ -535694 -661954 -433490 -203945 -348319 -753460 -1010770 -939401 -686672 -418334 -159439
36530a59439K36049J47060N4562M4253N1825l2563j54436j71504r7962q0579j37424
$$ -159439 76610 223670 278232 322485 374310 341747 187311 15807 -82155 -162734 -300158
36519c00158j22363J1186J13507R1325O0976J12012J01442j11696l59230l41980
$$ -300158 -422521 -411335 -297828 -206503 -145527 -33515 67927 -43769 -402999 -744979
36509g44979n8968J85828J94646O3146m7599q0283J2345K62278M94837M10553
$$ -744979 -803947 -618119 -423473 -360327 -407926 -488209 -475864 -213586 281251 691804
36499F91804J7682k56163r9092K33790K64049n1855l06373k33474j5034N7349
$$ 691804 709486 453323 354231 588021 852070 800215 493842 260368 245334 302683
36489C02683k9369r6680q4105r0938j57893j71350m1011J23188J29354j3053o9486
$$ 302683 273314 176634 92529 1591 -156302 -327652 -368663 -245475 -116121 -129174 -198660
36478a98660Q8650K67476K14867r813j44902j34564j52571k25843j56239R2573
$$ -198660 -110010 157466 372333 362520 217618 83054 -69517 -295360 -451599 -359026
36468c59026K44327J15375r8589j43516p1331n2223n0737L2643Q4221m5563k15563
$$ -359026 -114699 676 -97913 -241429 -312760 -364983 -415720 -383077 -298856 -344419 -559982
36457e59982j60745Q9548K52551J99761N1659q5215j98469k20223p7750J11532
$$ -559982 -720727 -631179 -378628 -178867 -127208 -212423 -410892 -631115 -708865 -597333
36447e97333J55996R4024J21453K26687J93650j471j03503J8615J54471P3535
$$ -597333 -441337 -347313 -225860 827 194477 193006 89503 108118 262589 336124
36437C36124j50829k84183k40523j19284m1487m1340m9514M1019K12515K67316
$$ 336124 185295 -98888 -339411 -458695 -500182 -541522 -591036 -550017 -337502 -70186
36427g0186P8346j59007j32703J49329L63737L25235J82101J06827N3680o2077
$$ -70186 8160 -150847 -283550 -134221 229516 554751 736852 843679 897359 835282
36417H35282j69002j73699j28337j26620j51251j31849n8614L1968R5809Q0106
$$ 835282 666280 492581 364244 237624 86373 -45476 -104090 -72122 23687 103793
36407A03793q609m4082O6883J96148J48929j4834n0548P5919J35341K1580r5384
$$ 103793 95184 51102 117985 314133 463062 448228 397680 473599 608940 630520 535136
36396E35136q4256l1785j960Q1854J75702N9327k58693m01414j62195J05244k1847
$$ 535136 450880 419095 417135 498989 674691 734018 475325 73911 -88284 16960 -4887
36385d887l78744m45701j09157K21663K38860R6853P5196J84570K44322J60049
$$ -4887 -383631 -829332 -938489 -716826 -477966 -381113 -305917 -121347 122975 283024
36375B83024j93j00486m5859J19596K10689R4328j20707k01416r3213K7379K0973
$$ 283024 282831 182345 136486 256082 466771 561099 440392 238976 145763 173142 194115
36364A94115l3562O027J14470J30880p845j65305j78245p0955l810j4994M2282
$$ 194115 160553 166580 281050 411930 404085 238780 60535 -10420 -14230 -29224 13058
36353A3058K22641L09148J08394j85944k08689K3321J07954j15811k91838r8702
$$ 13058 235699 544847 653241 467297 258608 281929 389883 274072 -17766 -116468
36343a16468K31245K53386l3470k25400j15165Q6056J29435L4336n2812p5901
$$ -116468 114777 368163 334693 109293 -5872 80184 209619 243955 191143 115242
36333A15242m9900J3545O7768L1280r0122j54384k9743K33511M17307L37084M8084
$$ 115242 65342 78887 146655 177935 87813 -66571 -96314 137197 554504 891588 939672
36322I39672j69193r7658J53396K84951K05354J13329J32532R3866j55972m33620
$$ 939672 770479 672821 826217 1111168 1316522 1429851 1562383 1656249 1500277 1066657
36312A066657m55842k69082j63084k15722k15754n0498J13519J25356Q6226J47052
$$ 1066657 610815 341733 178649 -37073 -252827 -303325 -189806 -64450 21776 168828
36302A68828K40531J88919r066j60214j26373K4404J27679J03330k401j00747
$$ 168828 409359 598278 589212 428998 302625 327029 454708 558038 555637 454890
36292D54890j34727q9134Q491P6444L2498r0002j41728n0241N3655J7425r1341
$$ 454890 320163 231029 239520 315964 348462 258460 116732 66491 120146 137571 46230
36281D6230r0455J3612M3643k8495l2846P2470R9855k2527q1063N6814J64366
$$ 46230 -44225 -30613 13030 -15465 -48311 24159 124014 101487 20424 77238 241604
36270B41604N190k46036k41202K2134K38242K60899K11621J68111P2754m3722
$$ 241604 246794 758 -240444 -218310 19932 280831 492452 660563 733317 689595
36260F89595o0968k9194j28540l07433k77020J4997K15154O3293k02905j97283
$$ 689595 628627 599433 470893 163460 -113560 -98563 116591 179884 -23021 -220304
36250b20304N8410K26745J86652J42051K07137K09061J8502j84258j75841n3170
$$ -220304 -161894 64851 251503 393554 600691 809752 828254 643996 468155 414985
36240D14985p9300k41660k47537M039K23797J50278o3661j10161o886k3859k03867
$$ 414985 335685 94025 -153512 -149473 74324 224602 160941 50780 43894 20035 -183832
36229a83832k80422j07555J21446J84386J18013P1046O8806N7715K8320j6633
$$ -183832 -464254 -571809 -450363 -265977 -147964 -76918 -8112 49603 77923 61290
36219F1290q1686j00957N38J29984J12647j8624p4716p3203k04999l72597k08151
$$ 61290 -20396 -121353 -120815 9169 121816 103192 28476 -44727 -249726 -622323 -830474
36208h30474K60431M52141P9350l11644j17364L97685N29673J97644p7016q2759
$$ -830474 -570043 -117902 -38552 -350196 -467560 -69875 459798 657442 580426 497667
36198D97667j07746k40733j76000J55894L69487K40285K6769l7184r4861k66833
$$ 497667 389921 149188 -26812 129082 498569 738854 765623 728439 633578 366745
36188C66745l40546j51631R3712J66867J62454K19498K10766Q089k18307k63811
$$ 366745 26199 -125432 -31720 135147 297601 517099 727865 735954 517647 253836
36178B53836k05733j72970n8364K21765M22591K88087j0805j24065o2632j06070
$$ 253836 48103 -124867 -183231 38534 461125 749212 738407 614342 551710 445640
36168D45640k69646k73001l2596J93847K17609J52325J38151J05828m5692k36621
$$ 445640 175994 -97007 -129603 64244 281853 434178 572329 678157 632465 395844
36158C95844l14808k48591j05150N9005J95424K37597J64615M4952l5112m9700
$$ 395844 81036 -167555 -272705 -213700 -18276 219321 383936 428888 393776 344076
36148C44076k1016J5080J0893o2503j52876j50605k2665J12243R8605o8691k17115
$$ 344076 323060 338140 349033 286530 133654 -16951 -39616 72627 171232 102541 -114574
36137a14574j78896K2844K00267K00125L7682j57579k61738k06071N813K64270
$$ -114574 -293470 -270626 -70359 129766 167448 9869 -251869 -457940 -452127 -187857
36127a87857L94668L09335R5702q2865j23687n866K07483L25029J37968k87333
$$ -187857 206811 516146 611848 528983 405296 399430 606913 931942 1069910 782577
36117G82577n63261m17279o9539N1455j02904j69345P1044L81429M04716J05993
$$ 782577 219316 -197963 -267502 -216047 -318951 -488296 -417252 -35823 368893 474886
36107D74886k33372l35548j64280O0842N8907k08240m41049l32553M4826L37658
$$ 474886 241514 -94034 -258314 -197472 -138565 -346805 -787854 -1120407 -1075581 -737923
36097g37923L47478J75857j6005j49751j49757J1417J67886J26323q18P7505L32786
$$ -737923 -390445 -214588 -230593 -380344 -530101 -518684 -350798 -224475 -225293 -147788 184998
36086A84998L94061J28964j19346o6381R0780N2242q6383n3321J03110J13484
$$ 184998 579059 708023 588677 522296 613076 665318 578935 525614 628724 742208
36076G42208m1054j25570p8588r5405k44977l06640j11157J65856K11871j9663
$$ 742208 701154 575584 496996 401591 156614 -150026 -261183 -95327 116544 96881
36066I6881k54159k29864O948J84663J40988j5694j02562j00758q8921m3994J04909
$$ 96881 -157278 -387142 -380194 -195531 -54543 -70237 -172799 -273557 -362478 -406472 -301563
36055c01563K69356K61778P4424r7605j35287j05812p6265l3853k5154j35299
$$ -301563 -32207 229571 303995 206390 71103 -34709 -110974 -144827 -169981 -305280
36045c05280k66151j86145J03040K98577K17165M1547L201N9188O3404L9704P4568
$$ -305280 -571431 -757576 -654536 -355959 -138794 -97247 -94046 -34858 28546 68250 142818
36034A42818J12870P0175J2428L8169J01598J12123Q8259P2477K7409m9117n0224
$$ 142818 255688 325863 338291 376460 478058 590181 678440 750917 778326 729209 678985
36023F78985O7458J86556K19460K18481J83558q852l20145m40032j98511J18267
$$ 678985 746443 932999 1152459 1370940 1554498 1545646 1225501 785469 586958 705225
36013G05225J31037j11909k48585j17221J11779K34460J93502J3501k19859l45500
$$ 705225 836262 724353 475768 358547 470326 704786 898288 911789 691930 346430
36003C46430k72936j16092n0502r7497j60659j75493j04311Q9420L21437L77500
$$ 346430 73494 -42598 -93100 -190597 -351256 -526749 -631060 -541640 -220203 157297
35993A57297J84806l3727m3183Q3557J01257n4371k16129k16657m7059J44046
$$ 157297 342103 308376 265193 348750 450007 395636 179507 -37150 -84209 59837
35983E9837J44564j07853l66519l07826L6249L04466L06024J98462J01775p9405
$$ 59837 204401 96548 -269971 -577797 -541548 -237082 68942 267404 369179 289774
35973B89774k90550k10425K17894N22035L23892q8998j98651J1818J66843J06598
$$ 289774 -776 -211201 6693 528728 852620 763622 564971 576789 743632 850230
35963H50230l3279j71461l05180l24507j67415j8526k3067L295K21476L62686
$$ 850230 816951 645490 340310 15803 -151612 -170138 -193205 -189910 31566 394252
35953C94252J21065k48389k38718J17827K93322O7844k07940j93455L0585K05516
$$ 394252 515317 266928 28210 146037 439359 507203 299263 105808 136393 341909
35943C41909K00958K1460k09637k65355o0068J78694K19906J67538K05750K10436
$$ 341909 542867 564327 354690 89335 29267 207961 427867 595405 801155 1011591
35933A011591n336k53949k33437o8912j04788k81038k43837K686J08396R589j0437
$$ 1011591 1006255 752306 518869 449957 345169 64131 -179706 -177020 -68624 -59035 -69472
35922f9472R6196O7590r9459p4990J88487L06730J00415j14555p0744O6561P0591
$$ -69472 26724 94314 -5145 -80135 108352 415082 515497 400942 330198 396759 467350
35911D67350Q276J3459N3163J00788K21279L39224K43045n3125k67727k72722
$$ 467350 475626 489085 542248 643036 864315 1203539 1446584 1393459 1125732 853010
35901H53010k32349k43471j91205n3859P078l7474k5295N3483Q059j72197k44263
$$ 853010 620661 377190 185985 132126 139204 101730 76435 129918 137977 -34220 -278483
35890b78483j05353P9039J95750K82628K85265J02450j12538j11767r384j16637
$$ -278483 -383836 -304797 -109047 173581 458846 561296 448758 336991 327607 210970
35880B10970l36461k62086R8307K88584J66667O9901J04523m5674l97496m58750
$$ 210970 -125491 -387577 -289270 -686 165981 235882 340405 294731 -102765 -561515
35870e61515n0218L23780K91057J61904K50261K77998k5406k92155q7424L24038
$$ -561515 -611733 -287953 3104 165008 415269 693267 667861 375706 288282 612320
35860F12320L88056J06254j01388j14161j42827k33720k34610j31696k7340Q6182
$$ 612320 1000376 1106630 1005242 891081 748254 514534 279924 148228 120888 207070
35850B07070K10933J84983m9180k19949q2635J90777K64796R1834j39824k93858
$$ 207070 418003 602986 553806 333857 251222 441999 706795 798629 658805 364947
35840C64947k94277r4264J44903J22873j40523k37785J1438K51119J64892l3861
$$ 364947 70670 -23594 121309 244182 103659 -134126 -122688 128431 293323 259462
35830B59462j9641J15930J27667O8323Q6990Q3278n3127j44278l4043Q9819M1644
$$ 259462 239821 355751 483418 551741 638731 722009 668882 524604 490561 580380 622024
35819F22024L43J49298K66747R2912j74863j88616j5643K4445j10721k11978j97605
$$ 622024 622367 771665 1038412 1131324 956461 767845 752202 776647 665926 453948 256343
35808B56343j21092J7119J60600J13681j41720k86523j09161J50405J84716O4128
$$ 256343 135251 152370 312970 426651 284931 -1592 -110753 39652 224368 288496
35798B88496J0648K4041K3595N8880J06592q760k33274k12230J24815L44313J81451
$$ 288496 299144 323185 346780 405660 512252 503492 270218 57988 182803 527116 708567
35787G08567m1393j4025N5190o3151j40607K4380J55040L2161k7226K34303M49180
$$ 708567 667174 653149 708339 645188 504581 528961 684001 716162 688936 923239 1372419
35776A372419K40084r3830j23769l5239j66940k92294q6135J37582o8582m23315
$$ 1372419 1612503 1518673 1394904 1359665 1192725 900431 814296 951878 883296 459981
35766D59981l49925N3230K57799K29042L22399N06736M56765K17322P2668k8857
$$ 459981 110056 163286 421085 650127 972526 1479262 1936027 2153349 2226017 2197160
35756B197160k68231m55959l85893l35369n32063n53114l2090M99003L71862n1742
$$ 2197160 1928929 1472970 1087077 751708 219645 -333469 -365559 133444 505306 453564
35746D53564K5458M61689M90871J11626n827J80496P1319l48220m43886j31781
$$ 453564 479022 940711 1431582 1543208 1537381 1717877 1789196 1440976 997090 865309
35736H65309j8686k45107k68911M6873J66507j03112k93818j73640o2451q0718
$$ 865309 846623 601516 332605 379478 545985 442873 149055 -24585 -87036 -167754
35726a67754M3941K80871K68445P8366J34115L23067J35413k77334k24988K53399
$$ -167754 -123813 157058 425503 503869 637984 961051 1096464 819130 594142 847541
35716H47541L58171n9297k12067K01311M51102Q5214l05068j70563J09401J7270
$$ 847541 1205712 1146415 934348 1135659 1586761 1671975 1366907 1196344 1305745 1323015
35706A323015k48543k84099j53260n8017N2974J65262Q0359j08221l8187K36266
$$ 1323015 1074472 790373 637113 579096 632070 797332 877691 769470 731283 967549
35696I67549K63391K7585l180K16741K04152j06901k07711J7256Q4799j26506
$$ 967549 1230940 1258525 1255345 1472086 1676238 1569337 1361626 1378882 1463681 1337175
35686A337175j53930R6310J40938j02994j19829J80372K46503n2919j88664m1764
$$ 1337175 1183245 1279555 1420493 1317499 1197670 1378042 1624545 1571626 1382962 1341198
35676A341198j25288m55915l55252K63420N65886J76172k32668j55539L8112L0579
$$ 1341198 1215910 759995 404743 668163 1234049 1410221 1177553 1022014 1060126 1090705
35666A090705Q1478K25546O2942k85609j76852K89505K73945k30645k48780L79990
$$ 1090705 1172183 1397729 1460671 1175062 998210 1287715 1561660 1331015 1082235 1462225
35656A462225N95785J3689l82514p3061J10993l05061m87666N5929M65533J41573
$$ 1462225 2058010 2071699 1689185 1616124 1727117 1422056 934390 990319 1455852 1597425
35646A597425j51601J99645N23843K52941k5517J04812K0050m93344n03456L03070
$$ 1597425 1445824 1645469 2169312 2422253 2396736 2501548 2521598 2028254 1524798 1827868
35636A827868P52925J84599l54663m7165L06442M1016n5682N14793P69258J76787
$$ 1827868 2580793 2765392 2410729 2363564 2670006 2711022 2655340 3170133 3939391 4116178
35626D116178j31826M71326P56759j1021n00826K12271Q13491K40434k68764L71168
$$ 4116178 3984352 4455678 5212437 5201416 4700590 4912861 5726352 5966786 5698022 6069190
35616F069190R34265L50952p3429P62102J444989Q07399L86732J459941K382971
$$ 6069190 7003455 7354407 7280978 8043080 9488069 10295468 10682200 12142141 14525112
35607A4525112J784331J449150K829179L863995K835836J975409L283638M527265
$$ 14525112 16309443 17758593 20587772 24451767 27287603 29263012 32546650 37073915
35599C7073915L862773M201832P721874J0833338J0979930J3024904K1010264
$$ 37073915 40936688 45138520 52860394 63693732 74673662 87698566 108708830
35592A08708830L0086129L7404189N3191271Q3106417J03023096P5515768l88961
$$ 108708830 138794959 176199148 229390419 312496836 415519932 491035700 490646739
35585D90646739p5828846j02371183q1863193n2214727l7242160l0608228k1752041
$$ 490646739 414817893 312446710 230583517 178368790 141126630 110518402 88766361
35578H8766361j3689375j1508689j1189633p856370m184299l828559m493742l201478
$$ 88766361 75076986 63568297 52378664 44522294 40337995 36509436 32015694 28814216
35570B8814216j938909l010092m173182k956952j235295j415828k102428j298050
$$ 28814216 26875307 23865215 19692033 16735081 15499786 14083958 11981530 10683480
35562A0683480k93639q15020j530404p62709K04782l02517j107399n34761L82259
$$ 10683480 10389841 9574821 8044417 7281708 7486490 7183973 6076574 5541813 5924072
35553E924072j1272q34101m48202M66504L41017l92123l98120q541k82982p61709
$$ 5924072 5912800 5078699 4630497 5097001 5438018 5045895 4647775 4639234 4356252 3594543
35543C594543m23461K13838N5638m95139l75394J38120Q7169l40175l27077j2877
$$ 3594543 3171082 3384920 3440558 2945419 2570025 2708145 2795314 2455139 2128062 2115185
35533B115185k9734j92070l2526J14474j61129l48305M5399M18291J17377l40783
$$ 2115185 2085451 1893381 1860855 1975329 1814200 1465895 1511294 1929585 2046962 1706179
35523A706179k55832j6563k09779m06061m9970L56840J78056j49786k5196J24212
$$ 1706179 1450347 1433784 1224005 817944 767974 1124814 1302870 1153084 1127888 1252100
35513A252100k30071n34724j72923K52382k3066m67759k30003K71953J69775k19994
$$ 1252100 1022029 487305 314382 566764 543698 75939 -154064 117889 287664 67670
35503F7670o6970L56441K54093r4497J23986N94327L40326m66002p17056k20880
$$ 67670 700 357141 611234 516737 640723 1235050 1575376 1109374 392318 171438
35493A71438J31601j0568n8451K37223L72933J16710j27069j33119j32200j90461
$$ 171438 303039 292471 234020 471243 844176 960886 833817 700698 568498 378037
35483C78037j12885L0817J2090k6767J44686K45965p0369m42721l04212J02601
$$ 378037 265152 295969 308059 281292 425978 671943 601574 158853 -145359 -42758
35473d2758J12815j90923j47114L00407N42231L56026J15524j5828k37075m65036
$$ -42758 70057 -120866 -267980 32427 574658 930684 1046208 1030380 793305 328269
35463C28269l56339N785J83020J21946J26647J72644k1917l17732k92922p863
$$ 328269 -28070 -22285 160735 282681 409328 581972 560055 242323 -50599 -58462
35453e8462R3693j0352N5087K81244K62754l2509j84620l9318J30893J76614J81100
$$ -58462 35231 24879 79966 361210 623964 591455 406835 367517 498410 675024 856124
35442H56124P6181k43300n02704l58554j9983N5881o8711j4196J38658L0047j79350
$$ 856124 932305 689005 186301 -172253 -192236 -136355 -205066 -219262 -80604 -50557 -229907
35431b29907j9673L64655L63312m0556k22934J5055J87649M7930o0906M3654P0271
$$ -229907 -249580 115075 478387 437831 214897 229952 417601 465531 404625 448279 518550
35420E18550q3868q6750J74043L69835L84243N08346P49439O42386N7867m52462
$$ 518550 434682 347932 521975 891810 1276053 1784399 2533838 3176224 3234091 2781629
35410B781629m72309k95045l13475l85733k32180m552r620j93593k94290k61093
$$ 2781629 2309320 2014275 1700800 1315067 1082887 1078335 1068715 875122 580832 319739
35400C19739k06848j50803p1460m1013r7985j24565J665K36063M09264L56882
$$ 319739 112891 -37912 -109372 -150385 -248370 -372935 -371270 -135207 274057 630939
35390F30939N3311k71046k87219r837J37637o2025k38342k8956K69383J58765
$$ 630939 684250 413204 125985 116148 253785 191760 -46582 -75538 193845 352610
35380C52610k14994k86550K4941K74421K60959J95581J41122o5225l13297k74554
$$ 352610 137616 -148934 -123993 150428 411387 606968 748090 682865 369568 95014
35370I5014p190R0896k2087Q916K31217K80698Q0999K027J68708K30718Q846k10505
$$ 95014 87824 178720 156633 165549 396766 677464 758463 760490 929198 1159916 1168762 958257
35358I58257k21497j86888j95796q3771J18698J10455j10559j55487O9038J47731
$$ 958257 736760 549872 354076 270305 389003 499458 388899 233412 302450 450181
35348D50181j24684l65805k35077O4572K06894K00969J59970N6888m5118L8259
$$ 450181 325497 -40308 -275385 -210813 -3919 197050 357020 413908 368790 407049
35338D07049K05266J08098k08219k55196P4730K35765q5568m10779k35761J74218
$$ 407049 612315 720413 512194 256998 331728 567493 481925 71146 -164615 9603
35328I603K68803O2889l6543O2963J27363Q1843N4394O6723L6739j5728k0254
$$ 9603 278406 341295 304752 367715 495078 576921 631315 698038 734777 719049 698795
35317F98795O025L7176R1098J03574k0119j65734j23870J2623n4268k82845l06628
$$ 698795 704820 741996 833094 936668 916549 750815 626945 639568 585300 302455 -4173
35306d173q3270K325j64505k05989M0488J89492L301j57266K8170K81037K38105
$$ -4173 -87443 -85118 -249623 -455612 -415124 -225632 -222331 -379597 -351427 -70390 167715
35295A67715L9856l9339q5051k08188j74349J38686L49115J61318o7213Q9353
$$ 167715 207571 168232 83181 -125007 -299356 -160670 188445 349763 282550 371903
35285C71903L64045K41590j59309l07602j36986m9109j76794k57435j81976j25872
$$ 371903 735948 977538 818229 510627 373641 324532 147738 -109697 -291673 -417545
35275d17545j44627r3700N4515J76598K28726K12855N1719k00912k35722P7651
$$ -417545 -562172 -655872 -601357 -424759 -196033 16822 68541 -132371 -368093 -290442
35265b90442L70010K78545J6653q840J12277J6397k33360k62050p9337o0693k60379
$$ -290442 79568 358113 374766 365926 478203 494600 261240 -810 -80147 -140840 -401219
35254d01219l10151m7811K54615L61930L33987K44677N2959j61770j96060l6193
$$ -401219 -711370 -759181 -504566 -142636 191351 436028 488987 327217 131157 94964
35244I4964J19165J74356J89531J45740k0532j73807j10036P9275J06615n6054
$$ 94964 214129 388485 578016 723756 703224 529417 419381 498656 605271 549217
35234E49217j54654q2215M095M621q362j4465p4527j23095l0963J19349J19254
$$ 549217 394563 312348 316443 321064 312702 298237 223710 100615 69652 189001 308255
35223C08255l313j0530J47545K64040K22081J18714K2854j03202k13373j86163
$$ 308255 304942 294412 441957 705997 928078 1046792 1069646 966444 753071 566908
35213E66908o0589j3506p4283r4275j1554P7511J10416J14978R6472N7430O3444
$$ 566908 506319 492813 418530 324255 312701 390212 500628 615606 712078 769508 832952
35202H32952J00510m130k86584m46189k47686N3305O4423j21622j06851J21731
$$ 832952 933462 929332 642748 196559 -51127 2178 66601 -55021 -161872 -40141
35192d0141J93713K2207o6724N6420J03171q6147k40288j22597R2583J51893J03866
$$ -40141 153572 175779 109055 165475 268646 182499 -57789 -180386 -87803 64090 167956
35181A67956R9223Q5735m0145j83450j90597r5346l5161l6327l2007N18L6667
$$ 167956 267179 352914 312769 129319 -61278 -156624 -191785 -228112 -260119 -259601 -222934
35170b22934O5735Q3838Q5909Q4049P1167J241j08397j33451k3576P6480M1891
$$ -222934 -157199 -73361 12548 96597 167764 169005 60608 -72843 -96419 -19939 21952
35159B1952k0100L6185J30170J17928P2828J23316J52046j2077k15393j61462
$$ 21952 1852 38037 168207 286135 358963 482279 634325 622248 406855 245393
35149B45393R8135K29903J34068J7298k6587j19120k67286l06394k11445j29331
$$ 245393 343528 573431 707499 724797 698210 579090 311804 5410 -206035 -335366
35139c35366q4118J9456J12645L8874j11520j23507p3896j92810l41998j38843
$$ -335366 -419484 -400028 -287383 -248509 -360029 -483536 -557432 -750242 -1092240 -1231083
35129a231083L59470O22544M08374N9157r7466j43308k00460j67092l7110k1876
$$ -1231083 -871613 -249069 159305 218462 120996 -22312 -222772 -389864 -426974 -448850
35119d48850j30693p2452K10780L69381K29770P6529J04639R3862p5542j07792
$$ -448850 -579543 -651995 -441215 -71834 157936 234465 339104 432966 357424 249632
35109B49632J37127K69677J3552k52254j01913K11471K02888l3535p6232L8858
$$ 249632 386759 656436 669988 417734 315821 527292 730180 696645 620413 659271
35099F59271o1636l47735m10629j76727j0447q2344j53143n2369Q1277J24992
$$ 659271 597635 249900 -160729 -337456 -347903 -430247 -583390 -635759 -554482 -429490
35089d29490J45956J61280O8643r6155j39006k5583N6914K4318J2410Q8523J03646
$$ -429490 -283534 -122254 -53611 -149766 -288772 -314355 -257441 -233123 -220713 -132190 -28544
35078b8544m4786k00869j46274R4120K54651J24751j83751l04280l9917L16271
$$ -28544 -73330 -274199 -420473 -326353 -71702 53049 -130702 -434982 -474899 -158628
35068a58628K95172q9864l04660m9057L02069K85372M3422K3280K19860K17988
$$ -158628 136544 46680 -257980 -307037 -4968 280404 323826 347106 566966 784954
35058G84954j00951l85113l73142k03455p5368L0766J61213K13241J11564l6562
$$ 784954 684003 298890 -74252 -277707 -353075 -322309 -161096 52145 163709 127147
35048A27147p9718J7609J88292K96430J82781j39659l77389k71350J5584R1581
$$ 127147 47429 65038 253330 549760 732541 592882 215493 -55857 -40273 51308
35038E1308j00900k24997q8481R2762R2839K9986J21158L07172L50376J74552
$$ 51308 -49592 -274589 -363070 -270308 -177469 -147483 -26325 280847 631223 805775
35028H05775q4574k79525l43768k58150p4852O5778O9681K2215Q0277K32884K70973
$$ 805775 721201 441676 97908 -160242 -235094 -169316 -99635 -77420 2857 235741 506714
35017E06714M4088l11007m81424l28308m4858R8880Q8177J07361K05473K28732
$$ 506714 550802 239795 -241629 -569937 -614795 -515915 -427738 -320377 -114904 113828
35007A13828J14798K0458M8050O4897m2818j40691q2650K401p8724k20401j59931
$$ 113828 228626 249084 297134 362031 319213 178522 95872 98273 19549 -200852 -360783
34996c60783R3533K71720K61684K11455K07564J42625k2416j31305r2937n6635
$$ -360783 -267250 4470 266154 477609 685173 827798 805382 674077 581140 524505
34986E24505j76061l49257l52099j45264Q8567J79359J38223Q7689R1068R7445
$$ 524505 348444 -813 -352912 -498176 -409609 -230250 -92027 -4338 86730 184175
34976A84175N2009l922j3280l2405j45026k63669k01694K4853J81037J72034J76226
$$ 184175 236184 232262 218982 186577 41551 -222118 -423812 -398959 -217922 -45888 130338
34965A30338K96283L45076J74680m1966j07671j27790k42094k81475o9014J54900
$$ 130338 426621 771697 946377 904411 796740 668950 426856 145381 76367 231267
34955B31267O0419j74770j03618K34989L49052R7838j01224P823J38151J9237
$$ 231267 291686 116916 13298 248287 597339 695177 593953 601776 739927 759164
34945G59164j57669j53262j13640k33679l35518j79330O3186N3235j65325k48330
$$ 759164 601495 448233 334593 100914 -234604 -413934 -350748 -297513 -462838 -711168
34935g11168q8161Q6664J12824P8526Q9940J06843P0649K3925M1288J27274J97338
$$ -711168 -799329 -712665 -599841 -521315 -431375 -324532 -253883 -229958 -188670 -61396 135942
34924A35942J30547r5802k98144k46172Q134J33509l9594k71958k69672q9699
$$ 135942 266489 170687 -127457 -373629 -365495 -231986 -271580 -543538 -813210 -902909
34914i02909L2589Q6998K21011L68971K88629j9397k34665j50591N4814J06031
$$ -902909 -870320 -783322 -562311 -193340 95289 75892 -158773 -309364 -254550 -148519
34904a48519m54o8642j8902M4425L9633K3556O3618J00296L0911j01694j23205
$$ -148519 -148973 -217615 -236517 -192092 -152459 -128903 -65285 35011 65922 -35772 -158977
34893a58977J9328J29956J8111j93267k09166n169J08008n2753k50807j78483
$$ -158977 -139649 -9693 8418 -184849 -394015 -399184 -291176 -343929 -594736 -773219
34883g73219Q6214K14314J12409Q336O8651J77078J50026j1619j64882j94817
$$ -773219 -687005 -472691 -360282 -351946 -283295 -106217 43809 32190 -132692 -327509
34873c27509q3378R2876J95347J44887L0186l801K5473k7680j63303j78598K2429
$$ -327509 -410887 -318011 -122664 22223 52409 48608 74081 46401 -116902 -295500 -273071
34862b73071K32532K15316N5047K7249J74515K44169Q5401j10967r7985N9600
$$ -273071 -40539 174777 229824 257073 431588 675757 761158 650191 552206 611806
34852F11806R1732p2860k18389j80379q0475j13015k27531j92430N7352K98022
$$ 611806 703538 630678 412289 231910 151435 38420 -189111 -381541 -324189 -26167
34842b6167K92110Q0923q0174l1037J30073J88821N7170j51913k57279j82539
$$ -26167 265943 346866 266692 235655 365728 554549 611719 459806 202527 19988
34832A9988o356J27679J40617P1363R510j7796n9376j17314p4123J50433L88181
$$ 19988 13632 141311 281928 353291 362801 345005 285629 168315 94192 244625 632806
34821F32806L32723o6228m70050n42269l40241j47734n2355N9673J77162J55463
$$ 632806 965529 899301 429251 -113018 -453259 -600993 -653348 -593675 -416513 -261050
34811b61050L6372M0845J71602J63555m2519j36780M1033J82134J8136j81707
$$ -261050 -224678 -183833 -12231 151324 108805 -27975 13058 195192 213328 31621
34801C1621m5296K22740J18981l13364m78330j19272L00549K93791N47j25053
$$ 31621 -13675 209065 328046 14682 -463648 -582920 -282371 11420 11967 -113086
34791a13086K8777J95166J72111K3966r2103j04663n0066j5678l6459k9733Q3592
$$ -113086 -84309 110857 282968 306934 214831 110168 60102 44424 7965 -21768 61824
34780F1824K01758J35489j03400k81050k54474j27321l3128M6669J54715K24237
$$ 61824 263582 399071 295671 14621 -239853 -367174 -400302 -353633 -198918 25319
34770B5319J92281J08071K6486p5444j86656k09000j16005k9883l7440n6900Q095
$$ 25319 217600 325671 352157 276713 90057 -118943 -234948 -264831 -302271 -359171 -351076
34759c51076J03514J21710O0335q853l9089j1896N6435P0771m8527j91741j47836
$$ -351076 -247562 -125852 -65517 -74370 -113459 -125355 -68920 1851 -46676 -238417 -386253
34748c86253Q0521K41104J90157Q2907R7627J76417J84338J32771P2458o4301
$$ -386253 -305732 -64628 125529 208436 306063 482480 666818 799589 872047 807746
34738H07746l18444n28959m93575k25009Q7641K81794K88764J35068j8438N412
$$ 807746 489302 -39657 -533232 -758241 -670600 -388806 -100042 35026 16588 22000
34728B2000J40575J27302p0088j49991M8482K41266J40594o9206n5497P7279l3393
$$ 22000 162575 289877 219789 69798 118280 359546 500140 430934 375437 452716 419323
34717D19323l49827m28933j07334K30461J96723j12359l27832k58420J7992L17641
$$ 419323 69496 -359437 -466771 -236310 -39587 -151946 -479778 -738198 -720206 -402565
34707d02565M62341L64001J10643j12047k14562k21300j32063N2536J82530O9702
$$ -402565 59776 423777 534420 422373 207811 -13489 -145552 -93016 89514 159216
34697A59216k02475l04106q4820K20736L14337J78007j6175j58044k14322j47115
$$ 159216 -43259 -347365 -432185 -211449 102888 280895 264720 106676 -107646 -254761
34687b54761R631J03992O5063N2322K23048M27786L64420L1297k07428r5046J67833
$$ -254761 -245130 -141138 -76075 -23753 199295 627081 991501 1022798 815370 720324 888157
34676H88157J98833o2069l16617l33118j98144j02915p4888m2400j4339k2792
$$ 888157 1086990 1024921 708304 375186 177042 74127 -761 -43161 -57500 -80292
34666h0292J4828J76704L28768K48147m6036k87104l07418j92568o3649O7257
$$ -80292 -65464 111240 440008 688155 642119 355015 47597 -144971 -208620 -141363
34656a41363J60687J10409m4565r1012L6738J20699N891j32801p3714R4680J35379
$$ -141363 19324 129733 85168 -5844 30894 151593 157484 24683 -49031 45649 181028
34645A81028K7639o9854r3043p4491Q561J47733J79491J022j93352j56611K3713
$$ 181028 208667 138813 45770 -28721 -20160 127573 307064 308086 114734 -41877 -18164
34634a8164O3303p4554j72244j37458p5682j8184R2901J54197j5975l02740l49453
$$ -18164 45139 -29415 -201659 -339117 -414799 -432983 -340082 -185885 -201860 -504600 -854053
34623h54053p7989J71230J42366l370j9513N2717N8268L7332J09118K06351J75667
$$ -854053 -932042 -760812 -618446 -621816 -641329 -588612 -530344 -493012 -383894 -177543 -1876
34612a876N5609L0970J38148J98760P0826j51960k43821j12003Q2990J02515q2411
$$ -1876 53733 84703 222851 421611 492437 340477 96656 -15347 67643 170158 87747
34601H7747k56223k42602j03230K8682J57182L04621L39647J68515j1036O0808
$$ 87747 -168476 -411078 -514308 -485626 -328444 -23823 315824 484339 473303 534111
34591E34111K79295K94344M7865j43242r1362Q135n9347k08079k48492j59683
$$ 534111 813406 1107750 1155615 1012373 921011 929146 869799 661720 413228 253545
34581B53545j6627J42937K43507J63415o9800k55543k89892k68709k50831j54067
$$ 253545 236918 379855 623362 786777 716977 461434 171542 -97167 -347998 -502065
34571e02065K2462J27981J20055J31125J70411O7438j53802k01973j7297M4527
$$ -502065 -479603 -351622 -231567 -100442 69969 137407 -16395 -218368 -235665 -191138
34561a91138j87903l16222P176M23967L61689n8172k05382O1345K11431p1529
$$ -191138 -379041 -695263 -688087 -264120 97569 39397 -165985 -104640 106791 35262
34551C5262m08685l56855m5742J33502J32959J78430K99970K90954P3202j76617
$$ 35262 -373423 -730278 -776020 -642518 -509559 -331129 -31159 259795 332997 156380
34541A56380k74798k15287q9379L1463R9369Q6637K8715R039O1257J22676J12467
$$ 156380 -118418 -333705 -423084 -391621 -292252 -205615 -176900 -167861 -106604 16072 128539
34530A28539K2827j00560k31315l47089l58662j71374J30147K82349J53511m1480
$$ 128539 151366 50806 -180509 -527598 -886260 -1057634 -927487 -645138 -491627 -533107
34520e33107j3366J82474K34333O5487n3327M0812J39686L6569j07682l9541J43975
$$ -533107 -546473 -363999 -129666 -64179 -117506 -76694 62992 99561 -8121 -47662 96313
34509I6313J47930l7190j42956p9826m4196j18339r0781J70834M22537L42998
$$ 96313 244243 207053 64097 -15729 -59925 -178264 -269045 -98211 324326 667324
34499F67324j2934k85615k81011j62336j51986k21851j85724N36J75936K01894
$$ 667324 654390 368775 87764 -74572 -226558 -448409 -634133 -633597 -457661 -255767
34489b55767J21754M6254n025n5282n9710K0289R2447M1346p1107q4577l639J5529
$$ -255767 -134013 -87759 -92784 -148066 -207776 -187487 -95040 -53694 -124801 -209378 -213017 -197488
34477a97488m9198m3234O6182R7852j8963p1519J00505L02060K50380Oj52909
$$ -197488 -246686 -289920 -223738 -125886 -144849 -216368 -115863 186197 436577 436583 283674
34466B83674j05814l6484q0054j49566j12964K0006J40549J66672R3015j9941
$$ 283674 177860 141376 61322 -88244 -201208 -181202 -40653 126019 219034 199093
34456A99093r4491j04487p6704k4419M6671O8718k4900j44071j08064Q3226K19415
$$ 199093 104602 115 -76589 -101008 -54337 14381 -10519 -154590 -262654 -179428 39987
34445C9987J84551R0317K4616q5821k31677k18062r851R4561r0591k69344q3946
$$ 39987 224538 314855 339471 253650 21973 -196089 -205940 -111379 -201970 -471314 -555260
34434e55260K99201M22439K24223O4669J16160J66467P0273j3931L3525N1795
$$ -555260 -256059 166380 390603 455272 571432 737899 808172 794241 827766 879561
34424H79561j18182l44838l76860j63731J11767K28922J09856j07407j82766n1921
$$ 879561 761379 416541 39681 -124050 -12283 216639 326495 219088 36322 -15599
34414a5599P2801l096j76620k34698j81392j43208q9272N6361J44667m406k21494
$$ -15599 57202 54106 -122514 -357212 -538604 -681812 -771084 -714723 -570056 -574462 -795956
34403g95956j87285L6099R1024o9010j13789P3221K12225J50928R9484J65581
$$ -795956 -983241 -947142 -856118 -925128 -1038917 -965696 -753471 -602543 -503059 -337478
34393c37478J20254j25838k49054k7314K51728K40854O1116J5415O8263Q851j02942
$$ -337478 -217224 -343062 -592116 -619430 -367702 -126848 -65732 -50317 17946 26797 -76145
34382g6145o8521M1628J7861o9340K6286K69181L57617J81856m9968j46488j22184
$$ -76145 -144666 -103038 -85177 -154517 -128231 140950 498567 680423 630455 483967 361783
34371C61783n2080J9019K0659p9861j69807j26401j2173M1874O0791J24541J44078
$$ 361783 309703 328722 349381 269520 99713 -26688 -38861 3013 63804 188345 332423
34360C32423n019j99361j96893j1984J12132Q5314M6977N8872P633j35956k15689
$$ 332423 327404 128043 -68850 -80834 31298 116612 163589 222461 230094 94138 -121551
34349a21551j25693N1457J93622K46806J69391l0290j91118j51580j2599q581
$$ -121551 -247244 -195787 -2165 244641 414032 383742 192624 41044 28445 19864
34339A9864j11493n9037J70097K46875O249k43922j62533J21089K23030O0820
$$ 19864 -91629 -150666 19431 266306 272555 28633 -133900 -12811 210219 271039
34329B71039j01298q4975M103J5335l4828m9249k924N4560P1223L2285k8156n1749
$$ 271039 169741 84766 88869 104204 69376 20127 17203 71763 142986 175271 147115 95366
34317I5366k3544Q246R560J0418L5395M3013l024n4594m7200j2204m1846j50599
$$ 95366 71822 80068 89628 100046 135441 178454 175430 120836 73636 61432 19586 -131013
34305a31013k30189j52943R0358L37739L59364R0753k32371k84545m0010J75528
$$ -131013 -361202 -514145 -423787 -86048 273316 364069 131698 -152847 -192857 -17329
34295a7329J07257r4426j16195N4324J34442r066j68643j25426L4462P8763k7781
$$ -17329 89928 -4498 -120693 -66369 68073 59007 -109636 -235062 -200600 -121837 -149618
34284a49618j10934o1096L9508O5140P76p9872j09741p4291j5097l02m8848r0734
$$ -149618 -260552 -321648 -282140 -217000 -216224 -296096 -405837 -480128 -495225 -495527 -544375 -635109
34272f35109n3821K7434O0731L7370L0284M9301J4018r1233j49074o6632R1673
$$ -635109 -688930 -661496 -600765 -563395 -533111 -483810 -469792 -561025 -710099 -776731 -685058
34261f85058K11261K80766L34830L18748J51646r4110k12121r6310J25387K29723
$$ -685058 -473797 -193031 141799 460547 612193 518083 305962 209652 335039 564762
34251E64762J27382p0181j91361j91924j75857k07907j78556K0347K33495J78192
$$ 564762 692144 621963 430602 238678 62821 -145086 -323642 -303295 -69800 108392
34241A08392j15013k63020p2703J54455J05424k3941J35441M62363M92328J59084
$$ 108392 -6621 -269641 -342344 -187889 -82465 -106406 29035 491398 983726 1142810
34231A142810j25355j74679k71894n38128n97952k06838K39916K63145K5947J3407
$$ 1142810 1017455 842776 570882 32754 -565198 -772036 -532120 -268975 -243028 -229621
34221b29621K25176K28301q8930l52899l16766j59690p5793J4944J84498K81361
$$ -229621 -4445 223856 134926 -217973 -534739 -694429 -770222 -755278 -570780 -289419
34211b89419K03169J11452J64479K48017J72679k8736j86528k40088k31574j72960
$$ -289419 -86250 25202 189681 437698 610377 581641 395113 155025 -76549 -249509
34201b49509p5714j0083N881P2484K26687L10034J82192l5668j20596p4482p4213
$$ -249509 -325223 -335306 -329425 -256941 -30254 279780 461972 426304 305708 231226 157013
34190A57013j31364n0956K17417M14642K97089j9259k05994j41255j5780k9761
$$ 157013 25649 -25307 192110 606752 903841 884582 678588 537333 521553 491792
34180D91792j37581j55565k6398J15699J16855k6711j78160k10537j38453r1319
$$ 491792 354211 198646 172248 287947 404802 378091 199931 -10606 -149059 -240378
34170b40378j37042j64355k2326K23375L04054R1701j95709k66028j28380j3578
$$ -240378 -377420 -541775 -564101 -340726 -36672 55029 -140680 -406708 -535088 -548666
34160e48666J0103R6120K86713L85087K60273N5909m7786r0284j79271k50605
$$ -548666 -538563 -442443 -155730 229357 489630 545539 497753 407469 228198 -22407
34150b2407j86382n0764R949J6330Q3362J63510J04600n4397r2626N0532J68292
$$ -22407 -208789 -259553 -249604 -233274 -149912 13598 118198 63801 -28825 21707 189999
34139A89999J01691l0464l1298R3968J94677K14000K23370K48186J89587l6591
$$ 189999 291690 261226 229928 323896 518573 732573 955943 1204129 1393716 1357125
34129A357125l41307n08540m19608j94395n4024o1032q5615l3107L0806M2976
$$ 1357125 1015818 507278 87670 -106725 -160749 -221781 -307396 -340503 -309697 -266721
34119b66721P8861J92378K46209R4502j33048j49462Q0532K50379R7857k63207
$$ -266721 -187860 4518 250727 345229 212181 62719 143251 393630 491487 228280
34109B28280m82766l57502m965K86150L23025J52717k6187q2398n0041r336L8232
$$ 228280 -254486 -611988 -616953 -330803 -7778 144939 118752 36354 -13687 -23023 15209
34098A5209J12280J57234J06799n186r1086j22731j16011n7825N8871J71092J97585
$$ 15209 127489 284723 391522 386336 295250 172519 56508 -1317 57554 228646 426231
34087D26231J19024k9893j70727j71294K2608K10338J10168k02112l01122k5963
$$ 426231 545255 515362 344635 173341 195949 406287 516455 314343 13221 -12742
34077a2742K18426M7508l06511l61285j11513O2737N1073P0037J44171O3693j25937
$$ -12742 205684 253192 -53319 -414604 -526117 -463380 -412307 -342270 -198099 -134406 -260343
34066b60343j15315J10924K13383J08900J22262L49417L97236L5139l71839m19615
$$ -260343 -375658 -264734 -51351 57549 179811 529228 926464 961603 589764 170149
34056A70149k38549j46312j09076M1020J74419R0709p0520o5956K0367r688m1715
$$ 170149 -68400 -214712 -323788 -282768 -108349 -17640 -88160 -154116 -133749 -143437 -185152
34045a85152J19706K81870J20642k09446k34347R7050L20705J56952j40072k33406
$$ -185152 -65446 216424 337066 127620 -106727 -9677 311028 467980 327908 94502
34035I4502j19206L6499J47075J48614k8682k84263l58097j44280J68118L37330
$$ 94502 -24704 11795 158870 307484 278802 -5461 -363558 -507838 -339720 -2390
34025b390K96632J16613p8800j39505j5048J36237J30476J2342o3537j11871k09693
$$ -2390 294242 410855 332055 192550 177502 313739 444215 456557 393020 281149 71456
34014G1456k13957M4885L38485K54983j26868k66878m57J73189q9055l68094j34469
$$ 71456 -142501 -97616 240869 495852 368984 102106 101649 274838 185783 -182311 -316780
34003c16780L77099M94059R9300k67185k48499q0495p9132j81583j93608j43647
$$ -316780 60319 554378 653678 386493 137994 57499 -21633 -203216 -396824 -540471
33993e40471j39286j08047N4182K16001J50560j02574k36973o9321K30409L62397
$$ -540471 -679757 -787804 -733622 -517621 -367061 -469635 -706608 -775929 -545520 -183123
33983a83123K40098K4015j18393j71527j93308j89782j32439l8748M4341J09956
$$ -183123 56975 80990 -37403 -208930 -402238 -592020 -724459 -763207 -718866 -608910
33973f08910J72722K03663J63113Q2396K3960k8345j33471k47846k42693r7568
$$ -608910 -436188 -232525 -69412 12984 36944 8599 -124872 -372718 -615411 -712979
33963g12979M9777R6702R1268Q9900M3938o2145r3951N2468K42294K47172N3054
$$ -712979 -663202 -566500 -475232 -385332 -341394 -403539 -497490 -445022 -202728 44444 97498
33952I7498j37660j78129q9180O9287K44629L03297J12133k21054l78994k13860
$$ 97498 -40162 -218291 -307471 -238184 6445 309742 421875 200821 -178173 -392033
33942c92033O5937K01339K05053K20296K22519R5301r4741j60864j02595r1193
$$ -392033 -326096 -124757 80296 300592 523111 618412 523671 362807 260212 169019
33932A69019j44936r7338N1620N2249j77285l25644j17015K42641L33491J02598
$$ 169019 24083 -73255 -21635 30614 -146671 -472315 -589330 -346689 -13198 89400
33922H9400j25767j49421q2817n4088j4771P5483J32963J24971J51142K41787
$$ 89400 -36367 -185788 -268605 -322693 -337464 -261981 -129018 -4047 147095 388882
33912C88882K61396J27427l9991j02727r1725r8746j18679j07808p4673k3819
$$ 388882 650278 777705 737714 634987 543262 444516 325837 218029 143356 119537
33902A19537N8734R6248k7843k26347k29369K0048K16996J23547p3445o5785J17266
$$ 119537 178271 274519 246676 20329 -209040 -188992 28004 151551 78106 12321 129587
33891A29587K36922K58659K98296K71358j1030m10198n13974k10895J21568J43874
$$ 129587 366509 625168 923464 1194822 1183792 773594 259620 48725 170293 314167
33881C14167j3402l4578Q9125J03802p6140k26132j25350J39588K71549J26954
$$ 314167 300765 266187 355312 459114 382974 156842 31492 171080 442629 569583
33871E69583r7012r5444J55424L51008K28132j38583m72887n93104m74341j72259
$$ 569583 472571 377127 532551 883559 1111691 973108 500221 -92883 -567224 -739483
33861g39483J52013K62219J00846q0439l4350J41251J87373R1894M5040P5473
$$ -739483 -587470 -325251 -224405 -304844 -339194 -197943 -10570 81324 126364 201837
33851B01837M5840k1797M8707K26867K44523J1178k22417k23196n8420P6880R3629
$$ 201837 247677 225880 274587 501454 745977 757155 534738 311542 253122 330002 423631
33840D23631r672j77992k47614r5336J11351Q0049j43455k02411l527J17870k4358
$$ 423631 413959 235967 -11647 -106983 4368 84417 -59038 -261449 -264976 -147106 -171464
33829a71464j29842O3115K81384J37616k19246l17466p6902J29666P6369o5301
$$ -171464 -301306 -238191 43193 180809 -38437 -355903 -432805 -303139 -226770 -292071
33819b92071j04569r8068j38240j53537n1927J15994K37037K54339J60658k533
$$ -292071 -396640 -494708 -632948 -786485 -838412 -722418 -485381 -231042 -70384 -72917
33809g2917j14033p3769L6282K2839j46343k60059j15682K24752M87982M64823
$$ -72917 -186950 -260719 -224437 -201598 -347941 -608000 -723682 -498930 -10948 453875
33799D53875K08822k2364k9001J23938K02733J04328l5903o9223m2297q6775j96992
$$ 453875 662697 640333 611332 735270 938003 1042331 1006428 937205 894908 808133 611141
33788F11141k41113j48225J4977J27977J15010j940j09100j12466n6042m2450
$$ 611141 370028 221803 236780 364757 479767 477827 368727 256261 200219 157769
33778A57769m5641M4221J75345J43351q0086k50127k04904r8459j13394j62471
$$ 157769 112128 156349 331694 475045 394959 144832 -60072 -158531 -271925 -434396
33768d34396r5942p196n9524j53958o5158J75237L11350K35481Q0369k4913o4174
$$ -434396 -530338 -537534 -597058 -751016 -816174 -640937 -329587 -94106 -13737 -38650 -102824
33757a02824m0302N982o9141l30869n63617m84800j25902K22188L88447M07304
$$ -102824 -143126 -137144 -206285 -537154 -1100771 -1585571 -1711473 -1489285 -1100838 -693534
33747f93534L03982R1785o1501J0821J60979J00624j05549q8607K25663M55840
$$ -693534 -389552 -297767 -359268 -348447 -187468 -86844 -192393 -281000 -55337 400503
33737D00503L31033M5624j31077k40933l88844m29904k17407O8215J56495Q9976
$$ 400503 731536 777160 646083 405150 16306 -413598 -631005 -562790 -406295 -316319
33727c16319R5271J87206J99316J12546N8073M6777k2390j06169m3090J42923
$$ -316319 -221048 -33842 165474 278020 336093 382870 360480 254311 211221 354144
33717C54144K15587O5842j28508j61919m9095P0202J24098J04720o878j89044
$$ 354144 569731 635573 507065 345146 296051 366253 490351 595071 588193 399149
33707C99149l23338l05631j84100r6282q9050r2674o9993p8525j31814j04466
$$ 399149 75811 -229820 -413920 -510202 -599252 -691926 -761919 -840444 -972258 -1076724
33697a076724J01399L45716L70588J50093n0524l9474N4663L7588k4396M4066
$$ -1076724 -975325 -629609 -259021 -108928 -159452 -198926 -144263 -106675 -131071 -87005
33687h7005J76411J55184O725j3669J35805J78328l2744k59968k52231j06524
$$ -87005 89406 244590 251315 237646 373451 551779 519035 259067 6836 -99688
33677i9688l8657k1210P8114J73109Q7471r1483j03875O5839J57021L5836j40711
$$ -99688 -138345 -159555 -81441 91668 179139 87656 -16219 49620 206641 242477 101766
33666A01766k15815k32798k50034j82777L3399K87476M31706M41595L33323Q3181
$$ 101766 -114049 -346847 -596881 -779658 -746259 -458783 -27077 414518 747841 831022
33656H31022k26896l45159j43690J24447J01932j77312l22713j43730R1380P3639
$$ 831022 604126 258967 115277 239724 341656 164344 -158369 -302099 -210719 -137080
33646a37080j00786j19277N3874J41108j2542k16957k22521l9597J41204K13098
$$ -137080 -237866 -357143 -303269 -162161 -174703 -391660 -614181 -653778 -512574 -299476
33636b99476K00875J27642j8055j94875k95038k39464m8286J68783K70762J88954
$$ -299476 -98601 29041 10986 -183889 -478927 -718391 -766677 -597894 -327132 -138178
33626a38178J7955n3196M6448J84378K01815R8048k8156j27185j90241j80057
$$ -138178 -120223 -173419 -126971 57407 259222 357270 329114 201929 11688 -168369
33616a68369r2026j5047q729M454Q6409J13553n0911k77114k87898n0489J75850
$$ -168369 -260395 -275442 -284171 -279717 -193308 -79755 -130666 -407780 -695678 -746167 -570317
33605e70317K10509J47065J18690R1798Q916m9128L710Q7053O3293n2870j12785
$$ -570317 -359808 -212743 -94053 -2255 6661 -42467 -38757 48296 111589 58719 -54066
33594e4066k5063J44539K36415J37786q9993k34565j65158j1982J0613p9142p3749
$$ -54066 -79129 65410 301825 439611 349618 115053 -50105 -62087 -51474 -130616 -204365
33583b04365P5074J79093J24651K0633m4116j38210k54065j96315R6222L38588
$$ -204365 -129291 49802 174453 195086 150970 12760 -241305 -437620 -341398 -2810
33573b810K58187p2r0342L8122J42287J02356L7943J8732n1305j96028k52219
$$ -2810 255377 255305 164963 203085 345372 447728 485671 504403 453098 257070 4851
33562D851j08259J03089J70932O7702n7260q7641n1973l3781l5823J7515J40406
$$ 4851 -103408 -319 170613 238315 181055 93414 41441 7660 -28163 -10648 129758
33551A29758K14131J33042j8790o1602J8296N9868N164r379P6489Q9906j03644
$$ 129758 343889 476931 458141 396539 414835 474703 479867 470488 546977 636883 533239
33540E33239l34471l28344p0668K02638K95595J83086n1918k53092k57202q5952
$$ 533239 198768 -129576 -200244 2394 297989 481075 429157 176065 -81137 -167089
33530a67089K4510o4414j83120j32347r883j3594o6752M6577K64619L15132J74798
$$ -167089 -142579 -206993 -390113 -522460 -532343 -545937 -612689 -566112 -301493 13639 188437
33519A88437J09681K22238K95791J74886j2555j32092k49575m01685m17882j78655
$$ 188437 298118 520356 816147 991033 978478 846386 596811 195126 -222756 -401411
33509d01411J27286K05724J3161k31427l03001j43037J25936K82106J94949k4667
$$ -401411 -274125 -68401 -55240 -286667 -589668 -732705 -606769 -324663 -129714 -154381
33499a54381j65555j88735j91822j42905P6564L40674L22733j0593k70791j93450
$$ -154381 -319936 -508671 -700493 -843398 -766834 -426160 -103427 -114020 -384811 -578261
33489e78261l012N28q5558j8050J28083J21726J4787J7897O4107p6938l09392
$$ -578261 -581273 -580745 -666303 -684353 -556270 -434544 -419757 -401860 -337753 -414691 -724083
33478g24083k82081K6726K30451J37668K0028J09457K16879J07171o9267l8559
$$ -724083 -1006164 -979438 -748987 -611319 -591291 -481834 -264955 -157784 -227051 -265610
33468b65610J35760J95229J34891J54953K40729J51141j49300l65581k79289l5191
$$ -265610 -129850 65379 200270 355223 595952 747093 597793 232212 -47077 -82268
33458h2268J03861R2528N1109L3087P246k7116o0371j41861k87006l65430k31039
$$ -82268 21593 114121 165230 198317 205563 178447 118076 -23785 -310791 -676221 -907260
33447i07260N5719K76178L20984K67848J82991J8530k13199l19055j34620K12089
$$ -907260 -851541 -575363 -254379 13469 196460 214990 1791 -317264 -451884 -239795
33437b39795L98718K70269o949j66193j21853J658M8856j2684q9639p9059R909
$$ -239795 158923 429192 422243 256050 134197 135855 184711 172027 82388 3329 13238
33426A3238N2491n2749k47789l52847k49130J001K25279L10457K81950K22476
$$ 13238 65729 12980 -234809 -587656 -836786 -835785 -610506 -300049 -18099 204377
33416B04377J43923r607k14202l00201j43642J00933J20150j43463l53918k00496
$$ 204377 348300 338693 124491 -175710 -319352 -218419 -98269 -241732 -595650 -796146
33406g96146J62401K97854O7573j98413j61668J02180K67288J96474M1738l1045
$$ -796146 -633745 -335891 -268318 -466731 -628399 -526219 -258931 -62457 -20719 -51764
33396e1764l8798p7193j49139j71596r5658M8166K02136L15259L22421J62825
$$ -51764 -90562 -167755 -316894 -488490 -584148 -535982 -333846 -18587 303834 466659
33386D66659j22054l48048l36630j17284R5285J53315J21029J19762J29974N4826
$$ 466659 344605 -3443 -340073 -457357 -362072 -208757 -87728 32034 162008 216834
33376B16834q4877j57414j10332l0232J738M915J9259K8463J1277n152M310J3650
$$ 216834 131957 -25457 -135789 -166021 -164283 -159368 -140109 -111646 -100369 -105521 -101211 -87561
33364h7561l981j8557J4572P6194R0807J8419q0289r3701N686R7194M3619j11197
$$ -87561 -91542 -110099 -95527 -19333 71474 89893 9604 -84097 -78411 18783 62402 -48795
33352d8795j68201l6460J34604J67154R3245N5296N8094p532j35113j85239j09995
$$ -48795 -216996 -253456 -118852 48302 141547 196843 254937 247405 112292 -72947 -182942
33341a82942k4949j7881l5922j8633p494m7857q9482o4655R079O6308P5664M4296
$$ -182942 -207891 -225772 -261694 -280327 -287821 -335678 -425160 -489815 -480736 -414428 -338764 -294468
33329b94468l802k9235p554L9206R1069J73425K72014K67595Q8152j28976k00176
$$ -294468 -298270 -327505 -335059 -295853 -204784 -31359 240655 508250 596402 467426 267250
33318B67250j77112k45664l59969k57759R2352L49829K64867L4227j5618R9047
$$ 267250 90138 -155526 -515495 -773254 -680902 -331073 -66206 -31979 -47597 51450
33308E1450J18284k1899j27086q2042m450k9527j17652j35879l3137J05603J39891
$$ 51450 169734 147835 20749 -61293 -65743 -95270 -212922 -348801 -381938 -276335 -136444
33297a36444J7909j42042j73313q0416k6462o4469m3463J18699K44643J51442
$$ -136444 -118535 -260577 -433890 -514306 -540768 -605237 -648700 -530001 -285358 -133916
33287a33916m4349q8694L4115J16432P0471J9826M4743O1508R847l0083O149M0351
$$ -133916 -178265 -266959 -232844 -116412 -45941 -26115 18628 80136 89983 59900 66049 106400
33275A06400k0204j28553j67293j09207k5543L2625Q5629J51569J75346Q6085
$$ 106400 86196 -42357 -209650 -318857 -344400 -311775 -226146 -74577 100769 186854
33265A86854p1355j37170l8743P7669N0512j4221J22003L99781M45329J14821
$$ 186854 115499 -21671 -60414 17255 67767 53546 175549 575330 1020659 1135480
33255A135480k19534j70237R6555J18947j62287l40399j72850Q7082R7964j11547
$$ 1135480 915946 745709 842264 961211 798924 458525 285675 372757 470721 359174
33245C59174k56855j86797K202J35710J22584N983p9006m4635M2048O0086J6600
$$ 359174 102319 -84478 -82276 53434 176018 182001 102995 58360 100408 160494 177094
33234A77094J2520N2445M1850k9432o9534o5673j03742j72663j39882J4029J24869
$$ 177094 189614 242059 283909 254477 184943 119270 15528 -157135 -297017 -282988 -158119
33223a58119R9867O3587J33247K13904J62358K2930n3483k8153K7232O7717Q1014
$$ -158119 -58252 5335 138582 352486 514844 537774 484291 456138 483370 551087 632101
33212F32101L2918p0503j38856j29145j37774k40707l36725k93746j58162m8722
$$ 632101 665019 594516 455660 326515 188741 -51966 -388691 -682437 -840599 -889321
33202h89321O7482K77100M57743L78227P9787j10121l4651O8374m9298k54494
$$ -889321 -821839 -544739 -86996 291231 371018 260897 226246 294620 245322 -9172
33192i172k45411p126K04335K58157K57081K61940K00182J26770K87372P22949
$$ -9172 -254583 -261709 -57374 200783 457864 719804 919986 1046756 1334128 2057077
33182B057077J017689P15113q9324q13565j027412q08976m67709j69191O1683
$$ 2057077 3074766 3789879 3700555 2886990 1859578 1050602 582893 413702 475385
33173D75385J71804J02225r0734k65980l26191k62277j28327k0830j0204l9728
$$ 475385 647189 749414 658680 392700 66509 -195768 -324095 -344925 -355129 -394857
33163c94857L1117K29155L94450L63408J49093j08284k80375k94752j54723J6683
$$ -394857 -363740 -134585 259865 623273 772366 664082 383707 88955 -65768 -49085
33153d9085O4585L394N441J16663J45782m0594k71641k90546r7662R9855J77678
$$ -49085 15500 18894 24335 140998 286780 246186 -25455 -316001 -413663 -313808 -136130
33142a36130J54114N7605o7824r5781M6048K19525K30583Q6482o4670j69209k52956
$$ -136130 17984 75589 7765 -88016 -41968 177557 408140 494622 429952 260743 7787
33131G787k60077j33941O393Q620m7732J9585J50930J17308p6341j69896o6566
$$ 7787 -252290 -386231 -379838 -371218 -418950 -399365 -248435 -131127 -207468 -377364 -443930
33120d43930L2573p907n0374L9447J68165K12187K15307K32009J68300m8392k86623
$$ -443930 -411357 -419264 -469638 -430191 -262026 -49839 165468 397477 565777 517385 230762
33109B30762l59354k53557r2617L3992J06889J35957J65315K39954L19033L04658
$$ 230762 -128592 -382149 -474766 -440774 -333885 -197928 -32613 207341 526374 831032
33099H31032J71848k8192k71431n24693o39224m78700j56435O0005R8726J31121
$$ 831032 1002880 974688 703257 178564 -460660 -939360 -1095795 -1035790 -937064 -805943
33089h05943K53518L47563K96889J29416q5543k71726k85358p1702J36085P3381
$$ -805943 -552425 -204862 92027 221443 135900 -135826 -421184 -492886 -356801 -283420
33079b83420j20897q4545J59938K19573O826j06751L6962R4610j33701l00269
$$ -283420 -404317 -488862 -328924 -109351 -102525 -209276 -172314 -77704 -211405 -511674
33069e11674j16949J18235N2309r0500P2045L79013M12457K18138J51255J97218
$$ -511674 -628623 -510388 -458079 -548579 -476534 -97521 314936 533074 684329 881547
33059H81547N7002k03053k06936M2088J18378j16936l02352j88451K1190R4965
$$ 881547 938549 735496 528560 570648 689026 572090 269738 81287 102477 197442
33049A97442J02234J29677N1185j94961l92902l26100n8744K04973L52064L51320
$$ 197442 299676 429353 480538 285577 -107325 -433425 -492169 -287196 64868 416188
33039D16188K10895L9359k0551K4244N2225L5171J7492o7054k99198n18190m54467
$$ 416188 627083 666442 645891 670135 722360 757531 775023 707969 408771 -109419 -563886
33028e63886j32821J39533K03434J79315J62941J12028O7888J52857K85490K32819
$$ -563886 -696707 -557174 -353740 -174425 -11484 100544 168432 321289 606779 839598
33018H39598J8095p0028L6192N7500j39636k95222j88948J5340P6057K8030L977
$$ 839598 857693 787665 823857 881357 741721 446499 257551 272891 348948 376978 380955
33007C80955k9503j20145j44883j1042J44105J54910N8682l1241r4483j07773
$$ 380955 351452 231307 86424 75382 219487 374397 433079 401838 307355 199582
32997A99582L162J72152J82177l632j36429n6732P4148O9953k0316j03448j95921
$$ 199582 202744 374896 557073 553441 417012 360280 434428 504381 484065 380617 184696
32986A84696k16146L3122M47246N48925J39897l15741l14258n664J33873L3260
$$ 184696 -31450 1672 448918 997843 1137740 821999 507741 502077 635950 669210
32976F69210l3540j5928r1436k28980k27279j21049j10099j42998q232K02121
$$ 669210 635670 619742 528306 299326 72047 -49002 -159101 -302099 -310331 -108210
32966a08210J72434q9611k30075j15836L104k7334m4432N1866R2912j7431r8194
$$ -108210 64224 -25387 -255462 -371298 -368194 -395528 -439960 -388094 -295182 -312613 -410807
32955d10807j4442Q8208N8030j2997K945M5499L6057O4711K12732L49106K87039
$$ -410807 -425249 -337041 -279011 -292008 -289063 -243564 -207507 -142796 69936 419042 706081
32944G06081L4903k37148l79192l31379j42458J3903j3323j33031j07223Q8681
$$ 706081 740984 503836 124644 -206735 -349193 -335290 -348613 -481644 -588867 -500186
32934e00186K13396J42953O0068J21872J77472K6000k23001k86523j04561J14232
$$ -500186 -286790 -143837 -83769 38103 215575 241575 18574 -267949 -372510 -258278
32924b58278J87012J19328J2075m1646R481J20428J50475J7648j73512k41246
$$ -258278 -71266 48062 60137 18491 27972 148400 298875 316523 143011 -98235
32914i8235j32328M7338J60738J35980m089j34484j09141O9918K11445J39608
$$ -98235 -230563 -183225 -22487 113493 109404 -25080 -134221 -64303 147142 286750
32904B86750r7069k83726k68754q4289J15452J81591P8109q6197j60311j04821
$$ 286750 189681 -94045 -362799 -447088 -331636 -150045 -71936 -158133 -318444 -423265
32894d23265N51R5260J86996K46568J81420j8262k12338k68291j95652n6673J35843
$$ -423265 -422714 -327454 -140458 106110 287530 269268 56930 -211361 -407013 -463686 -327843
32883c27843L27427L57371J53183r0776j22727Q839J4438j94078l36638j54100
$$ -327843 -416 356955 510138 419362 296635 305474 319912 125834 -210804 -364904
32873c64904K04007L59875J91027o0492j46590q4496j5909K2052N7117M6317m8789
$$ -364904 -160897 198978 390005 329513 182923 98427 82518 104570 161687 208004 159215
32862A59215j28530p8369K0981N250p9244l2760J30479J55279k2642j20417L1737
$$ 159215 30685 -47684 -26703 -21453 -100697 -133457 -2978 152301 129659 9242 40979
32851D0979J64619j0436k89753k52030R2325L23148K36380N3036k5108q0351j89021
$$ 40979 205598 195162 -94591 -346621 -254296 68852 305232 358268 333160 252809 63788
32840F3788k16394q3064L8283n718r2659l8147J01753J35288K1720j10453j38363
$$ 63788 -152606 -235670 -197387 -203105 -295764 -333911 -232158 -96870 -75150 -185603 -323966
32829c23966j9450K00174L51010K46927n8764k57977j51238J07186K55228K66889
$$ -323966 -343416 -143242 207768 454695 395931 137954 -13284 93902 349130 616019
32819F16019K81176L06349K00885q4959m05476n60882m66094k10995k370J4075
$$ 616019 897195 1203544 1404429 1319470 913994 353112 -112982 -323977 -326347 -312272
32809c12272r2233j40233r3382o6703p0732L2937K45018L34748J77313k5417l8983
$$ -312272 -404505 -544738 -638120 -704823 -775555 -742618 -497600 -162852 14461 -10956 -49939
32798d9939P2235R7627l317j34809k52162l04904j57841J87584M36473L30064
$$ -49939 22296 119923 116606 -18203 -270365 -575269 -733110 -545526 -109053 221011
32788B21011K0293j45528j02976n1539o0497j9780O3858N4232k6389q488R4346
$$ 221011 241304 95776 -7200 -58739 -119236 -139016 -75158 -20926 -47315 -55803 38543
32777C8543O7444j28766k46562j14225J27278K55835K31967J33566J2531q3522
$$ 38543 105987 -22779 -269341 -383566 -256288 -453 231514 365080 377611 294089
32767B94089r8182n4512l1891k3616L9704J20311J05210J6916o803L7720O942
$$ 294089 195907 141395 109504 85888 125592 245903 351113 368029 361226 398946 405888
32756D05888j18831j76691r0077K0251N5680N8688N7192R762m2170q04O4812j4471
$$ 405888 287057 110366 20289 40540 96220 154908 212100 221862 179692 178888 243700 229229
32744B29229j72934j55104L1564P7117q5126j05487J77260L73976J35401k57766
$$ 229229 56295 -98809 -67245 9872 -75254 -180741 -3481 370495 505896 248130
32734B48130l29253j45665j19888k67098k09413J30028L72691K91558J10718O9058
$$ 248130 -81123 -226788 -346676 -613774 -823187 -693159 -320468 -28910 81808 150866
32724A50866Q1742R476o7381m5575j0361n3235q5268j6597N0165j4204j36694
$$ 150866 232608 242084 174703 129128 118767 65532 -19736 -36333 13832 -372 -137066
32713a37066j42925J642J75793K55150J93436K7608j30091j73202j05666N483
$$ -137066 -279991 -278349 -102556 152594 346030 373638 243547 70345 -35321 -29838
32703b9838J50501L11389L27117O1615k84562l21064k0732J71474m5497l89884
$$ -29838 120663 432052 759169 820784 536222 215158 194426 365900 320403 -69481
32693f9481m30536k15081j23305k43926k86571q9874J47232K14411J70712J55258
$$ -69481 -500017 -715098 -838403 -1082329 -1368900 -1458774 -1311542 -1097131 -926419 -771161
32683g71161J54306J04076M8046M3234M2929O209L959P9240J15489O235j29380
$$ -771161 -616855 -512779 -464733 -421499 -378570 -372361 -368402 -289162 -173673 -167438 -296818
32672b96818q7156J06105K11762J25429J4733M8636J58965J85498J26464Q9475
$$ -296818 -383974 -277869 -66107 59322 74055 122691 281656 467154 593618 683093
32662F83093P2544k4811j82838k28505p5616J31019J89379P0326r6327j87089
$$ 683093 755637 730826 547988 319483 243867 374886 564265 634591 538264 351175
32652C51175j61000m4252P3246Q4819K59k4207J11427K74996K53425M4459j40756
$$ 351175 190175 145923 219169 303988 304247 280040 391467 666463 919888 964347 823591
32641H23591j55222n4609M9372J24143J62999J31466L2570p3258j58708k40233
$$ 823591 668369 613760 663132 787275 950274 1081740 1114310 1041052 882344 642111
32631F42111k73514j75872N42P8678J9782J782J11220J44934p7421l52682l19750
$$ 642111 368597 192725 193267 271945 291727 293509 404729 549663 472242 119560 -200190
32620b00190J5321K68183K10282L9272K4067J25536J36768K5637o6249p5657p5029
$$ -200190 -184869 83314 293596 332868 356935 482471 619239 644876 578627 502970 427941
32609D27941j06651j23685j05009r5762j06486q2029r458M0614L5811N8712J77373
$$ 427941 321290 197605 92596 -3166 -109652 -191681 -201139 -160525 -124714 -66002 111371
32598A11371K95235K39214k462k23762k20070q512K05216K34087N0702k23927
$$ 111371 406606 645820 643358 419596 199526 191014 396230 630317 681019 457092
32588D57092m13427m03501k32916n5900K6977O5028J36670K00845J71269Q5294
$$ 457092 43665 -359836 -592752 -648652 -621675 -556647 -419977 -219132 -47863 37431
32578C7431N3653O0267j6993j62787j88854k0509J55634J51265L2915k9510l7291
$$ 37431 91084 151351 134358 -28429 -217283 -237792 -82158 69107 102022 72512 35221
32567C5221r9039j84057j51309K160J11883P7392k5721p9983m8491M3302J37350
$$ 35221 -63818 -247875 -399184 -397024 -285141 -207749 -233470 -313453 -361944 -318642 -181292
32556a81292J56083Q4426J7549L0042M9650j5213q9930m2220P5043Q2177m9934
$$ -181292 -25209 59217 76766 106808 156458 141245 51315 9095 84138 166315 116381
32545A16381j73261j94332j34137J0918K28762L33533J37897j90383k58051m530
$$ 116381 -56880 -251212 -385349 -374431 -145669 187864 325761 135378 -122673 -127203
32535a27203K02610J48450P9095K14914L14319N9527l81171n58169l58400o4998
$$ -127203 75407 223857 302952 517866 832185 891712 510541 -47628 -406028 -471026
32525d71026R9420J48686J15144o376j00585j4688J77099K40770J27721J9761
$$ -471026 -371606 -222920 -107776 -114152 -214737 -229425 -52326 188444 316165 335926
32515C35926K1867M0471j5108j22360k43360l30293k55363L3363L07861K74974
$$ 335926 357793 398264 383156 260796 17436 -312857 -568220 -534857 -226996 47978
32505D7978k979j75268j01821J3573K4753M3100J33640J38831k6166j79211j58890
$$ 47978 44999 -130269 -232090 -218517 -193764 -150664 -17024 121807 95641 -83570 -242460
$$ [...]
##END NTUPLES=NMR SPECTRUM
##END=
