##TITLE=31Pdec_13-2025
 CDCl3, 24 sc
 20.1.2025
##JCAMPDX= 6.0         $$ Bruker NMR JCAMP-DX V2.0
##DATA TYPE= NMR SPECTRUM
##DATA CLASS= NTUPLES
##ORIGIN= UXNMR, Bruker Analytische Messtechnik GmbH
##OWNER= root
$$ XWIN-NMR		Version 3.5
$$ Mon Jan 20 14:15:22 2025 Russian Standard Time (UT+4h)  she@DPX200
##.OBSERVE FREQUENCY= 81.013821
##.OBSERVE NUCLEUS= ^31P
##.ACQUISITION MODE= SIMULTANEOUS
##.ACQUISITION SCHEME= undefined
##.AVERAGES= 24
##.DIGITISER RES= 17
##SPECTROMETER/DATA SYSTEM= spect
##.PULSE SEQUENCE= zgpg30
##.SOLVENT NAME= CDCl3
##.SHIFT REFERENCE= (INTERNAL, CDCl3, 0, 198.062)
##AUDIT TRAIL= $$ (NUMBER, WHEN, WHO, WHERE, WHAT)
$$ ##TITLE= Audit trail, XWIN-NMR		Version 3.5
$$ ##JCAMPDX= 5.01
$$ ##ORIGIN= Bruker BioSpin GmbH
$$ ##OWNER= she
$$ F:/spectra/data/she/nmr/P31/2/pdata/1/auditp.txt
$$ ##AUDIT TRAIL=  $$ (NUMBER, WHEN, WHO, WHERE, WHAT)
(   1,<2025-01-20 14:14:08.89 +0400>,<she>,<DPX200>,
      <created by zg, POWCHK disabled, PULCHK disabled
       configuration hash MD5:
       00 E9 B6 7A A2 85 ED C7 34 08 36 98 17 FE 4E 26
       data hash MD5: 32K
       AC E4 EB CA 66 DC 9D F5 47 5C 17 05 85 29 F6 AA>)
(   2,<2025-01-20 14:14:11.68 +0400>,<she>,<DPX200>,
      <Start of raw data processing
       efp BC_mod = 2 LB = 1.5 FT_mod = 6 PKNL = 1 PHC0 = 1749.489 PHC1 = 87.4864 SI = 64K 
       data hash MD5: 64K
       93 46 E4 55 31 C6 3E B9 29 90 E3 8A 88 9A 57 41>)
(   3,<2025-01-20 14:14:32.00 +0400>,<she>,<DPX200>,
      <pk PHC0 = 17.9077 PHC1 = 0 
       data hash MD5: 64K
       E3 54 9A C6 F5 39 7A C2 8E 90 40 D6 DA 8E B0 A1>)
(   4,<2025-01-20 14:14:35.92 +0400>,<she>,<DPX200>,
      <abs ABSG = 5 
       data hash MD5: 64K
       A7 65 0E 89 E2 27 67 58 6F 97 A9 2C 90 55 84 87>)
$$ ##END=
$$ 
$$ hash MD5
$$ 95 F5 D6 CF 1F EC D4 8C FA 54 E9 28 2F 3C C5 E4
##$RELAX= 
##$RELAX= 
##$RELAX= 
##$RELAX= 
##$RELAX= 
##$RELAX= 
##$RELAX= 
##$RELAX= 
$$ Bruker specific parameters
$$ --------------------------
##$DU= <F:/spectra>
##$EXPNO= 2
##$NAME= <P31>
##$PROCNO= 1
##$TYPE= <nmr>
##$USER= <she>
##$AMP= (0..31)
100 100 100 100 100 100 100 100 100 100 100 100 100 100 100 100 100 100 
100 100 100 100 100 100 100 100 100 100 100 100 100 100 
##$AQSEQ= 0
##$AQ_mod= 1
##$AUNM= <au_zg>
##$AUTOPOS= <>
##$BF1= 81.014009
##$BF2= 200.13
##$BF3= 200.13
##$BF4= 200.13
##$BF5= 200.13
##$BF6= 200.13
##$BF7= 200.13
##$BF8= 200.13
##$BYTORDA= 1
##$CFDGTYP= 0
##$CFRGTYP= 5
##$CHEMSTR= <none>
##$CNST= (0..31)
1 1 145 1 1 1 1 1 1 1 1 1 1 1 1 1 1 1 1 1 1 1 1 1 1 1 1 1 1 1 1 1 
##$CPDPRG= <waltz16>
##$CPDPRG1= <>
##$CPDPRG2= <waltz16>
##$CPDPRG3= <>
##$CPDPRG4= <mlev>
##$CPDPRG5= <mlev>
##$CPDPRG6= <mlev>
##$CPDPRG7= <mlev>
##$CPDPRG8= <mlev>
##$CPDPRGB= <>
##$CPDPRGT= <>
##$D= (0..31)
0 1 0 0 0 0 0 0 0 0.06 0 0.03 2e-05 3e-06 0 0 0.0002 0 0 0 0 0 0 0 0 0 
0 0 0 0 0 0 
##$DATE= 1737368048
##$DBL= (0..7)
120 120 120 11 120 120 24 19 
##$DBP= (0..7)
150 150 150 150 150 150 150 150 
##$DBP07= 0
##$DBPNAM0= <>
##$DBPNAM1= <>
##$DBPNAM2= <>
$$ [...]
##$SUBNAM3= <"">
##$SUBNAM4= <"">
##$SUBNAM5= <"">
##$SUBNAM6= <"">
##$SUBNAM7= <"">
##$SUBNAM8= <"">
##$SUBNAM9= <"">
##$SW= 400.765351723535
##$SWIBOX= (0..15)
0 1 3 0 0 0 0 0 0 0 0 0 0 0 0 0 
##$SW_h= 32467.5324675325
##$TD= 32768
##$TD0= 1
##$TE= 0
##$TE2= 300
##$TE3= 300
##$TEG= 300
##$TL= (0..7)
0 120 53 12 22 120 120 120 
##$TP= (0..7)
150 150 150 150 150 150 150 150 
##$TP07= 0
##$TPNAME0= <>
##$TPNAME1= <>
##$TPNAME2= <>
##$TPNAME3= <>
##$TPNAME4= <>
##$TPNAME5= <>
##$TPNAME6= <>
##$TPNAME7= <>
##$TPOAL= (0..7)
0.5 0.5 0.5 0.5 0.5 0.5 0.5 0.5 
##$TPOFFS= (0..7)
0 0 0 0 0 0 0 0 
##$TUNHIN= 0
##$TUNHOUT= 0
##$TUNXOUT= 0
##$USERA1= <user>
##$USERA2= <user>
##$USERA3= <user>
##$USERA4= <user>
##$USERA5= <user>
##$V9= 5
##$VALIST= <valist>
##$VCLIST= <CCCCCCCCCCCCCCC>
##$VD= 0
##$VDLIST= <DDDDDDDDDDDDDDD>
##$VPLIST= <PPPPPPPPPPPPPPP>
##$VTLIST= <TTTTTTTTTTTTTTT>
##$WBST= 1024
##$WBSW= 4
##$XGAIN= (0..3)
0 0 0 0 
##$XL= 0
##$YL= 0
##$YMAX_a= 19012
##$YMIN_a= -23102
##$ZGOPTNS= <>
##$ZL1= 120
##$ZL2= 120
##$ZL3= 120
##$ZL4= 120
##$ABSF1= 198.0616
##$ABSF2= -202.7028
##$ABSG= 5
##$ABSL= 3
##$ALPHA= 0
##$AQORDER= 0
##$ASSFAC= 0
##$ASSFACI= 0
##$ASSFACX= 0
##$ASSWID= 0
##$AUNMP= <proc_1d>
##$AZFE= 0.1
##$AZFW= 0.5
##$BCFW= 0
##$BC_mod= 2
##$BYTORDP= 0
##$COROFFS= 0
##$CY= -3
##$DATMOD= 1
##$DC= 0
##$DFILT= <>
##$DTYPP= 0
##$F1P= 0
##$F2P= 0
##$FCOR= 1
##$FTSIZE= 65536
##$FT_mod= 6
##$GAMMA= 0
##$GB= 0
##$INTBC= 1
##$INTSCL= 9.790993e-09
##$ISEN= 30
##$LB= 1.5
##$LEV0= 0
##$LPBIN= 0
##$MAXI= 10000
##$MC2= 0
##$MEAN= 0
##$ME_mod= 0
##$MI= 50
##$NCOEF= 0
##$NC_proc= -4
##$NLEV= 6
##$NOISF1= 182.463
##$NOISF2= 159.3651
##$NSP= 0
##$NTH_PI= 0
##$NZP= 0
##$OFFSET= 198.0616
##$PC= 4
##$PHC0= 1767.397
##$PHC1= 87.4864
##$PH_mod= 1
##$PKNL= yes
##$PPARMOD= 0
##$PSCAL= 0
##$PSIGN= 0
##$REVERSE= no
##$SF= 81.0140089999434
##$SI= 65536
##$SIGF1= 159.3651
##$SIGF2= -187.1042
##$SINO= 113.3802
##$SIOLD= 16384
##$SREGLST= <1H.CDCl3>
##$SSB= 0
##$STSI= 65536
##$STSR= 0
##$SW_p= 32467.5324675325
##$SYMM= 0
##$S_DEV= 0
##$TDeff= 32768
##$TDoff= 0
##$TI= <>
##$TILT= no
##$TM1= 0
##$TM2= 0
##$TOPLEV= 0
##$USERP1= <user>
##$USERP2= <user>
##$USERP3= <user>
##$USERP4= <user>
##$USERP5= <user>
##$WDW= 1
##$XDIM= 65536
##$YMAX_p= 291060294
##$YMIN_p= -8112248
$$ End of Bruker specific parameters
$$ ---------------------------------
##NTUPLES= NMR SPECTRUM
##VAR_NAME=  FREQUENCY,     SPECTRUM/REAL,   SPECTRUM/IMAG
##SYMBOL=    X,             R,               I
##VAR_TYPE=  INDEPENDENT,   DEPENDENT,       DEPENDENT
##VAR_FORM=  AFFN,          ASDF,            ASDF
##VAR_DIM=   65536,         65536,           65536
##UNITS=     HZ,            ARBITRARY UNITS, ARBITRARY UNITS
##FACTOR=    0.49542278885378, 1,            1
##FIRST=     16045.7642231865, 0,            0
##LAST=      -16421.768244346, 0,            0
##MIN=       -16421.768244346, -8112248,     0
##MAX=       16045.7642231865, 291060294,    0
$$ Real data points
##PAGE= N=1
##DATA TABLE= (X++(R..R)), XYDATA
$$ [...]
39639e57123j27994N8629J46459J04987N0418N8615P6358N2310K8108L0023q189
39628h7399j14856j75004p7160J03654J92036J37787M3274l560j6315m3801j06156
39617a47500j89596k39372j83436k7722J10178J33162Q4487N8878N4387J6036
39607c30498k9522j2592M1433N0808L3379P3530J37561R1628o2278j39370l8345
39596a84266R3401O8450q1711j77353j36910k9226O3397J10382R1034M737p8485
39585b56550p1591J7182R8138J25497J33414J41310J06046L139j05765j35704
39575E5116q0368j2809L653k2809l8471j2342L4210O5292P8906R2411Q9080K7646
39563B79515p5739j25567n5700O8767J13922L1766r5129j57247j19898k6088N1066
$$ plain form
39639 -557123 -685117 -626488 -480029 -375042 -324624 -266009 -189651 -137341 -109233 -79210 -87399
39628 -87399 -202255 -377259 -454419 -350765 -158729 -20942 22332 18772 2457 -41344 -147500
39617 -147500 -337096 -576468 -759904 -787626 -677448 -544286 -459799 -400921 -346534 -330498
39607 -330498 -360020 -372612 -331179 -280371 -246992 -173462 -35901 55727 -6551 -145921 -184266
39596 -184266 -90865 -22415 -104126 -281479 -418389 -447615 -384218 -273836 -182802 -178065 -256550
39585 -256550 -328141 -310959 -212821 -87324 46090 187400 293446 296585 190820 55116
39575 55116 -25252 -38061 -34408 -57217 -95688 -108030 -73820 -8528 70378 162789 251869 279515
39563 279515 203776 78209 22509 91276 205198 236964 141835 -15412 -135310 -161398 -110332
39552a10332N4845q909o5924n6714k0929l8406q8175n5085R1013K15595J89291
39541A06270O5093o627Q808J1956n2770j15217r8024k4113L5209N2142M2322K5729
39529E0778K1797L7263L4711l1981j25979j39033l7029P2194P4266m476m9689
39518i7178j0297P2413J44287J71285J27356K7986n0661o1184o2164j22003j82373
39507d2533j29260J5876J03286O7956R637K0057N0119J8146m9120p2883n1533
39496f0252m2660n6542m9723o719L5173L6753l975n0037m4345L7104J33574J47505
39484G5856O6385j7904l6941k4612l0513l4850j2753q520o0525j08903p1414K7897
39472b36797R5935J02340Q2088L9502m2476j12035q3116K6494R3835N4246k2090
$$ plain form
39552 -110332 -55487 -64396 -130320 -187034 -207963 -246369 -334544 -389629 -298616 -83021 106270
39541 106270 171363 164736 173544 185500 132730 17513 -80511 -104624 -69415 -17273 25049 50778
39529 50778 72575 109838 144549 112568 -13411 -152444 -189473 -117279 -43013 -47489 -97178
39518 -97178 -107475 -35062 109225 280510 407866 435852 385191 324007 261843 139840 -42533
39507 -42533 -171793 -155917 -52631 15325 24962 45019 95138 113284 64164 -8719 -60252
39496 -60252 -102912 -159454 -209177 -215896 -180723 -143970 -147945 -197982 -242327 -205223 -71649 75856
39484 75856 142241 124337 87396 62784 32271 -2579 -15332 -23852 -84377 -193280 -264694 -236797
39472 -236797 -140862 -38522 43566 83068 40592 -71443 -154559 -128065 -34230 20016 -2074
39461b074m7133k4669l081N977R678o475m4855o0943j5508N8982Q4030K0213q9598
39448a15456j50519r1271O1077J84158J76754P1161j4005k4365q845j1219j3228
39437F4242j2590n8314j45250j63530m9286Q0447O3712o8400j22111j3793J21043
39426c03830J34066N4138j0128n0990j21079j77034j13676M9578J56459J25766
39416b56730N7633O7669J20714J17275N8955J6276p659n3420p9749o530J13487
39405A47921J15666l6156j63877j11028M4344J16467O7879J2545R188r171q9307
39394A04471j57903j19370J1543J26279J42058O9820k0880p4674q4242o7849l7327
39383a08074m280K231l5587q0751p3367j4623K8604J5820k1676m3238m7755l7107
$$ plain form
39461 -2074 -49207 -73876 -76957 -70980 -61302 -67777 -112632 -173575 -189083 -130101 -46071 -25858 -115456
39448 -115456 -265975 -357246 -296169 -112011 64743 135904 121899 97534 88689 77470 64242
39437 64242 51652 -6662 -151912 -315442 -364728 -284281 -220569 -288969 -411080 -424873 -303830
39426 -303830 -169764 -115626 -125754 -176744 -297823 -474857 -588533 -538955 -382496 -256730
39416 -256730 -199097 -131428 -10714 106561 165516 181792 174133 120713 40964 34434 147921
39405 147921 263587 227431 63554 -47474 -3130 113337 181216 193761 202949 193778 104471
39394 104471 -53432 -172802 -161259 -34980 107078 176898 156018 81344 -2898 -70747 -108074
39383 -108074 -112354 -110123 -145710 -226461 -299828 -314451 -285847 -270027 -291703 -334941 -382696 -419803
39371d19803M945O4915R5000Q9991R6966J12961O5632m7656j07256m7207J8887
39360g2625l0379j15907p7063N9671J10230J8361o7907l5629L8605L7511k4013
39349a59145n6382l1789J5465N8081P7751M8634k5126r0622j00510n4167K7109
39338b90701J16387J63737J26625L7036k3331l3293n2185j09282j45917j03406
39328c14330o091Q1692J27813J26556P2693j7684r6153j22566r2823k1012O6952
39317a94953J21845J05751M6515J0615J9753M0307M5147L0289j1995o9893q5658
39306E7723l2206J3777k6006q9581o1908K1770J9944o6569p5376M3379J22927
39295g2126M0060r1777j11898m9633k8976n2060l4820K1038M5115L8342N8679
$$ plain form
39371 -419803 -414858 -349943 -254943 -164952 -67986 44975 110607 62951 -44305 -91512 -72625
39360 -72625 -103004 -218911 -295974 -236303 -126073 -107712 -175619 -211248 -172643 -135132 -159145
39349 -159145 -215527 -247316 -231851 -173770 -96019 -47385 -72511 -163133 -263643 -317810 -290701
39338 -290701 -174314 -10577 116048 153084 129753 96460 44275 -65007 -210924 -314330
39328 -314330 -320421 -238729 -110916 15640 88333 70649 -25504 -148070 -240893 -261905 -194953
39317 -194953 -73108 32643 79158 89773 109526 149833 194980 225269 213274 143381 57723
39306 57723 25517 39294 13288 -76293 -138201 -116431 -96487 -163056 -238432 -195053 -72126
39295 -72126 -32066 -123843 -235741 -285374 -314350 -366410 -401230 -380192 -335077 -296735 -238056
39284b38056R6888Q4977J2060n9291p2305o989J20550K23586J78908j7512j94884
39273A27932k02328r5344k9838m2425n6555m5843m9319n2567R309J28066K07868
39262a01044J81271O7063p0036j52772j26438l3742P3o4257j01268j0429J05069
39251c06510Q8516j7718l9741N4021J27419J07990O4114M3309N145n6045p5515
39240e015m1350j8164k0358M689M5393K1924n6553p7746r333M9675M5861M8110
39228a2867Q8898Q4094o633q1506n4101J6941N2370Q3306J47711J69357P0198
39217E57768p8157j41080j01914m8416k9610k6493k2835j5464J0636M6962M5176
39206A96573m480l8329k2320j3395m7226n4987J2578O7532J2818q5113r0806j4772
$$ plain form
39284 -238056 -141168 -56191 -44131 -103422 -175727 -182716 -62166 161420 340328 322816 127932
39273 127932 -74396 -169740 -199578 -242003 -298558 -344401 -393720 -446287 -436978 -308912 -101044
39262 -101044 80227 147290 77254 -75518 -201956 -235698 -235625 -299882 -401150 -411579 -306510
39251 -306510 -217994 -235712 -275453 -221432 -94013 13977 78091 121400 126545 70500 -5015
39240 -5015 -46365 -64529 -84887 -80198 -34805 -12881 -69434 -147180 -156513 -106838 -60977 -12867
39228 -12867 76031 160125 153492 71986 17885 34826 87196 170502 318213 487570 557768
39217 557768 479611 338531 236617 188201 158591 132098 109263 93799 104435 151397 196573
39206 196573 192093 153764 131444 118049 70823 15836 28414 95946 108764 23651 -67155 -81927
39194h1927J6376k3057k9531L4886P1850J1601p8703j09145q6235n3366k67Q7042
39182b40476J46179J00388j6420p2190J1190J61132K30618J51056r313j28784
39172C33380j47907r5800l2395J384r631n2352q4628p4420m3871l5813l8383K230
39160b78206Q5493J35774J01454J8334m9823p5828n2248J8466Q3067O3119l1842
39149A7760r2149o0549j2254j6783j6528N6096J26447P7356n0158j00030k7166
39138i7958N6533O3867K7950l666m2396q3275o9997L370M8117P132m9857l2106
39126a72286L0729L8408k1377n1894J1600J07807J25998M1733n9792q8896m5786
39115h3756P709L9713O2514O5871J1239p9115j03346j3209R2203Q3945k8947j32493
$$ plain form
39194 -81927 -65551 -88608 -118139 -83253 -11403 198 -78505 -187650 -273885 -327251 -327518 -240476
39182 -240476 -94297 6091 -10329 -82519 -71329 89803 320421 471477 462164 333380
39172 333380 185473 89673 57278 58662 49031 -3321 -87949 -162369 -206240 -242053 -280436 -278206
39160 -278206 -192713 -56939 44515 62849 13026 -62802 -115050 -96584 -13517 49602 17760
39149 17760 -74389 -134938 -147192 -163975 -180503 -124407 2040 79396 29238 -70792 -97958
39138 -97958 -41425 22442 50392 46726 4330 -78945 -148942 -145572 -97455 -90323 -140180 -172286
39126 -172286 -141557 -103149 -124526 -176420 -164820 -57013 68985 110718 50926 -37970 -83756
39115 -83756 -76047 -36334 26180 92051 103290 24175 -79171 -92380 -177 83768 54821 -77672
39103g7672j66839j52316r2341K1852J17650R4694r94K100J47733K53821J59554
39092C07242m3119j42814q9633r481J0367P291K4864L8443K3302p68k2670n9768
39080D3256r8639q9514l0401J1262k212k0250J0453N6395M9025j0900n7143m4712
39068a83380J5739R2754J54114J61180R3962r650p4660o0822M504O4734Q5208
39057C43683O8712M0335J7425j2420o6824j16089r9039k3275O032p3295j57517
39046g2272r9229O6453J47462O5950l7293l2175R402l2957j03470o4563N2579
39035a00113P8506k5030j05954o2889J8381L1881J1068L1558O9422O2554L0935
39024D0319K9564L9505O871m8719n8534j5002K2112J6646r313j7350J8676R9260
$$ plain form
39103 -77672 -244511 -396827 -489168 -467316 -349666 -254972 -255966 -253866 -106133 147688 307242
39092 307242 264123 121309 31676 22195 32562 39853 64717 103160 126462 125694 103024 43256
39080 43256 -55383 -144897 -175298 -164036 -166248 -186498 -176045 -119650 -70625 -81525 -138668 -183380
39068 -183380 -167641 -74887 79227 240407 334369 324719 250059 189237 193741 258475 343683
39057 343683 412395 452730 470155 457735 390911 274822 175783 152508 158540 85245 -72272
39046 -72272 -171501 -105048 42414 108364 71071 38896 48298 15341 -88129 -152692 -100113
39035 -100113 -21607 -46637 -152591 -215480 -197099 -165218 -154150 -122592 -53170 9384 40319
39024 40319 69883 109388 116259 67540 9006 -5996 16116 32762 23449 6099 24775 124035
39012A24035J67863J31221l0685k07479k68280j97679p4041L6000R4831O4404
39002a59810m1693j09888l6003J24573K08516J44297J5519p0948q8687n8474m274
38991g6872L5562K9901P223J9159M6832K5123l3427m0028J7779L3683m9020j25419
38979a09504p4055N5523J04806K4498p0468o7246Q685N4840L0995j3179k6439
38968h1544j6884j1005K226L9551O0912J1307p0743p5593J0030N7793l666m9430
38956a27046N1487J90393J50749m3649j32291j2082R4056j9318k17240k24460
38946b89401k2256J58020J71704Q7449j369q7141j38539o8600J03219J99368J01152
38935B13606q0321j54238r4379k1754P10K6820R2333J42834J24934O1153k654
$$ plain form
39012 124035 291898 423119 392434 184955 -83325 -281004 -355045 -319045 -224214 -159810
39002 -159810 -201503 -311391 -347394 -222821 -14305 129992 145511 74563 -14124 -72598 -76872
38991 -76872 -41310 -11409 -4186 14973 61805 86928 53501 13473 31252 64935 15915 -109504
38979 -109504 -183559 -128036 -23230 1268 -69200 -136446 -127761 -72921 -41926 -55105 -81544
38968 -81544 -98428 -109433 -107207 -67656 -6744 4563 -66180 -141773 -131743 -73950 -77616 -127046
38956 -127046 -75559 114834 265583 221934 89643 77561 171617 152299 -64941 -289401
38946 -289401 -311657 -153637 18067 105516 104147 17006 -121533 -190133 -86914 112454 213606
38935 213606 133285 -20953 -115332 -137086 -136376 -109556 -17223 125611 250545 311698 309044
38924C09044n4266q2166n4487J6910N0245j764o5845m2928M2297P5288K3241k5446
38912A90123q791J7834j7877r1781j27352r5580j8106P5323J38128J11332L172
38901A76425q0918n6107L2988Q6118Q4517P8949Q5848Q4038P8676P4572K0069
38890F65175j16484k41705k29185j06290k4877m3052o4671j2402P0225J20900
38880A7634J34460R7482k1455j62695j88363p3383M1688O2285O9451J42179J89535
38869C08818R6243p2663j61935j40782q5873k6760L8508M1639o9613j86221j55673
38858d14312k1139L9173L328L4795J88457K92995K13328N4853j5107j0641m8932
38847C16798j26564j31647l7763N3866O3993K0756j6276l4111m5454m7586k8835
$$ plain form
38924 309044 254778 172612 118125 135035 185280 183516 117671 74743 117040 192328 215569 190123
38912 190123 181332 199166 181289 89508 -37844 -133424 -151530 -76207 61921 173253 176425
38901 176425 95507 39400 72388 158506 243023 321972 407820 491858 570534 645106 665175
38890 665175 548691 306986 77801 -28489 -53366 -96418 -161089 -173491 -103266 17634
38880 17634 152094 249576 228121 65426 -122937 -196320 -154632 -92347 -22896 119283 308818
38869 308818 405061 332398 170463 29681 -56192 -82952 -44444 -2805 -72418 -258639 -414312
38858 -414312 -435451 -396278 -392950 -358155 -169698 123297 336625 391478 376371 365730 316798
38847 316798 190234 58587 20824 74690 138683 159439 143163 109052 63598 16012 -12823
38836a2823J1600N8336P6421K7119p9662j60112j27966K350J18810J30411N5688
38825A00172j9524m2405k2744J5891O5007J02260Q3877O555n6921m2888M47k7838
38813A61889j17119j37242l6451N1908j0581j53122j81008m4604J02657J22064
38803b41609M8421n419k909J8288L2148L8091K6427j0412m5913l7228K8549J18146
38791c3420J71244J41895M9742j9428p752K8191j6677j41852k21703j59907j599
38780b11266J33705J73545J21531K5699m7383n6860l4146l8907o0200l4160K8067
38769c75L3225l2616n1631M0044J25540P5727n0296j06191q2256p1387o7206J7518
38757a69904J43554J54371L1395m5937K6415J10480M5637j05991j74406j35917
$$ plain form
38836 -12823 -1223 57113 133534 160653 80991 -79121 -207087 -204737 -85927 44484 100172
38825 100172 80648 38243 15499 31390 96397 198657 282534 289089 232168 189280 189727 161889
38813 161889 44770 -92472 -128923 -77015 -87596 -240718 -421726 -466330 -363673 -241609
38803 -241609 -193188 -198607 -201516 -183228 -151080 -112989 -86562 -96974 -142887 -180115 -151566 -33420
38791 -33420 137824 279719 329461 310033 302281 330472 313795 171943 -49760 -209667 -211266
38780 -211266 -77561 95984 217515 243214 195831 138971 104825 65918 5718 -28442 -375
38769 -375 32850 234 -51397 -11353 114187 189914 139618 33427 -48829 -120216 -187422 -169904
38757 -169904 -26350 128021 159416 113479 139894 250374 296011 190020 15614 -120303
38747a20303r3284p1494n331R2923J19986N4786L398L0166O6125M2656Q707L5303
38735A63638Q4089O4783k1831q8015q8484o8408p9460j08422j06712n4419K2273
38724b80968P9989R6498Q6745P7217O5172K7238k2798k4072M8546J20922R0804
38713C65293m2582j65901j75870q0659L0858Q5141P0653J6946m0908p9123q6615
38702a02767o2815j9619J6533J7349k1044o7386p7171k5925P0889J57210J67602
38691E2856R2321Q058j355L9640K3970p1804j22868k1531J55374K36709J78360
38680E69730Q9562M8943R199q7260j96871k34329j79378p5777K7323R3146J00821
38669A65109O7646L2681o86n7759j14405r7347R33P7766M5218n6208j23779j20754
$$ plain form
38747 -120303 -213587 -285081 -290412 -197489 -77503 -22717 -19319 10847 76972 119628 128335 163638
38735 163638 247727 312510 290679 202664 114180 45772 -33688 -142110 -248822 -303241 -280968
38724 -280968 -200979 -104481 -17736 59481 124653 151891 129093 105021 153567 274489 365293
38713 365293 322711 156810 -19060 -99719 -68861 16280 86933 103879 62971 -16152 -102767
38702 -102767 -165582 -185201 -168668 -151319 -172363 -239749 -316920 -342845 -271956 -114746 52856
38691 52856 145177 153235 151880 191520 215490 143686 20818 -713 154661 391370 569730
38680 569730 659292 708235 717434 630174 433303 198974 19596 -56181 -28858 64288 165109
38669 165109 232755 265436 264750 206991 92586 -4761 -3828 73938 119156 62948 -60831 -181585
38657a81585q0088k9446K0187M6870M2036L4939M3130L8203J2333K3955J03174
38646G3708J62033R4050o4629j68250j41545l9331N7882J10793R1485l558r3141
38635G9497o8234N4698J28639O8419l7438o3943j8926L660j8116j9501K5032N2086
38623A85873O925p0333r5145m7213J0112J5462j8577l5726j5178J1717J5803J766
38611c4514j8869m3282n2953k1774K8036L0514k7021o3787j1500Q6713J39227
38600A0790J23630Q0330L3840q576k2226p958k8197j10589j57378o2073J09021
38589c9386J75357Q0587m7298q4812m3676R993N0672O7855M5742R552P509K2903
38577B54998l098m7986k3520O2384R2071K6738l2845k9473l8070r1208q4618K1483
$$ plain form
38657 -181585 -261673 -291119 -270932 -224062 -182026 -147087 -103957 -65754 -53421 -29466 73708
38646 73708 235741 329791 265162 96912 -44633 -83964 -26082 84711 176196 172638 79497
38635 79497 11263 65961 194600 263019 225581 161638 142712 146372 128256 108755 133787 185873
38623 185873 192798 122465 27320 -19893 -9781 5681 -12896 -48622 -63800 -52083 -36280 -34514
38611 -34514 -53383 -96665 -149618 -171392 -143356 -112842 -139863 -203650 -215150 -128437 10790
38600 10790 134420 214750 248590 240014 217788 209830 181633 71044 -86334 -148407 -39386
38589 -39386 135971 216558 169260 84448 40772 50765 101437 169292 215034 224586 232095 254998
38577 254998 251900 203914 180394 242778 334849 361587 328742 299269 261199 169991 85373 106856
38565A06856P1922m4224j66222q5807J02282J19599o7072j93089r8026O2532R4688
38554i6561M6219O4377J22417O9331j06192k25757j50641M3883J64758J19785
38544E1619k228n7543j6384K4891p810o3773n2763J6014N3404K7493j711J1034
38532a7757L4540K9763J1142L989l660k5207l4818q051K4916J1488m8706r6591
38520a18952q2196j8435M0601O4056P2626R6148J20458J07431O1240K4892Q80
38509C68749n8972j49273j71586p1152M9678N5702k2543l4159N9681J31856R3247
38498B51228J8257J177K516n9355j42508j31071k0435O4010M2020k3687l7567
38487c5415k496J4860J004L509K9178J0746q3338j57159q4946J01652K10175J17100
$$ plain form
38565 106856 178778 134554 -31668 -117475 -15193 104406 37334 -155755 -253781 -191249 -96561
38554 -96561 -50342 14035 136452 205783 99591 -126166 -276807 -232924 -68166 51619
38544 51619 49391 -8152 -24536 355 -7455 -71228 -123991 -107977 -54573 -27080 -28791 -17757
38532 -17757 16783 46546 57688 61677 58017 32810 -2008 -10059 14857 26345 -22361 -118952
38520 -118952 -201148 -219583 -178982 -114926 -42300 53848 174306 281737 342977 367869 368749
38509 368749 309777 160504 -11082 -82234 -32556 23146 603 -33556 26125 157981 251228
38498 251228 269485 270662 273178 213823 71315 -59756 -80191 -16181 25839 2152 -35415
38487 -35415 -37911 -23051 -22047 -18538 10640 21386 -61952 -219111 -304057 -202405 7770 124870
38475A24870o6735j36795n7152J7936k3651j07905j01046P801J15130J41698R8456
38464A2607M3384K5761N4361P9552K8942r8543j98735j71699m8465M4973M2718
38453a85144K49o258J7510J3980l4474q8138j09041r6785o3277n760P5997J52594
38441c28547J78742J35914N0519k9561o7542n3118m581M1672O0500N8954N0645
38430I3597J7341o2596j41920j22568J0785J27419R2191n6110j48706j02496m360
38419b97423L5875K3940K3464L9101L5208K2984M1707P1266M5731m1244j14145
38408a13536j13279n4572K4928J15158J90026J79504N1525j09912j79136j34818
38398a44112o9553n3131n5723k9971J152n554k2380J6386J03390J49604R8389
$$ plain form
38475 124870 58135 -78660 -135812 -117876 -141527 -249432 -350478 -342677 -227547 -85849 12607
38464 12607 55991 81752 136113 215665 244607 146064 -52671 -224370 -272835 -227862 -185144
38453 -185144 -184895 -191153 -173643 -159663 -194137 -282275 -391316 -488101 -551378 -557138 -481141 -328547
38441 -328547 -149805 -13891 36628 7067 -60475 -113593 -118174 -76502 -16002 42952 93597
38430 93597 110938 48342 -93578 -216146 -205361 -77942 14249 -41861 -190567 -293063 -297423
38419 -297423 -261548 -237608 -214144 -175043 -139835 -116851 -75144 -3878 41853 609 -113536
38408 -113536 -226815 -281387 -256459 -141301 48725 228229 279754 169842 -9294 -144112
38398 -144112 -213665 -266796 -322519 -352490 -351338 -356892 -379272 -362886 -259496 -109892 -11503
38387a1503n140p7775q6931n2110J998N7136Q8301P6175L2009p369r810K7318
38375C2299P0525P1738J9292l4027k5366L1977N4770m514r5615j33358q8977m63
38363a01719P1217P5717N147p8969r0417j9999N1006O9571Q2206J33039J56200
38352C52999O4892q6405j42168n7883L1542j872j06096j30604l3609P1599P3081
38341C5476m646n3913l2865n235k8746o2263l1402M6331P3275J0263o6167o9804
38329a89696r143M7443N9172K8950k0452m8999k2412L5800O4408N8594P1742R6043
38317A71450M7230o7580q6838Q3995K84487K81889Q1063j03733j46596j13431
38307D31936q4713n1811j2173p348k3863O022O7053O1602j5430n0817j2090j2347
$$ plain form
38387 -11503 -16643 -94418 -181349 -233459 -231461 -174325 -86024 -9849 22160 14791 4981 32299
38375 32299 102824 174562 193854 159827 134461 166438 221208 216694 121079 -12279 -101256 -101719
38363 -101719 -30502 45215 50362 -28607 -119024 -139023 -88017 -18446 63760 196799 352999
38352 352999 417891 331486 189318 131435 162977 161105 55009 -75595 -109204 -37605 35476
38341 35476 30830 -23083 -55948 -61183 -89929 -152192 -183594 -137263 -63988 -53725 -119892 -189696
38329 -189696 -198839 -151396 -92224 -63274 -83726 -132725 -155137 -119337 -54929 3665 75407 171450
38317 171450 218680 151100 64262 148257 432744 714633 795696 691963 545367 431936
38307 431936 347223 295412 283239 275891 252028 258050 325103 386705 371275 320458 308368 296021
38295B96021j00252j48388o2349M6761L8029l5756l9748P339j0001p3310m8763
38284a30417P3903J40094O2723m8493n0563M3021J04882O4140k6908p2126m0874
38273A19382L670j1800o4270n6990L2780R9330N8624j9274k0759K6061J075r7994
38261F9835j35670m6190O9615J02320P5515O1822N4585J2155l9948m9023l3648
38250A41368m6194o4868k4143N5521P5334J5249k1190L0891Q4695L2715q0094
38239A99284j19938o1865o543q922j4418J2222J9399j5128j6000N8647J16048
38228A62786O1857m4845q3734n4052l6571l0205K6438J00449Q8118p366o9926
38217A12949n5225l7767n4450n0611j5297j6760n2292j5956J14775K06815J66957
$$ plain form
38295 296021 195769 47381 -14968 31793 69822 34066 -5682 1657 -8344 -81654 -130417
38284 -130417 -56514 83580 146303 97810 47247 90268 195150 259290 232382 160256 119382
38273 119382 123052 111252 46982 -10008 22772 122102 180726 161452 140693 166754 167829 69835
38261 69835 -65835 -112025 -42410 59910 135425 197247 251832 263987 224039 175016 141368
38250 141368 95174 30306 6163 61684 137018 152267 131077 161968 246663 279378 199284
38239 199284 79346 17481 10938 2016 -12402 -180 19219 4091 -11909 46738 162786
38228 162786 224643 179798 96064 42012 5441 -24764 1674 102123 190241 182875 112949
38217 112949 57724 19957 -34493 -85104 -100401 -117161 -169453 -185409 -70634 136181 303138
38206C03138O9879N459n5213j38349j61828q2473j4387n3664j06812n3020L7132
38195b50138K5349m8775m4017L1236N0246N272M850N5549N4191k879q198M1619
38183h5695K5528o6067q0753L6388J23984N1790p4329q0972K4751J07106J09016
38172I0747P8491M8810J0479k7036l5944j6907J1566M4800P1766O2111J3938k6989
38160C25832l3912m0703p9433j21455j20067p3876j6314K2203K3623j815o41O2283
38148e4275J20681O9714o4658j18050l956J52509J72677M5015r4162j41455r7896
38137a3856m421R3524J32295P3103l1470q0358m4602O411O299l1235n3066m2572
38125A0052k6063k1803j0603L5397J04077J41533J10822L7812k3657n7033p8853
$$ plain form
38206 303138 373017 378476 323263 184914 23086 -59387 -73774 -127438 -234250 -287270 -250138
38195 -250138 -224789 -273564 -317581 -286345 -236099 -230827 -225977 -170428 -116237 -119116 -127314 -85695
38183 -85695 -60167 -126234 -206987 -170599 -46615 5175 -69154 -150126 -125375 -18269 90747
38172 90747 169238 218048 228527 201491 165547 148640 160206 205006 276772 338883 352821 325832
38160 325832 291920 251217 171784 50329 -69738 -143614 -159928 -137725 -114102 -115917 -116558 -54275
38148 -54275 66406 136120 71462 -46588 -50544 101965 274642 319657 225495 84040 -13856
38137 -13856 -18277 75247 207542 280645 249175 168817 124215 130626 136925 105690 52624 10052
38125 10052 -16011 -37814 -48417 -13020 91057 232590 343412 381224 357567 300534 221681
38114B21681q2613m1808K3058L8874k7053j10938j29012q2024m2084m9547o4303
38103c45769k5352O8777J57190J86676J63749J25216P6362n474j08291j74465
38093A18619j69812j19009n1785L1123J07914J20439O2895J8072L4591L8006m3011
38082A48042j30712j03161L771M5844M61j3007M6577O7255j9443j14926j06108
38071a75407k4326L4451N2517O5447P0370M5355O482k2434m8337o7003m2979J8245
38059h7619M3803m339o3379o2823k2715q51n54Q493K7614M1338M7661L9013P225
38046b7133q070M5822J22476J00668k9804j20718p9118j1721n0170j37613j25280
38035c20661p819Q2712P6997K8422m412j4934j337L1523L4386k6701q8952o3986
$$ plain form
38114 221681 139068 97260 120318 159192 132139 21201 -107811 -189835 -231919 -281466 -345769
38103 -345769 -371121 -302344 -145154 41522 205271 330487 406849 401375 293084 118619
38093 118619 -51193 -170202 -221987 -190864 -82950 37489 100384 118456 153047 191053 148042
38082 148042 17330 -85831 -82060 -36216 -35755 -48762 -2185 65070 45627 -69299 -175407
38071 -175407 -199733 -165282 -112765 -47318 23052 68407 74889 52455 4118 -62885 -105864 -87619
38059 -87619 -43816 -48155 -111534 -174357 -197072 -197923 -198477 -189984 -162370 -121032 -73371 -34358 -27133
38046 -27133 -35203 10619 133095 233763 203959 83241 4123 -7598 -57768 -195381 -320661
38035 -320661 -328480 -245768 -168771 -140349 -144761 -159695 -161032 -129509 -95123 -121824 -210776 -274762
38023b74762K9005R2953R1394O1278J6834m8631q6111l6386N2880P1998J2054
38012a7494l1294j6295O762K1170O6773J11260N1244r6961j54827k7712J30079
38001D2705J19330k8366j18153p4098j026J7818L0829Q8924J30332P1573n4876
37990B24992j30408q9784K3159J20659J46438R8763K1997k6480l2802m3208r1657
37979B21669j28988q0613L0526R2508N3825j6127n4716j02182j91843k28753j02489
37968e07183J20350K50581K15295J14831L9213l0116j05113j26731q6301q1647
37958a96821j58264k03543j09078M9336J15846P6703N2122R9958J48585J21286
37948c870K8832p1033j31958j27803o2363J7719N6431L9616q94j7601K2179R6914
$$ plain form
38023 -274762 -245757 -152804 -61410 -132 16702 -31929 -118040 -154426 -101546 -29548 -17494
38012 -17494 -48788 -65083 -58321 -37151 29622 140882 192126 95165 -59662 -87374 42705
38001 42705 162035 133669 15516 -58582 -59608 -41790 -10961 77963 208295 279868 224992
37990 224992 94584 4800 27959 148618 295056 393819 415816 389336 356534 313326 221669
37979 221669 92681 12068 42594 135102 188927 172800 118084 15902 -175941 -404694 -507183
37968 -507183 -386833 -136252 79043 193874 233087 202971 97858 -28873 -115174 -196821
37958 -196821 -355085 -558628 -667706 -618370 -502524 -425821 -373699 -273741 -125156 -3870
37948 -3870 24962 -46071 -178029 -305832 -368195 -350476 -294045 -254429 -255323 -272924 -250745 -153831
37936a53831J21519M0494o7205o7854K7362O3635j2358n3908M4345J47416P1059
37925A60674j27560k20088j16325N4295J42974J20261L1075n6563o3811K2645
37915e2423R5884N2283n7563j10887j04729j29117j76562j36406J2815J51739
37905d54966J89241J59941J24999Q8076M0774m037m6989q9830r0915k2254M6965
37894e8995L0589l2098l6202R162M078n2599n9237m104R331m1295m9410K1109
37882b59671N9094K475m6243P410R8208J19242P5119K6387j2876l8934k2978J3338
37870B0571n620o9353o1097M6674J17135O7172J0569N2867R0628j0933j59153
37859I9460j59465k7861L8797k0403n6584K3927J15920J02312K6788j0379r483
$$ plain form
37936 -153831 -32312 8182 -59023 -126877 -99515 -35880 -48238 -102146 -57801 89615 160674
37925 160674 33114 -186974 -303299 -249004 -106030 14231 45306 -11257 -75068 -52423
37915 -52423 43461 95744 38181 -72706 -177435 -306552 -483114 -619520 -606705 -454966
37905 -454966 -265725 -105784 19215 107291 148065 144028 97039 7209 -83706 -105960 -58995
37894 -58995 -28406 -60504 -96706 -87544 -83466 -136065 -195302 -199406 -190075 -231370 -280780 -259671
37882 -259671 -200577 -198102 -244345 -236935 -138727 -19485 55634 82021 69145 30211 7233 20571
37870 20571 14951 -54402 -115499 -68825 48310 115482 126051 178918 269546 258613 99460
37859 99460 -60005 -87866 -49069 -69472 -126056 -102129 13791 116103 142891 132512 123029
37848A23029k2430l1514J2251P4065O4551k3496r6324r2008n5218m3452k8697
37837a19243L7931J10690R8908K3482Q026Q0281J02390k0382j67387j60157j9225
37826b4686P7409N1198r508k5329k0553k8118l4153m4549q9571j37619j15033
37815d00512k9728L6433O6126J11065J52575J07792j056m3554J0180L8578j9329
37804B8570o7598m0361j6546n6744q7832n4778l0006n5711l3306R5490K03567
37793a15255J62865M4058j7535k8584n3315n0575K5627P4753p645j25824j17909
37782b09339j8800R922m9106p3604l4388j6591k8762Q898Q7298J06931O2378N3540
37770a01623R9935J12288O6798M2169N6826L0027n6827j09847p9593l3891k7757
$$ plain form
37848 123029 100599 69085 81336 155401 219952 196456 100132 8124 -47094 -90546 -119243
37837 -119243 -81312 29378 128286 151768 159794 240075 342465 322083 154696 -5461 -24686
37826 -24686 52723 103921 94413 69084 48531 20413 -13740 -58289 -147860 -285479 -400512
37815 -400512 -430240 -393807 -327681 -216616 -64041 43751 42695 -859 9321 47899 28570
37804 28570 -39028 -79389 -95935 -152679 -240511 -295289 -325295 -381006 -414312 -318822 -115255
37793 -115255 47610 91668 74133 45549 -7766 -58341 -32714 42039 34394 -91430 -209339
37782 -209339 -228139 -218217 -267323 -340927 -375315 -391906 -420668 -411770 -324472 -217541 -155163 -101623
37770 -101623 -1688 110600 177398 219567 276393 306420 249593 139746 60153 26262 -1495
37759a495k4773M332J8744o825k9698j4600J7740L9011L5501j4685r9446j29316
37747b05510m7705M2225J464j12438j08746L1351J08838K5063m9224N7967K36627
37736b0088K39715K9483j74904j77540k0136J00887O5930n4210j07707n4846K08
37725a73208j7991m0758J6574J00636J13157Q4706J01734J15181J0623j52366
37715A58288j82476n7530L2421o846m4663R313L8980m0469r0546J4225J31369
37704c7934O1251j08892j23360M2269J55351R5189J308M39J0239p0460j51746
37693a26346r4225M2400O6133o2159j67692j12051K3666P5408K4560j2004K5546
37682c16764P5356Q3703Q3000R7423P4554j4535r1261p9028k9050k9341m5261
$$ plain form
37759 -1495 -26268 -21936 -3192 -10017 -39715 -54315 -36575 2436 37937 23252 -76194 -205510
37747 -205510 -253215 -210990 -209526 -321964 -430710 -399359 -290521 -265458 -314682 -256715 -20088
37736 -20088 219627 249110 74206 -103334 -123470 -22583 43347 -10863 -118570 -173416 -173208
37725 -173208 -191199 -231957 -215383 -114747 -1590 83116 184850 300031 310654 158288
37715 158288 -24188 -81718 -49297 -56143 -100806 -91493 -52513 -92982 -183528 -169303 -37934
37704 -37934 23317 -85575 -208935 -166666 -11315 83874 85182 85621 95860 25400 -126346
37693 -126346 -220571 -178171 -112038 -174197 -341889 -453940 -430274 -354866 -330306 -342310 -316764
37682 -316764 -241408 -157705 -74705 22718 97272 82737 -8524 -87552 -116602 -145943 -191204
37671a91204J7972J26010J36631J6448j02808j15103o2771k6379q793J2444J6633
37660a80920r064k5806p720J2845O206j3325l5562o6674o7834K2467J65184K22809
37648B2606J42465L8834K6385O5352N7977Q706j3833q067k5115o2195o5469j9280
37636A68366L7699O5443M5156j1366l5323M9971J98055K39364R6429q0003r8959
37625F74832J8103J12432J61873K89904M82314M93737J57150l34347o07396n27615
37615I20987l02374j70906j40045r1481k2082l1089j12805j27278j4480R9731
37605H178R0141J2885o368K5764J3364m5824o9944n4274o8044r7476n1798N5251
37593a88145Q8797L637p3800l5966O4253J27531J35775R4836j7612j54652j75218
$$ plain form
37671 -191204 -173232 -47222 89409 105857 3049 -112054 -174825 -201204 -209997 -197553 -180920
37660 -180920 -189984 -215790 -223510 -210665 -204459 -217784 -253346 -320020 -387854 -365387 -200203 22606
37648 22606 165071 203905 230290 295642 353619 362325 348492 340425 315310 253115 187646 168366
37636 168366 206065 271508 316664 305298 269975 319946 518001 757365 853794 773791 674832
37625 674832 692935 805367 967240 1257144 1739458 2233195 2390345 2055998 1448602 920987
37615 920987 618613 447707 307662 216181 194099 163010 50205 -77073 -91553 8178
37605 8178 98319 111204 104836 130600 143964 98140 28196 -26078 -94122 -191598 -243396 -188145
37593 -188145 -99348 -95711 -169511 -205477 -141224 -13693 122082 216918 199306 44654 -130564
37582a30564k9081J34795J56526O8503j803l3638q0995j19549q2149m029J5204
37571a06780k5226l4990P355K8572k956l2303k3050l836Q683L8989P9532P2465
37559F455j414q0251r8301n4282J7193Q8284J25383Q4647l5182j55959j76585
37548b80012p6742M9068P9910r3p7745m2964P6892J60954J53737J07075O3642
37537B13722n789j09213j65451j03653K0396Q1221L3663m9142p3050j9180M6237
37526a30239L8629n2561j38855j32628n8198n564R874N1787J26262J50378Q8558
37515e2557J4809p306o654j3867Q737P8626J27513R8639K9310k7626p6876j11896
37503F0852p5665K8288Q6086K7823o2398q6129p9392j09431j22811l5773R7261
$$ plain form
37582 -130564 -159645 -24850 131676 200179 198376 164738 83743 -35806 -117955 -121984 -106780
37571 -106780 -132006 -166996 -159641 -131069 -134025 -166328 -189378 -193214 -184531 -145542 -66010 6455
37559 6455 5041 -75210 -173511 -227793 -210600 -122316 3067 87714 52532 -103427 -280012
37548 -280012 -356754 -307686 -227776 -227869 -305614 -348578 -271686 -110732 43005 150080 213722
37537 213722 207933 98720 -66731 -170384 -149988 -68767 -35104 -84246 -157296 -176476 -130239
37526 -130239 -91610 -144171 -283026 -415654 -473852 -479416 -469542 -417755 -291493 -141115 -52557
37515 -52557 -37748 -45054 -51708 -65575 -56838 21788 149301 247940 277250 249624 172748 60852
37503 60852 -14813 13475 99561 127384 64986 -21143 -100535 -209966 -332777 -368550 -271289
37492b71289J48939J03385M5768J3888j2069j3692M0020R8531Q3529J6958j3293
37481B40675Q363K3595O849k7102q5446j62207j81545q9887L1959O5635K9246
37470a39865L2065Q7111J02769M8015m470m311J9456L3267L6408K5753O182J9444
37458B61824Q3300J35480J21414Q6335Q2267M9208q3890k37337k66727j71831
37448F0043p2236j0104O4539J37546J31114N8528J6219J4812k5606j04558j26926
37437A43371p6266m1797m8466k2097M3667N2918q940k0034P7120J64269J21834
37426C85579m898r6168j13333r0472n8979m5284o7753q9098m6649M2007Q9732
37415i5316P4567O0268O2263J5175q5509j32144n7700N9756J04653N3780m0238
$$ plain form
37492 -271289 -122350 -18965 26803 40691 28622 14930 54950 153481 237010 253968 240675
37481 240675 249038 272633 279482 252380 166934 4727 -176818 -266705 -234746 -169111 -139865
37470 -139865 -107800 -20689 82080 130095 125625 121314 140770 174037 210445 236198 242380 261824
37458 261824 345124 480604 602018 688353 770620 819828 735938 498601 231874 60043
37448 60043 -12193 -22297 42242 179788 310902 369430 385649 400461 374855 270297 143371
37437 143371 67105 25308 -23158 -45255 -1588 51330 42390 22356 99476 263745 385579
37426 385579 380681 284513 171180 80708 21729 -23555 -91308 -180406 -227055 -185048 -95316
37415 -95316 -20749 39519 101782 116957 31448 -100696 -158396 -98640 6013 59793 19555
37404A9555j08313q2040M6082J55269J06825m8855j10260j3011P2261M157j23965
37393h2295j57073j16723j12251j16078j2560J65741K30562R6389q8855j34188
37383c27331l6571N6893O4864M9178P1225P3592j8230j37457j37323l568J16020
37372b28708J17319N1380o617n8026q9269l9856M6028J2339j36607j54591O9062
37361d17546K53061J08915j86463k30537J786J61296Q9314n415L0615O9050j78
37350a26102o8960m7707k2828m2744n727J04995J28898J4211n3162L6560J17292
37339C4726L5464r1552r5055k2976N879J8268N9001L6814r4091j75124p9376N9412
37327c08610P0761L4382J05284K04212J49549j1073p0409L021M8031r336q2817
$$ plain form
37404 19555 -88758 -170798 -124716 30553 137378 88523 -21737 -34748 37513 41670 -82295
37393 -82295 -239368 -356091 -468342 -584420 -596980 -431239 -200677 -104288 -193143 -327331
37383 -327331 -363902 -307009 -242145 -192967 -121742 -48150 -66380 -203837 -341160 -344728 -228708
37372 -228708 -111389 -60009 -66626 -124652 -213921 -253777 -207749 -195410 -332017 -486608 -417546
37361 -417546 -164485 -55570 -242033 -472570 -470784 -309488 -220174 -225589 -194974 -125924 -126102
37350 -126102 -195062 -242769 -265597 -308341 -314068 -209073 -80175 -65964 -119126 -82566 34726
37339 34726 70190 -21362 -116417 -139393 -133514 -115246 -56245 -19431 -113522 -288646 -368022 -308610
37327 -308610 -237849 -203467 -98183 106029 255578 244505 174096 177117 225148 215812 132995
37316A32995j11074j19047j06878m5849K6621M5021K2915J0835K669j0768K0136
37305a32424R6062J02888j4065j22021r3370p894j74k8956J3887P9215N3188k0623
37293g4287k2543K2921K0623J7248J11100K14306J48557n3599j77872j46800q6831
37282b7177p6566m7227L7256R5941P5578K9386J3576K3027M2995O2729M8571m616
37270B73473l3952q407M032l3700l6060M5483J01594N8115M2002J55250K33141
37259H00971Q0908j71246k38463j20170o0014j18514j13041J5920J01825O3825
37249B42001K7674O0477M9010o5220j60088j37294n7662M179N8987R7647O5909
37238A85620m347j1197L4275J6853o9888j09359p8201p4375j10656r2617k2048
$$ plain form
37316 132995 21921 -97126 -204004 -249853 -223232 -178211 -155296 -144461 -141792 -152560 -132424
37305 -132424 -36362 66526 52461 -69560 -162930 -170824 -170998 -199954 -186067 -106852 -53664 -74287
37293 -74287 -96830 -73909 -53286 -36038 75062 289368 437925 384326 206454 59654 -27177
37282 -27177 -103743 -150970 -113714 -17773 57805 87191 100767 123794 166789 229518 278089 273473
37270 273473 239521 231114 235146 201446 165386 210869 312463 370578 412580 567830 800971
37259 800971 881879 710633 472170 352000 291986 173472 60431 76351 178176 242001
37249 242001 269675 330152 379162 313942 153854 16560 -41102 -36923 22064 119711 185620
37238 185620 181273 170076 204351 221204 151316 41957 -36244 -110619 -221275 -313892 -335940
37227c35940K310O117J14680K75517K74577R0368m0839J293N3894j6589j04916
37216C20472j02533q4387j08926p6553M4614Q3969n5352j97184j62614m4271j0523
37205c93288k0074M9535J45393J37689N4248O014j7856q1900j27344o0220O0807
37194b46996J08248Q8718R0286R5776K4922q8276j29242q1366k4480J1978N8135
37183i2297R7843Q4583M0210K2130J6296k8697q5220p1798J6018R2168R5076M5100
37171B31412r899n2070r4896j51319j94250j61224l9847P6506R2958M8006M2630
37160b11993N9821o326j41919j92781q8208N9690J24239R9349L4458k5481q753
37149b97904J20854K44903J99014K1729r0264q9326j13449j87704j61342j7851
$$ plain form
37227 -335940 -333630 -327513 -212833 62684 337261 427629 386790 388083 441977 425388 320472
37216 320472 217939 133552 24626 -51927 -7313 76656 21304 -175880 -338494 -382765 -393288
37205 -393288 -413362 -363827 -218434 -80745 -26497 -20483 -38339 -120239 -247583 -307803 -246996
37194 -246996 -138748 -50030 40256 136032 160954 72678 -56564 -137930 -162410 -150432 -92297
37183 -92297 5546 90129 130339 152469 168765 140068 54848 -16950 -932 91236 186312 231412
37171 231412 221513 169443 74547 -76772 -271022 -432246 -472093 -395587 -302629 -254623 -211993
37160 -211993 -152172 -158498 -300417 -493198 -581406 -521716 -397477 -298128 -263670 -289151 -297904
37149 -297904 -177050 67853 266867 288596 198332 109006 -4443 -192147 -353489 -371340
37139c71340M5019l1310l2686J36959K34929Q3088r1597j4693J73767J53241n4113
37128B31264j52616o1161K1435k452j2570N2434Q7954M0479K228L5041P7715O6536
37116C86287P665p6762j48687j28349l289Q3345M786j38247j42270O191J30021
37105a9309J16383Q540j14683j82049j00522J29237L02551K13433m7088j87993
37095A18500j06728J6471K1115m0661n8495k9008N523M4779Q5051Q6043L5647
37084A78237k3420n3290m7184p829L5211K2568m5675p4046j3677L5578k1891j06659
37072a22077q7386N092M8509L9922N3384N2389m5869j58123j12452O5652J64932
37061i6027J05771L1451M2632N4383p314n8369j0766P2789Q3131J6570n9998j05587
$$ plain form
37139 -371340 -326321 -357631 -390317 -253358 -18429 64659 -26938 -41631 132136 285377 231264
37128 231264 78648 17487 38922 36470 23900 76334 164288 204767 206995 242036 319751 386287
37116 386287 393952 317190 168503 40154 36865 120210 124996 -13251 -155521 -149330 -19309
37105 -19309 97074 105614 -9069 -191118 -291640 -162403 140148 353581 306493 118500
37095 118500 11772 28243 49358 8697 -49798 -78806 -73283 -28504 56547 142590 178237
37084 178237 154817 101527 54343 46514 81725 104293 58618 -15428 -29105 6473 -15418 -122077
37072 -122077 -209463 -204371 -155862 -115940 -62556 -10167 -56036 -214159 -326611 -260959 -96027
37061 -96027 9744 41195 83827 138210 130896 72527 61761 134550 217681 234251 174253 68666
37049F8666j03266m5766K5533M2717O171j9315j8702m1766q4413o2896N0171J56049
37037b6817J49858M7261m9671o6953j4787L6611L1149l898P730O4716O5680l3239
37025B07640j26134j10862m6888m3914p5278m4268K9501M9809K6314N2098J22070
37014D0088J36655P9290L4106K4444j3922q4525j00400l1770L9323M2468k297
37003A63460m5422n9653k9838K7342M7540Q1m9181l6495m591j3322j9844L2461
36991A2538Q1662M4150k5593k2787K5045K0917k0477k0828m464m0921q1200l3507
36979f5465N5055P6107N2227N7936L1988j05212k26864j53403K7959P6382j2563
36968a85853k9900N8493P4970o251l156J08810J20695k1044q7287K9745J07375
$$ plain form
37049 68666 -34600 -80366 -54833 -12116 -5945 -25260 -43962 -85728 -170141 -233037 -182866 -26817
37037 -26817 123041 170302 120631 53678 38891 75502 106651 102753 110483 175199 240879 207640
37025 207640 81506 -29356 -76244 -120158 -195436 -239704 -210203 -160394 -134080 -81982 40088
37014 40088 176743 256033 290139 314583 300661 216136 115736 83966 123289 165757 163460
37003 163460 118038 58385 28547 55889 103429 103510 54329 17834 13243 -79 -19923 12538
36991 12538 94200 138350 112757 89970 115015 135932 115455 94627 90163 49242 -31958 -65465
36979 -65465 -10410 65697 117924 175860 207848 102636 -124228 -277631 -249672 -173290 -185853
36968 -185853 -215753 -157260 -82290 -88541 -91697 17113 137808 116764 29477 59222 166597
36957A66597k3940j75670j07668R2852J79192J14593M0674P384m8321j34164j85098
36946g3569j62481o6677P2761J53951P1784j00144j44847k408J28188Q8816j0675
36935d5301Q95Q5165R5576K4859k1364j6905k5373o4585q2642m5356K5982P7386
36923H337N6500k2720n5011K7674J25944J01716J0144K6232J48354J87173P4395
36912F88738m5014q0823j18727j91425j73331k6513P4786J0764r7201j16685j18916
36901a94347j88942k09006m2289J99701K80598J52046j9893p9003n785J15419
36891H499J61156O9700o1949p2458L8473J07508N8370j0796k9371m7577o8340
36880A53215j571J27586J45704J2214q7450m6219j677o2536j09355l6495L7668
$$ plain form
36957 166597 142657 -33013 -140681 -47829 131363 245956 286630 294014 245693 111529 -73569
36946 -73569 -236050 -302727 -229966 -76015 -4231 -104375 -249222 -251630 -123442 -34626 -45301
36935 -45301 -44406 40759 136335 161194 139830 122925 97552 32967 -49675 -95031 -69049 8337
36923 8337 64837 42117 -12894 14780 140724 242440 252584 278816 427170 614343 688738
36912 688738 643724 562901 444174 252749 79418 52905 127691 138455 41254 -75431 -194347
36901 -194347 -383289 -592295 -634584 -434883 -154285 -2239 -22132 -101135 -106920 8499
36891 8499 169655 239355 177406 104948 143421 250929 309299 298503 269132 221555 153215
36880 153215 151644 279230 424934 437148 349698 303479 301802 239266 129911 93416 131084
36869A31084n026o0771j1350M4841j3901q8957l4950Q1837J16226Q8592Q8377
36858C36002Q0802J9070K604J06075J86991Q2916j21387k29708k12649j53585
36848I7131n7673P3296J15616j026j20608q5185K211k6933q9607n68J73363K00489
36836B80506O3760k5899K6409R0605N0217n4046j27969j17495j5816J01021J01818
36825C73111k2318j01550k9826O2322K3504p2301p1306N524M5496N1656O9147
36814C33459L4180r5164j83986j13165l476k3259r5857m1139J00040J38482N3966
36803A04081n921J3685L9129M3369N9387O8835M2537K2798K9961j796p0037n0650
36791B95378N8312N2142j36632k50048r5466J21269J31923L0640M1628R9104K8273
$$ plain form
36869 131084 126058 65287 53937 98778 84877 -4080 -39030 42807 159033 247625 336002
36858 336002 416804 435874 438478 544553 731544 814460 693073 463365 250716 97131
36848 97131 39458 112754 228370 227344 106736 21551 23762 -3171 -92778 -93346 80017 280506
36836 280506 344266 318367 344776 435381 485598 431552 303583 186088 170272 271293 373111
36825 373111 350793 249243 219417 281739 305243 232942 161636 167160 212656 264312 333459
36814 333459 367639 272475 88489 -24676 -28152 -51411 -147268 -188407 -88367 50115 104081
36803 104081 98160 111845 150974 194343 253730 322565 365102 387900 417861 416065 346028 295378
36791 295378 353690 405832 269200 19152 -76314 44955 176878 207518 249146 348250 376523
36780C76523o4833R286J12289n343k15534j88648L9561J30698J5079m9642K9648
36769A89084O8404j925l4441O700p485p2725n1602K0455k0050j20408p6761O4811
36757c5943N5679j01093j38797L168R0836K3830l0657J1376L5415J7655O4742
36746c789J19836P350j81270j45272J12670K38697Q9195o5572k3802N7623J2883
36735B18549n7560l8005n523k2691n779O7095Q6897M9229P7103J38299N0163j64881
36723C92896k57002j52852m3013n850Q3345J97443J23416j04826j60934L5212
36713A07835J49567j1023j83020j07501P1575J18144P3790O3051L1003p5402j26942
36702A11077l8521N7834M7469P086M689j7485m5929K6582J21842J0106k55185
$$ plain form
36780 376523 311690 320976 433265 427922 212388 23740 63301 193999 209078 159436 189084
36769 189084 257488 255563 221122 227822 220337 147612 96010 116465 96415 -23993 -100754 -35943
36757 -35943 19736 -81357 -220154 -216986 -126150 -102320 -132977 -121601 -86186 -68531 -3789
36746 -3789 116047 123397 -57873 -203145 -90475 148222 237417 171845 148043 205666 218549
36735 218549 160989 122984 117461 94770 88991 156086 242983 292212 369315 507614 557777 392896
36723 392896 135894 -16958 -59971 -65821 17524 214967 338383 233557 72623 107835
36713 107835 257402 246379 63359 -44142 27433 145577 219367 282418 313421 238019 111077
36702 111077 72556 130390 177859 184945 189634 172149 126220 152802 274644 284750 29565
36691B9565l05659k1535K46633K10658L3013k8807p131j8291o586O3291O0676
36680B55827m5891p6570J7882K9258j06720j43222L1872J58763N6521o4091o758
36669A06871O1055l7830j36372m1831J05307J02073K3275L333l0247j30442j40922
36658a15730l717N9811n3824r4300Q9290K21236O1509j55298j15188O0676Q3535
36647C8000j0575k5831n26n1389o5760P7415K05571J28792l669L3096J43117J15132
36635E83373M473k1623n016m7743o1230L7286J08384N0884K1706J21184J50912
36624I42590k4223j86928j48262q4529j66278k04839l2058J25751M9422n0009
36614B20637O9851K09027R9008q4036n1647O5622L937j15300m7356P7877J9883
$$ plain form
36691 29565 -276094 -297629 -50996 159662 192675 163868 156737 138446 131860 195151 255827
36680 255827 209936 133366 151248 180506 73786 -69436 -37564 121199 177720 113629 106871
36669 106871 167926 130096 -6276 -48107 57200 159273 182548 185881 155634 25192 -115730
36658 -115730 -119447 -59636 -113460 -207760 -118470 102766 164275 8977 -106211 -45535 38000
36647 38000 27425 1594 1068 -50321 -116081 -38666 166905 295697 292028 325124 468241 583373
36635 583373 587846 566223 561207 513464 452234 489520 597904 648788 670494 791678 942590
36624 942590 918367 731439 583177 498648 332370 127531 95473 221224 270646 220637
36614 220637 290488 499515 598523 514487 462840 528462 532399 417099 369743 447620 467503
36603D67503q0981K1575J80188J40307O1276K18519M31645L38264K4466j54289
36593A648473j76588k50594l14470j82709m167m0898j65978r6047O6100L8936
36583E22058q8038m0527J02714Q9389P849Q3374J71818J4789k06454j46482P0287
36572E80777P0146j04821j35460m2000p2232j56131o3157P8491Q506j17116o32
36561D6371J92209J23208n2407L0511K25919J35977j17314j04099J11979J19987
36551G12341n4324n3009P6207m307k07004j68954K1129n079j50729n0496J58468
36540B74243P1464j49832l3024K74488K30465q1860j00883J48674J22233j68855
36530E87113j64849J51662J98359j04992j90856Q4226K14521L9854o587J80648
$$ plain form
36603 467503 386522 408097 588285 728592 789868 1008387 1440032 1778296 1802762 1648473
36593 1648473 1471885 1221291 906821 724112 719945 679047 513069 417022 483122 522058
36583 522058 434020 393493 496207 585596 593445 676819 848637 863426 656972 510490 580777
36572 580777 650923 546102 410642 368642 296410 140279 77122 155613 164119 47003 46371
36561 46371 238580 361788 309381 339892 565811 701788 584474 480375 592354 712341
36551 712341 658017 605008 681215 676908 469904 300950 322079 317000 166271 115775 274243
36540 274243 345707 195875 162851 437339 667804 585944 485061 633735 755968 587113
36530 587113 422264 573926 772285 667293 476437 560663 775184 815038 808451 989099
36520I89099J60953j49936k71989n7921P3864k5886l1275R6191J8606j94296r7346
36509E10064K20592J97573j50134k20301N2927J04717j37606j25061J89028K17053
36499H58852j04286j64599J22970J45837j75153j85919K15338L26090l3406j86988
36489H18736Q1793J47392j72642k39678J10381J96872j61258k48188J57690L29563
36479A020661m665j59066J28468J97355j50466j93372K48139L55996j15493l16287
36469A011270O4210J96438k26635l44747J63857L94469k3526j82520K97268M75816
36459A825900m7813k97675J58263L26662k12349l79895K87729O23663N0532k77820
36449B057197K51908M92399j23088l25541M83368Q73067Q9548l80218L59098Q33707
$$ plain form
36520 989099 1150052 1000116 728127 670206 744070 718184 686909 783100 801706 607410 510064
36509 510064 730656 928229 778095 557794 610721 715438 577832 452771 641799 858852
36499 858852 754566 589967 712937 858774 683621 497702 713040 1039130 1005724 818736
36489 818736 900529 1047921 875279 635601 745982 942854 781596 533408 691098 1020661
36479 1020661 1015996 856930 985398 1182753 1032287 838915 1087054 1443050 1327557 1011270
36469 1011270 1075480 1271918 1045283 700536 864393 1258862 1235336 1052816 1350084 1825900
36459 1825900 1778087 1480412 1638675 1965337 1752988 1373093 1660822 2284485 2335017 2057197
36449 2057197 2309105 2801504 2678416 2352875 2836243 3709310 3798858 3418640 3777738 4611445
36439D611445J07010k90277O20126J197306L80347p5290R78992J652127P33694
36430I915480L80182J989931L106053J980366J266884L087011M657739L588786
36422B9972432K996747N762393Q553915Q159596Q430337J2915007J6823682J7171423
36414A10785532K4122944M5620102O3600468M6931248n906265n5935294o6930961
36407A62287774m5156435k3023427j6346514j5533432j1067692o742009o818233
36400C7600032p098898m061613j395684k238023l435717k059299n88218j464509
36392A5258071k466221j394154k30771r89373j881322j011065N3723m32961j091720
36383E814207l79799L68602k88464j026931l84720M15427r9205q50323l93684
$$ plain form
36439 4611445 4718455 4428178 5048304 6245610 6625957 6550667 7529659 9181786 9915480
36430 9915480 10295662 12285593 15391646 17372012 18638896 21725907 26383646 29972432
36422 29972432 32969179 38731572 47285487 55445083 63875420 76790427 93614109 110785532
36414 110785532 134908476 180528578 244129046 291060294 285154029 229218735 162287774
36407 162287774 117131339 94107912 77761398 62227966 51160274 44418265 37600032
36400 37600032 30501134 26439521 25043837 22805814 19370097 17310798 16722580 15258071
36392 15258071 12791850 11397696 11166925 10177552 8296230 7285165 7338888 6905927 5814207
36383 5814207 5434408 5803010 5514546 4487615 4102895 4518322 4419117 3568794 3175110
36374C175110L38184l7152p08334l58400L16794P6375n08055l33936Q5110j90394
36364A855302n73869j54681M29399J89185l41936j98606J98244J2484l22795n0836
36354A041891L24627J8605m52638k36030K37781J17272k67280j42474K01251P8872
36344I21877k02666j8458K70687L7030l27434j56612J82433K3035k78827n7778
36334C93287L17884J32989k86509j89939J78060Q1813l03122k77533N0416O5691
36324A63037j32421p038K90518K17936q0490p9443R2827k8388k56655j17246J67359
36313B29996P6254j91589j10949J33906L4190j97523k4633L15644J95099k19366
36303B41029k50115O3730J04576j49197j55978J11557J53933o7571j04478P4266
$$ plain form
36374 3175110 3513294 3476142 2767808 2409408 2726202 2802577 2294522 1960586 2045696 1855302
36364 1855302 1281433 1126752 1556151 1745336 1403400 1204794 1403038 1415522 1092727 1041891
36354 1041891 1366518 1385123 932485 696455 934236 1051508 784228 641754 843005 921877
36344 921877 719211 700753 971440 1008470 681036 524424 706857 729892 451065 393287
36334 393287 711171 844160 557651 367712 545772 627585 324463 46930 97346 163037
36324 163037 30616 23578 314096 532032 451542 372099 464926 436538 179883 62637 229996
36313 229996 306250 114661 3712 137618 171808 -25715 -50348 265296 460395 241029
36303 241029 -9086 54644 159220 10023 -145955 -34398 119535 51964 -52514 21752
36293B1752P2827q9474j4089K45378K41212k2046j15546k692k8552j63301n7379
36282H8090K05047J95068o5816j58735n4644r3377k43133j45601J45837K22000
36272I4736P0659M3912J31404R214k35607j87249J11452J96231K054p8371M5169
36261B03604O3207o0735l5558J14153N1880j87962k06445K9450J33755J9041J744
36250A26134J44016J49343k4504q5509M003k0287j43408o5978J81351K42151Q9815
36239E97127N7071J81916J57280l5339q5286J8598k9899k05049j49121J27643
36229F34941K26982J04270J28436L15162K32137j83150m30882k72528p1824j04584
36219E78960j78616j52701j91883k83465j33438K20374L18863M8515j28733K8995
$$ plain form
36293 21752 94579 5105 -8984 236394 477606 455560 340014 337322 308770 145469 88090
36282 88090 293137 488205 422389 263654 209010 115633 -127500 -273101 -127264 94736
36272 94736 165395 209307 340711 349925 114318 -72931 38521 234752 236806 158435 203604
36261 203604 266811 206076 170518 284671 336551 148589 -57856 -28406 105349 124390 126134
36250 126134 270150 419493 394989 309480 313483 293196 149788 83810 265161 507312 597127
36239 597127 654198 836114 993394 958055 872769 891367 861468 656419 507298 634941
36229 634941 861923 966193 1094629 1409791 1641928 1458778 1027896 755368 683544 578960
36219 578960 400344 247643 55760 -227705 -361143 -140769 178094 226609 97876 126871
36209A26871J53661k5685k09106j14280L2683k5162j16521l2139Q6292Q9154J11435
36198G7203K10948J60134r3202k06649j161K01500J19326m7324m5308j1570j25389
36187B38508k12304p3931J21013J28445J7132l9945p0081j21856q1430P2761J31688
36176A10000J0859o6356L8342J33122O3186k5968j7079m8649j76597j83529J4393
36165a48276J41182J6876j22587m6837Q3167N0132l8064r507M4541K139k9503
36154e6737L4892N2222l9118k7931J75107K86353R2326j78134k30801j42839j16382
36143a51042j07716k0889K7966m0304m4048J21515K18858O0255j32557r5421M3103
36132a20280M1386k1320M4881J51395J17449J8823P636P485q4515j27535K96J11002
$$ plain form
36209 126871 280532 254847 45741 -68539 -35856 -61018 -177539 -209678 -123386 -34232 77203
36198 77203 288151 448285 355083 148434 147273 348773 468099 420775 375467 363897 238508
36187 238508 26204 -47727 73286 201731 218863 178918 108837 -13019 -94449 -21688 110000
36176 110000 120859 54503 92845 225967 289153 263185 246106 197457 20860 -162669 -148276
36165 -148276 -7094 9782 -112805 -159642 -76475 -26343 -64407 -73914 -29373 -27234 -56737
36154 -56737 -21845 30377 -8741 -36672 138435 424788 517114 338980 108179 -34660 -151042
36143 -151042 -258758 -279647 -251681 -291985 -336033 -214518 4340 64595 -67962 -163383 -120280
36132 -120280 -78894 -100214 -55333 96062 213511 232334 239970 247455 162940 35405 35701 146703
36120A46703J8567r9272l040J77800J77740M0018l2423n8483j46705j86215m0950
36109f260J33548J28186M9258R2609J45572l063k31344k57512j06751k8409o6561
36098a50727o6912k943L1203M4322P7508N0713n4085m8872J41030K48814P4764
36087C44815j36377q9035O2810K4810r2671j5185J39153O6145j34780j17789Q3091
36076A34987J24479k8863q9794n178n55q5587l3605J30947J29457m7881j03636
36065A24771K8541Q4235k4550p5254K432l939j40598j60867J0534J18665M2557
36054F527j014J01765J26776o0664k17000j16276P8227J01019j2102n7775M235
36043d6282P9840J33596J59987R9775n8360k05700k46908j92396o8392J12761
$$ plain form
36120 146703 165270 65998 62958 240758 418498 458516 426093 367610 220905 34690 -6260
36109 -6260 127288 255474 304732 397341 542913 539850 308506 50994 -55757 -84166 -150727
36098 -150727 -217639 -220582 -189379 -145057 -67549 -16836 -70921 -119793 21237 270051 344815
36087 344815 208438 119403 182213 207023 114352 99167 238320 304465 169685 51896 134987
36076 134987 259466 230603 140809 135631 135076 49489 15884 146831 276288 228407 124771
36065 124771 153312 237547 212997 137743 140175 136236 -4362 -165229 -154695 -36030 6527
36054 6527 5513 107278 234054 173390 -43610 -159886 -81659 19360 7258 -50517 -46282
36043 -46282 33558 167154 327141 426916 368556 162856 -84052 -276448 -344840 -232079
36033b32079K53381K18640L4577j23380j63097j31605n5484O5920J28798K9899
36023B5570j07456p5025O4183N8160r4188j23699M4283J63514J00135L7347J04202
36012A97026J37113k33j54802j51081o9114n0939n2132J1468O6479K6979l2881
36001g2117k3389M515k151K6044J17034J42235K4151j00617q3717J3020M3047
35990H8055j2638q7288j46451j50781m5696J07695J48335N7861Q343O9068P9648
35979A16151n0312j43178m1709J08968R0453m1547p6561M857M2475k0804q3445
35968i4652p2970j3483O2960J30903J38652Q2341N7843J24369J84138J16859l5114
35957F81846j38275j57459j48421j22583n2542K7153M8139J6730l012P059J3204
$$ plain form
36033 -232079 21302 239942 274519 151139 -11958 -143563 -199047 -133127 -4329 25570
36023 25570 -81886 -156911 -92728 -34568 -128756 -252455 -208172 -44658 55477 92824 197026
36012 197026 334139 333906 179104 28023 -41091 -92030 -144162 -132694 -66215 -39236 -72117
36001 -72117 -95506 -90991 -93142 -67098 49936 192171 216322 115705 31988 45008 88055
35990 88055 75417 -11871 -158322 -309103 -354799 -247104 -98769 -40908 -32565 36503 116151
35979 116151 65839 -77339 -119048 -10080 80373 38826 -37735 -32878 9597 -11207 -94652
35968 -94652 -167622 -181105 -118145 12758 151410 233751 291594 415963 600101 716960 681846
35957 681846 543571 386112 237691 115108 62566 89719 137858 154588 151576 158635 171839
35946A71839K066j2010k8076n1391o8625o5146l5972L0837J26571J78201J16298
35935C64592p274o8673m7655l7608o6694n0115L8889R5880N0059k6332m6880l3523
35923A64666l8682n2227n4022o1607p2128n3638k6046l6354l6611O4449K02750
35912E50J93072J8109j05592l4616J12630J72710J55906J27428N3880q1561j70099
35901D42417j42796j07222j64424k23813j61342l3489L8249P6719J57610K12344
35891I4253J25153l9490j02616l0273M4676L9893Q524J2553M0596N6250L6473
35880B85992k8360j06328j31855r7510p5491r1570o8569L0528J09579Q8587M1467
35869d3530O7122J18408R1174N148l7330j1680K9716N9167O7497K5996m2620m0749
$$ plain form
35946 171839 173905 161895 133819 82428 13803 -51343 -87315 -56478 70093 248294 364592
35935 364592 357318 288645 240990 203382 136688 86573 125462 221342 271401 245069 198189 164666
35923 164666 125984 73757 19735 -41872 -114000 -167638 -193684 -230038 -266649 -202200 550
35912 550 193622 211731 106139 71523 184153 356863 512769 640197 694077 612516 442417
35901 442417 299621 192399 27975 -195838 -357180 -390669 -352420 -275701 -118091 94253
35891 94253 219406 179916 77300 47027 91703 131596 140120 152673 193269 249519 285992
35880 285992 257632 151304 19449 -78061 -153552 -245122 -313691 -283163 -173584 -84997 -43530
35869 -43530 23592 142000 233174 238322 200992 189312 219028 278195 345692 371688 329068 288319
35857B88319M6424P2603n5499j91188j42040L4828J19824N6431p178K0352O1890
35846C04766L5921l1618r1491j36074j47970q9643K7453J39844K02360J98645
35836D12193J12489k8584j19220q4347P945L5776j1741n8788q4982j21494j39686
35825h0439p7247L6079J03514J08069J16592J39485J08761J1161o7118n5677K3840
35814C67020J08770J45240R0927m2340j48292j21801l761N7799K763p2281n9352
35803C24692K8355R9152R4693K9647l7652n7035l5346k5816m5647m3802N934L8330
35791C75505m81m0391J4848J15514J21807K2433m1673N334P0293N7978J5891K7666
35779G44724O3995M6923p592k5957j1080k1412m0639K302Q0111P3723k8375p9386
$$ plain form
35857 288319 334743 407346 351847 160659 18619 53447 173271 229702 222524 242876 304766
35846 304766 340687 309069 217578 81504 -66466 -156109 -128656 11188 213548 412193
35836 412193 524682 496098 376878 292531 300476 336252 324511 265723 180741 59247 -80439
35825 -80439 -157686 -121607 -18093 89976 206568 346053 454814 465975 398857 343180 367020
35814 367020 475790 621030 711957 669617 521325 399524 395763 453562 456325 384044 324692
35803 324692 353047 452199 546892 576539 538887 481852 446506 420690 375043 331241 337175 375505
35791 375505 375024 334633 349481 464995 586802 609235 567562 572896 643189 701167 717058 744724
35779 744724 808719 855642 848050 822093 811013 789601 748962 751264 831375 905098 876723 797337
35767G97337l549O2519j0710j05462k4150J77584K53609J47377O0926R8424R8315
35756A552220n8595k06048j39974O3332J73110J22415J9395m6428l4559R9080
35746A543948L10193M27999L73921K97122L31926L79854L22768K67794L45798
35737D601323M54669M70782N21595P46075R85121J047187J071086J255319J468679
35728A2621836J557839J769588K360301L083280L651224M345220N448590O579436
35720D1417314P618881R647575J3108633J5126566J1159844O56136j0715836j6317887
35712G1701226j5060367j1113021q238238o684964n291532l981497l214793k715279
35704A5401535k016639j374208j197274j231400j052278q09994q18155q90759
$$ plain form
35767 797337 793788 856307 845597 740135 715985 893569 1147178 1294555 1355481 1453905 1552220
35756 1552220 1493625 1287577 1147603 1210935 1384045 1506460 1525855 1479427 1444868 1543948
35746 1543948 1854141 2282140 2656061 2953183 3285109 3664963 3987731 4255525 4601323
35737 4601323 5055992 5526774 6048369 6794444 7779565 8826752 9897838 11153157 12621836
35728 12621836 14179675 15949263 18309564 21392844 25044068 29389288 34837878 41417314
35720 41417314 49036195 58683770 71792403 86918969 98078813 98734949 88019113 71701226
35712 71701226 56640859 45527838 37289600 30604636 25313104 21331607 18116814 15401535
35704 15401535 13384896 12010688 10813414 9582014 8529736 7719742 6901587 6010828
35696F010828p07950m32488l87996m67377l86540k24605k18099k79063j83898
35687B722812k3941l8894j85004k50921k29346k26255j81129j6998J04667J2813
35677A687804j47927j39390k3349j8728j12213j30843p8576q4926j18392n4631
35667G78829M8794L2562p2125r6422k5248J0284j8154k7361j8475o1693j21615
35656D29376j00089k0175J5168P846L4510P6465N0381k8011o7294n1918l2673
35645C13586j1483L4806O7958M9532L2318P5329J28547J09001K5891o1885j31220
35634F32380j56106q9467K9709P2332J1395k1341L5791N7138l8113j18340n9062
35623C56316M3154N1262J7089M0682O0494p024o4706N989J13369J09602N1770
$$ plain form
35696 6010828 5302878 4870390 4482394 4015017 3628477 3403872 3185773 2906710 2722812
35687 2722812 2698871 2659977 2474973 2224052 1994706 1768451 1587322 1570324 1674991 1687804
35677 1687804 1539877 1400487 1377138 1358410 1246197 1115354 1036778 951852 833460 778829
35667 778829 827623 860185 788060 691638 666390 676674 658520 631159 612684 550991 429376
35656 429376 329287 309112 324280 332126 366636 443101 493482 465471 398177 346259 313586
35645 313586 302103 336909 404867 454399 486717 562046 690593 799594 825485 763600 632380
35634 632380 476274 386807 416516 488848 500243 478902 514693 571831 533718 415378 356316
35623 356316 399470 450732 467821 508503 568997 561973 497267 503256 616625 726227 777997
35612G77997O9896R2465l0123k14675k35537q1458M0263L6202J5845M8103O1286
35601E80264J2405m0916o9252j09620j55305j48362r0134m0027j6170m3K040J942
35589g3178N9584J60585J69417L8935n9922J3557J26497Q4508m1869n0604L6299
35578D63809L0079p5707j03119j4748L8694R47k3914r262n4847j58885j80129
35567h7082q1292L937k200k6520j7751j7152j7323N3051J61312J76585Q0484j1525
35555B14524n9190j25639j77754q8722J11823K19826J58123P6829Q0165P8447
35545D88432M284m8680j9564k632m6477l0570J10015K19205J44205k7846j21851
35534F68521j27632j31840j15109k433J53856K09479J19647k0934j02116q3752
$$ plain form
35612 777997 847893 940358 910235 695560 460023 378565 418828 455030 470875 518978 580264
35601 580264 592669 551753 482501 372881 217576 69214 -20920 -60947 -77117 -77160 -75120 -73178
35589 -73178 -13594 146991 316408 355343 295421 308978 435475 519983 478114 427510 463809
35578 463809 493888 418181 315062 300314 339008 339955 316041 306779 251932 93047 -87082
35567 -87082 -168374 -164437 -166637 -193157 -210908 -228060 -245383 -192332 -31020 145565 226049 214524
35555 214524 155334 29695 -148059 -236781 -124958 94868 252991 329820 409985 488432
35545 488432 492716 444036 424472 421840 375363 344793 454808 674013 818218 790372 668521
35534 668521 540889 409049 293940 291507 445363 654842 774489 753555 651439 567687
35524E67687k421M5764j0885j07649j00886K0515R9237M8625j1355L8897J09186
35513F96715M4412j15987j90506j24618n1505q2185j59736j56614m1123R4457
35503h6690J46009J12122Q1613J02734J11812M4145l7456k4834N9486R5953O1137
35492F66031L8285L5638k6305j12212n8987J45630K66006J39581o9240j08061
35482I16366L44L3226p4289j58003r5844L3264R1198M7582l3600q0022n1720L6901
35470F65403J15797J26927R2861P5662Q6191Q7867P1782O7238Q5850J09039J26221
35459A710838J39888J39736J13189P4910M9556L4668J6144J2023O3549J78117
35449B532618L03898L69282L44935K70237K16367K18929K60733L25493M26382
$$ plain form
35524 567687 565266 611030 600145 492496 391610 412125 511362 559987 548632 587529 696715
35513 696715 741127 625140 434634 310016 258511 176326 16590 -140024 -181147 -86690
35503 -86690 59319 171441 253054 355788 467600 511745 474289 449455 508941 604894 666031
35492 666031 704316 739954 713649 601437 542450 688080 954086 1093667 1024427 916366
35482 916366 916710 949936 875647 717644 621800 655064 746262 793844 760244 680222 628502 665403
35470 665403 781200 908127 1000988 1076650 1162841 1250708 1322490 1389728 1475578 1584617 1710838
35459 1710838 1850726 1990462 2103651 2178561 2228117 2262785 2278929 2290952 2354501 2532618
35449 2532618 2836516 3205798 3550733 3820970 4037337 4256266 4516999 4842492 5268874
35440E268874N49086O18821N93113N52765O15613P76108R18363R80299J011913
35431A1884955J070918J161050J286835J467462J666744J797070J818279J748235
35423B3901548J563198J196047O65742J00858m09076q81541j317205j627757j760534
35414B1431280j790142j799667j760170j618200j421349j256284j127637j000570
35406I657261r06466q91607q93681p89449n70150l71197l01548l18804l14455
35397D299904k68570k53679k93121k90161j57808J6901M0861j28901l03800l07526
35387B354100j98819j43119j57575j39379q3842q5958j42901j46153q3148n8625
35377A114581q4756m6462O6117R0116m9910j96077j90022r1712l6547k1449J9973
$$ plain form
35440 5268874 5817960 6436781 7029894 7582659 8198272 8974380 9892743 10873042 11884955
35431 11884955 12955873 14116923 15403758 16871220 18537964 20335034 22153313 23901548
35423 23901548 25464746 26660793 27326535 27427393 27018317 26136776 24819571 23191814 21431280
35414 21431280 19641138 17841471 16081301 14463101 13041752 11785468 10657831 9657261
35406 9657261 8750795 7859188 6965507 6176058 5605908 5234711 4933163 4614359 4299904
35397 4299904 4031334 3777655 3484534 3194373 3036565 3053466 3094327 2965426 2661626 2354100
35387 2354100 2155281 2012162 1854587 1715208 1631366 1545408 1402507 1256354 1173206 1114581
35377 1114581 1029825 983363 1049480 1139596 1089686 893609 703587 611875 575328 553879 573852
35366E73852N5976L0665K220M9892J16574R0987j2100q8773j10376j22791j26818
35355D59308q1877P90O7653R2408O3346l4216j45935j49423k9629M3586n8049
35344B27962k08599j97121l6492P4122N3738J8253N4661R6092O6568R106M577
35333A62867N6568J11428J29817J02188L9600k9082p9129j05839r8533l5037O1671
35322C16519J10945P1168L34l3396m2203n8861n7850j5104K3960K5825M5596J19279
35310E06212J55399O2328p8947j15673n2974k3854n2873k5794Q4534J32064Q110
35299E98532j85915k62322j67432n337J06317J37161J22583R3827M5956k7608
35289D55762q6690p2894K205N1908K7701j9681l0542j9299j4238R846O3232P5500
$$ plain form
35366 573852 629828 660493 662713 712605 829179 920166 908066 819293 708917 586126 459308
35355 459308 377431 378221 445874 538282 601628 567412 421477 272054 242425 286011 227962
35344 227962 19363 -177758 -214250 -140128 -86390 -68137 -13476 82616 149184 158290 162867
35333 162867 219435 330863 460680 562868 602468 573386 494257 388418 289885 254848 316519
35322 316519 427464 498632 498966 465570 423367 364506 306656 291552 315512 341337 386933 506212
35310 506212 661611 723939 644992 529319 476345 452491 399618 373824 458358 590422 598532
35299 598532 412617 150295 -17137 -22474 83843 221004 343587 437414 483370 455762
35289 455762 369072 296178 298383 350291 377992 358311 327769 308470 294232 304078 367310 442810
35277D42810r020j23321j58655j09022m6139J706M9066P5011M8784M794j923J2388
35265A86479k494l7826n5574o7178r1431q1444N121J06206J28910Q2684M0005
35254B13458J2407k9724o7008p1864q1144j12575q3815M5541J35272M6780j04884
35243i7556r3850O1468J23879J8302o7196j5080L7504l8244j32805r1157K7216
35232b67519O0838J2855K4566J31024K04396J44239P157q1580p4667k7529j0807
35221A22973l3884o1951q2882j09044j11745l4219Q6908J07271k6793j49867p8692
35210c71925J18237K09762J28947L3313L2390M3298k2036r2226o3159K5193N0780
35199I2574j6438r5272j13669p8638l8226j4991J5787P8384J31209R9007m066
$$ plain form
35277 442810 433790 310469 151814 42792 -3347 -1641 47425 122436 171220 176014 174091 186479
35265 186479 183985 146159 90585 23407 -68024 -149468 -144347 -38141 90769 173453 213458
35254 213458 225865 196141 129133 57269 -23875 -136450 -220265 -174724 -39452 7328 -97556
35243 -97556 -191406 -129938 -6059 12243 -54953 -70033 -32529 -70773 -203578 -294735 -267519
35232 -267519 -206681 -193826 -169260 -38236 166160 310399 317556 235976 161309 133780 122973
35221 122973 89089 27138 -55744 -164788 -276533 -310752 -223844 -116573 -143366 -293233 -371925
35210 -371925 -253688 -43926 85021 118334 150724 194022 171986 79760 16601 41794 92574
35199 92574 76136 -19136 -132805 -211443 -249669 -264660 -248873 -170489 -39280 59727 55661
35188E5661n9980j4584L2148k407k6144O9052J84410J44265o608n7255L1350P6922
35176D26830m712o6995k20Q2183M4232o0219j08597j03711j11658j15636o4419
35165h2922J1133M3930L5543K8344K8195K2488J6075l001o3945j34510j24936
35154b23606k0891P3032P6394L5926L2532O8598J00756J05156O2604l9705j47613
35143A23183j64868p9660J7066O8382J06813J42446J13702M136r9233j24732j00031
35132G204p0260l1533Q998J1471j1876N043N8394O2670K555k9309O199K8676q492
35119C9740l4431Q79L5901J8398q302q909j7559l0356K3111J27591J49237M0138
35107C35438o9714p3475l0844j7854N578O6475P6832j0989r3867r0924p7963j16442
$$ plain form
35188 55661 -4319 -18903 13245 10838 -15306 53746 238156 382421 375813 318558 349908 426830
35176 426830 422118 355123 354903 437086 481318 421099 312502 208791 97133 -18503 -82922
35165 -82922 -71789 -27859 7684 36028 64223 86711 102786 99785 35840 -98670 -223606
35154 -223606 -244497 -171465 -95071 -59145 -26613 41985 142741 247897 310501 270796 123183
35143 123183 -41685 -121345 -104279 -35897 70916 213362 327064 331200 231967 107235 7204
35132 7204 -63056 -94589 -85591 -74120 -85996 -80953 -22559 40111 42666 13357 19556 48232 39740
35119 39740 5309 6188 42089 60487 52185 43276 25717 -4639 18472 146063 295300 335438
35107 335438 265724 192249 161405 143551 149129 215604 292436 281447 187580 96656 18693 -97749
35095i7749j08641J7867J34012R9478j730n678O4872P4325K0236M023K3838p186
35083B17667p4918p2107K2852J10361R8630k0857j80452k52926j50230K7848O9905
35072b04227m5774r3227N0668J96583J44173o289n0816q194j0421k8049K9665
35061b5908P5481j2816j20115n6395R7823J10105r005m4897L0106L2563o9546
35050G396r7317j050M9226j8432n3766L1657J12527Q6852M0210O2674R3665N6411
35038C70053r893l8529k5782J4069N6749K3868j18217k29973j52068L1104R3398
35027A4779J7103n625P3232Q0446n0511j51370j07158j7042K9884Q9834J68242
35016A41814J41077K076n5072N0258J23811J2550j39873j39356m1657q036l8721
$$ plain form
35095 -97749 -206390 -188523 -54511 44967 43237 37559 102431 176756 196992 201015 224853 217667
35083 217667 142749 70642 93494 203855 302485 281628 101176 -151750 -301980 -274132 -204227
35072 -204227 -250001 -343228 -292560 -95977 48196 41907 -8909 -17103 -27524 -55573 -25908
35061 -25908 49573 36757 -83358 -139753 -41930 68175 59170 14273 44379 76942 7396
35050 7396 -89921 -90971 -41745 -60177 -113943 -82286 30241 117093 157303 219977 313642 370053
35038 370053 360160 321631 295849 309918 366667 390535 272318 42345 -109723 -78619 14779
35027 14779 31882 26257 99489 179935 129424 -21946 -129104 -146146 -116262 -26428 141814
35016 141814 282891 284967 229895 280153 403964 416514 276641 137285 95628 87592 48871
35005D8871n3779q0211j49327j48135J1107J87048J85512M7574l6285j6986L917
34994f94j2731j5485l276j9142l4774M846N5279L4307k6815l3730M521p01n3245
34981a01640o7181j3006N1462Q5637R4133O5307j1968p8898n5306L8546R1696
34970I8782M2158n5285j05037p0926k452J7282l4102p7453l2243N2769N4101l7591
34958a49997r4611m5468L2115O0765P7266J22422J38457P1311k3514o7767o4149
34947E6830l6993K7722J01389Q5050l8541j32463r0510R785M6154L1380L0113
34936H9916Q405q2267j59717j12775J0629P1309N2003N5222J14471J47107R4066
34925B88369j418n8413l1953N8474J22120O5852p9402j68867j32218o0735m5841
$$ plain form
35005 48871 -4908 -85119 -234446 -382581 -371474 -184426 1086 48660 12375 -4611 -694
34994 -694 -13425 -28910 -32186 -51328 -86102 -81256 -25977 8330 -18485 -52215 -47694 -48395 -101640
34981 -101640 -168821 -181827 -130365 -44728 49405 114712 102744 23846 -31460 7086 98782
34970 98782 140940 85655 -19382 -90308 -92760 -75478 -109580 -187033 -219276 -166507 -112406 -149997
34958 -149997 -244608 -290076 -257961 -197196 -119930 2492 140949 212260 188746 120979 56830
34947 56830 19837 47559 148948 233998 195457 62994 -27516 -17731 28423 59803 89916
34936 89916 98321 16054 -143663 -256438 -245809 -174500 -122497 -67275 47196 194303 288369
34925 288369 286951 228538 196585 255059 377179 443031 363629 194762 62544 1809 -44032
34914d4032m6981q219J8702j3972l0527M0438J19129R6238J0780l2677l2794l5729
34902D0356r707O7563R3689j1413j29385r8610K9200P6130J3594m2630m7193l1639
34890e0045L9489J94139K85244J45671j09466j89963m7414P1108J9302o0243k0107
34879B77715O4740O9218J4589l2023q4355j42243j21340R11R9571P6919M576j6153
34867B12125j7837p2243j34946j12293j2611Q0077J24580J21684N9289m4044r8133
34856A05648m6762K7233N411q3849r4652J9644J21730P2831o5992r8618M5424
34845H048K00914J73836k013j17733p6343P872K1002M999K0704Q501p8028j26005
34833D5754k5325J12477Q9113q0248j94287j62430q2448l5283K568L3130J1235
$$ plain form
34914 -44032 -91013 -99232 -80530 -94502 -125029 -84591 34538 130776 141556 108879 76085 40356
34902 40356 30649 98212 191901 180488 51103 -47507 -18307 57823 71417 28787 -18406 -50045
34890 -50045 -10556 183583 468827 614498 505032 315069 267655 338763 358065 297822 277715
34879 277715 342455 411673 426262 394239 309884 167641 46301 47212 146783 223702 228278 212125
34867 212125 194288 122045 -12901 -125194 -137805 -57728 66852 188536 247825 203781 105648
34856 105648 58886 86119 91530 7681 -86971 -67327 54403 127234 61242 -37376 8048
34845 8048 208962 382798 380785 263052 186709 194581 215583 220582 241286 249787 171759 45754
34833 45754 20429 132906 222019 141771 -52516 -214946 -297394 -332677 -330109 -296979 -285744
34822b85744l1024o097O2374O5264J2428K2302Q7022O0760o7770j12979R816J33545
34810e0103J02241l897m0304k6667n2362r1043o6585k873L0394L7824N1467N1266
34798f0642L1399M6783R5908P0798o4608j63403r4165N5354J14579P5774N0751
34787A58528N9659K7019n4991j08826r7079m9374P601M5807P932j07568j82324
34776b93616j15029K2446Q5235O5963P0551J15858J01583j0162j20876j31940
34766b09987n5155M0156J08074J29508J02559N2967J0740k4405n5694n2176L863
34755E0450N8619M6847p487k6216l325j4274q8047j45127r9149K3770J07503P8124
34743a8312j0509l8307L3831J10049Q5595p748n1314j3885K1297Q972O566M7965
$$ plain form
34822 -285744 -316768 -322865 -260491 -195227 -182799 -160497 -73475 -12715 -80485 -193464 -183648 -50103
34810 -50103 52138 48241 7937 -18730 -71092 -162135 -228720 -231593 -201199 -163375 -111908 -60642
34798 -60642 -29243 17540 113448 184246 119638 -43765 -137930 -82576 32003 107777 158528
34787 158528 218187 245206 190215 81389 -15690 -65064 -57463 -11656 -3724 -111292 -293616
34776 -293616 -408645 -386199 -300964 -235001 -164450 -48592 52991 42829 -78047 -209987
34766 -209987 -265142 -224986 -116912 12596 115155 168122 178862 154457 98763 46587 50450
34755 50450 109069 155916 148429 122213 118888 104614 16567 -128560 -227709 -203939 -96436 -18312
34743 -18312 -28821 -67128 -33297 76752 162347 154599 103285 89400 110697 119669 126235 174200
34731A74200O6932J4595m6482m8731l2244n6360p5503j4508Q3493R9253P492r1538
34719H0599j07045n1402K526O607k3261l2829n164J416n7909j09278m3920R3222
34707b46438J32971L4564m1004J8810J07725Q7790M264k4217q908k8325n9512
34696b2280l4609J0005R69k1598K0270P7395M8668l0990m5636L418K4550J9287
34684D9449N8121J06521O9096r370R396J06970J16588J1384l0958Q0470J92698
34673G60365J44309n928j00629j05338r3613j06162j28265j41805j25328o0414
34663C7192J5298K9437j7760m6608k3523o29o024l036R029k6009r3764q5229L3670
34650a77956J44655J45471Q6629N6114L3821l6353j14300j14568l7316M0878O5046
$$ plain form
34731 174200 241132 255727 209245 160514 128270 71910 -3593 -18101 65392 164645 172137 80599
34719 80599 -26446 -77848 -75322 -68715 -91976 -124805 -129969 -128553 -186462 -295740 -339660 -246438
34707 -246438 -113467 -78903 -119907 -101097 6628 94418 98682 74465 65557 37232 -22280
34696 -22280 -56889 -46884 -45915 -67513 -47243 30152 78820 47830 2194 5612 30162 49449
34684 49449 107570 214091 283187 273817 283213 390183 506771 518155 487197 567667 760365
34673 760365 904674 898746 798117 692779 599166 493004 364739 222934 97606 37192
34663 37192 52490 81927 64167 17559 -5964 -6593 -12617 -15653 -6624 -32633 -126397 -211626 -177956
34650 -177956 -33301 112170 198799 254913 288734 252381 138081 23513 -13803 27075 92121
34639I2121K5855n9669j30241j05126R891J03038J00840O0624N9319P4468N2202
34628B83322R685j9608o2947j31676j45577m9548O0766N7890k5231n8578k9990
34617a11492m2654j11178j24742m1195L4413K4132k026L8177R2410O8155m068
34606a80068k1968J4844Q138o2468q7737J328J08919J00396o818p7847o3308n4979
34594c21568j14255j54148o9186Q9556J70308J20442L1744p006n681m969k835
34583b67598J0889J3376j0953l3621k4138M782K2798K2676J5275J2430K6329N6223
34571a51532P5649O9302O9188R9488J06398K8224p2300n7190Q2058J86094J45362
34560E80741M1376o037k1753r3149j88880j96795j04385j3356J4454J2841J3109
$$ plain form
34639 92121 117976 58307 -71934 -177060 -167169 -64131 36709 97333 156652 231120 283322
34628 283322 293007 273399 210452 78776 -66801 -116349 -55583 2307 -22924 -81502 -111492
34617 -111492 -154146 -265324 -390066 -431261 -396848 -372716 -374742 -336565 -244155 -176000 -180068
34606 -180068 -202036 -187192 -179054 -241522 -329259 -327931 -219012 -118616 -125434 -203281 -266589 -321568
34594 -321568 -435823 -589971 -659157 -569601 -399293 -278851 -247107 -254113 -259794 -264763 -267598
34583 -267598 -256709 -243333 -254286 -287907 -312045 -307263 -284465 -261789 -246514 -234084 -207755 -151532
34571 -151532 -75883 -6581 62607 162095 268493 296717 224417 167227 249285 435379 580741
34560 580741 622117 616080 594327 501178 312298 115503 11118 -2238 12216 25057 38166
34549C8166j955k7973j7277M1005R3079J02505R3411Q1013K7157q4363j77824
34538A66944j54791j8936J16329J46209O9824l3942r3607q9730l6117M1135R5929
34527B09247P5020k0450j06428r8006j3225N5634O7803O3416O2788K5847m9234
34516B72412p6079j580R0686Q7193N930m5330l6704l1214m5734k0061N1727P4118
34504C25364q988j14818j32968p1482k0253j9991m4349p2692r5409p0240L3370
34493b92456J46724J50724L3250q5473j14727r2647p5126k3743R8847J94888J27507
34482F7768o8394k00834j59511k4626Q3233J35286J31623M2671r6278j47865m8089
34471b85016O9852N5823l0430k3069P8123J19451N7402J6540N3936N7740l7701
$$ plain form
34549 38166 36211 8238 -9039 31966 125045 227550 320961 401974 429131 344768 166944
34538 166944 12153 -6783 109546 255755 325579 291637 198030 108300 72183 113318 209247
34527 209247 284267 263817 157389 59383 46158 101792 169595 233011 295799 321646 272412
34516 272412 196333 194753 285439 372632 378562 333232 296528 265314 219580 199519 251246 325364
34504 325364 316376 201558 68590 -2892 -23145 -43136 -87485 -160177 -255586 -325826 -292456
34493 -292456 -145732 4992 38242 -47231 -161958 -254605 -329731 -353474 -254627 -59739 67768
34482 67768 -626 -201460 -360971 -385597 -302364 -167078 -35455 7216 -89062 -236927 -285016
34471 -285016 -215164 -159341 -189771 -212840 -134717 -15266 42136 58676 112612 170352 132651
34460A32651j04800j8953J21966J27956k312q6952k9756N8294L7704o5717j11899
34449E8182l9238O4422Q2254R017o0464n9529j5857J4684K0699J0328k6673p6194
34437a8369p1684J7403J10372J11045M3845M707J0384K03l8970o3744p0404p9768
34425d4980m7072P3078J83885J30835n7407j76869j25637q942O3608J02421J11901
34414B04821M0729o4328n9390M1290K4244j76601l11615j73436P8531J69272J07745
34403a18738Q4846J15124O3688n2825p4284K3164J01270R9107P9534N7330n066
34392C73150n4456j6470K0847p4916k06735j53862N1347J34581L644j24746r5210
34381a42826k6814m1180m6858M5545J22924O5990l7687n1448k066K7391O2577
$$ plain form
34460 132651 27851 8898 130864 258820 256508 169556 139800 198094 235798 170081 58182
34449 58182 18944 83366 165620 174637 114173 54644 38787 53471 74170 84498 57825 -18369
34437 -18369 -90053 -72650 37722 148767 192612 197319 207703 207906 168936 105192 34788 -44980
34425 -44980 -92052 -18974 164911 295746 238339 61470 -64167 -73109 -9501 92920 204821
34414 204821 245550 181222 121832 163122 187366 10765 -300850 -474286 -395755 -226483 -118738
34403 -118738 -33892 81232 144920 92095 17811 40975 142245 241352 320886 378216 373150
34392 373150 318694 302224 323071 248155 41420 -112442 -61095 73486 77130 -47616 -142826
34381 -142826 -169640 -210820 -257678 -212133 -89209 -23219 -60906 -112354 -114420 -87029 -24452
34370b4452J29351J28576j151j25827j04223j6036j4385o1088j6651R1552J12717
34359I8383L6584j117L8991N3081k315m4690l3095l6595q7013j02831k2756Q9534
34347a3839J33851R1854J3282n3577q1866o5493k8014l996k617q435m120K5975
34335C005Q0533J07332M1112q7122j47938p6344L5192P1914M3713J4416k5272
34324F0541j00242j44208q5759J3472M3197J9749L4075O8334K7023p0636r9465
34313b33919l2372K6185K4218K1787M7382N5183N1928R8640J49191P0060j14960
34302A63323j88592m9982J12120Q4544q1837j93083j90295j45400q5331M269P0792
34291d99472N8268L0786P7811J41806J00433j3343m3290M6834J27457J11176M8360
$$ plain form
34370 -24452 104899 233475 232324 106497 2274 -13762 -28147 -89235 -105886 -14334 98383
34359 98383 134967 133850 172841 225922 223607 178917 145822 109227 22214 -80617 -103373 -13839
34347 -13839 120012 211866 225148 171571 89705 24212 -3802 -7798 -10415 -18850 -22970 3005
34335 3005 83538 190870 231982 144860 -3078 -79422 -44230 27684 71397 85813 60541
34324 60541 -39701 -183909 -269668 -256196 -212999 -193250 -159175 -90841 -63818 -134454 -233919
34313 -233919 -266291 -240106 -215888 -194101 -146719 -91536 -39608 59032 208223 278283 163323
34302 163323 -25269 -75251 36869 121413 39576 -153507 -343802 -489202 -574533 -570264 -499472
34291 -499472 -441204 -410418 -332607 -190801 -90368 -103711 -147001 -100167 27290 138466 186826
34280A86826r090q1067j48340j18113K4137J50369J59548J08464R1348Q7218K7604
34269D78904n9978q9611n8024m5813r0805j40583j31905o2531J6136M4923Q080
34258a31207l8472j7651O8328J29033J04477M1434J3786K3216K9067K1265L472
34247B46748m2548j07631j23371n7541J0872K900k5234K8338J22979J12738l0182
34236A38068j62183j62800o4160M5207J27879J60658J02286l0980j40137j56705
34226a42867j11955n1859K6545J03464J06639K9700j8144K9359Q1501L9220l5575
34215E6028k9095K3900K103q9435j31277r1946n2136k6930O0379J90917K12332
34204A24840P3332n0839J1516J74645K08126N0218j26268j55106o6888k845k1658
$$ plain form
34280 186826 177736 96669 -51671 -169784 -145647 4722 164270 272734 364082 451300 478904
34269 478904 418926 329315 271291 225478 134673 -5910 -137815 -200346 -184210 -139287 -131207
34258 -131207 -169679 -187330 -119002 10031 114508 155942 169728 192944 222011 243276 246748
34247 246748 204200 96569 -26802 -84343 -73471 -70571 -95805 -67467 55512 168250 138068
34236 138068 -24115 -186915 -251075 -205868 -77989 82669 184955 153975 13838 -142867
34226 -142867 -254822 -306681 -280136 -176672 -70033 -40333 -58477 -29118 52383 91603 56028
34215 56028 26933 50833 52936 -36499 -167776 -259722 -311858 -338788 -278409 -87492 124840
34204 124840 198172 147333 158849 333494 541620 591838 465570 310464 243576 240731 219073
34193B19073o0152n7004m1401o9982j21520j18297m7156J2073L561k8716k5545
34182c35066r15J7812O2530J43125J61867L7433j25058j34574J9561J45943J14521
34171A07179J690o5216p0545n4516j6689M2887P8546P1893P4157J12297J28605
34160D10288P4155j2372p5272j14304j34775j11027n5951l6508o0194m4047L6977
34149a23030Q0758K2021m5857j9043M8289M2860k7979p7449q0030n1660K3978
34138b07142J20118J12327m8428j96847j59644j8828K6883j2346L1362J48062
34128b04483J41608j7097j04682n080R4114Q134j48387j52498j3305P3067K4689
34117c03920m8586l5541N0640J32914J58535J23995O7699K8234r135p9391j44379
$$ plain form
34193 219073 158921 101917 60516 -9466 -130986 -249283 -296439 -284366 -280805 -309521 -335066
34182 -335066 -335981 -318169 -255639 -112514 49353 86786 -38272 -172846 -153285 -7342 107179
34171 107179 108869 43653 -26892 -81408 -98097 -55210 23336 95229 169386 281683 410288
34160 410288 484443 472071 396799 282495 147720 36693 -19258 -55766 -115960 -160007 -123030
34149 -123030 -42272 -20251 -66108 -85151 -36862 5998 -21981 -99430 -179460 -231120 -207142
34138 -207142 -87024 25303 -23125 -219972 -379616 -398444 -371561 -383907 -352545 -204483
34128 -204483 -62875 -79972 -184654 -189734 -95620 -87486 -235873 -388371 -401676 -328609 -303920
34117 -303920 -352506 -388047 -337407 -204493 -45958 78037 145736 173970 164835 85444 -58935
34106e8935j20131k3150K0727l5799q3661l8744K5531K5307J8087P6258J25376
34095f9134P1158o707K4452J03304O0650p7670j05998J9409Q7439l3860j78916
34084a05873j39142K6078J05033N1854m43Q262k503n6323l5509J22366K69230
34073B43030K12413j5756j78203j30285R456L9353n6113j18233o4044M412k0516
34062g4486p9683n1395M6573Q6716L5665o682J6510L6163j223l0808R483N3177
34050D0010Q179p9584q3280J5134J04269J04269M7050q705m7007o1195l7691o58
34038G91M1l0593l6307j2585j9065n7699l9953O2038J29308N7018p0949q3374
34026a01329M2354J61747J66100R2176K1836k4771o4959j00438j23401j23819
$$ plain form
34106 -58935 -179066 -202216 -181489 -217288 -300949 -339693 -314162 -288855 -270768 -194510 -69134
34095 -69134 2024 -4683 19769 123073 183723 106053 55 19464 106903 73043 -105873
34084 -105873 -245015 -218937 -113904 -62050 -62493 -54231 -56734 -113057 -148566 -26200 243030
34073 243030 455443 439687 261484 131199 140655 180008 123895 5662 -58382 -53970 -74486
34062 -74486 -154169 -205564 -158991 -72275 -36610 -43292 -26782 9381 8158 -22650 -13167 40010
34050 40010 48189 -31395 -114675 -99541 4728 108997 156047 147342 100335 39140 1449 791
34038 791 832 -29761 -66068 -78653 -97718 -155417 -195370 -133332 -4024 52994 -17955 -101329
34026 -101329 -58975 102772 268872 361048 382884 358113 293154 192716 69315 -54504
34016e4504p6392K5430J18000J17178L1057m3696n0320k7119k2367l2939m8434
34005f4106p4992q8282m6433K0198K4234l5376m7259M0175J27922J22842P6621
33994E5544P0149O3479j0718q9725o7623J7383M1176M959K1356R8791J14539K8981
33982C48291m1495k3495m543o4802j23698p2310L4682N2675l1709p8933K192J27974
33970A24829J48730L3732r3187r8253M813O9461k149j32163j65757o4322O8995
33959a05271J38723J45037J17276N4996k7720p5550n8007j0891K0329K6649N186
33948B30757m8624r2064n8173L2659O9454J3466k6954L6020J14477P0165o5375
33937B75808j30074o9167K485q576m9285l9419j0464l8001r9779j03156l5100
$$ plain form
34016 -54504 -130896 -105466 12534 129712 160769 117073 66753 39634 17267 -15672 -64106
34005 -64106 -139098 -227380 -273813 -253615 -229381 -264757 -312016 -271841 -143919 -21077 55544
33994 55544 125693 189172 178454 88729 21106 38489 79665 84624 105980 204771 319310 348291
33982 348291 306796 283301 278758 213956 90258 17948 52630 105305 73596 -5337 -3145 124829
33970 124829 273559 307291 214104 115851 120664 190125 187976 55813 -109944 -174266 -105271
33959 -105271 33452 178489 295765 350761 323041 247491 189484 178593 198922 225571 230757
33948 230757 182133 90069 31896 64555 134009 147475 120521 156541 271018 341183 275808
33937 275808 145734 76567 79052 70476 21191 -18228 -28692 -66693 -166472 -269628 -304728
33926c04728J3599n194j2497P3225J83038J65492L683j36092j16368m868L9546
33915a01164m957j9332N2876J18470P8855l3450j09864r0794O602J26207J94480
33904B17929J56539L8236o6308j04611j20059j61952j93753j43892j2835J22918
33894b67788J93335J82386J14240K9258l7785p8998j04156j09829q5765m8150
33884b13252k3353k223L4299N0944k317q1930p8492K0837R9968Q7262N1273N6617
33872c67M0492o0231j55336j14118K2311Q5575K0043n3854k6746O3636J15325
33861f3270R3800M0462N707O233J8377M362l2172l3705L0891R8662Q0281j8255
33849B31373r8416r0393k3570K3418M309o0767j06191q5921l1469j3267l2653
$$ plain form
33926 -304728 -291129 -296323 -308820 -235595 -52557 112935 116618 -19474 -135842 -140710 -101164
33915 -101164 -106121 -125453 -72577 45893 124748 91298 -18566 -109360 -102758 23449 217929
33904 217929 374468 412704 346396 241785 121726 -40226 -233979 -377871 -390706 -267788
33894 -267788 -74453 107933 222173 251431 213646 134648 30492 -79337 -165102 -213252
33884 -213252 -236605 -238828 -204529 -153585 -155902 -237832 -316324 -295487 -195519 -108257 -56984 -367
33872 -367 40125 -20106 -175442 -289560 -267249 -181674 -161631 -215485 -242231 -178595 -63270
33861 -63270 30530 70992 76699 82932 101309 105671 73499 39794 70685 169347 249628 231373
33849 231373 132957 42564 18994 42412 46721 -14046 -120237 -206158 -237627 -250894 -283547
33838b83547j3361O7177J16310O1277k5941k8434M5722R4249Q2272O3791O0681
33827B40196L0386m0101j00419j11179q1663k9854K8433N3438J3779n2836p0623
33816a20443j6657O4666J19196J11049L3050n5670n7880K5965O1127k7567j08610
33805B8226k7717J32443J53335M654j28727j41658j22328j33780r3790L8356J40572
33794a50414J14614M6108N0095Q2678M3878l6166o0076l4655l3528m4108J643
33783a9931P3911O5709l1540r6576m6696N6933J02780N6966l2085j01880j15810
33772h8219p0145O162O8143Q7754P3023N3729M3759J7348n6520j44192j53105
33761a62263n0964O1652O9416J833j9466K5016L2387l3873o8051O168J03697J04717
$$ plain form
33838 -283547 -296908 -229731 -113421 -52144 -78085 -106519 -60797 33452 115724 179515 240196
33827 240196 270582 230481 130062 18883 -62780 -92634 -64201 -10763 3016 -49820 -120443
33816 -120443 -137100 -72434 46762 157811 190861 135191 77311 103276 164403 136836 28226
33805 28226 509 132952 286287 290941 162214 20556 -101772 -235552 -329342 -290986 -150414
33794 -150414 -35800 10308 60403 143081 186959 150793 90717 56062 22534 -21574 -19931
33783 -19931 53980 119689 88149 -8427 -55123 1810 104590 161556 129471 27591 -88219
33772 -88219 -158364 -152202 -84059 3695 76718 130447 174206 191554 135034 -9158 -162263
33761 -162263 -213227 -151575 -82159 -80326 -99792 -74776 -42389 -76262 -144313 -138145 -34448 70269
33749G0269K7333k1977j0563L390j7057m1006k3185M8444J41616J84102J14830
33738D76196l4594j48503j49189o8801K1000Q8637J21365R7829L1722j8566l0476
33727C86620m6424q3039q7532l5081J2213O592o818J4609J9892m2881j16798j18976
33715i7623p4246o4274q9680q1887j6720P1887J54144J98529J51405J4061j04154
33704F1442j04989l4077k133k0757k1815L492O000n887K7050R9146J37210J10078
33692B54760M8825k6161j02275j22412m5776N3815O3477m145l6917o095L874m3193
33680C7777p3341l2653L2798O3173N5824K2863l1051o9091n2907k3592m9949r2307
33668b12456m5676O3564P5938n1353j45006o1254R8594J40650M9190l2270k9374
$$ plain form
33749 70269 97602 75625 65062 68452 51395 10389 -12796 35648 177264 361366 476196
33738 476196 441602 293099 143910 75109 96109 184746 306111 403940 435662 417096 386620
33727 386620 340196 257157 169625 134544 146757 153349 146531 161140 181032 138151 21353 -97623
33715 -97623 -171869 -236143 -325823 -407710 -424430 -352543 -198399 130 151535 165596 61442
33704 61442 -43547 -77624 -79757 -100514 -122329 -118837 -112837 -118724 -91674 7472 144682 254760
33692 254760 303585 277424 175149 52737 6961 60776 124253 120108 83191 77096 80970 37777
33680 37777 -35564 -68217 -35419 27754 83578 106441 75390 6299 -46608 -70200 -120149 -212456
33668 -212456 -258132 -194568 -118630 -169983 -314989 -376243 -277649 -136999 -87809 -120079 -149453
33657a49453m247j2595k1294J0669O1092R0071R7819J00333Q1710J0610r8858
33646A65857j72390j47302n4554P555k359j4377M6022J42579J79256J29884M4744
33635C24915m0863j18786j52318j08020l5010j1405j7003K7547R5077O5464o2352
33624c2754j19484n024J49437J54920J1583j26527j61878j17200l6486O1634J39920
33613h1859J44965P3862r052l5131M968N3608M0225l3653p5924j7553P4986P9509
33601B18951j752n0589l0462m1879j32326j89165j13053J7491O7449M0528L2590
33590a82217O1598P1498N7342O1209P0274L2375m1084q4769p8541n2691j6187
33579a01193L5171O3270K9441k6909l4765M629L8853N5745O5860L5993n0855j06299
$$ plain form
33657 -149453 -153700 -166295 -187589 -176920 -115828 -25757 72062 172395 254105 264715 165857
33646 165857 -6533 -153835 -208389 -200834 -203193 -217570 -171548 -28969 150287 280171 324915
33635 324915 284052 165266 12948 -95072 -130082 -141487 -158490 -130943 -35866 29598 -32754
33624 -32754 -152238 -157262 -7825 147095 158678 32151 -129727 -246927 -283413 -221779 -81859
33613 -81859 63106 136968 127916 92785 97753 151361 191586 157933 82009 64456 139442 218951
33601 218951 217199 166610 136148 94269 -38057 -227222 -340275 -322784 -255335 -214807 -182217
33590 -182217 -120619 -49121 8221 69430 139704 172079 130995 46226 -32315 -85006 -101193
33579 -101193 -66022 -2752 26689 -220 -34985 -30356 8497 64242 130102 166095 115240 8941
33567H941l7272Q4373R6933n433n7524J4568P5633J194j22760j30654j3428R4446
33555I017J06748N3255j2996p1122r7899o6503q92K8264j0835o5490o1953P196
33543a83210P9916R8449O5482K3914n36j5431k6851k1651J647J4391l027k5183
33531G910j4816K3931N4302N3910K5106k3904p6224r9461p4058j8010L7749P5886
33519b7679P5222J0586q9562j32222o8514K1621K4272n3956j02261n9776K7192
33508c75077R4198J19710R2554N163r7722j36197q8293r606N1442R1929R9536
33497a52363M3714m8846r1341n2692l210K681J2234P6334J35310R5251j9031q3056
33485h5015l8302M3027O9837L9718Q398L516O477o538l8682p6265r5061p1127
$$ plain form
33567 8941 -28331 56042 152975 147542 90018 104586 180219 181413 58653 -72001 -85429 9017
33555 9017 115765 169020 156024 84902 -12997 -79500 -80392 -52128 -62963 -128453 -190406 -183210
33543 -183210 -103294 -4845 60637 84551 84015 68584 41733 20082 21729 36120 33093 7910
33531 7910 -6906 17025 71327 125237 150343 126439 50215 -49246 -123304 -141314 -103565 -27679
33519 -27679 47543 58129 -31433 -163655 -232169 -210548 -186276 -240232 -342493 -402269 -375077
33508 -375077 -280879 -161169 -68615 -63452 -161174 -297371 -385664 -395270 -343828 -251899 -152363
33497 -152363 -108649 -157495 -248836 -301528 -304738 -302057 -289823 -213489 -78179 17072 -1959 -85015
33485 -85015 -123317 -80290 -10453 29265 37663 41179 47656 41118 2436 -73829 -168890 -240017
33473b40017p575N4830P9796Q6382J19981J61587J22125k3456j48826j16530J4830
33462A03127M5966p7355j70757q1468P6228R0208l4560j01623k7433O0865M9681
33451f7121p272k0214q958k8931n3739k8699K3984M0887J6267n705o264q98M110
33438a42553J7909M1832O4639O5973K6006l4174l9699M5601J30306R3016l3385
33427B35471r1656l2332K0671j4919m8424P763P0638K7261o7717q7175m0047k0813
33415d1279j4685O2823J62056J32775j9028r4119J6403J64569J51174j9147j82559
33404C18983k26299j59585m3210N3086O3309j4019q2785m5384P6580J69805J64470
33393B74951R1041J3355l8101o0219n5114l7406l3587m8988n1649j2671M5679
$$ plain form
33473 -240017 -247592 -192762 -112966 -26584 93397 254984 377109 353653 204827 88297 103127
33462 103127 149093 71738 -99019 -180487 -104259 -14051 -48611 -150234 -177667 -116802 -67121
33451 -67121 -74393 -94607 -103565 -132496 -186235 -214934 -190950 -150063 -133796 -139501 -145765 -146663 -142553
33438 -142553 -124644 -82812 -18173 47800 73806 39632 -67 45534 175840 268856 235471
33427 235471 143815 111483 132154 117235 68811 76574 147212 174473 106756 19581 -20466 -41279
33415 -41279 -55964 6859 168915 301690 282662 188543 204946 369515 520689 501542 318983
33404 318983 92684 -66901 -110111 -57025 6284 -7735 -90520 -135904 -59324 110481 274951
33393 274951 365992 379347 341246 281027 225913 188507 154920 105932 54283 41612 87291
33382H7291O7625L1371k6450o2955p4848o9235k6030N8508J14833O3563n8171
33371A05502j14389m4999N3142O7323J7256p150P166L363k8757m1055k1937j6118
33359b0653m4565p5159p8837n5360n062O3541J02504O7661p271m7426m6435o2339
33347b09401r6398o5062O8300K04189K06996O2864j03542j58701q9138m628p214
33336a91735o0277l6293Q5014J52588N6333p9835n2401J19560K11170J13218l2044
33325B85298o1406j38L7709K5692L206k0796m4026l0598J9192L3053k2118p1879
33313A53189n3039j4063j4790k0786O036J0702m4883p1871P530R8264O6884l3104
33301I0069m7850J5916J5291o0749n8895P2507J81863J46350L9549j4920j5757
$$ plain form
33382 87291 154916 186287 159837 96882 22034 -47201 -73231 -14723 100110 163673 105502
33371 105502 -8887 -53886 -744 66579 83835 76685 83851 87214 58457 17402 -4535 -20653
33359 -20653 -65218 -140377 -219214 -274574 -279636 -216095 -113591 -45930 -53201 -100627 -147062 -209401
33347 -209401 -305799 -370861 -302561 -98372 108624 171488 67946 -90755 -179893 -184521 -191735
33336 -191735 -252012 -288305 -203291 -50703 5630 -74205 -126606 -7046 204124 317342 285298
33325 285298 223892 223754 261463 287155 290361 269565 225539 194941 214133 247186 225068 153189
33313 153189 100150 86087 71297 50511 56547 67249 22366 -49505 -41975 56289 123173 90069
33301 90069 42219 58135 73426 12677 -46218 26289 208152 354502 394051 379131 363374
33290C63374k1282l5554m7864q4181j35519j29386m9111J5428J2364J5496P6576
33279a9659J04199J2344j08445j14460l2927n768n4076o6005r175J3200n0615
33268c31387j05655o2461L2158Q6975R4870R2278O6465p425q3511q6894j9133
33257c23720M8558P6018Q4146R1471Q9083Q6234J11049J38934Q8480n7913j84669
33246B47671j72122o2939n828m3234o9228k2169J2899k9039n0958M7886J67025
33235A9964J35172l659l8936O8104J14052j4221j49789j15049L08L893r0696j16522
33223a87379k9681O5745J19362J64209J67168M8505j35862k16438j50283p0526
33213b25180n2759o314J26957K30215J79805L1707p5334j05175j02056p0786L82
$$ plain form
33290 363374 342092 306538 258674 174493 38974 -90412 -139523 -124095 -111731 -96235 -19659
33279 -19659 84540 96884 -11561 -126021 -158948 -164716 -218792 -284797 -293972 -280772 -331387
33268 -331387 -437042 -499503 -467345 -380370 -285500 -193222 -126757 -134182 -217693 -304587 -323720
33257 -323720 -275162 -199144 -114998 -23527 65556 151790 262839 401773 490253 432340 247671
33246 247671 75549 12610 6782 -36452 -105680 -127849 -114950 -143989 -194947 -147061 19964
33235 19964 155136 151477 112541 180645 294697 280476 130687 15638 15946 19839 -70857 -187379
33223 -187379 -217060 -151315 -31953 132256 299424 347929 212067 -4371 -154654 -225180
33213 -225180 -277939 -284253 -157296 72919 252724 284431 209097 103922 1866 -68920 -68538
33202f8538N9162M7267k148k3511l2361p9264j28608r5723Q406P5257M9973k690
33190a92778k612M4625P7125O1222K2134R922M0972O8973L5252m4317q5628n0989
$$ plain form
33202 -68538 -9376 37891 35743 12232 -20129 -99393 -228001 -323724 -315318 -240061 -190088 -192778
33190 -192778 -195390 -150765 -73640 -12418 9716 19638 60610 129583 164835 120518 34890 -16099
$$ [...]
##END NTUPLES=NMR SPECTRUM
##END=
