##TITLE=31Pdec_13-2024
 DMSO-d5
 24 sc
 12.2.2024
##JCAMPDX= 6.0         $$ Bruker NMR JCAMP-DX V2.0
##DATA TYPE= NMR SPECTRUM
##DATA CLASS= NTUPLES
##ORIGIN= UXNMR, Bruker Analytische Messtechnik GmbH
##OWNER= root
$$ XWIN-NMR		Version 3.5
$$ Mon Feb 12 13:56:30 2024 Russian Standard Time (UT+4h)  she@DPX200
##.OBSERVE FREQUENCY= 81.013821
##.OBSERVE NUCLEUS= ^31P
##.ACQUISITION MODE= SIMULTANEOUS
##.ACQUISITION SCHEME= undefined
##.AVERAGES= 24
##.DIGITISER RES= 16
##SPECTROMETER/DATA SYSTEM= spect
##.PULSE SEQUENCE= zgpg30
##.SOLVENT NAME= CDCl3
##.SHIFT REFERENCE= (INTERNAL, CDCl3, 0, 248.564)
##AUDIT TRAIL= $$ (NUMBER, WHEN, WHO, WHERE, WHAT)
$$ ##TITLE= Audit trail, XWIN-NMR		Version 3.5
$$ ##JCAMPDX= 5.01
$$ ##ORIGIN= Bruker BioSpin GmbH
$$ ##OWNER= she
$$ F:/spectra/data/she/nmr/P31/1/pdata/1/auditp.txt
$$ ##AUDIT TRAIL=  $$ (NUMBER, WHEN, WHO, WHERE, WHAT)
(   1,<2024-02-12 13:55:22.03 +0400>,<she>,<DPX200>,
      <created by zg, POWCHK disabled, PULCHK disabled
       configuration hash MD5:
       00 E9 B6 7A A2 85 ED C7 34 08 36 98 17 FE 4E 26
       data hash MD5: 32K
       89 D0 58 B9 4F 5D E2 84 7C 10 2E C7 B3 1C 60 00>)
(   2,<2024-02-12 13:55:32.90 +0400>,<she>,<DPX200>,
      <Start of raw data processing
       efp BC_mod = 2 LB = 10 FT_mod = 6 PKNL = 1 PHC0 = -13128.03 PHC1 = 697.2838 SI = 64K 
       data hash MD5: 64K
       F0 C3 E4 65 45 A8 C0 8A 6F 02 97 A6 60 B6 27 15>)
(   3,<2024-02-12 13:55:47.87 +0400>,<she>,<DPX200>,
      <pk PHC0 = -188.5278 PHC1 = 293.7999 
       data hash MD5: 64K
       BB 1A A7 4E D7 AA CD E7 E3 01 0E E1 65 74 D9 51>)
(   4,<2024-02-12 13:55:50.53 +0400>,<she>,<DPX200>,
      <abs ABSG = 5 
       data hash MD5: 64K
       B4 DB BA A9 D5 F6 34 16 35 01 DB F9 5E 9B 8B 03>)
$$ ##END=
$$ 
$$ hash MD5
$$ A7 FC 71 7D 8C 09 F3 6F 0A B2 52 1B 4C 21 E5 FE
##$RELAX= 
##$RELAX= 
##$RELAX= 
##$RELAX= 
##$RELAX= 
##$RELAX= 
##$RELAX= 
##$RELAX= 
##$RELAX= 
$$ Bruker specific parameters
$$ --------------------------
##$DU= <F:/spectra>
##$EXPNO= 1
##$NAME= <P31>
##$PROCNO= 1
##$TYPE= <nmr>
##$USER= <she>
##$AMP= (0..31)
100 100 100 100 100 100 100 100 100 100 100 100 100 100 100 100 100 100 
100 100 100 100 100 100 100 100 100 100 100 100 100 100 
##$AQSEQ= 0
##$AQ_mod= 1
##$AUNM= <au_zg>
##$AUTOPOS= <>
##$BF1= 81.014009
##$BF2= 200.13
##$BF3= 200.13
##$BF4= 200.13
##$BF5= 200.13
##$BF6= 200.13
##$BF7= 200.13
##$BF8= 200.13
##$BYTORDA= 1
##$CFDGTYP= 0
##$CFRGTYP= 5
##$CHEMSTR= <none>
##$CNST= (0..31)
1 1 145 1 1 1 1 1 1 1 1 1 1 1 1 1 1 1 1 1 1 1 1 1 1 1 1 1 1 1 1 1 
##$CPDPRG= <waltz16>
##$CPDPRG1= <>
##$CPDPRG2= <waltz16>
##$CPDPRG3= <>
##$CPDPRG4= <mlev>
##$CPDPRG5= <mlev>
##$CPDPRG6= <mlev>
##$CPDPRG7= <mlev>
##$CPDPRG8= <mlev>
##$CPDPRGB= <>
##$CPDPRGT= <>
##$D= (0..31)
0 1 0 0 0 0 0 0 0 0 0 0.03 2e-05 3e-06 0 0 0 0 0 0 0 0 0 0 0 0 0 0 0 0 
0 0 
##$DATE= 1707731721
##$DBL= (0..7)
120 120 120 11 120 120 24 19 
##$DBP= (0..7)
150 150 150 150 150 150 150 150 
##$DBP07= 0
##$DBPNAM0= <>
##$DBPNAM1= <>
$$ [...]
##$SUBNAM3= <"">
##$SUBNAM4= <"">
##$SUBNAM5= <"">
##$SUBNAM6= <"">
##$SUBNAM7= <"">
##$SUBNAM8= <"">
##$SUBNAM9= <"">
##$SW= 501.771253377433
##$SWIBOX= (0..15)
0 1 3 0 0 0 0 0 0 0 0 0 0 0 0 0 
##$SW_h= 40650.406504065
##$TD= 32768
##$TD0= 1
##$TE= 0
##$TE2= 300
##$TE3= 300
##$TEG= 300
##$TL= (0..7)
0 120 53 12 22 120 120 120 
##$TP= (0..7)
150 150 150 150 150 150 150 150 
##$TP07= 0
##$TPNAME0= <>
##$TPNAME1= <>
##$TPNAME2= <>
##$TPNAME3= <>
##$TPNAME4= <>
##$TPNAME5= <>
##$TPNAME6= <>
##$TPNAME7= <>
##$TPOAL= (0..7)
0.5 0.5 0.5 0.5 0.5 0.5 0.5 0.5 
##$TPOFFS= (0..7)
0 0 0 0 0 0 0 0 
##$TUNHIN= 0
##$TUNHOUT= 0
##$TUNXOUT= 0
##$USERA1= <user>
##$USERA2= <user>
##$USERA3= <user>
##$USERA4= <user>
##$USERA5= <user>
##$V9= 5
##$VALIST= <valist>
##$VCLIST= <CCCCCCCCCCCCCCC>
##$VD= 0
##$VDLIST= <DDDDDDDDDDDDDDD>
##$VPLIST= <PPPPPPPPPPPPPPP>
##$VTLIST= <TTTTTTTTTTTTTTT>
##$WBST= 1024
##$WBSW= 4
##$XGAIN= (0..3)
0 0 0 0 
##$XL= 0
##$YL= 0
##$YMAX_a= 3501
##$YMIN_a= -3447
##$ZGOPTNS= <>
##$ZL1= 120
##$ZL2= 120
##$ZL3= 120
##$ZL4= 120
##$ABSF1= 248.5645
##$ABSF2= -253.2056
##$ABSG= 5
##$ABSL= 3
##$ALPHA= 0
##$AQORDER= 0
##$ASSFAC= 0
##$ASSFACI= 0
##$ASSFACX= 0
##$ASSWID= 0
##$AUNMP= <proc_1d>
##$AZFE= 0.1
##$AZFW= 0.5
##$BCFW= 0
##$BC_mod= 2
##$BYTORDP= 0
##$COROFFS= 0
##$CY= -3
##$DATMOD= 1
##$DC= 0
##$DFILT= <>
##$DTYPP= 0
##$F1P= 0
##$F2P= 0
##$FCOR= 1
##$FTSIZE= 65536
##$FT_mod= 6
##$GAMMA= 0
##$GB= 0
##$INTBC= 1
##$INTSCL= 6.047779e-11
##$ISEN= 30
##$LB= 10
##$LEV0= 0
##$LPBIN= 0
##$MAXI= 10000
##$MC2= 0
##$MEAN= 0
##$ME_mod= 0
##$MI= 50
##$NCOEF= 0
##$NC_proc= -7
##$NLEV= 6
##$NOISF1= 182.463
##$NOISF2= 159.3651
##$NSP= 0
##$NTH_PI= 0
##$NZP= 0
##$OFFSET= 248.5645
##$PC= 4
##$PHC0= -13316.56
##$PHC1= 991.0837
##$PH_mod= 1
##$PKNL= yes
##$PPARMOD= 0
##$PSCAL= 0
##$PSIGN= 0
##$REVERSE= no
##$SF= 81.0140089999694
##$SI= 65536
##$SIGF1= 159.3651
##$SIGF2= -187.1042
##$SINO= 113.3802
##$SIOLD= 16384
##$SREGLST= <1H.CDCl3>
##$SSB= 0
##$STSI= 65536
##$STSR= 0
##$SW_p= 40650.406504065
##$SYMM= 0
##$S_DEV= 0
##$TDeff= 32768
##$TDoff= 0
##$TI= <>
##$TILT= no
##$TM1= 0
##$TM2= 0
##$TOPLEV= 0
##$USERP1= <user>
##$USERP2= <user>
##$USERP3= <user>
##$USERP4= <user>
##$USERP5= <user>
##$WDW= 1
##$XDIM= 65536
##$YMAX_p= 366112839
##$YMIN_p= -3231238
$$ End of Bruker specific parameters
$$ ---------------------------------
##NTUPLES= NMR SPECTRUM
##VAR_NAME=  FREQUENCY,     SPECTRUM/REAL,   SPECTRUM/IMAG
##SYMBOL=    X,             R,               I
##VAR_TYPE=  INDEPENDENT,   DEPENDENT,       DEPENDENT
##VAR_FORM=  AFFN,          ASDF,            ASDF
##VAR_DIM=   65536,         65536,           65536
##UNITS=     HZ,            ARBITRARY UNITS, ARBITRARY UNITS
##FACTOR=    0.620285442955139, 1,           1
##FIRST=     20137.2065510682, 0,            0
##LAST=      -20513.1999529968, 0,           0
##MIN=       -20513.1999529968, -3231238,    0
##MAX=       20137.2065510682, 366112839,    0
$$ Real data points
##PAGE= N=1
##DATA TABLE= (X++(R..R)), XYDATA
$$ [...]
38108g22202j00159j04418j03072r5043q0600o0975l7618j1574J6729M7211P9440
$$ -722202 -822361 -926779 -1029851 -1124894 -1205494 -1266469 -1304087 -1315661 -1298932 -1251721 -1172281
38097a172281J11760J40855J62389J72756J70941J59244J42323J25063J10499
$$ -1172281 -1060521 -919666 -757277 -584521 -413580 -254336 -112013 13050 123549
38088A23549R8845Q8198P6444O3118M9998M0107L6013L8511M6276N6416O5638
$$ 123549 222394 310592 387036 450154 500152 540259 576272 614783 661059 717475 783113
38077G83113P1535P3385P1895O8116O2267N3327L9630J9942n661l5653o7651r9134
$$ 783113 854648 928033 999928 1068044 1130311 1183638 1223268 1243210 1237549 1201896 1134245 1035111
38065A035111j27744j51210j67445j75120j74329j66537j53852j38188j20985
$$ 1035111 907367 756157 588712 413592 239263 72726 -81126 -219314 -340299
38056c40299j03462q6880p2484o1275n3839n0352n0727n4735o1901p1098q0023
$$ -340299 -443761 -530641 -603125 -664400 -718239 -768591 -819318 -874053 -935954 -1007052 -1087075
38045a087075q5139q2530o9471m5742j3676K3041O0914R7386J30588J58801J80380
$$ -1087075 -1172214 -1254744 -1324215 -1369957 -1383633 -1360592 -1299678 -1202292 -1071704 -912903 -732523
38034g32523J94263K00371J99458J92614J80890J65241J46413J24661R9514P0176
$$ -732523 -538260 -337889 -138431 54183 235073 400314 546727 671388 770902 841078
38024H41078L6475k92l7364p1473r9974j21274j34473j38933j34408j21585j02186
$$ 841078 877553 877261 839897 768424 668450 547176 412703 273770 139362 17777 -84409
38013h4409p8330n1713k3476N264L2817N6938P5446Q7002R1645R0745Q6479Q0959
$$ -84409 -162739 -214452 -237928 -232664 -199847 -142909 -67463 19539 111184 201929 288408 369367
38001C69367P5607P1005O7155O3883O0991N8105N4232M7486L5465J6409r390l8836
$$ 369367 444974 515979 583134 647017 708008 766113 820345 867831 903296 919705 910315 871479
37989H71479o6635q7161r6833r5748q7718p8590p3841p6590q6797j01678j17147
$$ 871479 804844 717683 620850 525102 437384 358794 284953 208363 121566 19888 -97259
37978i7259j29642j37531j41341j42759j43201j42869j40708j35022j24372j08428
$$ -97259 -226901 -364432 -505773 -648532 -791733 -934602 -1075310 -1210332 -1334704 -1443132
37968a443132q8336o6395m5131k6367j0873J434J1233J9809K9123M1450N8571
$$ -1443132 -1531468 -1597863 -1642994 -1669361 -1680234 -1678800 -1667567 -1647758 -1618635 -1577185 -1518614
37957a518614Q0996J07662J36088J62766J83711J95251J94793J81329J55490J19545
$$ -1518614 -1437618 -1329956 -1193868 -1031102 -847391 -652140 -457347 -276018 -120528 -983
37947i83P7288L3591o707l9998o4559q0283q7997q8990q4868p7423o8346n8841
$$ -983 76305 109896 103189 63191 -1368 -81651 -169648 -258638 -343506 -420929 -489275 -548116
37935e48116m9444m0123l0501k0042q194N405K0581L6347N0974O2539O9601P1627
$$ -548116 -597560 -637683 -668184 -688226 -696420 -691015 -670434 -634087 -583113 -520574 -450973 -379346
37923c79346O8938O2458N3485M3346L2858K1847R338n607k2981m1513n9004p3096
$$ -379346 -310408 -247950 -194465 -151119 -118261 -96414 -87076 -92683 -115664 -157177 -216181 -289277
37911b89277q2203q6360q7311q7397q7825q7760q5064p7908o5771m9193k8930
$$ -289277 -371480 -457840 -545151 -632548 -720373 -808133 -893197 -971105 -1036876 -1086069 -1114999
37900a114999n492K0604M8341P5974J01374J22701J38945J49923J55848J57043
$$ -1114999 -1120491 -1099887 -1051546 -975572 -874198 -751497 -612552 -462629 -306781 -149738
37890a49738J54081J48175J41064J34251J28120J21811J14083J04489R3793Q3392
$$ -149738 4343 152518 293582 427833 555953 677764 791847 896336 990129 1073521
37880A073521P4330O6701N9753N2246M2929L0991J6402p4j7210l3606m7714n7848
$$ 1073521 1147851 1214552 1274305 1326551 1369480 1400471 1416873 1416799 1399589 1365983 1318269 1260421
37868A260421o2682o2048n7367n1208m6179m4062m5633n0971n9624p0178p9649
$$ 1260421 1197739 1135691 1078324 1027116 980937 936875 891242 840271 780647 710469 630820
37857F30820q3669p8002o0700l3285O4L4738O7700R7999J25812J50912J71653
$$ 630820 547151 469149 408449 375164 375228 409966 477666 575665 701477 852389 1024042
37846A024042J85142J88556J80844J63576J40320J14942R0077O6563M3794K0704
$$ 1024042 1209184 1397740 1578584 1742160 1882480 1997422 2087499 2154062 2197856 2218560
37836B218560l123k6606m7222o2115o9643p0237o6074n9819n3354m7102m0290
$$ 2218560 2215437 2188831 2141609 2079494 2009851 1939614 1873540 1813721 1760367 1713265 1672975
37825A672975l2097k2991j5292j2321j6592k8263m4778o1869p5242q2353q3346
$$ 1672975 1640878 1617887 1602595 1590274 1573682 1545419 1500641 1438772 1363530 1281177 1197831
37814A197831q0768p8080p8035q1799q9042r8396j07957j15863j21038j23639
$$ 1197831 1117063 1038983 960948 879149 790107 691711 583754 467891 346853 223214
37804B23214j24749j25464j26117j26127j24325j19312j09677r4359p3175m7276
$$ 223214 98465 -26999 -153116 -279243 -403568 -522880 -632557 -726916 -800091 -847367
37794h47367j8967Q899L3443N1937O2018O2432N4095M0448K6596J7556J6511K3906
$$ -847367 -866334 -857435 -823992 -772055 -710037 -647605 -593510 -553062 -526466 -508910 -492399 -468493
37782d68493L7674N4365P0487Q3159Q9992Q8952P8948O0806L7625J3881o161j9798
$$ -468493 -430819 -376454 -305967 -222808 -132816 -43864 35084 95890 133515 147396 141235 121437
37770A21437k6358k6892k3432j8269j3393j0106q741q763r329j0164j1876j5330
$$ 121437 95079 68187 44755 26486 13093 2987 -5754 -14517 -23846 -34010 -45886 -61216
37758f1216k0512k5881k8672k5905j5314M073L1637O5021J00380J33232J59563
$$ -61216 -81728 -107609 -136281 -162186 -177500 -173427 -141790 -76769 23611 156843 316406
37747C16406J76477J82129J75463J56456J26721Q9627M9551J0718k3655n1747
$$ 316406 492883 675012 850475 1006931 1133652 1223279 1272830 1283548 1259893 1208146
37737A208146p3100q8298r8343j04055j05920j04437j00618r6096r2592r0930
$$ 1208146 1135046 1046748 948405 844350 738430 633993 533375 437279 344687 253757
37727B53757r0290q8285q1887o8523m6840j7122J8530N6460R2410J22744J45260
$$ 253757 163467 75182 -6705 -75228 -122068 -139190 -120660 -64200 28210 150954 296214
37716B96214J59202J64767J62503J52823J35821J11572Q0805M5480Q898k4797
$$ 296214 455416 620183 782686 935509 1071330 1182902 1263707 1309187 1318085 1293288
37706A293288n1519o8279p3928o9229n6413l8666j9712l148Q521J4721J6787J7117
$$ 1293288 1241769 1173490 1099562 1030333 973920 935254 915542 912394 920915 935636 952423 969540
37694I69540J8047K1030K6219L2407L7515L9672L8452L5554L4157L7177M5493
$$ 969540 987587 1008617 1034836 1067243 1104758 1144430 1182882 1218436 1252593 1289770 1335263
37683A335263N7431O9882P9962Q6014Q7399Q3805P4775N9790L8635J1837j9087
$$ 1335263 1392694 1462576 1542538 1628552 1715951 1799756 1874531 1934321 1972956 1984793 1965706
37672A965706n1703q3072j10333j31093j43691j47335j42237j29573j11288q9921
$$ 1965706 1914003 1830931 1720598 1589505 1445814 1298479 1156242 1026669 915381 825460
37662H25460o8488n0220l7833l2414l2571l4717l4472k8455j5393L774K6304M8273
$$ 825460 756972 706752 668919 636505 603934 569217 534745 506290 490897 494671 520975 569248
37650E69248O5343P3933P2502O2144M6167K8881J4356N489L450P314J4039J9133
$$ 569248 634591 708524 781026 843170 889337 918218 932574 938063 941513 948827 962866 981999
37638I81999J8149Q548r110l1445n3934p2719q5457r0951q8515p7893n9952l7463
$$ 981999 1000148 1008696 999586 968141 914207 841488 756031 665080 576565 498672 438720 401257
37626D01257j5124J584Q406M117r032k6599m4011n8172o7971p3915p7484q0307
$$ 401257 386133 387717 396123 400240 391208 364609 320598 262426 194455 120540 43056 -37251
37614c7251q3344q6381q8132q6930q1505p1562n7997m2614k7484j4113k887O740
$$ -37251 -120595 -206976 -295108 -382038 -463543 -535105 -593102 -635716 -663200 -677313 -680200 -673460
37602f73460J5445K3084K8326K9078K3409J0478q805l1640n3823p0976p9853p9050
$$ -673460 -658015 -634931 -606605 -577527 -554118 -543640 -552445 -584085 -637908 -708884 -788737 -867787
37590h67787o8882n1046k8453m902J5747L0546L7936L7648L0568J8710M933p877
$$ -867787 -936669 -987715 -1016168 -1021070 -1005323 -974777 -936841 -899193 -868625 -849915 -844982 -852859
37578h52859j7751k4139k7687k9530l0390k9968k7092k0695j0916O00J1526K0160
$$ -852859 -870610 -894749 -922436 -951966 -982356 -1012324 -1039416 -1060111 -1071027 -1070427 -1058901 -1038741
37566a038741K6151L0161L2859L4297L4292L3331L2771L3858L6465L8895L8990
$$ -1038741 -1012590 -982429 -949570 -915273 -880981 -847650 -814879 -781021 -744556 -705661 -666671
37555f66671L5620K9411K2449J7323J6101J9574K7112L7015M7095N5134N9280
$$ -666671 -631051 -601640 -579191 -561868 -545767 -526193 -499081 -462066 -414971 -359837 -300557
37544c00557N8539N3227M5027L6433K9667K5642K3604K1780J8653J3904Q237K315
$$ -300557 -242018 -188791 -143764 -107331 -77664 -52022 -28418 -6638 12015 25919 34156 36471
37532C6471m152j2199k2416l3800m3607m8487m6102l6253k0793k565J5902L3029
$$ 36471 32319 20120 -2296 -36096 -79703 -128190 -174292 -210545 -231338 -233903 -218001 -184972
37520a84972M8099O0750P0632P7316Q0432P9929P6239P0181O2577N3982M4970
$$ -184972 -136873 -76123 -5491 71825 152257 232186 308425 378606 441183 495165 540135
37509E40135L6662L0900K9587L3501M1300M9454N3479N0221L9966K6733J6194
$$ 540135 576797 607697 637284 670785 712085 761539 815018 865239 905205 931938 948132
37498I48132J2566J6700K6494L8733N0739O0886O8310P2463P2883O9147O0929
$$ 948132 960698 977398 1003892 1042625 1093364 1154250 1222560 1295023 1367906 1437053 1497982
37487A497982M8106L0956J0425j1880l4056n4602p3064r0155j07101j24336j40326
$$ 1497982 1546088 1577044 1587469 1575589 1541533 1486931 1413867 1323712 1216611 1092275 951949
37476I51949j51600j54357j46734j30018j07891q4385o2068m1570k2326l698J4332
$$ 951949 800349 645992 499258 369240 261349 176964 114896 73326 51000 47302 61634
37465F1634L1199M6234N9165P0476Q1554R4232J09528J26028J39327J43382J33240
$$ 61634 92833 139067 198232 268708 350262 444494 554022 680050 819377 962759 1095999
37454A095999J07359O8288K1689k5431o6435r6358j12655j15512j07520r2693
$$ 1095999 1203358 1271646 1293335 1267904 1201469 1105111 992456 876944 769424 676731
37444F76731p5027n7374m1263k7546j7000j0254p364p665j0178j4193j9503k6292
$$ 676731 601704 544330 503067 475521 458521 448267 440903 433238 423060 408867 389364 363072
37432C63072l4765m4797n5572o5416p1937p2728o6306n2660l3087r650J5082L8058
$$ 363072 328307 283510 227938 162522 90585 17857 -48449 -101109 -134196 -143846 -128764 -90706
37420i0706N6017O6267O7560O0372M6597K8952J0273p280k2722l6068m7439n6213
$$ -90706 -34689 31578 99138 159510 206107 235059 245332 238052 215330 179262 131823 75610
37408G5610o0932n9948n2354l8524k0123M34K0684L8465N1813N8756N7680M8181
$$ 75610 14678 -45270 -97624 -136148 -156271 -155837 -135153 -96688 -44875 13881 71561 119742
37396A19742L1671J0908j1333l3411n4928p5937r6076j14251j28869j38245j40982
$$ 119742 151413 162321 150988 117577 62649 -13288 -109364 -223615 -352484 -490729 -631711
37385f31711j36260j23986j04867q0618n4200k9674j1109r19J275j781o626j0797
$$ -631711 -767971 -891957 -996824 -1077442 -1131642 -1161316 -1172425 -1173344 -1172069 -1173850 -1180476 -1191273
37373a191273j3473j4909j5358j4279j0354k279J0216K5824M1980N5795O4959
$$ -1191273 -1204746 -1219655 -1235013 -1249292 -1259646 -1261925 -1251709 -1225885 -1183905 -1128110 -1063151
37362a063151O8192O5143N6140M2157K5019P464p475j7582k2259k2269j8739j2495
$$ -1063151 -994959 -929816 -873676 -831519 -806500 -799036 -806511 -824093 -846352 -868621 -887360 -899855
37350h99855m332M227J0752J2538P616m508k2556m3638o3825p9161q6695q5049
$$ -899855 -904187 -899960 -889208 -876670 -869054 -873562 -896118 -939756 -1003581 -1082742 -1169437 -1254486
37338a254486p4187n4652k6951Q144M8510Q9700J25357J49192J57376J49820J29769
$$ -1254486 -1328673 -1383325 -1410276 -1402132 -1353622 -1263922 -1138565 -989373 -831997 -682177 -552408
37327e52408J02337P2885M5816K3714O959o003j7754l0746m6515o5331q6140j06700
$$ -552408 -450071 -377186 -331370 -307656 -300697 -306700 -324454 -355200 -401715 -467046 -553186 -659886
37315f59886j24033j35274j38641j33836j21764j03943q1996n7376l1195m353
$$ -659886 -783919 -919193 -1057834 -1191670 -1313434 -1417377 -1499373 -1556749 -1587944 -1592297
37305a592297K2032M6156O5730P8792Q4575Q3599P6971O5729N0821L3602J6114
$$ -1592297 -1570265 -1524109 -1458379 -1379587 -1295012 -1211413 -1134442 -1068713 -1017892 -984290 -968176
37294i68176O21j1251j9152k3961k7226l0480l4747m0291m6695n3135n8608o1996
$$ -968176 -967555 -978806 -997958 -1021919 -1049145 -1079625 -1114372 -1154663 -1201358 -1254493 -1313101 -1375097
37282a375097o2106n7968m9232l6212j9580j53K0733M0757N6874O6649O9691O8133
$$ -1375097 -1437203 -1495171 -1544403 -1580615 -1600195 -1600348 -1579615 -1538858 -1481984 -1415335 -1345644 -1277511
37270a277511O5719O6184P1896Q3258R8841J15912J31091J41108J43538J37324
$$ -1277511 -1211792 -1145608 -1073712 -990454 -891613 -775701 -644610 -503502 -359964 -222640
37260b22640J22842J01561P5879M9239K5936R866K552K094M240M957K433k710
$$ -222640 -99798 1763 77642 126881 152817 162683 165235 167329 171569 176526 178959 176249
37248A76249q684j3923j7837k0710k3012k4575k4253k0384j1796J324J7130L2388
$$ 176249 167565 153642 135805 115095 92083 67508 43255 22871 11075 12399 29529 61917
37236F1917M3332M6964M2348L1242J7617O318J245L731J1929K1771K9149L1958
$$ 61917 105249 152213 194561 225803 243420 249738 250983 254714 266643 288414 317563 349521
37224C49521L0639K7207K3887K2339K3581K8149L5983M6153N6676O4792O7722
$$ 349521 380160 407367 431254 453593 477174 505323 541306 587459 644135 708927 776649
37213G76649O3612N2150L4676J3818p190k5352l8610m6090m7935m5104l9379l3192
$$ 776649 840261 892411 927087 940905 933715 908363 869753 823663 775728 730624 691245 658053
37201F58053k8944k8006l0280l4632l9720m4527m8492n1586n4448n8281o4340
$$ 658053 629109 601103 570823 536191 496471 451944 403452 351866 297418 239137 174797
37190A74797p3155q3896r4245j01073j01788r5641q3928o8818n1757l2762j1049
$$ 174797 101642 17746 -76499 -177572 -279360 -375001 -458929 -527747 -579504 -612266 -623315
37179f23315J3686M0309O6161Q7842J02456J08722J07369J00674R1464Q2110P3903
$$ -623315 -609629 -569320 -503159 -415317 -312861 -204139 -96770 3904 95368 177478 251381
37168B51381O6926O0356N2963M3672L2166J9579Q766L592P206K0252M0254O2523
$$ 251381 318307 378663 431626 475298 507464 527043 535809 539401 546607 566859 607113 669636
37156F69636Q2050R5182J00503R8589R1012P9201O3824M4960K2800j616k6073
$$ 669636 751686 846868 947371 1045960 1136972 1216173 1279997 1324957 1347757 1346141 1320068
37145A320068m7599o3409p1880p2902o7438n6879m2630k6095q708Q165K3432L6387
$$ 1320068 1272469 1209060 1137180 1064278 996840 939961 897331 871236 862528 870693 894125 930512
37133I30512M6603N3670N6930N5561M9033L7746K3254P816o402j8143k7362l5047
$$ 930512 977115 1030785 1087715 1143276 1192309 1230055 1253309 1261125 1254723 1236580 1209218 1174171
37121A174171m2452n0132n7333o2284o3296n9908n3290m5702l9432l5877l5165
$$ 1174171 1131719 1081587 1024254 961970 898674 838766 785476 739774 700342 664465 629300
37110F29300l6232l7336l6637l2896k5922j6682o901J500O866Q064M818j863r550
$$ 629300 593068 555732 519095 486199 460277 443595 436694 438194 445060 453124 457942 456079 446529
37097D46529j4916j4750o809R769L4248O4072R4986J22072J41332J50895J51147
$$ 446529 431613 416863 410054 419823 454071 518143 613129 735201 876533 1027428 1178575
37086A178575J44021J32251J18696J05614R3881Q2654O9795N2836K9948N20l4601
$$ 1178575 1322596 1454847 1573543 1679157 1773038 1855692 1925487 1978323 2008271 2008791 1974190
37075A974190p3191j12036j47627j77032j98653k12508k19717k21472k18239k09824
$$ 1974190 1900999 1788963 1641336 1464304 1265651 1053143 833426 611954 393715 183891
37065A83891j95974j76891j53227j26153r7738p1259n0528l8196l4142l5188l6592
$$ 183891 -12083 -188974 -342201 -468354 -566092 -637351 -687879 -726075 -760217 -795405 -831997
37054h31997l4359k6997j5782l638O663J4094J9994K7343L8805N4695P2156Q6312
$$ -831997 -866356 -893353 -909135 -912773 -906110 -892016 -872022 -844679 -805874 -751179 -679023 -592711
37042e92711R2539Q8535P5233N6442L7425K2895J5149J3346J4327J4416J0963
$$ -592711 -500172 -411637 -336404 -279962 -242537 -219642 -204493 -191147 -176820 -162404 -151441
37031a51441K924r432k4939m1528n6008o4419o3363n1735l1568p232J6430L5762
$$ -151441 -148517 -157949 -182888 -224416 -280424 -344843 -408206 -459941 -491509 -498741 -482311 -446549
37019d46549M8857N5166N5011M9389L9986K8806J7458O708l240j2040j8945k3164
$$ -446549 -397692 -342526 -287515 -238126 -198140 -169334 -151876 -145168 -148408 -160448 -179393 -202557
37007b02557k4374k2797j8953j3434o789N55Q258J5791K2251K6646K8562K8455
$$ -202557 -226931 -249728 -268681 -282115 -288904 -288349 -280091 -264300 -242049 -215403 -186841 -158386
36995a58386K7222K5445K3121K0198J7424J6705K0452L0228M5588O3954Q1669
$$ -158386 -131164 -105719 -82598 -62400 -44976 -28271 -7819 22409 67997 131951 213620
36984B13620R5487J03682J06288J04544R9990R3630Q5497P4838O0789M3263K3661
$$ 213620 309107 412789 519077 623621 723611 817241 902738 977576 1038365 1081628 1105289
36973A105289M905r408j6529j6001j0075k663K579L818J279l685r663j5549k0442
$$ 1105289 1110194 1100786 1084257 1068256 1058181 1055518 1058097 1061915 1063194 1059509 1049846 1034297 1013855
36960A013855k3782k5881k8158l2301l8623m4916m6944m0719k5190l403J8718
$$ 1013855 990073 964192 936034 903733 865110 820194 773250 732531 707341 703938 722656
36949G22656L5269M2937M1847L4657K4859J5242O982k93p523j4885k1218k4635
$$ 722656 757925 800862 842709 877366 902225 917467 924449 924156 916633 901748 880530 855895
36937H55895k3809j8737j0590j056Q102J5161J8455J6524Q423n827k4710m5079
$$ 855895 832086 813349 802759 801703 809805 824966 843421 859945 868368 862541 837831 792752
36925G92752o2893p4712p8990p6283o8301n6664m2157k4803m415J8759M3681O8383
$$ 792752 729859 655147 576157 499874 431573 374909 332752 307949 303534 322293 365974 434357
36913D34357R0037J05151J10204J02699Q2314N1346J4243k3359n5634p7556q5955
$$ 434357 524394 629545 739749 842448 924762 976108 990351 966992 911358 833802 747847
36902G47847q0386o3287l9249j3760Q229K3534L1438L3300L1284K6975K0901J2975
$$ 747847 667461 604174 564925 551165 559394 582928 614366 647666 678950 705925 726826 739801
36890G39801L247p741j9081k9858l9499m7794n4613n9462o1524o0285n6239n0924
$$ 739801 743048 735307 716226 686368 646869 599075 544462 485000 423476 363191 306952 256028
36878B56028m6115m2822m0853l9115l6464l2545k8147k4794k3805k5545k9361
$$ 256028 209913 167091 126238 87123 50659 18114 -10033 -34827 -58632 -84177 -113538
36867a13538l4090l8651m2268m4413m4626m2479l7693l0390k1218j1105q32R174
$$ -113538 -147628 -186279 -228547 -272960 -317586 -360065 -397758 -428148 -449366 -460471 -461303 -452129
36855d52129J8459K5944K9756K7885J9228M202j5612l8294o2049q5024j04916
$$ -452129 -433670 -407726 -377970 -350085 -330857 -326655 -342267 -380561 -442610 -527634 -632550
36844f32550j19111j25428j22817j11577r3013o8865m0923j1059J8423M4625O4726
$$ -632550 -751661 -877089 -999906 -1111483 -1204496 -1273361 -1314284 -1325343 -1306920 -1262295 -1197569
36833a197569P7417Q4054Q8244R3769J02191J11861J18893J19368J11264R5326
$$ -1197569 -1120152 -1036098 -947854 -854085 -751894 -640033 -521140 -401772 -290508 -195182
36823a95182P4720N3940L7415K8239K7411L3745M4363N5542O3637O5974O1464
$$ -195182 -120462 -66522 -29107 -868 26543 60288 104651 160193 223830 289804 351268
36812C51268N0724L5581J8280Q34j5249k8875l9235m5759m8266m7108m3169l7600
$$ 351268 401992 437573 455853 456687 441438 412563 373328 327569 279303 232195 189026 151426
36800A51426l1370k4937j8335j1581m932J356P474J4163K2134L1208L9836M5331
$$ 151426 120056 95119 76784 65203 60271 61627 69101 83264 105398 136606 176442 221773
36788B21773M4625L5243J6264j0999m2817p3675r7501j09126j05467q6132n3516
$$ 221773 266398 301641 317905 306906 264089 190414 92913 -16213 -121680 -207812 -261328
36777b61328j2381L1037P0489J01364J21680J31877J33618J28687J18510J04329
$$ -261328 -273709 -242672 -172183 -70819 50861 182738 316356 445043 563553 667882
36767F67882Q7557P0152N4704M3908L9226L9760M2407M3626M1521L6760L1708
$$ 667882 755439 825591 880295 924203 963429 1003189 1045596 1089222 1130743 1167503 1199211
36756A199211K8654K8333K9536K9831K6719J8618N246j2375l2084n0844o5364
$$ 1199211 1227865 1256198 1285734 1315565 1342284 1360902 1366148 1353773 1321689 1270845 1205481
36745A205481p3065p2950o5880n4158m0802k8922k1180j9110k2424k8935l5457
$$ 1205481 1132416 1059466 993586 939428 898626 869704 848524 829414 806990 778055 742598
36734G42598l9334l9535l6671l2196k7500k3242j9046j3634n726M635J5183K1956
$$ 742598 703264 663729 627058 594862 567362 544120 525074 511440 505714 510349 525532 547488
36722E47488K1097J0723q354l3224o0091q5221j05412j18217j22172j16962j03419
$$ 547488 568585 579308 570954 537730 477639 392418 287006 168789 46617 -70345 -173764
36711a73764q3384n9448l4578j1626P117K0102K6567K6644K1514J3331M706j905
$$ -173764 -257148 -316596 -351174 -362800 -355683 -335581 -309014 -282370 -260856 -247525 -242819 -244724
36699b44724m626k464M276J3635K2186K6086K2521J0771p675k9879n2627p3459
$$ -244724 -249350 -251814 -247538 -233903 -211717 -185631 -163110 -152339 -160014 -189893 -242520 -315979
36687c15979r1125j05400j16443j24140j27764j26176j18449j04443q4889o1069
$$ -315979 -407104 -512504 -628947 -753087 -880851 -1007027 -1125476 -1229919 -1314808 -1375877
36677a375877l4519p039J9238M2069N9606P0777P5397P4111O8260N9655N0371
$$ -1375877 -1410396 -1417435 -1398197 -1356128 -1296522 -1225745 -1150348 -1076237 -1007977 -948322 -897951
36666h97951M2588L8491L9870M7453O0386P6452R2936J07457J18270J24107J24156
$$ -897951 -855363 -816872 -777002 -729549 -669163 -592711 -499775 -392318 -274048 -149941 -25785
36655b5785J18343J07593R3586P8136O2562M7466L2882J8687N006p622j8549k7508
$$ -25785 92558 200151 293737 371873 434435 481901 514783 533470 538476 530854 512305 484797
36643D84797l4708m0290m3584m3035l7073k5526j0674K823R535N828q063k7886
$$ 484797 450089 409799 366215 323180 286107 260581 249907 252730 262265 268093 260030 232144
36631B32144m7385o1060o6024o2266n1918l8393k5802j8371j9499l0557m9975
$$ 232144 184759 123699 57675 -4591 -56509 -94902 -120704 -139075 -158574 -189131 -239106
36620b39106p3294r4378j07390j08631r7578p6769n0775k4755l011J1977J9976
$$ -239106 -312400 -406778 -514168 -622799 -720377 -797146 -847921 -872676 -875687 -863710 -843734
36609h43734K2684K2791K2819K4236K7298L1493L6311M1786M8457N6826O6692
$$ -843734 -821050 -798259 -775440 -751204 -723906 -692413 -656102 -614316 -565859 -509033 -442341
36598d42341P6910Q5561R0398Q9333Q1109O5886M5512K3254L293j0143j4157q993
$$ -442341 -365431 -279870 -189472 -100139 -19030 46856 92368 115622 118915 108772 94615 85622
36586H5622J137R266Q750l614k6275n3827p9437r7499j05476j04198r6693q6514
$$ 85622 86759 96025 104775 101161 74886 21059 -58378 -155877 -261353 -365551 -462244 -548758
36574e48758p6572o8800o4189o2758o3471o4362o2950n6901m4766k6539l846K0454
$$ -548758 -625330 -694130 -758319 -821077 -884548 -948910 -1011860 -1068761 -1113527 -1140066 -1143912 -1123458
36562a123458M3076O1149P2777P7245P5020O7525N6729M4580L2484K1021J0088
$$ -1123458 -1080382 -1019233 -946456 -869211 -794191 -726666 -669937 -625357 -592873 -571852 -561764
36551e61764o55j1311k1578l0896l8610m3981m6183m4559l8977k9833j7769l561
$$ -561764 -562419 -573730 -595308 -626204 -664814 -708795 -754978 -799537 -838514 -868347 -886116 -889677
36539h89677J1544K5506L5809M0412L8734L1989K2832J4551J0155J1646J9594
$$ -889677 -878133 -852627 -816818 -776406 -737672 -705683 -682851 -668300 -658145 -646499 -626905
36528f26905L3115N0115O7802Q3201R3641R7197R3368Q3721P1863O2215N8168
$$ -626905 -593790 -543675 -475873 -392672 -299031 -201834 -108466 -24745 47118 109333 167501
36517A67501O0760O8634P8950Q8503R4555R5217Q9398P6443N5879K7648p326m6580
$$ 167501 228261 296895 375845 464348 558903 654120 743518 819961 875840 903488 896162 849582
36505H49582q6099j20946j46502j59888j60901j51836j36136j16747r5222p2089
$$ 849582 763483 642537 496035 336147 175246 23410 -112726 -229473 -324695 -396784
36495c96784m7919k4132k922J3436K3249K5749K1318J1712M8r854j4771j3313
$$ -396784 -444703 -468835 -471757 -458321 -435072 -409323 -388005 -376293 -376245 -386099 -400870 -414183
36483d14183o289M167J6104K8826M2728N8205P4624R0115J02198J08664J08328
$$ -414183 -420472 -416305 -400201 -371375 -328647 -270442 -195818 -105703 -3505 105159 213487
36472B13487J01437Q9611P5277O0772M7511L5584K3906J0836m891k3299m2827
$$ 213487 314924 404535 479812 540584 588095 623679 647585 658421 653530 630231 587404
36461E87404o0792p4530q2542q5015q3494q0034p6423p3628p1481o8488o2201
$$ 587404 526612 452082 369540 284525 201031 120997 44574 -29054 -100535 -169023 -231224
36450b31224n0372l2497j0735J0541K6388L3176K9664J7084j480k1880l9610n0581
$$ -231224 -281596 -314093 -324828 -314287 -287899 -254723 -225059 -207975 -209455 -231335 -270945 -321526
36438c21526n1962m2927k4890r65K5111N0012P1272Q7116R6208R7704R1654P9244
$$ -321526 -373488 -416415 -441305 -442270 -417159 -367147 -295875 -208759 -112551 -14847 76807 156051
36426A56051O2654M4559K7651J4187N553J827J643K603K154j573r417k1345l6822
$$ 156051 218705 263264 290915 305102 310655 312482 314125 316728 318882 317309 307892 286547 249725
36413B49725n4856p3771r1010j03462j08304j03997r0921p1367m9011k8116j2748
$$ 249725 194869 121098 30088 -73374 -181678 -285675 -376596 -447963 -496974 -525090 -537838
36402e37838o134j0102k4627m7486p4297r9172j15986j20031j09485q5936n3757
$$ -537838 -543972 -554074 -578701 -626187 -700484 -799656 -915642 -1035673 -1145158 -1231094 -1284851
36391a284851j8570J4424M1638O1630P5078Q4150R1315R7998J03927J07541J07081
$$ -1284851 -1303421 -1288997 -1247359 -1185729 -1110651 -1026501 -935186 -837188 -733261 -625720 -518639
36380e18639J01360Q9993P3231N2013K8045L669j8666l7159n1283o1942p0807
$$ -518639 -417279 -327286 -254055 -202042 -173997 -170328 -188994 -226153 -277436 -339378 -410185
36369d10185p8939q5642q8540q4892p3003n2621k4447J0245M9234Q8707J23315
$$ -410185 -489124 -574766 -663306 -748198 -821201 -873822 -898269 -888024 -838790 -750083 -626768
36358f26768J47398J56948J51290J33518J09441Q5592O7296N7521N6650O2870
$$ -626768 -479370 -322422 -171132 -37614 71827 157419 224715 282236 338886 401756
36348D01756P2963Q3334R0943R3820R1068Q2625O9217N2478L4972J9768R627O085
$$ 401756 474719 558053 648996 742816 833884 916509 985726 1038204 1073176 1092944 1102571 1108656
36336A108656Q938J6446K6076L5333M2059M4319M0323K8891J0099j4449m1935
$$ 1108656 1117594 1134040 1160116 1195449 1237508 1281827 1322150 1351041 1361140 1346691 1304756
36325A304756o9102r3115j12381j26966j38154j47250j54453j58779j59066j55000
$$ 1304756 1235654 1142539 1030158 903192 765038 617788 463335 304556 145490 -9510
36315i510j47186j36290j22232j04291q2106n6691l0540o634J2781K6788L5411
$$ -9510 -156696 -292986 -415218 -519509 -601615 -658306 -688846 -695480 -682699 -655911 -620500
36304f20500L8959L7912L3448K7796K3715K3223K6547L1947L6497L7246L2338
$$ -620500 -581541 -543629 -510181 -482385 -458670 -435447 -408900 -376953 -340456 -303210 -270872
36293b70872K1585O304j1578l0436m9245o7186q3074r5362j02773j05214j04161
$$ -270872 -249287 -242983 -254561 -284997 -334242 -401428 -484502 -579864 -682637 -787851 -892012
36282h92012j01965j00263r8525r4040q3586o5648m1560j4944J0135L1048M7446
$$ -892012 -993977 -1094240 -1192765 -1286805 -1370391 -1436039 -1477599 -1492543 -1482408 -1451360 -1403914
36271a403914O0616P1912Q1549Q8519R1374Q9016Q1095O8372N2978L8221K7545
$$ -1403914 -1343298 -1271386 -1189837 -1101318 -1009944 -920928 -839833 -771461 -718483 -680262 -652717
36260f52717K3102K4774L0073L4994L5465K9000J5767j461j8461l1062l6272l2624
$$ -652717 -629615 -604841 -574768 -539774 -504309 -475309 -459542 -461003 -479464 -510526 -546798 -579422
36248e79422k0055L31K6175N3691P7940R3925R8142Q9632O9985M2465J0912k1280
$$ -579422 -599477 -599146 -572971 -519280 -441340 -347415 -249273 -159641 -89656 -47191 -36279 -57559
36236e7559n2000q0687j07820j33752j57696j77546j90437j93602j85204j65027
$$ -57559 -109559 -190246 -298066 -431818 -589514 -767060 -957497 -1151099 -1336303 -1501330
36226a501330j34802r7824n7775j7503K1430N8269R2170J21648J44756J59897
$$ -1501330 -1636132 -1733956 -1791731 -1809234 -1787804 -1729535 -1637365 -1515717 -1370961 -1211064
36216a211064J66856J67295J64254J60724J58312J56955J55830J54453J53026
$$ -1211064 -1044208 -876913 -712659 -551935 -393623 -236668 -80838 73615 226641
36207B26641J51905J50981J49589J46854J42047J34664J24343J10843R4133P4489
$$ 226641 378546 529527 679116 825970 968017 1102681 1227024 1337867 1432000 1506489
36197A506489N2521K8978M485k0466m5169o8274q7823j01930j09601j11101j07702
$$ 1506489 1559010 1587988 1592473 1572007 1526838 1458564 1370741 1268811 1159210 1048109 940407
36186I40407j01118r3063q5077p8571p4886p5208q0219q9629j01872j14247j23696
$$ 940407 839289 746226 661149 582578 507692 432484 352265 262636 160764 46517 -77179
36175g7179j27918j26261j19704j09994r8572q6133p2892n9095m5331l2369k0609
$$ -77179 -205097 -331358 -451062 -561056 -659628 -745761 -818653 -877748 -923079 -955448 -976057
36164i76057r401L093J9067L9611O3622Q7858J08052J20483J23421J17974J07726
$$ -976057 -985458 -982365 -963298 -923687 -860065 -772207 -664155 -543672 -420251 -302277 -194551
36153a94551R7095Q9177Q4455Q1040P6105O7464N4507L8266K0834M492r104j9461
$$ -194551 -97456 -8279 76176 157216 233321 300785 355292 393558 414392 418884 409780 390319
36141C90319k7365l4452m2311n1482o1091o9248p3928p3456o6360n1056k6070
$$ 390319 362954 328502 286191 234709 173618 104370 30442 -43014 -109374 -160430 -186500
36130a86500R008N2352R9348J43214J76657J93800J91596J70287J33191Q6122
$$ -186500 -177492 -125140 -25792 117422 294079 487879 679475 849762 982953 1069075
36120A069075L6562p639m0005n7042n8982m9286l3182j5948j585P722J1316R520
$$ 1069075 1105637 1097998 1057993 1000951 941969 892683 859501 843553 841968 849690 861006 870526
36108H70526L224o255j7307k8343l8081m5692n0896n4148n6634n9877o4999p2219
$$ 870526 873750 867495 850188 821845 783764 738072 687176 633028 576394 516517 451518 379299
36096C79299q0732q8792r3966r3610q5737o9750m6713j9070R898L6777N8842P4617
$$ 379299 298567 209775 115809 22199 -63538 -133288 -180001 -199071 -189173 -152396 -93554 -18937
36084a8937Q3884Q7207Q5527Q0064P2118O2543N1224L7175J9226l164k9349n7146
$$ -18937 64947 152154 237681 317745 389863 452406 503630 540805 560031 556867 527518 470372
36072D70372q2814j01671j09471j04034q6160n9389k8729Q27K5344M2247N0135
$$ 470372 387558 285887 176416 72382 -13778 -73167 -101896 -101069 -75725 -33478 16657
36061A6657M8648L8680K2834N604p298j0617j603J8722M5949P4044R7410J12240
$$ 16657 65305 103985 126819 132423 125125 114508 112905 131627 177576 251620 349030 461270
36049D61270J16975J12007R8818P8880N3032K1821j3384m9564q2243j06637j19046
$$ 461270 578245 690252 789070 867950 920982 942803 929419 879855 797612 690975 571929
36038E71929j17792j03479p8630m6875j1924K3141N5961Q4294J05398J16085J13704
$$ 571929 454137 350658 272028 225153 213229 236370 292331 376625 482023 598108 711812
36027G11812R7429O9069L2954n059l9308o6158q5002r7719j07022j14881j22045
$$ 711812 809241 878310 911264 906205 866897 800739 715737 618018 510996 396115 274070
36016B74070j28405j33516j36730j37193j33999j26553j14898r9685q1947o2991
$$ 274070 145665 12149 -124581 -261774 -395773 -522326 -637224 -736909 -818856 -881847
36006h81847m4693k9732k1129k1044k9697m5311o5038q5875j04870j18872j24665
$$ -881847 -926540 -956272 -977401 -998445 -1028142 -1073453 -1138491 -1224366 -1329236 -1448108 -1572773
35995a572773j19858j03894p8286m5928j0228K5292N7147Q2324R8950J06500J05417
$$ -1572773 -1692631 -1796525 -1874811 -1920739 -1930967 -1905675 -1848528 -1766204 -1667254 -1560754 -1455337
35984a455337R6678Q1898O3580M4945K9318J9562J7806K5212M1749O6045R5513
$$ -1455337 -1358659 -1276761 -1213181 -1168236 -1138918 -1119356 -1101550 -1076338 -1034589 -968544 -873031
35973h73031J26650J55457J78015J91059J92481J81646J59613J28948R3026N5027
$$ -873031 -746381 -590924 -412909 -221850 -29369 152277 311890 440838 533864 588891
35963E88891J7397j8100n0075p7352r8811j13103j18522j13383r6830o9579l4344
$$ 588891 606288 588188 538113 460761 361950 248847 130325 16942 -79888 -149467 -183811
35952a83811M221M0354O8714Q5933R1268Q6118P3107N5418L6387J9052N645k643
$$ -183811 -179590 -139236 -70522 15411 106679 192797 265904 321322 357709 376761 382406 379763
35940C79763n550l523K253R622J5443J6310R881l748k1642l8986n0966n4466m8699
$$ 379763 374213 370690 372943 382565 398008 414318 424199 420451 398809 359823 308857 254391 205692
35927B05692l4773j5018P257K7604M0772M2021K8982K914l1429o7222r7494j16879
$$ 205692 170919 155901 163158 190762 231534 273555 302537 305451 274022 206800 109306 -7573
35915g573j22746j15581r8530p6262n3394l3093j6282j706J3245L1165N3063P7193
$$ -7573 -130319 -245900 -344430 -420692 -474086 -507179 -523461 -525167 -511922 -480757 -427694 -350501
35903c50501R9271J14289J19058J13821J01976Q8302P7011P0489O9036P1320P5194
$$ -350501 -251230 -136941 -17883 95938 197914 286216 363227 433716 502752 574072 649266
35892F49266P8427P9176P6306O9613N9800M7986L5014K1052N783j1081k9275m7439
$$ 649266 727693 806869 883175 952788 1012588 1060574 1095588 1116640 1122423 1111342 1082067 1034628
35880A034628o2773p1363o9449n5233l0025J970L5014O3428Q2839R1035Q8496
$$ 1034628 971855 900492 831043 775810 745785 747755 782769 846197 929036 1020071 1108567
35869A108567P8339O5387N4425M8391M7426M9266N0714M9368M4715L8081L1551
$$ 1108567 1186906 1252293 1306718 1355109 1402535 1451801 1502515 1551883 1596598 1634679 1666230
35858A666230K6610K3298K0409J6258R321j644j7610l8835o4036q9905j11744
$$ 1666230 1692840 1716138 1736547 1752805 1762126 1760482 1742872 1704037 1640001 1550096 1438352
35847A438352j24968j26562j15679r3353o1863k4255J5910N4844Q9017J15837
$$ 1438352 1313384 1186822 1071143 977790 915927 891672 907582 962426 1051443 1167280
35837A167280J34046J43585J44877J38009J22304R6605O0234J4102l8778r3864
$$ 1167280 1301326 1444911 1589788 1727797 1850101 1946706 2006940 2021042 1982264 1888400
35827A888400j46495j93024k30905k57887k71491k69556k51478k19016j75974
$$ 1888400 1741905 1548881 1317976 1060089 788598 519042 267564 48548 -127426
35818a27426j27069p6900k9495J1713M3906O4960P3660P0020N5771L4576J1471
$$ -127426 -254495 -331395 -360890 -349177 -305271 -240311 -166651 -96631 -40860 -6284 5187
35807E187q398k1142k4756j9084n408J3914L5643N5921P0806P7192P3734O1043
$$ 5187 -3211 -24353 -49109 -68193 -73601 -59687 -24044 31877 102683 179875 253609 314652
35795C14652M0855J5018j4725m6069p5519r8690j11376j10773r6253o9572l4529
$$ 314652 355507 370525 355800 309731 234212 135522 24146 -86627 -182880 -252452 -286981
35784b86981L777L9822O8566Q6436R2243Q7514P5823O1386M7580L6042K6619J8092
$$ -286981 -283204 -243382 -174816 -88380 3863 91377 167200 228586 276166 312208 338827 356919
35772C56919R317M9r086j7249k3969k9221l3167l5955l7695l8389l7815l5414
$$ 356919 366236 366285 357199 339950 315981 286760 253593 217638 179943 141554 103739 68325
35760F8325l0351k1876r892M520J8988L0419L5938L3728K3340N533j8062m5121
$$ 68325 37974 16098 6206 10726 29714 60133 96071 129799 153139 158672 140610 95489
35748I5489p2714r7488j16155j26093j26002j16316r9358p8715n7807l8223j9051
$$ 95489 22775 -74713 -190868 -316961 -442963 -559279 -658637 -737352 -795159 -833382 -852433
35737h52433K167K7415N6575Q7164J15353J37570J51787J58097J58237J54371
$$ -852433 -850266 -822851 -766276 -679112 -563759 -426189 -274402 -116305 41932 196303
35727A96303J47794J38323J24599J04957P8403M5473Q546k8792o3313r3665j20545
$$ 196303 344097 482420 607019 711976 790379 835852 844398 815606 752293 658628 538083
35716E38083j45374j68609j89063k04474k12411k10869j98688j76241j46093j12809
$$ 538083 392709 224100 35037 -169437 -381848 -592717 -791405 -967646 -1113739 -1226548
35706a226548q1547n6113l7690k4811j4266k323J4052L6153O2949R1313J16912
$$ -1226548 -1308095 -1364208 -1401898 -1426709 -1440975 -1443298 -1429246 -1393093 -1330144 -1238831 -1121919
35695a121919J35386J43459J40025J26778J07800Q7772O9899N4830M1218K7196
$$ -1121919 -986533 -843074 -703049 -576271 -468471 -380699 -310800 -255970 -214752 -187556
35685a87556J1544o016k5040m4536o2786p7203q4761q3165p2131n3877l2392j1702
$$ -187556 -176012 -182028 -207068 -251604 -314390 -391593 -476354 -559519 -631650 -685527 -717919 -729621
35673g29621N725J9575L1034M1563N2053O2703P3332Q3531R2587R9327J02230
$$ -729621 -723896 -704321 -673287 -631724 -579671 -516968 -443636 -360105 -267518 -168191 -65961
35662f5961R9910R1852P8931O3159M6779L1561J8924J0462P936J2506K3859L9870
$$ -65961 33949 125801 204732 267891 314670 346231 365155 375617 383553 396059 419918 459788
35650D59788N7036P1417P9798Q0671P4544O3490N0248L7297K6234J7661J1527
$$ 459788 516824 588241 668039 748710 823254 886744 936992 974289 1000523 1018184 1029711
35639A029711P556N318L975K234j169o860j4489k2782k9826l3661l3070k8227
$$ 1029711 1037267 1042585 1046560 1048794 1047625 1040765 1026276 1003494 973668 940007 906937 878710
35627H78710k0634j2353n125L3K737K958J001k495o779j1452j6675k2816k9769
$$ 878710 858076 845723 840598 840631 843368 846326 847327 844832 838053 826601 809926 787110 757341
35614G57341l6706m2486m6303m8030m8046m6711m3799l8420k9697j7741l940R705
$$ 757341 720635 678149 631846 583816 535770 489059 445260 406840 377143 359402 355462 365167
35602C65167K1513L0537L6396L9001L8342L4310K6760J5828K196j3063k8757m3364
$$ 365167 386680 417217 453613 492614 530956 565266 592026 607854 610050 596987 568230 524866
35590E24866n4637n9797n6614m4567k5081r09K4750M8883O9139Q4131R3574R8126
$$ 524866 470229 410432 353818 309251 284170 283261 308011 356894 426033 510164 603738 701864
35578G01864R9068R7998R6441R5306R4325R1878Q5707P4113N6877L5290J1604
$$ 701864 800932 898930 995371 1090677 1185002 1276880 1362587 1436700 1493577 1528867 1540471
35567A540471j1509l1245m5088n1449n0269m2974l1795j8823n378Q033K1241L3823
$$ 1540471 1528962 1497717 1452629 1401180 1350911 1307937 1276142 1257319 1251941 1259974 1281215 1315038
35555A315038M4754N2454N5202N1757M1971K7118R622p761k3055l5920m7617o0041
$$ 1315038 1359792 1412246 1467448 1519205 1561176 1588294 1597916 1590155 1567100 1531180 1483563 1423522
35543A423522p4426r0641j07478j23351j36864j47132j54071j58290j60360j59875
$$ 1423522 1349096 1258455 1150977 1027626 890762 743630 589559 431269 270909 111034
35533A11034j55470j45916j31332j13338r4095p5049n6290l6755j5077R369L5783
$$ 111034 -44436 -190352 -321684 -435022 -529117 -604166 -660456 -697211 -712288 -702919 -667136
35522f67136O1840Q4131R9139J04549J00339Q8979P4513O1142N2069M8835N1124
$$ -667136 -605296 -521165 -422026 -317477 -217138 -128159 -53646 7496 59565 108400 159524
35511A59524N7101O4258P0435P4439P6056P5667P3771P0553O5725N8703M8923
$$ 159524 216625 280883 351318 425757 501813 577480 651251 721804 787529 846232 895155
35500H95155L5926J9218j581k6027n2025p5750r2721r9555r5370q2022o3137m2646
$$ 895155 931081 950299 948718 922691 870666 794916 702195 602640 507270 425248 362111 319465
35488C19465k3543p318N920J6835K6028L3547L9079M2660M5084M7462N0217N2515
$$ 319465 295922 288604 294524 311359 337387 370934 410013 452673 497757 545219 595436 647951
35476F47951N2716M9477M2577L2830K1443R472k152j2465k0541k5994k9387l2103
$$ 647951 700667 750144 792721 825551 846994 856466 854314 841849 821308 795314 765927 733824
35464G33824l5700m1261m9169n9257p1082q4153r8060j12439j26696j39779j50289
$$ 733824 698124 656863 607694 548437 477355 393202 295142 182703 56007 -83772 -234061
35453b34061j56792j57889j51881j36807j11318p6034l4065R842N0952Q5994J13806
$$ -234061 -390853 -548742 -700623 -837430 -948748 -1024782 -1058847 -1049005 -998053 -912059 -798253
35442g98253J35125J51625J64758J75066J82485J87127J89712J91156J91761J90839
$$ -798253 -663128 -511503 -346745 -171679 10806 197933 387645 578801 770562 961401
35432I61401J87152J79966J69853J58464J47218J35822J21858J01984P3893L7727
$$ 961401 1148553 1328519 1498372 1656836 1804054 1939876 2061734 2163718 2237611 2275338
35422B275338l954m7267q8290j23893j51914j71036j80721j81553j75636j66270
$$ 2275338 2271384 2224117 2135827 2011934 1860020 1688984 1508263 1326710 1151074 984804
35412I84804j56491j47256j36918j22583j02351p6707m8352k0946K391K0217L2965
$$ 984804 828313 681057 544139 421556 319205 242498 194146 173200 175591 195808 228773
35401B28773M2026M8434N2223N2928N0343M4771L6714K6629J4835J472j3444k9652
$$ 228773 270799 319233 371456 424384 474727 519498 556212 582841 597676 599148 585704 556052
35389E56052m6163o1184p2677p9054p9558p4286o4001m9854l3002j4250O119K8067
$$ 556052 509889 448705 376028 296974 217416 143130 79129 29275 -3727 -17977 -11858 16209
35377A6209N1283P4636R6063J13127J23897J27624J24792J16672J04813R0740
$$ 16209 67492 142128 238191 351318 475215 602839 727631 844303 949116 1039856
35367A039856P5879O1619M9481M1246L8762M3154N3767O7676Q0382Q7475Q6096
$$ 1039856 1115735 1177354 1226835 1268081 1306843 1349997 1403764 1471440 1551822 1639297 1725393
35356A725393P5471N6360L0287p79l4109o5879r1601j07524j12057j06009r1514
$$ 1725393 1800864 1857224 1887511 1886732 1852623 1786744 1695143 1587619 1475562 1369553 1278039
35345A278039p0631m4928j6103J3209L9406N8843O9296P1075O7030O1326N7679
$$ 1278039 1207408 1162480 1146377 1159586 1198992 1257835 1327131 1398206 1465236 1526562 1584241
35334A584241N8131O2842P0655P9793Q8372R4713R7528R5919Q9187P6547N7236
$$ 1584241 1642372 1705214 1775869 1855662 1944034 2038747 2136275 2232194 2321381 2397928 2455164
35323B455164L1209K0l3094o4349r1010j12113j27878j38595j44061j43842j37901
$$ 2455164 2486373 2486393 2453299 2388950 2297940 2185827 2057949 1919354 1775293 1631451 1493550
35312A493550j27149j13747j01017r2628r1153r6800j07238j18775j28072j33160
$$ 1493550 1366401 1252654 1151637 1059009 967856 871056 763818 645043 516971 383811
35302C83811j33298j28202j17622j01746q1911o0626m0615k3495r141L805J6798
$$ 383811 250513 122311 4689 -97057 -178968 -239594 -280209 -303704 -312845 -309040 -292242
35291b92242L0492M4465N7642O9154P9178Q9044J00288J13400J27401J40624J51754
$$ -292242 -261750 -217285 -159643 -90489 -11311 77733 178021 291421 418822 559446 711200
35280G11200J60157J65471J67130J64289J56060J41942J22271R8473P2706M7084
$$ 711200 871357 1036828 1203958 1368247 1524307 1666249 1788520 1886993 1959699 2006783
35270B006783K3040J286j7603l2535m1795m3736l7808k5168q342R795K6947M1819
$$ 2006783 2029823 2031109 2013506 1980971 1939176 1895440 1857632 1832464 1824122 1833917 1860864 1902683
35258A902683N4046O3867P1693P7598Q0970Q0546P4877O3186M6059K5561M517
$$ 1902683 1956729 2020596 2092289 2169887 2250857 2331403 2406280 2469466 2515525 2541086 2545603
35247B545603j4532l0018m1313m8225n0548m8100m1200l1216k0525j1674o180
$$ 2545603 2531071 2501053 2459740 2411515 2360967 2312867 2271667 2240451 2219926 2208252 2202072
35236B202072l995m061n508q371j3383k1305l2609m7532o6009q7158j08831j27927
$$ 2202072 2198077 2194016 2188508 2180137 2166754 2145449 2112840 2065308 1999299 1912141 1803310 1675383
35224A675383j41367j46982j43828j32036j12615q7285n8370k8641r78K2266L9962
$$ 1675383 1534016 1387034 1243206 1111170 998555 911270 852900 824259 823281 845547 885509
35213H85509N2453O1080O7510P3396Q0320Q9598J01932J17044J33466J48460J58312
$$ 885509 937962 999042 1066552 1139948 1220268 1309866 1411798 1528842 1662308 1810768 1969080
35202A969080J59315J49238J28395R9509O6681L4224O062j4515k5380k6496k0601
$$ 1969080 2128395 2277633 2406028 2505537 2572218 2606442 2612504 2597989 2572609 2546113 2525512
35191B525512j2628p713q863j5740k5212l3159l6366l3557k5332j3369K62J3439
$$ 2525512 2512884 2505171 2496308 2480568 2455356 2422197 2385831 2352274 2326942 2313573 2313835 2327274
35179B327274K4211L1340L4910L6481L8404M2680N0008N9579O9694P8674Q5353
$$ 2327274 2351485 2382825 2417735 2454216 2492620 2535300 2585308 2644887 2714581 2793255 2878608
35168B878608Q8830Q8054Q2044P0840N6321M2053L1945K8686L2864M3305N8083
$$ 2878608 2967438 3055492 3137536 3208376 3264697 3306750 3338695 3367381 3400245 3443550 3501633
35157C501633P5295R3293J10699J26567J40565J52774J63294J72037J78955J84336
$$ 3501633 3576928 3670221 3780920 3907487 4048052 4200826 4364120 4536157 4715112 4899448
35147D899448J88844J93081J96866J98566J94977J82144J56925J18697P0371J8063
$$ 4899448 5088292 5281373 5478239 5676805 5871782 6053926 6210851 6329548 6399919 6417982
35137F417982l0662o9228r3905j04297j02697r3102q0257o8660o1532n9961o2560
$$ 6417982 6387320 6318092 6224187 6119890 6017193 5924091 5843834 5775174 5713642 5653681 5591121
35126E591121o5882o5761n9091m5096k5380l012J8540L6380M9095N7425O4029
$$ 5591121 5525239 5459478 5400387 5355291 5329911 5326899 5345439 5381819 5430914 5488339 5552368
35115E552368P2271Q4621J01594J21551J41351J57452J67041J68672J62406J49580
$$ 5552368 5624639 5709260 5810854 5932405 6073756 6231208 6398249 6566921 6729327 6878907
35105F878907J32288J12730R2821P4418N9721N1072N0164N7345P1558R0692J11960
$$ 6878907 7011195 7123925 7216746 7291164 7350885 7401957 7452121 7509466 7581024 7671716 7783676
35094G783676J32161J48024J56763J56720J48001J32590J13811R5472Q1260P4490
$$ 7783676 7915837 8063861 8220624 8377344 8525345 8657935 8771746 8867218 8948478 9022968
35084I022968P7652R1727J15677J46716J81273K16146K49365K80258L08818L34856
$$ 9022968 9100620 9192347 9308024 9454740 9636013 9852159 10101524 10381782 10690600 11025456
35074A1025456L57712L76603L91312M02830M13679M27603M48467M78953N19762
$$ 11025456 11383168 11759771 12151083 12553913 12967592 13395195 13843662 14322615 14842377
35065A4842377N69425O24525O80158P30889P71777P98828Q08995Q00290P72272
$$ 14842377 15411802 16036327 16716485 17447374 18219151 19017979 19826974 20627264 21399536
35056B1399536P26325O65472N94077N17663M42584L75278L21356K84989K68572
$$ 21399536 22125861 22791333 23385410 23903073 24345657 24720935 25042291 25327280 25595852
35047B5595852K72697K96477L37926L94328M62832N41504O30027P29238Q39734
$$ 25595852 25868549 26165026 26502952 26897280 27360112 27901616 28531643 29260881 30100615
35038C0100615R60830J090553J226339J366108J509793J660683J825387K012189
$$ 30100615 31061445 32151998 33378337 34744445 36254238 37914921 39740308 41752497
35030D1752497K228980K481715K773621L105128L475006L882453M329097M820127
$$ 41752497 43981477 46463192 49236813 52341941 55816947 59699400 64028497 68848624
35022F8848624N364381N973427O659553P433627Q303968R276077J0352479J1532851
$$ 68848624 74213005 80186432 86845985 94279612 102583580 111859657 122212136 133744987
35014A33744987J2814735J4192995J5655168J7172716J8690723K0117184K1311114
$$ 133744987 146559722 160752717 176407885 193580601 212271324 232388508 253699622
35007B53699622K2071235K2132397K1181130J8905779J5093858R763182L265636
$$ 253699622 275770857 297903254 319084384 337990163 353084021 362847203 366112839
35000C66112839l722683j0363630j5907783j9901453k2250784k3145379k2920290
$$ 366112839 362390156 352026526 336118743 316217290 293966506 270821127 247900837
34993B47900837k1934943k0501384j8856507j7161796j5516370j3973269j2554202
$$ 247900837 225965894 205464510 186608003 169446207 153929837 139956568 127402366
34986A27402366j1262282j0092418r037528q090333p243353o489264n821210n232275
$$ 127402366 116140084 106047666 97010138 88919805 81676452 75187188 69365978 64133703
34978F4133703m714817m260627l861577l510123l199672k924828k681071k464115
$$ 64133703 59418886 55158259 51296682 47786559 44586887 41662059 38980988 36516873
34970C6516873k269799k094709j936460j793196j662980j543685j433023j328509
$$ 36516873 34247074 32152365 30215905 28422709 26759729 25216044 23783021 22454512
34962B2454512j227945j130413j036738r48823q68521p97097p35225o82911o39357
$$ 22454512 21226567 20096154 19059416 18110593 17242072 16444975 15709750 15026839 14387482
34953A4387482o03120n72366n44951n18314m89696m56687m18142l75073l30963
$$ 14387482 13784362 13211996 12667045 12148731 11659035 11202348 10784206 10409133 10078170
34944A0078170k90886k59679k40132k32159k33057k38694k45260k50819k55690
$$ 10078170 9787284 9527605 9287473 9055314 8822257 8583563 8338303 8087484 7831794
34935G831794k61409k69079k78108k85801k88072k81032k62782k34248j98711
$$ 7831794 7570385 7301306 7023198 6737397 6449325 6168293 5905511 5671263 5472552
34926E472552j60668j24806r4996p3386n9975n3120n0479m9607m8228m4543l7698
$$ 5472552 5311884 5187078 5092082 5018696 4958721 4905601 4855122 4805515 4757287 4712744 4675046
34915D675046k8035j6904o347J343M243J588n799j5825k6107l5133m2830n0245
$$ 4675046 4647011 4630107 4623760 4625103 4629346 4630934 4625135 4609310 4583203 4548070 4505240 4454995
34903D454995n8388o7083p4522p8058p5748o7753n6782m7328m4254n1186o9310
$$ 4454995 4396607 4329524 4255002 4176944 4101196 4033443 3976661 3929333 3885079 3833893 3764583
34892C764583r6723j28866j59981j84934k00586k06270k03565j95421j84673j72623
$$ 3764583 3667860 3538994 3379013 3194079 2993493 2787223 2583658 2388237 2203564 2030941
34882B030941j58583j40869j18318r1120o0559k8227M507L6554O6959R4911J19808
$$ 2030941 1872358 1731489 1613171 1522051 1461492 1433265 1437772 1474326 1541285 1636196 1756004
34871A756004J41172J58528J71651J81152J88560J95194K00423K00974J92304
$$ 1756004 1897176 2055704 2227355 2408507 2597067 2792261 2992684 3193658 3385962
34862C385962J71210J38091R7540N7040K4283M158l165k219k33m090j7598m0277
$$ 3385962 3557172 3695263 3792803 3849843 3874126 3878284 3875119 3872900 3872667 3868577 3850979 3810702
34850C810702o8101r5533j17677j31631j36937j35270j29514j22538j16242j11321
$$ 3810702 3742601 3647068 3529391 3397760 3260823 3125553 2996039 2873501 2757259 2645938
34840B645938j07637j04897j03252j03498j06607j12893j21533j30913j39311
$$ 2645938 2538301 2433404 2330152 2226654 2120047 2007154 1885621 1754708 1615397
34831A615397j45137j46689j41975j29076j06917p5956l8546J356L9121P0820
$$ 1615397 1470260 1323571 1181596 1052520 945603 869647 831101 832457 871578 942398
34821I42398R4388J09875J18626J21990J20436J13560J00828Q2466O0216L7532
$$ 942398 1036786 1146661 1265287 1387277 1507713 1621273 1722101 1804567 1864783 1902315
34811A902315J8979Q714Q739J7896L2169M5976N3913N2476M1225K2790J622j7715
$$ 1902315 1921294 1930008 1938747 1956643 1988812 2034788 2088701 2141177 2182402 2205192 2206814 2189099
34799B189099l1828l9058l9713l6083l2006l1671l8090n1967p1433r2703j11219
$$ 2189099 2157271 2118213 2078500 2042417 2010411 1978740 1940650 1888683 1817250 1724547 1613328
34788A613328j23063j26234j21220j10348r6284q0922o5593n1971m2264l8132
$$ 1613328 1490265 1364031 1242811 1132463 1036179 955257 889664 837693 795429 757297
34778G57297l9374m3684m7607m7778m1719k8253p912J6642M0738N8823O6459O2106
$$ 757297 717923 674239 626632 578854 537135 508882 500970 517612 558350 617173 683632 745738
34766G45738M7455K6321L102j8140l4070m2427m2513l5395k3551j0185J645R833
$$ 745738 793193 819514 822616 804476 770406 727979 685466 650071 626520 616335 617980 627813
34754F27813J3620J3343R644K749p704k2211m0501o0721p9231r1486r3654q4142
$$ 627813 641433 654776 664420 667169 659465 637254 596753 536032 456801 365315 271661 187519
34742A87519o4275l7752r352J6587L7197N1297N8898O0476N6484M7439L4337J9092
$$ 187519 123244 85492 76140 92727 129924 181221 240119 300595 357079 404518 438855 457947
34730D57947M511o219j0266n869O988K6023M6737O3473P1327O7916N4076L3265
$$ 457947 462458 456239 445973 440104 447092 473115 519852 583325 654652 722568 776644 809909
34718H09909J0034j1584k9125m1759m9539n2596n0983m5193l6630k7350j9232
$$ 809909 819943 808359 779234 737475 687936 635340 584357 539164 502534 475184 455952
34707D55952j3363j0014q910r314j0143j0357r463p652n492l777l740p289j6606
$$ 455952 442589 432575 423665 414351 404208 393851 384388 376736 371244 367467 363727 356438 339832
34694C39832l3175n6496q3283j07784j23759j27203j18053r9663p6738n3384l2335
$$ 339832 306657 250161 166878 59094 -64665 -191868 -309921 -409584 -486322 -539706 -572041
34683e72041j5022j821P848J5384K2724L1772M3636N8032P3356Q7359R7998J03908
$$ -572041 -587063 -588884 -581036 -565652 -542928 -511156 -467520 -409488 -336132 -248773 -150775 -46867
34671d6867J04578J00421R2744Q3295P3290O2512M9272L1498Q208j9601m8994
$$ -46867 57711 158132 250876 334171 407461 469973 519245 550743 558951 539350 490356
34660D90356p5660r4699j01688r3957p1586l7557K808M2866P6038R7361J04698
$$ 490356 414696 319997 218309 124352 52766 15209 18017 60883 136921 234282 338980
34649C38980R8918Q3095O1442L8444J8158L504m360o278m868l724o217j4262k7640
$$ 338980 437898 520993 582435 620879 639037 642541 638181 631903 627035 623311 617094 602832 575192
34636E75192m4283o1273p5995q6908r3798r7493r9282j00171j00315r8844r4241
$$ 575192 530909 469636 393641 306733 212935 115442 16160 -84011 -184326 -283170 -377411
34625c77411q4963o9921m8738k1981Q551M0055O9640R5501J17323J35715J51220
$$ -377411 -462374 -532295 -581033 -603014 -594463 -554408 -484768 -389267 -271944 -136229 14991
34614A4991J63633J71886J74413J69757J57171J36966J10519Q0052M8182J7226
$$ 14991 178624 350510 524923 694680 851851 988817 1099336 1179388 1227570 1244796
34604A244796j1423l7381o0676q1005r7279j07803j10829j05460r2519p4810n6392
$$ 1244796 1233373 1195992 1135316 1054311 957032 849229 738400 632940 540421 465611 409219
34593D09219m1059l1024k6520k6363k8811l2085l4628l5449l4558l2990l2150
$$ 409219 368160 337136 310616 284253 255442 223357 188729 153280 118722 85732 53582
34582E3582l2880l5005l7449l8688l7237l2194k3662j2741j069R714J8210K3309
$$ 53582 20702 -14303 -51752 -90440 -127677 -159871 -183533 -196274 -197343 -187629 -169419 -146110
34570a46110K4308K1307J5478Q921L853J589K079M342P321J0331J2934J4778J5771
$$ -146110 -121802 -100495 -85017 -76096 -72243 -70654 -68575 -64233 -56912 -46581 -33647 -18869 -3098
34557c098J6308J7010J7971J8207J5797Q851l393k0011l8606n5908o8344p2699
$$ -3098 13210 30220 48191 66398 82195 91046 87653 67642 29036 -26872 -95216 -167915
34545a67915o7064n1563k8201J17L0491O0283Q7182J09673J27564J41752J52988
$$ -167915 -234979 -286542 -314743 -314626 -284135 -223852 -136670 -26997 100567 242319 395307
34534C95307J60641J62453J55604J38388J11328P7198M0187M994k3938m3076n0536
$$ 395307 555948 718401 874005 1012393 1123721 1200919 1241106 1246100 1222162 1179086 1128550
34523A128550m6474l3057j4131N305K0116K6514K3315J2131l532j9527l2176l9211
$$ 1128550 1082076 1049019 1034888 1040193 1060309 1086823 1110138 1122269 1118737 1099210 1067034 1027823
34511A027823m0455l7824l4413l3138l5634m1878n0472n9316o6353p0103o9721
$$ 1027823 987368 949544 915131 881993 846359 804481 754009 694693 628340 558237 488516
34500D88516o4761n5030m0839k3368m486J4093L1600M8045O3307P6426Q5832R0114
$$ 488516 423755 368725 327886 304518 300032 314125 345725 393770 457077 533503 619335 709449
34488G09449Q8635Q1784P0979N8317M5665L3632K1295P029j0130k9669m9825o8601
$$ 709449 798084 879868 950847 1009164 1054829 1088461 1109756 1116785 1106655 1076986 1027161 958560
34476I58560q4732r8018j08993j18318j26368j33005j37501j38772j35880j28578
$$ 958560 873828 775810 666817 548499 422131 289126 151625 12853 -123027 -251605
34466b51605j17409j03393q7644p1160n4871l9829k7382j8944j5073j4444j3724
$$ -251605 -369014 -472407 -560051 -631211 -686082 -725911 -753293 -772237 -787310 -801754 -815478
34455h15478q939K411K0036M1150O1973P9177R0422R4207Q9879P8112O1367M3405
$$ -815478 -824417 -822006 -801970 -760820 -698847 -619670 -529248 -435041 -345162 -267050 -205683 -162278
34443a62278K7870J6698R433L770k936j1873k1704k8961k9892k2677q639Q352
$$ -162278 -134408 -117710 -108277 -104507 -107443 -119316 -141020 -169981 -199873 -222550 -231189 -222837
34431b22837K3917L5241M1913M5093M5851M4198L9459L1398K0853R468j013r108
$$ -222837 -198920 -163679 -121766 -76673 -30822 13376 52835 84233 105086 114554 113541 104433
34419A04433j3606j3740r685k888M376J0050J3131J3644J1935Q078J897o550j6647
$$ 104433 90827 77087 67402 64514 68890 78940 92071 105715 117650 125728 127625 121075 104428
34406A04428k7256l6909m3936m6474m2815l2100j5011O202K8404M8510O4105P3630
$$ 104428 77172 40263 -3673 -50147 -92962 -125062 -140073 -133871 -105467 -56957 7148 80778
34394H0778P6268P1929O1463M7052L2275K1239J7021K0429L0086M3461N7757P0226
$$ 80778 157046 228975 290438 337490 369765 391004 408025 428454 458540 502001 559758 629984
34382F29984P8284Q0047P5022O4392N0638L6568K4158J3839M658m755j5133k6115
$$ 629984 708268 788315 863337 927729 978367 1014935 1039093 1052932 1057590 1052835 1037702 1011587
34370A011587l6418m4370m8655m9037m6432m2052l6154k7658j5141J620K0743
$$ 1011587 975169 930799 882144 833107 786675 744623 708469 680811 665670 667290 688033
34359F88033L8671N1483N6339N2445M1206K5705R704l504j2178j6602j8610k0164
$$ 688033 726704 778187 834526 886971 928177 953882 963586 960082 947904 931302 912692 892528
34347H92528k1971k3279k2909k0484j6609j1918o143J758J2650K6333M1452N5916
$$ 892528 870557 847278 824369 803885 787276 775358 769215 770973 783623 809956 851408 907324
34335I07324O7359P3495P2488O3340M6180K2461n033l2626n6814p5457q8170r5605
$$ 907324 974683 1048178 1120666 1184006 1230186 1252647 1247614 1214988 1158174 1082717 994547 898942
34323H98942r8426r6972r1606q2885p1290n7032m0567k3282p459M703J2148J5402
$$ 898942 800516 703544 611938 529053 457763 400731 360164 336882 329423 334126 346274 361676
34311C61676J6316J7468K1378K9633M2240N7545P2776Q4947R1882R2977Q9438
$$ 361676 377992 395460 416838 446471 488711 546256 619032 703979 795861 888838 978276
34300I78276Q3803P9008P7373P9712Q4887R0171R2566R0327Q3537P3374O0846
$$ 978276 1062079 1141087 1218460 1298172 1383059 1473230 1565796 1656123 1739660 1813034 1873880
34289A873880M6190K9319J0735q008k4784l7997m7436n4193n9906o6016p3539
$$ 1873880 1920070 1949389 1960124 1952116 1927332 1889335 1841899 1787706 1727800 1661784 1588245
34278A588245q3114r4965j08815j23942j39270j53313j64155j69710j68215j58623
$$ 1588245 1505131 1410166 1301351 1177409 1038139 884826 720671 550961 382746 224123
34268B24123j40671j14973q3230m8425j4613J3851L3302M1670L8891K6652P593
$$ 224123 83452 -31521 -114751 -163176 -177789 -163938 -130636 -88966 -50075 -23423 -15830
34257a5830j5443l9726o2557q1150r2957r6211r0400p6405n6265l2770q928J2511
$$ -15830 -31273 -70999 -133556 -214706 -307663 -403874 -494274 -570679 -626944 -659714 -668642 -656131
34245f56131K9367M0206M4472M2708L6607K8521K0464J3181N964k638j3723k7252
$$ -656131 -626764 -586558 -542086 -499378 -462771 -434250 -413786 -400605 -394641 -397279 -411002 -438254
34233d38254m1895n5394o5064o8257o3000m8869k7658k859K1958M4699O4680Q1129
$$ -438254 -480149 -535543 -600607 -668864 -731864 -780733 -808391 -811250 -789292 -744593 -679913 -598784
34221e98784R1982R4393Q6533O8938M4403J6873r561l1157m4739m8167m1128k5898
$$ -598784 -506802 -412409 -325876 -256938 -212535 -195662 -205223 -236380 -281119 -329286 -370414 -396312
34209c96312p421P738J3589P211r710l1231m9413n7399n1734l2962m666K8073
$$ -396312 -403733 -395995 -382406 -375195 -384905 -416136 -465549 -522948 -574682 -607644 -612310 -584237
34197e84237N9931Q6183J03404J10083J06790R5689P9651O1378M2761K4707P439
$$ -584237 -524306 -438123 -334719 -224636 -117846 -22157 57494 118872 161633 186340 193779
34186A93779q869k3675l6342m6743n5387o2762o8567p1650p0759o5334n5779m3244
$$ 193779 184910 161235 124893 78150 22763 -39999 -108566 -180216 -250975 -316309 -372088 -415332
34174d15332k9278j5580l874M238P598O029Q71n184r193r502o558k459M74R38
$$ -415332 -444610 -460190 -464064 -459826 -452228 -446199 -445328 -450512 -459705 -469207 -475765 -478224 -477750 -476812
34160d76812r86m309p844j0567j1616j0193n730J819J1886K3618L6363M9718O3004
$$ -476812 -477798 -482107 -489951 -500518 -512134 -522327 -528057 -526238 -514352 -490734 -454371 -404653 -341649
34147c41649P4626Q2015Q2396P3918N6561L2372M962k1601m4111o1081p2729q0192
$$ -341649 -267023 -185008 -102612 -28694 27867 60239 65201 43600 -511 -61592 -134321 -214513
34135b14513q4542q6165q4823q0313p3279o5633o0028n8597o1732o7673p3102
$$ -214513 -299055 -385220 -470043 -550356 -623635 -689268 -749296 -807893 -869625 -937298 -1010400
34124a010400p4405o8931n5834l6302j3117J0226L0531M5729N5062N8686N7104
$$ -1010400 -1084805 -1153736 -1209570 -1245872 -1258989 -1248763 -1218232 -1172503 -1117441 -1058755 -1001651
34113a001651N0936M1144K9221J6800M935o353j7805l0100m3089n5487o5180o9920
$$ -1001651 -950715 -909571 -880350 -863550 -858615 -864968 -882773 -912873 -955962 -1011449 -1076629 -1146549
34101a146549o8099n9254m4135k4410k145K0743M2912O3554Q1889R6454J04845
$$ -1146549 -1214648 -1273902 -1318037 -1342447 -1344592 -1323849 -1280937 -1217383 -1135494 -1039040 -934195
34090i34195J04266R2748P0326L9506M743k8910n7235p7781q9997r4854r4424
$$ -934195 -829929 -737181 -666855 -627349 -622606 -651516 -708751 -786532 -876529 -971383 -1065807
34079a065807r1423q8399q6638q5381q2219p4468o0650m1093j7527P551L1484
$$ -1065807 -1157230 -1245629 -1332267 -1417648 -1499867 -1574335 -1634985 -1676078 -1693605 -1686054 -1654570
34068a654570N1918O7443P8043Q4943Q9757R3529R6352R7818R7867R7317R7672
$$ -1654570 -1602652 -1535209 -1457166 -1372223 -1282466 -1188937 -1092585 -994767 -896900 -799583 -701911
34057g01911J00356J05982J14086J23456J32539J39675J43106J41172J32828J18203
$$ -701911 -601555 -495573 -381487 -258031 -125492 14183 157289 298461 431289 549492
34047E49492R8728P6572N3702L1180R167j2257l2125m8238n7952n9587n3449m1818
$$ 549492 648220 724792 778494 809674 818841 806584 774459 726221 668269 608682 555233 513415
34035E13415k8056j5471o476k255k845p510j4998k3514l0631l3815l1633k4846
$$ 513415 485359 469888 463412 461157 458312 450802 435804 412290 381659 347844 316211 291365
34023B91365j6401j0149r172j4764k6373m2028n8829p3491q3010q5396q0023o7466
$$ 291365 274964 264815 255643 240879 214506 172478 113649 40158 -42852 -128248 -208271 -275737
34011b75737m9098k6823k948K0116M0546N7725P2288Q5482R8367J11350J24050
$$ -275737 -324835 -351658 -354606 -334490 -293944 -236219 -163931 -78449 19918 131268 255318
34000B55318J35352J43609J47190J45254J38208J27575J15378J03335R2037Q0408
$$ 255318 390670 534279 681469 826723 964931 1092506 1207884 1311219 1403256 1483664
33990A483664O5987M6327K0814q291l6479n8765p1515p3458o5722n1067l2831
$$ 1483664 1549651 1595978 1616792 1608501 1572022 1513257 1441742 1368284 1302562 1251495 1218664
33979A218664j4059K751J5515K2491K2602J5870L641j1618k6924l9655m8334n2963
$$ 1218664 1204605 1207356 1222871 1245362 1267964 1283834 1287475 1275857 1248933 1209278 1160944 1107981
33967A107981n4761n5678n8019o3922p4545q9148j04920j17899j24540j23066
$$ 1107981 1053220 997542 939523 875601 801056 711908 606988 489089 364549 241483
33957B41483j14039j00098q5030p2435o4386o0669n8916n5475m6711l0295o175
$$ 241483 127444 27346 -57684 -130119 -194505 -255174 -314090 -369565 -416276 -446571 -452746
33946d52746K3156N3331P9588R8386J08459J10719J07175R9600Q8838P5134N8976
$$ -452746 -429590 -376259 -296671 -198285 -89826 20893 128068 227668 316506 391640 450616
33935D50616M1609K4797J0185j258r688j6669k4924l7205n4715p6191r8314j17076
$$ 450616 492225 517022 527207 525949 516261 499592 474668 437463 382748 306557 208243 91167
33923I1167j29157j32688j27381j14167r4604p0495m3876j7136P151K6669L9748
$$ 91167 -37990 -170678 -298059 -412226 -506830 -577325 -621201 -638337 -631186 -604517 -564769
33912e64769M5693M5099L9955L3123K7195K3495K1822K0920J9250J5643R745J966
$$ -564769 -519076 -473977 -434022 -400899 -373704 -350209 -328387 -307467 -288217 -272574 -262829 -260863
33900b60863p051j7072k8399m1402n5765p0147q2515r1038r4906r4510r0799q4441
$$ -260863 -267914 -284986 -313385 -354787 -410552 -480699 -563214 -654252 -749158 -843668 -934467 -1018908
33888a018908p5401o3363m8520l2064j5904j772R441J7600K2597K3877K0760J3159
$$ -1018908 -1094309 -1157672 -1206192 -1238256 -1254160 -1255932 -1246491 -1228891 -1206294 -1182417 -1161657 -1148498
33876a148498J984j1084k4217l6034m6020n4408o1646o7772p2352p4949p5452
$$ -1148498 -1146514 -1157598 -1181815 -1217849 -1263869 -1318277 -1379923 -1447695 -1520047 -1594996 -1670448
33865a670448p3701o8832n9213m3297k0842O496L5592O2875Q5094R9656J04921
$$ -1670448 -1744149 -1812981 -1872194 -1915491 -1936333 -1929837 -1894245 -1831370 -1746276 -1646620 -1541699
33854a541699J00853Q9457P4262N8704M4493L1097J6676k77j9428l8048n1582
$$ -1541699 -1440846 -1351389 -1277127 -1218423 -1173930 -1142833 -1126157 -1126434 -1145862 -1183910 -1235492
33843a235492n5143m5236k1038J5169N8496J02786J42334J73190J93466K02773
$$ -1235492 -1290635 -1335871 -1356909 -1341740 -1283244 -1180458 -1038124 -864934 -671468 -468695
33833d68695K01517J90629J71760J47482J21033R5582P3294N4915M0096K8166
$$ -468695 -267178 -76549 95211 242693 363726 459308 532602 587517 627613 655779
33823F55779J8686J1372N826J594j306j956J177R198K1804L7138N2556O5668P4982
$$ 655779 674465 685837 691663 693257 691951 689995 691172 700370 722174 759312 811868 877536 952518
33810I52518P9953Q0777P8058P2480O4541N4692M3748L3213K4988K0657K0811
$$ 952518 1032471 1113248 1191306 1263786 1328327 1383019 1426767 1459980 1484968 1505625 1526436
33799A526436K4936L1829M0141M8718N6693O3411O8297P0781P0297O6322N8446
$$ 1526436 1551372 1583201 1623342 1672060 1728753 1792164 1860461 1931242 2001539 2067861 2126307
33788B126307M6458L0525J1396r499l0119m8044o0865o6825o5634n8814m9064
$$ 2126307 2172765 2203290 2214686 2205187 2175068 2127024 2066159 1999334 1933700 1874886 1825822
33777A825822l8822k9111j9660j0155j508L975L692l790j7921l6482n6384p4369
$$ 1825822 1787000 1757889 1738229 1728074 1726566 1730541 1734233 1730443 1712522 1676040 1619656 1545287
33765A545287q7355r2914q9865p8750o1751m2240k4209j1657p774j4131l0149
$$ 1545287 1457932 1365018 1275153 1196403 1134652 1092412 1068203 1056546 1048772 1034641 1004492
33754A004492n3181p9256j04303j25320j40857j50435j53419j48400j33684j08753
$$ 1004492 951311 872055 767752 642432 501575 351140 197721 49321 -84363 -193116
33744a93116p5566l8609l308K6305M8950O5479P7016Q3624Q4569P9546O9660N7424
$$ -193116 -268682 -307291 -310599 -284294 -235344 -169865 -92849 -9225 75344 154890 224550 281974
33732B81974M6029L8314L5817L8115M2748M5878M3597L3472J5598p498l2227n5756
$$ 281974 328003 366317 402134 440249 482997 528875 572472 605944 621542 614044 581817 526061
33720E26061p6981r6020j12656j25269j31191j28421j17216j00339q1678o4187
$$ 526061 449080 353060 240404 115135 -16056 -144477 -261693 -362032 -443710 -507897
33710e07897m8500l2973j5176O025K9201N0801O6998P5472P5933O9477N7663M1952
$$ -507897 -556397 -589370 -604546 -598521 -569320 -518519 -451521 -376049 -300116 -230639 -172976 -131024
33698a31024K3497L156j8077l8291n4298o2554o1010n0562l4809j8146l469R125
$$ -131024 -107527 -104371 -122448 -160739 -215037 -277591 -338601 -389163 -423972 -442118 -445587 -436462
33686d36462K2066L8777O1780R1293J24839J57883J85248K02796K08780K04078
$$ -436462 -414396 -375619 -313839 -222546 -97707 60176 245424 448220 657000 861078
33676H61078J91139J72393J49245J22312R2381O1152L1172N031j5567l0290l9963
$$ 861078 1052217 1224610 1373855 1496167 1588548 1649700 1680872 1685903 1670336 1640046 1600083
33665A600083m6051n0297n4555o0252o7445p4366p8381p7988p4214p0171o9225
$$ 1600083 1554032 1503735 1449180 1388928 1321483 1247117 1168736 1090748 1016534 946363 877138
33654H77138p3134q1521r2630j04525j15715j24912j30463j30263j22394j06024
$$ 877138 804004 722483 629853 525328 409613 284701 154238 23975 -98419 -204443
33644b04443q1976n2663k1404Q592L5192N7757P6910R3793J09234J23075J34103
$$ -204443 -286419 -339082 -360486 -351894 -316702 -258945 -182035 -88242 20992 144067 278170
33633B78170J40638J41535J36948J28389J18072J07942R8901R0682Q2502P3876
$$ 278170 418808 560343 697291 825680 943752 1051694 1150595 1241277 1323779 1397655
33623A397655O4868N5558M5428L3420J8553M56k0629m4029o8522r1871j10605
$$ 1397655 1462523 1518081 1563509 1596929 1615482 1615938 1595309 1551280 1482758 1390887 1280282
33612A280282j20755j19406j06036q2709n3211k1974O707K9326M3764M9585M7768
$$ 1280282 1159527 1040121 934085 851376 798165 776191 782898 812224 855988 905573 953341
33601I53341M0329L0133K0560J4504J3128J5419J8940K1201K0652J6970J0595
$$ 953341 993670 1023803 1044363 1058867 1071995 1087414 1106354 1127555 1148207 1165177 1175772
33590A175772J923r349k4187m3404o6744r2541j18192j41045j59309j72483j81135
$$ 1175772 1177695 1168346 1144159 1100755 1034011 941470 823278 682233 522924 350441 169306
33579A69306j86186j88036j86003j78318j62699j37414j02359n9601j2981L2938
$$ 169306 -16880 -204916 -390919 -569237 -731936 -869350 -971709 -1031310 -1044291 -1011353
33569a011353P4035J07346J31135J44578J47424J39925J23101R8963P0430M0824
$$ -1011353 -937318 -829972 -698837 -554259 -406835 -266910 -143809 -44846 25584 66408
33559F6408J3177j0331k8578m1439m9609n4400n7352n9631o1491o2187o0346n4502
$$ 66408 79585 69254 40676 -763 -50372 -104772 -162124 -221755 -283246 -345433 -405779 -460281
33547d60281m3639k7603p327J5329L7944N7913P2855Q1195Q2853P9355P3114O6319
$$ -460281 -503920 -531523 -538850 -523521 -485577 -427664 -354809 -273614 -190761 -111406 -38292 28027
33535B8027O0273N5344N1227M7185M2489L7039L1758K8289K8028L1058L5727L8994
$$ 28027 88300 143644 194871 242056 284545 321584 353342 381631 409659 440717 476444 515438
33523E15438L7421K8413J1329j1914l6997n8230p0274o9910n7022l4204n189K6853
$$ 515438 552859 581272 592601 580687 543690 485460 415186 345276 288254 254050 248861 275714
33511B75714O0041R3205J24722J51770J70530J77215J69357J46934J12645P1235
$$ 275714 335755 428960 553682 705452 875982 1053197 1222554 1369488 1482133 1553368
33501A553368K8175j1460m3625o5619p6439p6899o9144n5612l8154j7936L751
$$ 1553368 1581543 1570083 1526458 1460839 1384400 1307501 1238357 1182745 1144591 1126655 1130406
33490A130406K4590M1030M9258M6715L3247J1046j6579m6834p8395j10842j42915
$$ 1130406 1154996 1196026 1245284 1291999 1325246 1336292 1319713 1272879 1194484 1083642 940727
33479I40727j70983j89296j92276j77317j46192j04333n8763j6016J9109M3965
$$ 940727 769744 580448 388172 210855 64663 -39670 -98433 -114449 -95340 -51375
33469e1375N8040O2705O0664N4970M7989M0984L4609K9704K7584K9626L6550M7792
$$ -51375 6665 69370 130034 185004 232993 273977 308586 338290 365874 395500 432050 479842
33457D79842O1058P2334P6747P0199N0993K0495j7441n7751r5451j26542j48486
$$ 479842 540900 613234 689981 760180 811173 831668 814227 756476 661025 534483 385997
33446C85997j60256j62048j54832j39959j19060r4201o8039m3620k3754j0146
$$ 385997 225741 63693 -91139 -231098 -350158 -444359 -512398 -556018 -579772 -589918
33436e89918k721L05J408K256K893K403N87r52O08P359J8965L2497M3890M9981
$$ -589918 -592639 -592334 -590926 -588670 -585777 -583374 -582787 -583739 -583131 -575772 -556807 -524310 -480420 -430439
33422d30439M9829M4697L6918K8443J9936J0754k98j3969k9799m5949n9644o8017
$$ -430439 -380610 -335913 -298995 -270552 -250616 -239862 -240160 -254129 -283928 -329877 -389521 -457538
33410d57538o8972o1693m6565k4905J146K8400N2711O9857P7016P3903O2793M7603
$$ -457538 -526510 -588203 -634768 -659673 -658527 -630127 -577416 -507559 -430543 -356640 -293847 -246244
33398b46244L2607K1327J5822J6366K1579K8939L5615L9257L8465L2761K2395
$$ -246244 -213637 -192310 -176488 -160122 -138543 -109604 -73989 -34732 3733 36494 58889
33387E8889Q323p697k3398l6665m6144n0995n0232m2380k6142j587K9063O1630
$$ 58889 67212 59515 36117 -548 -46692 -97687 -147919 -190299 -216441 -218028 -188965 -127335
33375a27335R1100J12960J24258J24056J13421R5022P2273M8343K5415M633j3557
$$ -127335 -36235 76725 200983 325039 438460 533482 605755 654098 679513 684146 670589
33364F70589k9151m2523n4119o3707o9878p0727o5512n6003m6242m0771m2550
$$ 670589 641438 598915 544796 481089 411211 340484 274972 218969 172727 131956 89406
33353H9406n1889o6679q3501r8752j09644j14957j15511j13996j13842j17532
$$ 89406 37517 -29162 -112663 -211415 -321059 -436016 -551527 -665523 -779365 -896897
33343h96897j25357j35491j45289j52765j57006j57395j52667j40982j21219r4370
$$ -896897 -1022254 -1157745 -1303034 -1455799 -1612805 -1770200 -1922867 -2063849 -2185068 -2279438
33333b279438o3713l3563p447J3011K8199L9900N0554O2514P7340R5192J14639
$$ -2279438 -2343151 -2376714 -2384161 -2371150 -2342951 -2303051 -2252497 -2189983 -2112643 -2017451 -1902812
33322a902812J33029J47336J55026J54669J46145J30545J09840Q6313O2020L8575
$$ -1902812 -1769783 -1622447 -1467421 -1312752 -1166607 -1036062 -926222 -839909 -777889 -739314
33312g39314J7395K2j1903j7056j4871n777Q754K6241M3598N7988O7760P2850
$$ -739314 -721919 -721897 -733800 -750856 -765727 -771504 -762750 -736509 -692911 -634923 -567163 -494313
33300d94313P4423P3966P2386O9513O4382N6226M5510L4072K4174J7267J3513
$$ -494313 -419890 -345924 -273538 -204025 -139643 -83417 -37907 -3835 20339 37606 51119
33289E1119J2306J3114J6020K1655L0578M2481N5855O8584P9162Q7354R3637R8011
$$ 51119 63425 76539 92559 114214 144792 187273 243128 311712 390874 478228 571865 669876
33277F69876R9475R6717Q9320P8266O5357N2186L9519K7523J6403O705r89o674
$$ 669876 769351 866068 955388 1033654 1099011 1151197 1190716 1218239 1234642 1241347 1240358 1233684
33265A233684j1132j5524k0787k7375l5406m4849n5355o5939p4999q0899q2762
$$ 1233684 1222552 1207028 1186241 1158866 1123460 1078611 1023256 957317 882318 801419 718657
33254G18657q0662p4979o5613n2016l4132j3147Q825K9745M8319O3740P5194Q1829
$$ 718657 637995 563016 497403 445387 411255 398108 406933 436678 484997 548737 623931 705760
33242G05760Q3199P9481P1339N9573M4943K8083R492j0206k9693m6641n8238o2480
$$ 705760 788959 868440 939779 999352 1044295 1072378 1081870 1071664 1041971 995330 937092 874612
33230H74612n9077m9118l3780j3541J1141L8329O3740Q1683Q7250P8604N7910
$$ 874612 815535 766417 732637 719096 730237 768566 832306 913989 1001239 1079843 1137753
33219A137753L0452K310k2061m0969n4892o4931p1545p4220p1837o3378m8545
$$ 1137753 1168205 1170515 1148454 1107485 1052593 987662 916117 841897 770060 706682 658137
33208F58137k8183m288K0321M2532N9618O9937P3432P1596O6806O1398N6812N3144
$$ 658137 629954 625666 645987 688519 748137 818074 891506 963102 1029908 1091306 1148118 1201262
33196A201262M9148M2729L1800J5170o881l2453n8525q1864r9947j11352j15710
$$ 1201262 1250410 1293139 1324939 1340109 1333228 1300775 1242250 1160386 1060439 949087 833377
33185H33377j13618j06777r7855q9559q3384p9016p4808o8865n9883m7522l2380
$$ 833377 719759 612982 515127 425568 342184 263168 188360 119495 59612 12090 -20290
33174b0290j5724J124J7433L3323M9264O5059P9087Q8556R0866Q5166P2860N6706
$$ -20290 -36014 -34890 -17457 15866 65130 130189 209276 297832 388698 473864 546724 603430
33162F03430L9245K1835M697j2498l0160m8426o6773q3660r6616j03063j01364
$$ 603430 642675 664510 669207 656709 626549 578123 511350 427690 331074 228011 126647
33151A26647r1513p4974n4090l1576j0392O376J6089J7512J1476P27j1026k0269
$$ 126647 35134 -39840 -93930 -125506 -135898 -129522 -113433 -95921 -84445 -83718 -94744 -115013
33139a15013k4499k2563j4610j901J3446K8802M1602N0108N4085N4992N5338N7407
$$ -115013 -139512 -162075 -176685 -178586 -165140 -136338 -94736 -44628 9457 64449 119787 177194
33127A77194O1865O7074O9754O6924N7906M4991L2093K2506J7386J5961J6699
$$ 177194 239059 306133 375887 442811 500717 545708 577801 600307 617693 633654 650353
33116F50353J8246J9465J9161J6082R476l03j1764k2949l2471m0056m6125n0720
$$ 650353 668599 688064 707225 723307 732783 732480 720716 697767 665296 625240 579115 528395
33104E28395n2780n0491m2443k8526r917J1776L5451O0896Q8475J18428J50302
$$ 528395 475615 425124 382681 354155 344238 356014 391465 452361 540836 659264 809566
33093H09566J82792K14005K41737K63481K76242K76588K61310K28726J80087J20238
$$ 809566 992358 1206363 1448100 1711581 1987823 2264411 2525721 2754447 2934534 3054772
33083C054772N6731k445n1349q7348j10726j23441j28000j26865j22168j15511
$$ 3054772 3111503 3109058 3057709 2970361 2859635 2736194 2608194 2481329 2359161 2243650
33073B243650j07826r9320q9560p7727o3260m6458k8818j2761r45M656L576k904
$$ 2243650 2135824 2036504 1946944 1869217 1805957 1759499 1730681 1717920 1716975 1721631 1725207 1722303
33061A722303j2522k3403l5002m7806o2157p7263r1133j01194j05120j01489r0134
$$ 1722303 1709781 1686378 1651376 1603570 1541413 1464150 1373017 1271823 1166703 1065214 975080
33050I75080p2147m9490k4533K91K2711M0988N4378O3376O9376P3889P7698Q0586
$$ 975080 902933 853443 828910 829201 851912 892900 947278 1010654 1080030 1153919 1231617 1312203
33038A312203Q1699Q0216P5906O9255O1280N3078M5413L8474L2013K5703J9318
$$ 1312203 1393902 1474118 1550024 1619279 1680559 1733637 1779050 1817524 1849537 1875240 1894558
33027A894558J2619N204l351j3016k3010l2021l8806m2835m4536m4905m4774m4332
$$ 1894558 1907177 1912381 1909030 1896014 1873004 1840983 1802177 1759342 1714806 1669901 1625127 1580795
33015A580795m3417m2483m3166m7573n6563o8438p9153q4081q0000o6266m4671
$$ 1580795 1537378 1494895 1451729 1404156 1347593 1279155 1200002 1115921 1035921 969655 924984
33004I24984j8525Q530L3310N3393O7080P3562P3309O8122O0374N1597M1664K9182
$$ 924984 906459 914989 948299 1001692 1068772 1142334 1215643 1283765 1344139 1395736 1437400 1466582
32992A466582J2816p568l0630n4005p4942r0824r9543r9798r1316p4943n2550
$$ 1466582 1479398 1471830 1441200 1387195 1312253 1221429 1121886 1022088 930772 855829 803279
32981H03279k6709l21K3665M2502N4066N7561N4075M6452L8282L2372K9503K8208
$$ 803279 776570 776249 799914 842416 896482 954043 1008118 1054570 1092852 1125224 1154727 1182935
32969A182935K5697J9414Q199p451k5875m4960o2845p8644r2939j07551j24352
$$ 1182935 1208632 1228046 1236245 1228794 1202919 1157959 1095114 1016470 923531 815980 691628
32958F91628j43686j63450j79641j88095j86398j74706j55093j30152j01881p1520
$$ 691628 547942 384492 204851 16756 -169642 -344348 -499441 -629593 -731474 -802994
32948h02994l9960q169K2722N1566P7404R9502J17208J29706J36016J35302J27434
$$ -802994 -842954 -851123 -828401 -776835 -699431 -599929 -482721 -353015 -216999 -81697 45737
32937D5737J13432R5554P6890O0527M8691M2382M1587M5618N3225O2531P1287
$$ 45737 159169 254723 331613 392140 440831 483213 524800 570418 623643 686174 757461
32926G57461P7357P9113P5573O6546N2905L6581K0017N355o039j3668j7768j9174
$$ 757461 834818 913931 989504 1056050 1108955 1145536 1165553 1170908 1164869 1151201 1133433 1114259
32914A114259j8881j7385j4221q176J926J6408L4244N3008O9280P9446Q0733P1963
$$ 1114259 1095378 1077993 1063772 1055596 1057522 1073930 1108174 1161182 1230462 1309908 1390641 1462604
32902A462604N3807K8618K4k7620n0051o4030o8063o2587m9696l2704j5770l309
$$ 1462604 1516411 1545029 1545053 1517433 1467382 1403352 1335289 1272702 1223006 1190302 1174532 1171223
32890A171223J010m320j7745l5098n1415o3085o8833o9291o5828n9784n2284m4355
$$ 1171223 1172233 1167913 1150168 1115070 1063655 1000570 931737 862446 796618 736834 684550 640195
32878F40195l6966l1033k7337k6211k7042k8135k7399k3573j7046r649l563l51
$$ 640195 603229 572196 544859 518648 491606 463471 436072 412499 395453 385804 382241 381890
32866C81890p20n003j3681k7258m5603o7290q9759j10267j27000j39436j47806
$$ 381890 381170 376167 362486 335228 289625 222335 132576 22309 -104691 -244127 -391933
32855c91933j52421j53441j51194j46449j40369j34178j28785j24297j19630j12701
$$ -391933 -544354 -697795 -848989 -995438 -1135807 -1269985 -1398770 -1523067 -1642697 -1755398
32845a755398j01488q5391o5722m4757k3970k859K0721M8880Q1719J16263J47061
$$ -1755398 -1856886 -1942277 -2007999 -2052756 -2076726 -2079585 -2058864 -2009984 -1928265 -1812002 -1664941
32834a664941J68163J75465J68084J48206J19812Q7315N4834K5999L697j0444
$$ -1664941 -1496778 -1321313 -1153229 -1005023 -885211 -797896 -743062 -717063 -713366 -723810
32824g23810j6483j6098j2046p390m624m815p022q496n648M638K3902N1540Q4887
$$ -723810 -740293 -756391 -768437 -775827 -780451 -785266 -792288 -800784 -806432 -801794 -777892 -726352 -641465
32811f41465J19989J52683J79516J97973K06315K03516J89669J66541J37772J08130
$$ -641465 -521476 -368793 -189277 8696 215011 418527 608196 774737 912509 1020639
32801A020639Q1969O1681M7105L6191K6259J5054J282j5167l3328n1660o8718
$$ 1020639 1102608 1164289 1211394 1247585 1273844 1288898 1290180 1275013 1241685 1190025 1121307
32790A121307q3465r4996j02095j03256r7381q4708o7269m8429l1620j8914j0317
$$ 1121307 1037842 942846 840751 737495 640114 555406 488137 439708 408088 389174 378857
32779C78857m108J979R478J8515K8146L7414M6183N4825O2928O8291O7533N8221
$$ 378857 374749 376728 386206 404721 432867 470281 516464 571289 634217 702508 770041 828262
32767H28262M0937J9634j54j4010k0423k0652j7196j2326p717m907n487j0470
$$ 828262 869199 888833 888679 874669 854246 833594 816398 804072 796355 791448 785961 775491
32755G75491j9414l0372m0917m9480n5938o1211o6499p2677q0089q8524r7318
$$ 775491 756077 725705 684788 635308 579370 518159 451660 378983 298894 210370 113052
32744A13052j05481j11809j14963j13690j07279r5974q0936o3661m5328k6543
$$ 113052 7571 -104238 -219201 -332891 -440170 -536144 -617080 -680741 -726069 -752612
32734g52612p590J1041K8260M2419N1808N5557N4429N0929M8437M9690N5625O5335
$$ -752612 -760202 -749161 -720901 -678482 -626674 -571117 -516688 -465759 -417322 -367632 -312007 -246672
32722b46672P6912Q8326R7571J02461J00692R0515P1699M6269J8587n604k1240
$$ -246672 -169760 -81434 16137 118598 219290 309805 381504 427773 446360 440756 419516
32711D19516k6001k1160j0577J187J0324J4222J1301Q06j7234m1770p0268r8351
$$ 419516 393515 372355 361778 362965 373289 387511 398812 399618 382384 340614 270346 171995
32699A71995j20188j30065j24596j04449p4368m1312j1764J0291K3832L0267L2625
$$ 171995 51807 -78258 -202854 -307303 -381671 -422983 -434747 -424456 -400624 -370357 -337732
32688c37732L4703L9768M8935O0341O9992P3894O9956N8486M1543K2107L509j1110
$$ -337732 -303029 -263261 -214326 -153985 -83993 -10099 59857 118343 159886 181993 185502 174392
32676A74392j9732k2384k1326k0232k2844l1707m7545o9305r4625j20325j42540
$$ 174392 154660 132276 110950 90718 67874 36167 -11378 -80683 -175308 -295633 -438173
32665d38173j56845j59033j46671j20395q3840m2117m5L8816P2310R9540J20556
$$ -438173 -595018 -754051 -900722 -1021117 -1104957 -1147074 -1147119 -1108303 -1035993 -936453 -815897
32654h15897J35754J45098J47952J43801J33396J19137J04278R1548Q2305P6596
$$ -815897 -680143 -535045 -387093 -243292 -109896 9241 113519 205067 287372 363968
32644C63968P3661P2275P0802O7306N9889M7312K9777R579r074k1568k5237k1045
$$ 363968 437629 509904 580706 648012 707901 755213 784990 794569 785495 763927 738690 717645
32632G17645j3159o616m550o702r966j0412n578M258J6389K7115L3360L3447K6887
$$ 717645 704486 697870 693320 686618 676652 666240 660662 664920 681309 708424 741784 775231 802118
32619H02118J3626o509l3688o7282j04890j41907j72188j89757j90808j74836
$$ 802118 815744 809235 775547 708265 603375 461468 289280 99523 -91285 -266121
32609b66121j44258j03060n5492n574M2860Q6098J20704J43807J53481J49344
$$ -266121 -410379 -513439 -568931 -574505 -531645 -445547 -324843 -181036 -27555 121789
32599A21789J32996J07873P8299M8334K0972k136k0594l4945m6109n4754o0908
$$ 121789 254785 362658 440957 489291 510263 508127 487533 452588 406479 351725 290817
32588B90817o4050o3511n8990n0880m0249k8432j6523n161N217J3904J9574K0397
$$ 290817 226767 163256 104266 53386 13137 -15295 -31818 -36979 -31762 -17858 1716 22113
32576B2113J4588J302j8708m3045o8269r0610j06625j13879j11587j00766q3446
$$ 22113 36701 38003 19295 -23750 -92019 -182629 -289254 -403133 -514720 -615486 -698932
32565f98932o1567l6461r285J8428M4753O7797Q6187R9455J08177J13708J17370
$$ -698932 -760499 -796960 -806245 -787817 -743064 -675267 -589080 -489625 -381448 -267740 -150370
32554a50370J19695J20389J18942J15205J09667J03397R7791R4058R2574R2625
$$ -150370 -30675 89714 208656 323861 433528 536925 634716 728774 821348 913973
32544I13973R2630R0565Q4170P1181M9972K0453j5241n2880q7228j13815j30495
$$ 913973 1006603 1097168 1181338 1252519 1302491 1322944 1307703 1254823 1167595 1053780 923285
32533I23285j37895j38360j34228j26612j15391r9936p9974n6167l0407n705J4495
$$ 923285 785390 647030 512802 386190 270799 170863 90889 34722 4315 -1390 13105
32522A3105K7531L2468L0158K2476J1507o26j1683j9595k3226k2980k0686j9077
$$ 13105 40636 73104 103262 125738 137245 136619 124936 105341 82115 59135 38449 19372
32510A9372k1019k8538m1671n7932p3195q3648q7437q4843p7161o5372m9750l0563
$$ 19372 -1647 -30185 -71856 -129788 -202983 -286631 -374068 -458911 -536072 -601444 -651194 -681757
32498f81757r029J2400L0873M4390N2509N6184N7066N6764N6259N5611N3973N0009
$$ -681757 -690786 -678386 -647513 -603123 -550614 -494430 -437364 -380600 -324341 -268730 -214757 -164748
32486a64748M2466L0927J6471J874r186j3580r945R87J6819L4105M8989N8032
$$ -164748 -122282 -91355 -74884 -73010 -82196 -95776 -105721 -104734 -87915 -53810 -4821 53211
32474E3211N9085N1821L7743J9690R92j5639k8944l9198m7396n4205n9277o1306
$$ 53211 112296 164117 201860 221550 222542 206903 177959 138761 91365 37160 -22117 -83423
32462h3423n8734n0890l8887k5487j3617m503L078J1574K2475L4996M6613N4714
$$ -83423 -142157 -193047 -231934 -257421 -271038 -275541 -272463 -260889 -238414 -203418 -156805 -102091
32450a02091N7735N5144M6914L3516J6521j043j5319k3076k3159j7052q180l36
$$ -102091 -44356 10788 57702 91218 107739 106696 91377 68301 45142 28090 19910 19574
32438A9574L983M529L135K512M639R585J5412J9256J8768J3036K615j0923k5359
$$ 19574 23557 28086 31221 33733 38372 47957 63369 82625 101393 114429 117044 106121 80762
32425H0762l7925m5404m4561l3079j0715J9976N3921Q4852J07094J17105J14213
$$ 80762 42837 -2567 -47128 -80207 -90922 -70946 -17025 67827 174921 292026 406239
32414D06239J00485P9862N7003L6237K0829J2388J0624J3636J8938K4549K9417
$$ 406239 506724 586586 643589 679826 700655 713043 723667 737303 756241 780790 810207
32403H10207L2831L3636L0066K0505M502j6762m0847o4885q6336j03205j13926
$$ 810207 843038 876674 906740 927245 931747 914985 874138 809253 722917 619712 505786
32392E05786j17210j12365r9856q1521n9813l6566j2455J2242L6234N6729P0444
$$ 505786 388576 276211 176355 94834 35021 -1545 -14000 -1758 34476 91205 161649
32381A61649P5358P1817O2373N0650M0100L3079L0463L1733L5378L9562M2740
$$ 161649 237007 308824 371197 421847 461947 495026 525489 557222 592600 632162 674902
32370F74902M3842M1945L5966K5095R672q530k7287m5232o2127p7823r1123r9831
$$ 674902 718744 760689 796655 821750 831422 822892 795605 750373 688246 610423 519300 419469
32358D19469j01831r6194q3489o5321m3662k0439K501K3344M0533N3311O2103
$$ 419469 317638 221444 137955 72634 28972 8533 11034 34378 74911 128222 190325
32347A90325O8372P3915P9935Q6314R1273R1788Q4761O8492M3795J4117j5389
$$ 190325 258697 332612 412547 498861 590134 681922 766683 835175 878970 893087 877698
32336H77698l9564n5089o1508o0766n5674m8413m0174l1617k3267j5254o908K940
$$ 877698 838134 783045 721537 660771 605097 556684 516510 484893 461626 446372 439464 442404
32324D42404J4858K7678L8336M3082L9428K7620J0612p423k2969l4311m1525m5734
$$ 442404 457262 484940 523276 566358 605786 633406 644018 636595 613626 579315 537790 492056
32312D92056m8302n0243n2020n3590n4674n5020n4609n3769n3210n3849n6390
$$ 492056 443754 393511 341491 287901 233227 178207 123598 69829 16619 -37230 -93620
32301i3620o0715o5490o8317o6460n7830m1708j8942Q268L6857O3606Q5992J02826
$$ -93620 -154335 -219825 -288142 -354602 -412432 -454140 -473082 -464814 -427957 -364351 -278359 -175533
32289a75533J14192J20724J22809J20241J12387R8615P8796N3761K5350m142l2767
$$ -175533 -61341 59383 182192 302433 414820 513435 592231 645992 671342 667200 634433
32278F34433n9197q2274j00419j11750j14859j09556r6793p7945n4213k6807K401
$$ 634433 575236 492962 392543 280793 165934 56378 -40415 -118360 -172573 -199380 -196979
32267a96979L0637N4790P2304Q1719Q2600P5303O0767M0249J5003j3853m5138
$$ -196979 -166342 -111552 -39248 42471 125071 200374 261141 301390 316393 302540 257402
32256B57402p7256j08113j35398j57169j72406j81159j84014j81374j73241j59770
$$ 257402 180146 72033 -63365 -220534 -392940 -574099 -758113 -939487 -1112728 -1272498
32246a272498j41740j20416r6912p1876m5770j9252O735L1119N2870P1203Q5747
$$ -1272498 -1414238 -1534654 -1631566 -1703442 -1749212 -1768464 -1761729 -1730610 -1677740 -1606537 -1520790
32235a520790R6630J04235J08878J10575J09046J03904R5022Q3063O9789N7897
$$ -1520790 -1424160 -1319925 -1211047 -1100472 -991426 -887522 -792500 -709437 -639648 -581751
32225e81751N0164M8356N2469O0844P1010Q0601Q7640R0256Q6544P5052N5568
$$ -581751 -531587 -483231 -430762 -369918 -298908 -218307 -130667 -40411 46133 121185 176753
32214A76753K9447q30l2492o3079r0470j12637j27603j33828j30817j19414j01522
$$ 176753 206200 205370 172878 109799 19329 -93308 -220911 -354739 -485556 -604970 -706492
32203g06492p9545n5873l2680j1833N207J7461K4539K6680K4754J9989J3593O371
$$ -706492 -786037 -841910 -874590 -886423 -881216 -863755 -839216 -812536 -787782 -767793 -754200 -747829
32191g47829j283r094j6591k3008k7452k9033k6962k0671j0016M657K2603M2769
$$ -747829 -749112 -758206 -774797 -797805 -825257 -854290 -881252 -901923 -911939 -907282 -884679 -841910
32179h41910O3621Q3041R8712J09004J13534J12922J08069R9646Q8184P4328N8953
$$ -841910 -778289 -695248 -596536 -487532 -373998 -261076 -153007 -53361 34823 109151 168104
32168A68104M3147K8211J5505O041J29k579k578p3M949J2230K0853K9252L5738
$$ 168104 211251 239462 254967 261008 261137 258558 255980 255907 260856 273086 293939 323191 358929
32155C58929L9199L9642L8238L6712L6369L7508L9513M1381M2068M0519L5790
$$ 358929 398128 437770 476008 512720 549089 586597 626110 667491 709559 750078 785868
32144G85868K7470J6155L386q874j8838k5161k7001k4058j6795o572M428J3569
$$ 785868 813338 829493 832879 824005 805167 780006 753005 728947 712152 705580 710008 723577
32132G23577J8387J7235R816k547j7078l0315l9326m2918m2092l9340l7116l6476
$$ 723577 741964 759199 769015 766468 749390 719075 679749 636831 594739 555399 518283 481807
32120D81807l6884l7365l7994m0365m6593n7620p2193q7212r9023j04756j03028
$$ 481807 444923 407558 369564 329199 282606 224986 152793 65581 -33442 -138198 -241226
32109b41226r3882p8323n7895l4470j0184J2774L2617M8461O0485O9540P6312
$$ -241226 -335108 -413431 -471326 -505796 -515980 -503206 -470589 -422128 -361643 -292103 -215791
32098b15791Q0579Q1069P6048O4232M5547K1527m733k9171m7921n8533o0604n5553
$$ -215791 -135212 -54143 21905 86137 131684 153211 148478 119307 71386 12853 -47751 -103304
32086a03304m5820l4086k2639j2884n144J100O611J1927J7297K2841K8527L3807
$$ -103304 -149124 -183210 -205849 -218733 -223877 -222777 -216166 -204239 -186942 -164101 -135574 -101767
32074a01767L7463L8153L5527L1038K7512K7610L2149L9516M6554N0432N0389
$$ -101767 -64304 -26151 9376 40414 67926 95536 127685 167201 213755 264187 314576
32063C14576M8265M7400N0618N8564O9437P9930Q6637Q7232Q1304P0679N8866
$$ 314576 362841 410241 460859 519423 588860 668790 755427 842659 923963 994642 1053508
32052A053508M9570M4814M3829M3473L9929L0730J5912k273k0741l7025n0080
$$ 1053508 1103078 1147892 1191721 1235194 1275123 1305853 1321765 1319492 1298751 1261726 1211646
32041A211646o0282o9018p8047q8803j01779j16435j31796j47141j62014j75647
$$ 1211646 1151364 1082346 1004299 915496 813717 697282 565486 418345 256331 80684
32031H0684j86466j92339j91295j82201j65185j41892j15400q9378o6683m8365
$$ 80684 -105782 -298121 -489416 -671617 -836802 -978694 -1094094 -1183472 -1250155 -1298520
32021a298520l3798k1605j0542L19J1790K4687L9564N6177P2955Q7082R5374R5836
$$ -1298520 -1332318 -1353923 -1364465 -1364146 -1352356 -1327669 -1288105 -1231928 -1158973 -1071891 -976517 -880681
32009h80681Q8880P7509O6264N9568O0221O8471Q1977R6599J07884J12605J09719
$$ -880681 -791801 -714292 -648028 -588460 -528239 -459768 -377791 -281192 -173308 -60703 49016
31998D9016J00454Q7589P4463O3992N7993N6944O0163O6292P3708Q0616Q4924
$$ 49016 149470 237059 311522 375514 433507 490451 550614 616906 690614 771230 856154
31987H56154Q4335P7063O2878M3704K3114M868q508j6237j8853j7509j3516q304
$$ 856154 940489 1017552 1080430 1124134 1147248 1152116 1143608 1127371 1108518 1091009 1077493 1069189
31975A069189l466o28j135n744j4475k6660m1122n6431p1256q4768r6807j07587
$$ 1069189 1065723 1065095 1063960 1058216 1043741 1017081 975959 919528 848272 763504 666697 559110
31963E59110j17072j24660j29374j30424j27482j20567j09835r5692p9118o1812
$$ 559110 442038 317378 188004 57580 -69902 -190469 -300304 -395996 -475114 -536926
31953e36926m5802l2689k2975j6033j0848p179o284j0408k1030l7026n4338o7635
$$ -536926 -582728 -615417 -638392 -654425 -665273 -672452 -678736 -689144 -710174 -747200 -801538 -869173
31941h69173p2879o8898n7035l9492j7879P214L5714O7280J00880J35003J68220
$$ -869173 -942052 -1010950 -1067985 -1107477 -1125356 -1118142 -1082428 -1015148 -914268 -779265 -611045
31930f11045J99674K29022K55892K79269K97303L07737L08779K99822K81612K55776
$$ -611045 -411371 -182349 73543 352812 650115 957852 1266631 1566453 1848065 2103841
31920B103841K24130J88236J49234J07741O3883J7701l0009p7019j19784j54469
$$ 2103841 2327971 2516207 2665441 2773182 2837065 2854766 2824757 2747738 2627954 2473485
31910B473485j78255j90091j90664j81943j66731j48410j30498j15776j05449
$$ 2473485 2295230 2105139 1914475 1732532 1565801 1417391 1286893 1171117 1065668
31901A065668r9022r5231r3343r3766r7593j05606j17499j31803j46380j59209
$$ 1065668 966646 871415 778072 684306 586713 481107 363608 231805 85425 -73784
31891g3784j68985j75101j76974j73363j62512j43298j16517q5141n3237k4295
$$ -73784 -242769 -417870 -594844 -768207 -930719 -1074017 -1190534 -1275675 -1328912 -1353207
31881a353207q5J9425L5301M8710O0284O9865P6571P9206P6941O9880N9039M5692
$$ -1353207 -1353292 -1333867 -1298566 -1249856 -1189572 -1119707 -1043136 -963930 -886989 -817109 -758070 -712378
31869g12378L0755J4750j594j6821k8831l5500l5358k8027j4453L104K1345L6651
$$ -712378 -681623 -666873 -668467 -685288 -714119 -749619 -784977 -813004 -827457 -824353 -803008 -766357
31857g66357M6053M8058M2983L2711K0176Q836J993J840Q546J9916L2081M0881
$$ -766357 -720304 -672246 -629263 -596552 -576376 -567540 -565547 -563707 -555161 -535245 -503164 -462283
$$ [...]
##END NTUPLES=NMR SPECTRUM
##END=
