##TITLE=31Pdec_13-2021
 CDCl3, 24 sc
 11.03.2021
##JCAMPDX= 6.0         $$ Bruker NMR JCAMP-DX V2.0
##DATA TYPE= NMR SPECTRUM
##DATA CLASS= NTUPLES
##ORIGIN= UXNMR, Bruker Analytische Messtechnik GmbH
##OWNER= root
$$ XWIN-NMR		Version 3.5
$$ Fri Mar 12 10:49:44 2021 Russian Standard Time (UT+4h)  she@DPX200
##.OBSERVE FREQUENCY= 81.013821
##.OBSERVE NUCLEUS= ^31P
##.ACQUISITION MODE= SIMULTANEOUS
##.ACQUISITION SCHEME= undefined
##.AVERAGES= 24
##.DIGITISER RES= 16
##SPECTROMETER/DATA SYSTEM= spect
##.PULSE SEQUENCE= zgpg30
##.SOLVENT NAME= CDCl3
##.SHIFT REFERENCE= (INTERNAL, CDCl3, 0, 248.564)
##AUDIT TRAIL= $$ (NUMBER, WHEN, WHO, WHERE, WHAT)
$$ ##TITLE= Audit trail, XWIN-NMR		Version 3.5
$$ ##JCAMPDX= 5.01
$$ ##ORIGIN= Bruker BioSpin GmbH
$$ ##OWNER= she
$$ F:/spectra/data/she/nmr/P31/1/pdata/1/auditp.txt
$$ ##AUDIT TRAIL=  $$ (NUMBER, WHEN, WHO, WHERE, WHAT)
(   1,<2021-03-12 10:48:46.87 +0400>,<she>,<DPX200>,
      <created by zg, POWCHK disabled, PULCHK disabled
       configuration hash MD5:
       00 E9 B6 7A A2 85 ED C7 34 08 36 98 17 FE 4E 26
       data hash MD5: 32K
       05 3D 6A 4D 25 87 5B E9 71 3D 76 40 2E F0 96 E0>)
(   2,<2021-03-12 10:48:49.50 +0400>,<she>,<DPX200>,
      <Start of raw data processing
       efp BC_mod = 2 LB = 1 FT_mod = 6 PKNL = 1 PHC0 = -4138.545 PHC1 = 252.601 SI = 64K 
       data hash MD5: 64K
       D4 4D C0 A6 05 2C B6 C2 3F 51 E8 88 3E 06 0A 12>)
(   3,<2021-03-12 10:49:18.95 +0400>,<she>,<DPX200>,
      <pk PHC0 = -221.3782 PHC1 = 447.8002 
       data hash MD5: 64K
       E5 DE C4 C4 B8 0E 87 DA F9 6D 32 40 8D 0C D3 DD>)
(   4,<2021-03-12 10:49:24.51 +0400>,<she>,<DPX200>,
      <abs ABSG = 5 
       data hash MD5: 64K
       0C 07 1E 59 D7 BD 4D C4 FF A6 72 FD 54 82 83 3A>)
$$ ##END=
$$ 
$$ hash MD5
$$ A9 DE 69 38 51 BA 18 83 64 20 3C 4E 61 FF D9 3D
##$RELAX= 
##$RELAX= 
##$RELAX= 
##$RELAX= 
##$RELAX= 
##$RELAX= 
##$RELAX= 
##$RELAX= 
$$ Bruker specific parameters
$$ --------------------------
##$DU= <F:/spectra>
##$EXPNO= 1
##$NAME= <P31>
##$PROCNO= 1
##$TYPE= <nmr>
##$USER= <she>
##$AMP= (0..31)
100 100 100 100 100 100 100 100 100 100 100 100 100 100 100 100 100 100 
100 100 100 100 100 100 100 100 100 100 100 100 100 100 
##$AQSEQ= 0
##$AQ_mod= 1
##$AUNM= <au_zg>
##$AUTOPOS= <>
##$BF1= 81.014009
##$BF2= 200.13
##$BF3= 200.13
##$BF4= 200.13
##$BF5= 200.13
##$BF6= 200.13
##$BF7= 200.13
##$BF8= 200.13
##$BYTORDA= 1
##$CFDGTYP= 0
##$CFRGTYP= 5
##$CHEMSTR= <none>
##$CNST= (0..31)
1 1 145 1 1 1 1 1 1 1 1 1 1 1 1 1 1 1 1 1 1 1 1 1 1 1 1 1 1 1 1 1 
##$CPDPRG= <waltz16>
##$CPDPRG1= <>
##$CPDPRG2= <waltz16>
##$CPDPRG3= <>
##$CPDPRG4= <mlev>
##$CPDPRG5= <mlev>
##$CPDPRG6= <mlev>
##$CPDPRG7= <mlev>
##$CPDPRG8= <mlev>
##$CPDPRGB= <>
##$CPDPRGT= <>
##$D= (0..31)
0 1 0 0 0 0 0 0 0 0 0 0.03 2e-05 3e-06 0 0 0 0 0 0 0 0 0 0 0 0 0 0 0 0 
0 0 
##$DATE= 1615531726
##$DBL= (0..7)
120 120 120 11 120 120 24 19 
##$DBP= (0..7)
150 150 150 150 150 150 150 150 
##$DBP07= 0
##$DBPNAM0= <>
##$DBPNAM1= <>
##$DBPNAM2= <>
$$ [...]
##$SUBNAM3= <"">
##$SUBNAM4= <"">
##$SUBNAM5= <"">
##$SUBNAM6= <"">
##$SUBNAM7= <"">
##$SUBNAM8= <"">
##$SUBNAM9= <"">
##$SW= 501.771253377433
##$SWIBOX= (0..15)
0 1 3 0 0 0 0 0 0 0 0 0 0 0 0 0 
##$SW_h= 40650.406504065
##$TD= 32768
##$TD0= 1
##$TE= 0
##$TE2= 300
##$TE3= 300
##$TEG= 300
##$TL= (0..7)
0 120 53 12 22 120 120 120 
##$TP= (0..7)
150 150 150 150 150 150 150 150 
##$TP07= 0
##$TPNAME0= <>
##$TPNAME1= <>
##$TPNAME2= <>
##$TPNAME3= <>
##$TPNAME4= <>
##$TPNAME5= <>
##$TPNAME6= <>
##$TPNAME7= <>
##$TPOAL= (0..7)
0.5 0.5 0.5 0.5 0.5 0.5 0.5 0.5 
##$TPOFFS= (0..7)
0 0 0 0 0 0 0 0 
##$TUNHIN= 0
##$TUNHOUT= 0
##$TUNXOUT= 0
##$USERA1= <user>
##$USERA2= <user>
##$USERA3= <user>
##$USERA4= <user>
##$USERA5= <user>
##$V9= 5
##$VALIST= <valist>
##$VCLIST= <CCCCCCCCCCCCCCC>
##$VD= 0
##$VDLIST= <DDDDDDDDDDDDDDD>
##$VPLIST= <PPPPPPPPPPPPPPP>
##$VTLIST= <TTTTTTTTTTTTTTT>
##$WBST= 1024
##$WBSW= 4
##$XGAIN= (0..3)
0 0 0 0 
##$XL= 0
##$YL= 0
##$YMAX_a= 24478
##$YMIN_a= -24659
##$ZGOPTNS= <>
##$ZL1= 120
##$ZL2= 120
##$ZL3= 120
##$ZL4= 120
##$ABSF1= 248.5645
##$ABSF2= -253.2056
##$ABSG= 5
##$ABSL= 3
##$ALPHA= 0
##$AQORDER= 0
##$ASSFAC= 0
##$ASSFACI= 0
##$ASSFACX= 0
##$ASSWID= 0
##$AUNMP= <proc_1d>
##$AZFE= 0.1
##$AZFW= 0.5
##$BCFW= 0
##$BC_mod= 2
##$BYTORDP= 0
##$COROFFS= 0
##$CY= -3
##$DATMOD= 1
##$DC= 0
##$DFILT= <>
##$DTYPP= 0
##$F1P= 0
##$F2P= 0
##$FCOR= 1
##$FTSIZE= 65536
##$FT_mod= 6
##$GAMMA= 0
##$GB= 0
##$INTBC= 1
##$INTSCL= 5.30512e-09
##$ISEN= 30
##$LB= 1
##$LEV0= 0
##$LPBIN= 0
##$MAXI= 10000
##$MC2= 0
##$MEAN= 0
##$ME_mod= 0
##$MI= 50
##$NCOEF= 0
##$NC_proc= -2
##$NLEV= 6
##$NOISF1= 182.463
##$NOISF2= 159.3651
##$NSP= 0
##$NTH_PI= 0
##$NZP= 0
##$OFFSET= 248.5645
##$PC= 4
##$PHC0= -4359.923
##$PHC1= 700.4012
##$PH_mod= 1
##$PKNL= yes
##$PPARMOD= 0
##$PSCAL= 0
##$PSIGN= 0
##$REVERSE= no
##$SF= 81.014009
##$SI= 65536
##$SIGF1= 159.3651
##$SIGF2= -187.1042
##$SINO= 113.3802
##$SIOLD= 16384
##$SREGLST= <1H.CDCl3>
##$SSB= 0
##$STSI= 65536
##$STSR= 0
##$SW_p= 40650.406504065
##$SYMM= 0
##$S_DEV= 0
##$TDeff= 32768
##$TDoff= 0
##$TI= <>
##$TILT= no
##$TM1= 0
##$TM2= 0
##$TOPLEV= 0
##$USERP1= <user>
##$USERP2= <user>
##$USERP3= <user>
##$USERP4= <user>
##$USERP5= <user>
##$WDW= 1
##$XDIM= 65536
##$YMAX_p= 401812119
##$YMIN_p= -1807422
$$ End of Bruker specific parameters
$$ ---------------------------------
##NTUPLES= NMR SPECTRUM
##VAR_NAME=  FREQUENCY,     SPECTRUM/REAL,   SPECTRUM/IMAG
##SYMBOL=    X,             R,               I
##VAR_TYPE=  INDEPENDENT,   DEPENDENT,       DEPENDENT
##VAR_FORM=  AFFN,          ASDF,            ASDF
##VAR_DIM=   65536,         65536,           65536
##UNITS=     HZ,            ARBITRARY UNITS, ARBITRARY UNITS
##FACTOR=    0.620285442955139, 1,           1
##FIRST=     20137.2065510759, 0,            0
##LAST=      -20513.1999529892, 0,           0
##MIN=       -20513.1999529892, -1807422,    0
##MAX=       20137.2065510759, 401812119,    0
$$ Real data points
##PAGE= N=1
##DATA TABLE= (X++(R..R)), XYDATA
$$ [...]
36327f9402J06886J92884L5314k10715k24256J2281J81479J01476m9413o6070
36317A0464j0495k4722o7467k3891P2733J08714P1984J3032p3168j74936j77067
36306b74819j7338J54350J56490M9302K8748R5965O6531q7298j57767m4913N5228
36295B4479m3839k08421j77597M8285K26653K26743J49886R5656J9438j10342
36285B50941j89428j27829o250L8432O081l961L6585P3492R1063J16435J15564
36274D01125J7449j37863j99474j03345L2120O8562J6573k7733l1591k1732J010
36263A5101M0330M5888j4766o2701p545Q2949N5884q0228j41069m3194O6970M9772
36251G391j4396J5637R4929Q3118L186P342J06806J36810J9079j20685j56211
$$ y = [-69402, 37484, 230368, 265682, 54967, -169289, -157008, 24471, 125947, 76534, 10464, -31, -24753, -92220, -116111, -43378, 65336, 137320, 150352, 77184, -97752, -274819, -292157, -137807, 18683, 67985, 96733, 192698, 259229, 171931, 14164, -30749, 24479, -19360, -227781, -405378, -357093, -130440, 96303, 246189, 341845, 361283, 250941, 61513, -66316, -72566, -34134, -28053, -32014, 4571, 78063, 169126, 285561, 401125, 418574, 280711, 81237, -22108, 10012, 78574, 95147, 67414, 35823, 14091, 15101, 55431, 101319, 86553, 23852, 16307, 99256, 155140, 74912, -66157, -109351, -42381, 7391, -7005, 8632, 103561, 186679, 189865, 197207, 304013, 440823, 459902, 339217, 183006]
36240A83006j23698j03286p8523j6064K6292j3930q5095r4301m5999j6155k6332
36229c94085k2913L6857J27018J68737J01193k4850n6782O8627J87912J08885
36219C00599r0599j63138p7071l7368q9995l4782J48907J56814j29096l39475
36209c55204j60533J36077J23988q0950n7429J72472K04988j1287j07485J1358
36199a24005J9152j56698j34565J99638L63052M1799l30013k25629J56429K59606
36189F8766M3610p9190J0983L9709q4307j30054j4891N3954r360k6867O5043P1686
36177I082p6136j33299O5071K94942K60647K1939j32815j08743o3634j02864j33947
36166i9757n3452P5837J13488L4070n2336n9610k8934l6610o3301l7368L0030
$$ y = [183006, 59308, -43978, -122501, -138565, -112273, -126203, -211298, -305599, -351598, -367753, -394085, -416998, -380141, -253123, -84386, 16807, -8043, -64825, 3802, 191714, 300599, 210000, 46862, -30209, -67577, -157572, -192354, -43447, 113367, -15729, -355204, -515737, -379660, -255672, -336622, -394051, -221579, -16591, -27878, -135363, -124005, -104853, -261551, -396116, -196478, 166574, 208373, -121640, -347269, -190840, 68766, 112376, 33186, 44169, 83878, -429, -130483, -145374, -91420, -100780, -127647, -62604, 9082, -67054, -200353, -135282, 159660, 420307, 442246, 309431, 200688, 137054, 34190, -99757, -153209, -77372, 36116, 70186, 17850, -41760, -70694, -107304, -170605, -207973, -177943]
36155a77943O4904P0217J08805J41129N0853j20386j55287J8988J76004J04347
36145B81631q2852j35630l5922L1725l638l0081K3769Q1142M6841p8594k14171
36134a15780k47947j15187R5161J84880Q3299n1463n7848K1672O9439Q8618J22946
36123G7790J18474L9029r668M0986N3997q6471k14555j12446J02618J20296q3882
36112D6168k18337j26993K4053O0131K9440L2238M2290Q687k9894k9714j8673
36101a80604k3575k4136j5004j6527j3470J8828L9993N050k7642K7253J24261
36090h5573J34905L3017q4342j32063r2220R679Q5525L0790j03905j13508O1064
36079b56631J97440J24089p275l966K9336o8788j48856j931J92634J13007j28050
$$ y = [-177943, -113039, -42822, 65983, 207112, 257965, 137579, -17708, 1280, 177284, 281631, 198779, 63149, 27227, 58952, 55314, 25233, 49002, 130144, 176985, 98391, -115780, -363727, -478914, -383753, -198873, -115574, -167037, -224885, -203213, -133774, -45156, 77790, 196264, 235293, 225625, 266611, 320608, 234137, 19582, -92864, 9754, 130050, 46168, -172169, -299162, -275109, -214978, -185538, -153300, -111010, -102323, -132217, -161931, -180604, -204179, -228315, -243319, -259846, -273316, -254488, -214495, -209445, -237087, -209834, -85573, 49332, 82349, -1993, -134056, -226276, -216597, -131072, -100282, -204187, -317695, -256631, -59191, 64898, 57623, 53657, 82993, 14205, -134651, -136582, 56052, 169059, 41009]
36068D1009j40685O6688J04252r1473j38385Q5473J91131l9464k55200j35142
36058c11796Q5649O9443m8587K8356J90659J31987q9686j55827k1823O5678Q156
36047d7791n7079o0931o5337n6725K6336R5422K4197q4992l4433J09245R9386
36036e2702o0390j02978M7216J41864L2685q6323k4283Q8188L9901j06706j42994
36025b26522n6141L882J4002P7669J60443Q9973j25847k22581n0838J67860J40917
36014b7183p3455j68179m1983R8201R4397M1395N2447N7517j6391n8390L7903
36003c721J41858O2577j28402j76080j0804J66450J70753L4208r6836j27238n9416
35992b6651K2100J9379m7166l4427J01177J80585N1440j44243j52938J3676J09659
$$ y = [41009, -99676, -32988, 71264, -20209, -158594, -73121, 118010, 78546, -176654, -311796, -226147, -156704, -205291, -176935, 13724, 145711, 56025, -99802, -121625, -55947, -47791, -104870, -165801, -231138, -287863, -261527, -166105, -141908, -226900, -261333, -152088, -52702, -113092, -216070, -168854, -26990, 5695, -80628, -104911, -16723, 23178, -83528, -226522, -282663, -278781, -264779, -187110, -26667, 63306, -62541, -285122, -335960, -168100, -27183, -100638, -268817, -310800, -212599, -118202, -76807, -24360, 33157, 16766, -41624, -3721, 138137, 200714, 72312, -103768, -114572, 51878, 222631, 256839, 160003, 32765, -26651, -4551, 14828, -32338, -66765, 34412, 214997, 266437, 122194, -30744, -17068, 92591]
35981I2591K3790j08452j48744r5968J3747J37750J60609Q566j69293j49105L5741
35970a98768J33710N3766l4003n441N3045M5396Q316j7301n9896j01493p1590
35959a94259O30J0443k4042J3925J04931J05308J2640k0377L1084J9241q8554
35948b9030j31426l2751Q2402J13334R7289N0604n7544j34412l8535J31304J16820
35937A68055p8244j70076o5598R424m1715o058J94942K74979N1743k02021j78182
35926d2751j0792o317j34101j33257L3058J59814J44421P2175J3207m5563j00336
35915e0442j17693q8096j5186P2596Q0714l5040j15491J7931K27535K01913m0083
35904A38658j47683j3429O6513m9386q6030J11317K31953L0693k01903j05654
$$ y = [92591, 116381, 7929, -140815, -236783, -223036, -85286, 75323, 83889, -85404, -234509, -198768, -65058, -11292, -45295, -50736, 2309, 47705, 56021, 38720, -21176, -122669, -194259, -193629, -183186, -207228, -193303, -88372, 16936, 29576, 9199, 40283, 59524, -29030, -160456, -193207, -110805, 2529, 99818, 150422, 92878, -41534, -80069, 51235, 168055, 89811, -80265, -145863, -136439, -178154, -184212, 10730, 285709, 337452, 135431, -42751, -53543, -59860, -193961, -327218, -294160, -134346, 10075, 82250, 95457, 49894, -50442, -168135, -256231, -271417, -198821, -118107, -153147, -268638, -250707, -23172, 178741, 138658, -9025, -22454, 44059, -5327, -91357, 19960, 251913, 282606, 80703, -24951]
35894b4951J53256J90540K6606n3956l7023j05628k00748j16695P2562J07247
35884A1210j4802p2942k7325k0759m7917J7117J16919P7405o1156r2931J4258
35873a00923J08966J23736R3016J524j25372j16093Q2223K02299L6623j76317
35863A29682j18920N6577j368j96489j38629J47300K33734J6161j32566j8551
35853b3069R1133l828j06428k6060R4385P8745P908L150J1433j3616J1927Q9679
35841B15359O9666o7319j30501n4420k5698j29518j68886j5385J45945J26253
35831c4504K4419o251l0817j31501j66048n282J71363J16104p5195r0728J18060
35820a10380K70203J75700k1609q7298m883N7153j0266j40096j91826j12086K3295
$$ y = [-24951, 128305, 318845, 345451, 291495, 254472, 148844, -51904, -168599, -96037, 11210, -3592, -76534, -103859, -124618, -172535, -155418, -38499, 38906, -22250, -115181, -100923, 8043, 131779, 224795, 226319, 100947, -15146, 67077, 269376, 305999, 129682, 10762, 67339, 65971, -130518, -269147, -121847, 111887, 128048, -4518, -23069, 68064, 64236, -42192, -68252, 26133, 104878, 112786, 115936, 127369, 113753, 125680, 215359, 285025, 217706, 87205, 32785, 7087, -122431, -291317, -306702, -160757, -34504, -10085, -16336, -47153, -178654, -344702, -349984, -178621, -62517, -137712, -228440, -110380, 159823, 335523, 313914, 226616, 221733, 278886, 268620, 128524, -63302, -175388, -152093]
35809a52093J07695J08329N9037o251o4573q0590l5533L1637O1701M2195L314
35798G4868k4347j7801K8054O8379M2862l3450q4842r1276q8871n4502N7371J50737
35786B7182O9447j07216j03797J10327K03235j5805k60684j95305N4953J34125
35776h3538J569r4172m7541L2713Q2019J02142K6518j43657j95386n807J62429
35765a62711K5335k15774j55536J44507K46845N1744q6714J1805J11587M8436
35755A9524r532N4728Q2208k2057r4791l9621n10l9364R314J72727J82013q6082
35743B28557l31287k57986n231J22625J07981J10399J09194k5148k20219k55496
35733d16611q7766R5291J32014M4397m5547n1320J2463N1024Q178m1601P48R0238
$$ y = [-152093, -44398, 63931, 122968, 116717, 52144, -28446, -63979, -32342, 29359, 71554, 74868, 50521, 32720, 60774, 129153, 172015, 138565, 53723, -37553, -126424, -180926, -123555, 27182, 96629, -10587, -114384, -4057, 199178, 183373, -77311, -272616, -217663, -83538, -81969, -176141, -223682, -190969, -108950, -6808, 19710, -123947, -319333, -325140, -162711, -137376, -353150, -508686, -364179, -117334, -65590, -152304, -140499, -28912, 19524, 9992, 64720, 146928, 124871, 30080, -9541, -10051, -49415, -40101, 132626, 314639, 228557, -102730, -360716, -365947, -243322, -135341, -24942, 84252, 59104, -161115, -416611, -504377, -409086, -277072, -232675, -278222, -329542, -317079, -266055, -257877, -299478, -298730, -208492]
35721b08492J00916K6570l5376o3296r2130o1207R2349K23358J27174j09650j93570
35710a93354p1034J8091k9652l6660Q3686J51621N6802m2234j5741K6927q438
35699e9986j5228O3644O9490q4552k06077j18700N3307J06407O1533M0522L2638
35688e7002p081o979O6861P5595o7514j99187j41441J4209O7444J9193P321M3029
35676a85552K4346n6088r6689m0351P6594J74228J57721o384j86216j90195l1437
35665c60023P5696L7191l798N4057J06197P0068M1439P9571O4793o6067j60985
35654f1861j03198o930J3611M3798J38973J35416o2555k27204j26014Q6478J04912
35643f4574m1884p3615N9791J17346k0596j77815j69395l4566Q2458J18384R8764
$$ y = [-208492, -107576, -81006, -116382, -179678, -271808, -333015, -240666, -17308, 109866, 216, -193354, -264388, -246297, -275949, -312609, -228923, -77302, -20500, -62734, -78475, -51548, -59986, -75214, -11570, 57920, -26632, -232709, -351409, -298102, -191695, -130162, -89640, -57002, -64083, -71062, -4201, 71394, 3880, -195307, -336748, -322539, -255095, -235902, -228581, -185552, -161206, -217294, -313983, -354334, -277740, -103512, 54209, 47825, -138391, -328586, -360023, -284327, -247136, -250934, -196877, -90680, -20612, 20827, 100398, 165191, 99124, -61861, -165059, -171989, -158378, -114580, 24393, 159809, 97254, -129950, -255964, -169486, -64574, -106458, -180073, -120282, -2936, -23532, -201347, -370742, -405308, -322850, -204466, -105702]
35632a05702P2140P4116R3282P8431K0916k3082l6000p4648j41948j34344l302
35621a80141J37915J61780Q0029k9691j30212j73630q4723R4061J76587P5430
35611A27405n6147n0843L1441L2289m7289p5195l099Q4343R5158J8390o9767n2633
35599C4053R3508K04490R8801j45741k58476j46386M522M5103M6475Q1566O7146
35588A25061m2115j18516o7939J7597M5034O5014J06268P1750o3457j53717j13760
35577a28780m0870O135J03232K14650J44755r3515j76961L4453K15333O9935j82850
35566A65517j61330Q2653J94901P5355o6608r8573o6946M819J16880J63780O8485
35555D78933m2130l5115j4958j09762j71576q005K16819J70404j25982l10929
$$ y = [-105702, -33562, 40554, 133836, 212267, 233183, 210101, 174101, 99453, -42495, -176839, -180141, -42226, 119554, 199583, 169892, 39680, -133950, -218673, -124612, 51975, 127405, 71258, 20415, 51856, 84145, 36856, -38339, -41438, 42905, 138063, 156453, 86686, 34053, 127561, 332051, 430852, 285111, 26635, -119751, -115229, -70126, -23651, 57915, 125061, 82946, -35570, -103509, -85912, -40878, 24136, 130404, 202154, 138697, -15020, -128780, -169650, -163515, -60283, 154367, 299122, 205607, 28646, 63099, 278432, 348367, 165517, 4187, 86840, 281741, 357096, 290488, 191915, 124969, 129788, 246668, 410448, 478933, 436803, 401688, 386730, 276968, 105392, 97387, 314206, 484610, 358628, 47699]
35545D7699j99921K3075J31291R2853k4359j36543j28749K5467J47516O4364j09757
35534f7064j24004K8837J24113O2693k6827l3814P356L7592L6953j6271r4035
35523f4471p9073O7376J83286J21592j7314n5728j8123k7894n4587n772M8199
35512I7491l418p6046l4617M4294K5373n057Q3704J46843j9937k51662k04440
35501a97472P3319J77778k5276k17434j46382M2060J15532Q7272Q5695J25854
35491A20946J46135J11868J0657j21603j69595q2679J548m1087q7445L1338J97872
35480A17955J68315k0735j27873j18944j46433j69540J005K75085L17665P2192
35470C68692j44877j52150j11609j28006n1570J57038K50493R3657r1591r1969
$$ y = [47699, -152222, -129147, 2144, 94997, 70638, -65905, -194654, -169187, -21671, 42693, -67064, -191068, -162231, -38118, 24575, -2252, -36066, -28710, 8882, 45835, 29564, -64471, -143544, -76168, 107118, 228710, 211396, 155668, 137545, 109651, 55064, 49292, 97491, 94073, 18027, -16590, 27704, 53077, 48020, 131724, 278567, 258630, 6968, -197472, -124153, 53625, 28349, -189085, -335467, -293407, -177875, -90603, -4908, 120946, 267081, 378949, 389606, 268003, 98408, 15729, 17277, -23810, -111255, -79917, 117955, 286270, 265535, 137662, 18718, -127715, -297255, -296250, -21165, 296500, 368692, 223815, 71665, -39944, -167950, -219520, -62482, 188011, 281668, 190077, 98108]
35460I8108j2335j0376j4286O4375J01535q881j18907o1742O5778P7341j4153
35449A66457q1515r7533q3889o128J10993J25903n34r5966m1830L4473l968o8483
35437d2020l1971L7021L1779K2860R7026J43260L6523j02577p7776O1548J11359
35426B87032L7767k8120m9223r2939j25914m1916J08871J40736Q867j23575j30385
35415h799o7866l0033p582M2154R6908J11732Q6156L7421l2999j01741j06735
35404A8616k4220O6757N8756m0259r3912r823J17132J16431j3292q7474l096J07729
35392B13345Q4702k4134p1240m9067m7290n3688K228O5149L1862k8513K6100J17366
35380B66820L5520j63246j70490P4099K25725N2500j88940j46859R3796J78406
$$ y = [98108, 85773, 75397, 61111, 125486, 227021, 218140, 99233, 37491, 103269, 180610, 166457, 84942, -12591, -96480, -102608, 8385, 134288, 133754, 37788, -4042, 30431, 26463, -42020, -73991, -36970, -5191, 17669, 114695, 257955, 294478, 191901, 114125, 175673, 287032, 324799, 296679, 247456, 154517, 28603, -13313, 95558, 236294, 245161, 121586, -8799, -76665, -106698, -114280, -72126, 24782, 136514, 222670, 260091, 227092, 125351, 18616, -5604, 61153, 119909, 79650, -14262, -24085, 93047, 209478, 196186, 108712, 105616, 213345, 298047, 273913, 202673, 153606, 106316, 52628, 54856, 120005, 151867, 123354, 149454, 266820, 302340, 139094, -31396, 42703, 268428, 320928, 131988, -14871, 78925, 257331]
35370B57331K9605r9006n9067J2262j9973p6534l6146N5131O6479j7537q4329
35359B8216n2232K9465N2466j0963p9533q2559n3314m9181l5988M3043J18501
35348i2079O0985r5692j56855m3977Q3555O8104k2674k5414P4316J54074J40200
35337A44543O5653j0843n1980n0640n6973j34001k27363j76231N4205K53155K08849
35326A8374l762j31479q8303k2044m7701r4971o6867O026N4518R3222J47154J45712
35314I879K2129j24607j10473P7967K33450J84467K564j18296j06865m3329l763
35303B3123O223j2376o3102r9449o4219J0509M2349L3669N2034Q3035M8736k0449
35291D0083r048N5959Q165j51725j81768K7346K24959J52613n9864j02209M4736
$$ y = [257331, 286936, 187930, 128863, 141125, 121152, 44618, 8472, 63603, 130082, 112545, 28216, -24016, 5449, 57915, 46952, -32581, -115140, -168454, -217635, -253623, -210580, -92079, -31094, -126786, -283641, -327618, -244063, -175959, -198633, -224047, -149731, 4343, 144543, 210196, 199353, 147373, 96733, 39760, -94241, -321604, -497835, -443630, -190475, 18374, 14612, -116867, -205170, -227214, -274915, -369886, -436753, -430727, -376209, -282987, -135833, 9879, 32008, -92599, -203072, -125105, 108345, 292812, 295376, 177080, 70215, 26886, 23123, 29346, 16970, -46132, -145581, -209800, -199291, -156942, -123273, -71239, 11796, 60532, 40083, 31035, 86994, 95159, -56566, -238334, -210988, 13971, 166584, 106720, 4511, 49247]
35280D9247J25986L1874q0865p9656j7282K3512L4616J056r6287j70958j06385
35269b85142L5422O7430k9868o8200M0355J36604P3408n7249q9350l6413k3416
35258b36419n3465j3159J07641J58350M5908r4531n7010J38168K39737J06040
35248C41260q7013j07041j2694k5047j25246p6291J35198K11228J6258j80165
35238I0447j27728L2035O2928K7466P9213J07714m7247k17943j41160O7813Q5812
35227A9350o4782o6014J25658K00785K6693j57288j60763q6046m5251J9833J10136
35216g7689Q1207p7472j59288o8422L5310L7128L9656J10552J34319N9303K7418
35205A42022J04430J35351K6246q1303q0175q4260j63539j58288K0821J60900
$$ y = [49247, 175233, 207107, 126242, 46586, 29304, 52816, 87432, 88488, -7799, -178757, -285142, -249720, -182290, -212158, -280358, -240003, -103399, -29991, -87240, -176590, -213003, -236419, -289884, -303043, -195402, -37052, 8856, -85675, -142685, -4517, 235220, 341260, 254247, 147206, 134512, 109465, -15781, -92072, 43126, 254354, 270612, 90447, -37281, -5246, 57682, 85148, 164361, 272075, 224828, 6885, -134275, -66462, 19350, -45432, -111446, 14212, 214997, 241690, 84402, -76361, -162407, -207658, -187825, -77689, 3518, -73954, -233242, -301664, -266354, -229226, -189570, -79018, 55301, 114604, 142022, 246452, 381803, 408049, 326746, 246571, 162311, -1228, -159516, -138695, 22205]
35195B2205Q0390l0886Q3356K77142J96985j39994l30219j67623Q1201R4198o8080
35184I8675j17592K3633J51587J08462r583l7176O543j4580j01516j13693j8520
35173b3760M4042P588o093P0746R4755l7322j66038j08070M3818R3701O3768Q1093
35161A58228Q9105k5812j43074p6882O1320K6516j13535q7587P2868O7757j25469
35150i6565j89457j8953J08629L6774k2743Q3171J71101P9270m7927n4059l3034
35139A6207p8579p1234N6810J23613J037j35112r2855K5504K7679o0617j06043
35128b93590r6666o7895J6138J34097J48129K8948n6077j8680O716o6622j07796
35117c73298k4958N5084K7609j5721r039m4952j29609r7265O1484J08433j2615
$$ y = [22205, 102595, 71709, 155065, 432207, 629192, 489198, 158979, -8644, 72557, 166755, 98675, -18917, 4716, 156303, 264765, 255182, 218006, 224549, 209969, 108453, -5240, -23760, 20282, 27870, 21777, 92523, 187278, 149956, -16082, -124152, -80334, 13367, 77135, 158228, 247333, 221521, 78447, 1565, 62885, 89401, -24134, -111721, -38853, 28904, -96565, -286022, -304975, -196346, -159572, -182315, -99144, 71957, 151227, 103300, 49241, 16207, -62372, -133606, -76796, 46817, 47854, -87258, -180113, -154609, -126930, -187547, -293590, -390256, -458151, -442013, -307916, -159787, -130839, -186916, -205596, -198880, -265502, -373298, -398256, -343172, -315563, -331284, -340323, -385275, -514884, -612149, -550665, -442232, -454847]
35106d54847j6285K08362L11832M9019k40547j39444J66782J94964o9984k17544
35096b07692r2453N5843O0517L0720M3800K5985j8409K0985J17774J10719k2680
35085A25109j31467j35461q5465k192J18457J70715M8939j28326j42727j2027
35075a74445L9034n3142r8120K7331J81506J66372j2470j71566j54904J8043J63884
35064f8477J16847o8056j69118r4122Q200N119k1071M0048J10095O8909j9398
35053i1024j8741N1806Q6976Q6154R3612N6575o4517j47113p2756M6902K1991
35042D9865j10334j48463m3020O4049R1624J02121J22687P0883q6973k29580k03698
35031c20839j0700J66678J42818m7007j58380n2766Q7611K4335j45819j23867
$$ y = [-454847, -471132, -262770, 49062, 98081, -142466, -281910, -115128, 79836, 9852, -207692, -300145, -244302, -183785, -153065, -109265, -83280, -101689, -80704, 37070, 147789, 125109, -6358, -141819, -227284, -229476, -111019, 59696, 108635, -19691, -162418, -174445, -135411, -188553, -286673, -259342, -77836, 88536, 76066, -95500, -250404, -232361, -68477, 48370, -19686, -188804, -282926, -274726, -269607, -290678, -250630, -140535, -71626, -91024, -109765, -57959, 29017, 115171, 208783, 265358, 200841, 53728, -19028, 27874, 49865, -60469, -208932, -251952, -187903, -96279, 5842, 128529, 199412, 112439, -117141, -320839, -331539, -164861, -22043, -69050, -227430, -280196, -192585, -168250, -314069, -437936]
35021d37936J05333K42334J55840M3244K5082m1617j95266k03857J1512J55604
35011a39727L2410j07396l435J61135J04536n3962m6131M4172k8402j70987j00047
35000c07834J35226K20204R4193j2372j6748n9130j48620j17827L4379R8007R286
34989g1236m7357L2000J02045K3613j13544j26189K1339J77642J62130l1714j89392
34978f0663j20635O5566J11453K1207L3794J54921J05771j35790j95461N4852
34968C5015J88168q3142l61447j87996J88942K34687p636r7456K567k5830j59094
34957b73222o7712K02104K46130K0816q6573L1994M4490j55017k21438J2256K26592
34946a9580J64362O370l3868m4705j04903o0113J25675J81799k4598k01617q2570
$$ y = [-437936, -332603, -90269, 65571, 108815, 133897, 92280, -102986, -306843, -295331, -139727, -107317, -214713, -218148, -57013, 47523, -6439, -52570, -8398, -36800, -207787, -307834, -172608, 47596, 141789, 129417, 112669, 53539, -95081, -212908, -178529, -80522, -71236, -118593, -86593, 15452, 39065, -74479, -200668, -179329, -1687, 160443, 128729, -60663, -181298, -115732, -4279, 16928, 50722, 205643, 311414, 175624, -19837, 35015, 223183, 140041, -221406, -409402, -220460, 14227, 6591, -90865, -88298, -114128, -273222, -340934, -138830, 107300, 128116, 41543, 73537, 118027, -36990, -258428, -246172, -19580, 144782, 151152, 117284, 72579, -32324, -92437, 33238, 215037, 190439, -11178, -93748]
34935i3748J43054J52601j4560r6104m1516n241l9410o1387m8393n1959o9537
34924b26200n5812j5544K2153O6275J19302J27325M1613j00641j81191q1180J85520
34913i8380L92093K83039p6849l07113k00530k160l555r8923m1358Q4891L7838
34902c1007j01657o1086J13100J33631N062J058J21924P8524j32928j57751Q9068
34891E7938K23489K3193k00396j24648Q2089Q5389r4607j95986j30424j5959M9406
34880b40516M0624l5715r2348j1120J60247K24436J20912Q756P94K2049l941m1407
34868A52771p1385j19745j22637K628J39098R1343o7800q1046N0173O4785p2785
34857c4600q8458R9472K08560Q3289m3554J3878P9846j6617j15036m3609M8244
$$ y = [-93748, 49306, 201907, 187347, 91243, 49727, 44486, 5076, -56311, -104704, -156663, -226200, -282012, -297556, -275403, -209128, -89826, 37499, 79112, -21529, -202720, -283900, -98380, 293713, 576752, 499903, 192790, -7740, -9900, -13455, -112378, -153736, -68845, -31007, -132664, -193750, -80650, 52981, 58043, 59101, 181025, 259549, 126621, -31130, 57938, 281427, 304620, 104224, -20424, 61665, 147054, 52447, -143539, -273963, -289922, -240516, -199892, -235607, -327955, -339075, -178828, 45608, 166520, 175276, 176070, 198119, 194178, 152771, 81386, -38359, -160996, -158368, -19270, 72073, 4273, -76773, -26600, 38185, -34600, -123058, -23586, 184974, 268263, 224709, 238587, 318433, 301816, 186780, 143171, 191415]
34846A91415k2302j23967n9791P0892O7995q506K2443J20895J11990n340r1291
34835B74433j07374j08150r0773m3715l8943j03992j22433k5728N3439m760p9715
34824c97711N267J83943K35608J02530n7672r8453l1669K8647k666p9273n5281
34813a66730R9365J76310O22k34421j81180J18354K44991L7456j54974l0401K06658
34802A16050K09210K2141o7747j2971j258q4548j22394n6452Q898r84l9565m2693
34790g2313p17N7787P4269j773j22728j61359o9286O6519J54478J75449J14557
34779B14883l3695j64256j35868J1245Q8104M5456K8577R4142J02316j8560j23772
34768A08572q8839K663K9030Q009q493m2234q3967n2246M3936P1878p263o5417
$$ y = [191415, 169113, 45146, -14645, 56247, 124242, 115736, 138179, 259074, 371064, 365724, 274433, 167059, 58909, -31864, -75579, -114522, -218514, -340947, -366675, -313236, -317996, -397711, -392444, -208501, 27107, 129637, 71965, -26488, -58157, -29510, -32176, -111449, -166730, -67365, 108945, 109567, -124854, -306034, -187680, 57311, 94767, -60207, -90608, 116050, 325260, 347401, 279654, 266683, 265425, 180877, 58483, 2031, 10929, 9945, -29620, -72313, -73030, -15243, 59026, 57253, -65475, -226834, -296120, -229601, -75123, 100326, 214883, 181188, 16932, -118936, -107691, -19587, 25869, 54446, 148588, 250904, 232344, 108572, 19733, 22396, 51426, 59435, 50942, 8708, -75259, -127505, -83569, -11691, -18954, -84371]
34756h4371l1311N976k185L0698J23332J40863K6258p7392m9626L9967Q2302P0557
34744B75068J5230r7800k00277j81116p4432r313K7939J32016K00190M3911k10804
34733g9388k17740L4283J73142N4383k5404J06168J82761M484j77673j02770N5493
34722G739L3702o7900l9873K9459k4233q0921K2593J33294M8996p7419k226J35344
34710A18555L0305k35627k89366m7510J89426K03298Q1297k6770q5587r5888o3401
34699b21268m3621n8105k9093O5668J04029L9702K8959J42644J67163n0579k71552
34688a26053j92661O8941J64542N0526k7173Q858J383q3403q8986K1154R3430
34677a09442N9516J9648K1966m200o9618r3576o5848m5152k897J28657K61932
$$ y = [-84371, -115682, -109706, -111891, -81193, 42139, 183002, 209260, 131868, 82242, 122209, 204511, 275068, 290298, 192498, -7779, -188895, -263327, -272640, -244701, -112685, 87505, 131416, -79388, -297128, -262845, -89703, -35320, -60724, 45444, 228205, 232689, 55016, -47754, 7739, 41441, -26459, -66332, -36873, -61106, -142027, -119434, 13860, 62856, -14563, -16789, 118555, 148860, -86767, -376133, -423643, -234217, -30919, 50378, 23608, -61979, -157867, -221268, -264889, -322994, -352087, -286419, -182390, -142688, -113729, 28915, 196078, 145499, -126053, -318714, -249773, -85231, -34705, -61878, -53020, -51637, -135040, -224026, -202872, -109442, -49926, -30278, -8312, -12512, -82130, -175706, -241554, -286706, -289603, -160946, 100986]
34666A00986K23098K8892j07763p7113N094R887l7816n8510n1732o4896j05082
34655a34955j26648q1148J5854O5891m810j15357j11470Q395Q7088N7032K0151
34644c19977K8922m331q9743p6538P9385J85762J16217K6266P5246J44618O5222
34633B31049o4590n5374K6759k3673j81818k19363o5235J02478J24182L0678n6549
34622a51456n9072J5983P5316K4687q3692q6217M2598J18287K5356q9887m5599
34611b13696R8708J53404P6403j9037n4001m4801k8692k2828j5559K8851Q9760
34600D8512N4185j02637j75381Q482K53146K26065j4678r9730L7143O5296j33517
34589A66886k35879m3579J71742J43065J5707l40J823q8987j15902K1695J01979
$$ y = [100986, 324084, 352976, 245213, 168100, 173194, 183081, 145265, 86755, 35023, -29873, -134955, -261603, -342751, -326897, -261006, -265816, -381173, -492643, -484248, -397160, -340128, -319977, -291055, -295386, -385129, -461667, -382282, -196520, -80303, -54037, 21209, 165827, 231049, 166459, 111085, 137844, 114171, -67647, -287010, -352245, -249767, -125585, -94907, -151456, -210528, -194545, -119229, -94542, -178234, -264451, -221853, -103566, -78210, -168097, -213696, -114988, 38416, 114819, 95782, 41781, -3020, -31712, -54540, -70099, -41248, 48512, 102697, 60, -175321, -166839, 86307, 312372, 297694, 197964, 235107, 300403, 166886, -68993, -112572, 59170, 202235, 217942, 217602, 219425, 130438, 14536, 36231, 138210]
34578A38210k8149j30871R129J80243J17312m1063m9060K548o5841j32341m0896
34567d0779L4637q1520j66526K3751K58490J92089m1572r6511k9912j13198k41311
34556c02362j06135J83409K26631k161j43242n7375N0365P0640R1568J01254J7815
34545A30407m4960M9475J27381k8036k16540j07788J48706J34440j19389j93887
34535a20191j1943P9941l3973q0075M7522J16481L7525J1646R1230O8275r0906
34524A15532j47534l1144M6086L275O73O2505J5400j23714j25039J9009O3908
34513a01043k4860k6583O6528J8732j41670j00422J46918K12261j2945j43032
34503a06116L0647J85368N9267j03187l1654Q9852j112j60885j20997L8361O8332
$$ y = [138210, 110061, -20810, -11681, 168562, 285874, 244811, 195751, 198299, 132458, 117, -40779, -6142, -87662, -254188, -230437, 28053, 220142, 178570, 82059, 52147, -61051, -302362, -408497, -225088, 1543, -618, -143860, -201235, -150870, -80230, 11338, 112592, 130407, 85447, 134922, 262303, 234267, 17727, -90061, 58645, 193085, 73696, -120191, -132134, -52193, -86166, -166241, -118719, -2238, 35287, 46933, 138163, 206438, 115532, -32002, -63146, -17060, -13785, -13112, 49393, 64793, -58921, -183960, -164951, -101043, -125903, -152486, -85958, -67226, -208896, -309318, -162400, 49861, 36916, -106116, -75469, 109899, 169166, 65979, 34325, 124177, 123065, -37820, -158817, -120456, -52124]
34492e2124k1368m8121J0511N1130N5268M1069l0883j19179o2542J44622K50064
34481B18447J00217j15688j63099q5785l9733k2271K2422K8650m2156n8214O2239
34470i4971J54703N2251j22179j34381N444R0491M4749j0452J0607M0883k83p1547
34458c4685o7478K6736R0826K1229r6625q0242O2187J09688j3627p6771P9164
34447B0402K28128J02244j50949k01565p0248k7825p8064L512J64762J05336j55582
34436e9849k35276j9713J38236K3214r7297K7467J97545J32672n2611p6971M2985
34425B0402P9417j1890o9562j0324Q7012J26189P3148n0598j56932j45987l4389
34414i3514N4472N5343J5085j6798k7715Q051Q1579R6750J6856k2871O1571R4658
$$ y = [-52124, -73492, -121613, -111102, -59972, -4704, 36365, 5482, -113697, -176239, -31617, 218447, 318664, 202976, 39877, -45908, -85641, -107912, -85490, -56840, -98996, -157210, -94971, 59732, 111983, -10196, -144577, -139133, -48642, -3893, -14345, -3738, 37145, 36862, -34685, -102163, -75427, 15399, 36628, -59997, -140239, -78052, 31636, 18009, -58762, 20402, 248530, 350774, 199825, -1740, -71988, -99813, -177877, -174365, -9603, 95733, -59849, -295125, -314838, -176602, -153388, -250685, -223218, -25673, 106999, 54388, -22583, 20402, 99819, 87929, 18367, 8043, 95055, 221244, 294392, 243794, 86862, -59125, -93514, -39042, 16301, 31386, 14588, -13127, -5076, 76503, 173253, 190109, 167238, 228809, 323467]
34402C23467q4014k73626j80449P7213J36250o927j9379J47891J68386m7292j58998
34391H2522N954J41209k587j90888j16972J03255J67902N5130m8534p7810p9781
34380C9400m5814K3489L7770k2275k8892O0112Q6632l5725j39174o3433Q8194
34369B84J28790N6772j7318n9354p9609n3613n58n267o6661p2026L104M0765j359
34356a26050o118Q5516J59340J19608K6567l0356l8971m830M7857J4891j47532
34345I9922k46187p2085K18142K50621j6089k23146j51943R667L9664j4413l6906
34334a42753m4613m6216K0983R4174Q778j72151j62914Q1215K31989Q7590j13631
34323a57549q5328Q6330J46777O3527j9760m1542l3967j2444K596k1539l4892
$$ y = [323467, 239453, -34173, -214622, -137409, -1159, -8086, -27465, 120426, 288812, 241520, 82522, 88476, 229685, 227098, 36210, -80762, 22493, 190395, 245525, 196991, 119181, 39400, -6414, 17075, 54845, 32570, 3678, 63790, 150422, 114697, -24477, -87910, 284, 129074, 185846, 168528, 109174, 29565, -24048, -24606, -29873, -96534, -168560, -165456, -124691, -126050, -132168, -46652, 112688, 232296, 258863, 228507, 189536, 184706, 232563, 247454, 99922, -146265, -218350, -208, 250413, 234324, 11178, -140765, -131098, -91434, -105847, -142753, -187366, -233582, -212599, -118425, -109647, -281798, -444712, -363497, -131508, -43918, -157549, -242877, -156547, -9770, 53757, 33997, -7545, -41512, -53956, -51360, -72899, -107791]
34312a07791M5591J52257J25377j8034r7389o7753n3700p4553k4654N6143J3056
34301e1450r4253m2424J30044J28540q5366j83855k888J99334J72027J0230r5282
34290H4657j20004p6481N6498J57688M7157j61745j56757N0798J14855m5659j10796
34279a59789M2790J22812l197m3482J42122K25910K357k01757r2588P1777m2380
34268F4575k51420j97474M8277J78611J66465J59802J15315m7073j53452l8684
34258D4942J09649M4528j13174j08442k924j5170j02223q0120K598k0388q7718
34247c28442k9660R1296Q5687k6925p9070l9785K0167J09498K16286J90767j6608
34236A93211j74638r3083N7337K5408j04638q5930N9815J08598K3830k7334J7444
$$ y = [-107791, -62200, 90057, 215434, 197400, 100011, 32258, -21442, -95995, -120649, -64506, -51450, -145703, -188127, -58083, 70457, -14909, -198764, -201652, -2318, 169709, 179939, 84657, -35347, -111828, -55330, 102358, 149515, -12230, -168987, -118189, -3334, -48993, -159789, -116999, 5813, 2616, -40866, 101256, 327166, 329523, 127766, 35178, 106955, 64575, -186845, -384319, -336042, -157431, 9034, 168836, 284151, 237078, 83626, 44942, 154591, 199119, 85945, -22497, -25421, -40591, -142814, -222934, -220336, -240724, -328442, -358102, -266806, -181119, -208044, -287114, -326899, -306732, -197234, 19052, 209819, 193211, 18573, -74510, -17173, 8235, -96403, -182333, -122518, -13920, 9910, -17424, 20]
34225B0N6499L5488R156K2741P1760J24699J08505j7053j29752o8485Q3191Q1678
34213C78447p0157j09621K5677Q5845l0679r8911j0044K1882r6584j14100Q7417
34202F9172K12399N3284j34893r7415j5914j04211j58081N5069K96720K18844
34192C94974m5417j18735J0484O1960k9218r6988r3884q8375m9086N0887P5720
34181G2322l9391r7004L7273J56662N8764r5003q7817l3260r7832j27635M8594
34170b04327K15234J01931j17512j04865O9939Q9173n1840r6412q849K2263l4981
34159a20246n2236k2792j4544L2185J50845J64101k7519j75760n0634J40146P8422
34148A01968j29191j56328j0307M9644n920m870M1296o357p8498r662J13136Q6817
$$ y = [20, 56519, 92007, 101163, 123904, 195664, 320363, 428868, 411815, 282063, 213578, 296769, 378447, 308290, 198669, 224346, 310191, 279512, 180601, 170557, 192439, 95855, -18245, 69172, 281571, 334855, 199962, 102547, 86633, -17578, -175659, -120590, 176130, 394974, 349557, 230822, 241306, 303266, 274048, 177060, 83176, -5199, -54285, -3398, 72322, 32931, -64073, -26800, 129862, 188626, 93623, 5806, -27454, -125286, -252921, -204327, 10907, 112838, -4674, -109539, -39600, 49573, -2267, -98679, -107528, -85265, -120246, -172482, -195274, -209818, -177633, -26788, 137313, 109794, -65966, -116600, 23546, 101968, -27223, -183551, -193858, -144214, -150134, -155004, -113708, -120065, -198563, -208225, -95089, -8272]
34136h272k3828k647J14255J06624m0504j43267j37839j04303o3675l028J5632
34125b90852j4512K5195J32718J12828n7698j14370K0203M1893j65869k26435
34115e36899P8435L29429J38243j60727p5845J96133J60156q3895p3036J41324
34105A13318J12470j48439j92035M8110J65580K3442p3747j344N589j20937j35179
34094b03172L2962J35653O1258m461M1448O8932J1391l3708l4190n1183n9272
34083c4342j3607n886q2110p2893R6537J68824j8301j63382O827K02811N7341
34072A41819j77908m8406K67596K45559o6300j63016J0553L8598j37811j47977
34062c7293M0203M5311j58828j46305J55498K83012M8584j41594j8858J21900
$$ y = [-8272, -32100, -34747, 79508, 186132, 145628, 2361, -135478, -239781, -303456, -306484, -290852, -305364, -280169, -147451, -34623, -92321, -206691, -186488, -144595, -310464, -536899, -458464, -129035, 9208, -151519, -227364, -31231, 128925, 45030, -28006, 113318, 225788, 77349, -114686, -66576, 99004, 122446, 48699, 47355, 52944, -67993, -203172, -170210, -34557, 26701, 22240, 63688, 132620, 144011, 110303, 76113, 24930, -34342, -47949, -53835, -135945, -208838, -112301, 56523, 38222, -125160, -118333, 84478, 141819, -36089, -84495, 183101, 428660, 362360, 199344, 209897, 248495, 110684, -37293, 2910, 48221, -110607, -256912, -101414, 181598, 230182, 88588, 69730, 191630]
34052A91630M503j70030j40315J993P9798J14386J30777M5908q7462p8244N1788
34041A44732P4889k2267k2806P0846J4929j80471j96138N0974K47456J86814K4037
34030C92995p5561j43792j75423p6337P3564P4394l3501l3384M8297k036j29577
34019h0361p0950J33862J71870J3180n5830K4919K3441p7467l8187J21226J03501
34008B69204r3679j33842L9399R4326o4136j23758L2104J06783l9072j30506m028
33997d7205J05081K1879p9618n6873l4240o7108J760J68638J75681k8970j50638
33986H387l8059R0447O5084R27k6630j21892k38262j38494J50489K63727N4483
33975G0207j73409j57262j6541N6769P7643Q3741J5347r0409r7741l4463m0649
$$ y = [191630, 196133, 26103, -114212, -112219, -32421, 81965, 212742, 258650, 171188, 92944, 144732, 219621, 197354, 174548, 245394, 260323, 79852, -116286, -65312, 182144, 368958, 392995, 317434, 173642, -1781, -78118, -4554, 69840, 36339, 2955, 51252, 49216, -80361, -151311, -17449, 154421, 167601, 111771, 136690, 160131, 82664, 44477, 165703, 269204, 175525, 41683, 81082, 175408, 111272, -12486, 19618, 126401, 87329, -43177, -47205, 57876, 79755, 137, -56736, -90976, -158084, -156324, 12314, 187995, 159025, 8387, -29672, 60775, 125859, 126786, 100156, -21736, -259998, -398492, -248003, 15724, 70207, -103202, -260464, -277005, -220236, -142593, -58852, -43505, -133914, -231655, -266118, -306767]
33964c06767n5597P9227K42987J86175Q495J0345J25550L9532j78277j65991K7130
33953A2809o389k45591k19760J26192K80058N2014j14429L7990J63547J8587r6799
33942H229M4540J65222M3986o9964J9887O6929j05738k21613o3252J17987P4953
33931H1166j9440J9651L3915p8239q2959J08925J60411j09573l24945j42782J82524
33920a71346K42975R4356J5710R588m7406o8614M3027J31048N0306o7109q0876
33909A51659q6342j50341j30127R651M9738q1025j28471K4219J15198j3884j05182
33898c44907M8258K17387J45010j7761j2964R9494J27385P7109K9119n4237j69187
33887A44706j77901n6225K8812J0499j183K214p3440j19508N3261K69503J72796
$$ y = [-306767, -362364, -283137, -40150, 146025, 154520, 164865, 290415, 329947, 151670, -14321, 12809, 6420, -239171, -458931, -332739, -52681, -667, -115096, -77106, 86441, 105028, 8229, 52769, 217991, 261977, 192013, 211900, 278829, 173091, -48522, -111774, 6213, 81166, 61726, 81377, 115292, 37053, -45906, 63019, 223430, 113857, -211088, -353870, -171346, 71629, 165985, 181695, 191283, 143877, 75263, 118290, 249338, 299644, 232535, 151659, 65317, -85024, -215151, -205500, -155762, -236787, -365258, -341039, -225841, -239725, -344907, -296649, -79262, 65748, 47987, 35023, 134517, 261902, 339011, 368130, 313893, 144706, -33195, -89420, -60608, -50109, -51292, -49078, -122518, -242026, -188765, 80738, 253534]
33876B53534j19581j35316J22469J43258j61162k44591J07816L61119J39989j60904
33866C06631j16161M0794l9243j79618r8710M0973P158m1227O6853J22055l8216
33855G1289j56456l3029P5597m7745j54700k2148J08216J4720o3775P8266J67977
33844C8212k2782j92774m8023J46387O5859q0245J1161J45239L3036j29484n2826
33833h6240O8958m9870j89611j7483K53833K05567o6754j58114l9629J9321M87
33822e9535P1363J51835M6969j39735j66488o8331k5368q792P4604J03897k7721
33811d7302j36001m6250P2940J4244r3271n1511L6653L254n0409J6775R2404N0812
33799a37662M945M3223K7298r0834j03786M6055R3761n4015r5633J04629K12478
$$ y = [253534, 133953, -1363, 121106, 264364, 103202, -141389, -33573, 327546, 467535, 306631, 190470, 231264, 192021, 12403, -86307, -45334, -38176, -79403, -12550, 109505, 71289, -85167, -118196, -42599, -90344, -245044, -267192, -158976, -144256, -208031, -129765, 38212, 15430, -177344, -225367, -78980, -13121, -93366, -82205, 63034, 96070, -33414, -86240, -17282, -67152, -256763, -274246, -20413, 185154, 118400, -39714, -79343, -60022, -59535, 11828, 163663, 210632, 70897, -95591, -163922, -189290, -198082, -123478, -19581, -47302, -183303, -229553, -156613, -142369, -235640, -287151, -250498, -247244, -297653, -280878, -188474, -137662, -132717, -89494, -62196, -153030, -256816, -210761, -117000, -171015, -266648, -162019, 50459]
33788E0459J8781j51627j2320J79163J06971n8421l1914Q1457O7953L016n350
33777B48168p2697k05153j49706J08835J92097j8026j19963P8432J81313n5247
33767A88053k45175q5311R4721j0555j12936N4483J84181R504j51049k7895N7931
33756d4048j33860k14204R2996L37870J35488j15093l33J25032j18993l27901
33746b63046p7650J99162l078k79145o7872K62879J12477j86558m65L60874J98661
33735B56239k42951k10247J69625J64858j75344j52637K38817L18902j0369j58435
33725A98458J6691N7984j04329o4563J46771P7691k00698j60348J53540J58540
33715B79737j61215j99057J45043K86663L9864j06686L0510L6369j97558k07114
$$ y = [50459, 69240, -82387, -94707, 84456, 191427, 133006, 101092, 182549, 250502, 253518, 248168, 175471, -29682, -179388, -70553, 121544, 103518, -16445, 61987, 243300, 188053, -57122, -142433, -47712, -58267, -171203, -116720, 67461, 76965, -74084, -101979, -44048, -177908, -392112, -299116, 38754, 174242, 59149, 58816, 183848, 64855, -263046, -340696, -141534, -144612, -423757, -491629, -228750, -116273, -302831, -303296, 57578, 256239, 13288, -196959, -27334, 137524, -37820, -190457, 48360, 367262, 356893, 198458, 215149, 273133, 168804, 104241, 251012, 328703, 128005, -32343, 121197, 279737, 118522, -80535, 64508, 351171, 391035, 284349, 314859, 351228, 153670, -53444]
33705e3444J31606K99038M9807j76792q2702J5228j24615k12766k6773J55465
33695b5948P4468q8845j12073p6984p1162J0809J66443J98855P9259O954K9154
33684A90930K93n5135K9731J71450J19871p6084j37114n3363n4240j33648q1874
33673g9183O9399J06052N2132O6714N1812j45343l04213j36646J58851K05902
33663D5477J06017J79794K82019O4246k72257k33273Q9335J54859r4101j99534
33653A22582m6465P318j29826j45707K4574Q6011k1898m0383O4505N6695o7959
33642i0553q4756M49K0821N3377K11877K40361p8834l62549j59244K24373J94918
33631A70240r9742p2582K08955J78628j36759j73436R3090J26012j24815j46639
$$ y = [-53444, 78162, 377200, 427007, 250215, 167513, 182741, 58126, -154640, -181413, -25948, 48520, -40325, -152398, -229382, -300544, -289735, -123292, 75563, 154822, 161776, 190930, 191223, 136088, 165819, 337269, 457140, 381056, 243942, 190579, 136339, 2691, -79183, -9784, 96268, 148400, 215114, 266926, 121583, -182630, -319276, -160425, 45477, 151494, 331288, 613307, 677553, 405296, 172023, 261358, 416217, 322116, 122582, 76117, 83435, -46391, -192098, -167524, -81513, -103411, -143794, -79289, -22594, -90553, -175309, -174860, -154039, -100662, 111215, 351576, 272742, -89807, -249051, -24678, 170240, 70498, -2084, 206871, 385499, 248740, 75304, 168394, 294406, 169591, 22952]
33621B2952J17120J56654j00043j44852J11142J54596j32598k31667L1426J68743
33611A53473m3620j87011l3104O6774p4384j22956Q0597J98031O0498k4524R5465
33600A69239J35307l3568j37559o1517l7560j05129j1731K06345J94183m2819
33590B75191r4838J00511J45221o7438j88464j12103j22286k29057j02884J98406
33580a97741K00476j29054k53597J7108K35472J40675L3579J05037J07364o3083
33570A96236j28578k129L6662p6901n9217J25562J64263P356m8756L0692j7541
33559B27649j46396n2374J46124L6608k66313k33403J14043K05049n2138j34485
33549a55636R3919J58047q4915j82714K4871J29612j8411o0518Q7009N4070j75828
$$ y = [22952, 140072, 296726, 196683, 51831, 162973, 317569, 184971, -46696, -15270, 153473, 109853, -77158, -110262, -43488, -117872, -240828, -160231, 37800, 98298, 73774, 169239, 304546, 270978, 133419, 71902, 34342, -70787, -82518, 123827, 318010, 275191, 180353, 280864, 426085, 358647, 170183, 58080, -64206, -293263, -396147, -197741, 2735, -126319, -379916, -362808, -127336, 13339, 46918, 151955, 259319, 196236, 67658, 65529, 102191, 25290, -33927, 91635, 255898, 263254, 214498, 245190, 227649, 81253, 28879, 175003, 211611, -54702, -288105, -174062, 30987, -21151, -155636, -61717, 96330, 11415, -171299, -146428, -16816, -35227, -95745, -8736, 45334, -130494]
33538a30494j47961J64385K26124p1771j87645O5855K01234R677p7893J14872
33528A66383J58017j10060k33796j0369J40888J1905l4094J40554J42996j27325
33518B45099k05669M7465J37084j34671k81956m6440J49337L6800l9465J23552
33508C1136J87602J476p2445Q6141Q1663j76396k12046J08885K57948O12j77159
33497A17417J3276J65817Q572r9586P4044J78114p800j61320r5005q6930k04400
33486i7801r2693K42250K72240j00122k75710P135K28535L8759j94526j57736
33476a29669p8548r3304M4301L01532K54136p4524j29870J59612K08811j28325
33466C34152k75093k7328R0941j17860j59254J24708K19492j9742p0175J65296
$$ y = [-130494, -278455, -114070, 112054, 40283, -147362, -81507, 119727, 129404, 51511, 166383, 324400, 214340, -19456, -29825, 111063, 122968, 88874, 229428, 372424, 245099, 39430, 86895, 223979, 89308, -192648, -239088, -89751, -52951, -92416, 31136, 218738, 220214, 147769, 233910, 315573, 139177, -72869, 36016, 293964, 294576, 117417, 130693, 296510, 305082, 205496, 279540, 457654, 449854, 288534, 193529, 106599, -97801, -190494, 51756, 323996, 223874, -51836, -44701, 183834, 222593, 28067, -129669, -208217, -301521, -257220, 44312, 298448, 223924, 94054, 253666, 462477, 334152, 59059, 31731, 122672, 4812, -154442, -29734, 189758, 170016, 99841, 265137]
33456B65137R9616l27045l67814J57920M28641O5314k12496N2436K58896m0050
33446C80555l08694j12634Q5206q1714j63536J39413L27673Q6103j04450M4784
33436B92706P8769j84912j97554J80664K53504j92997l77688K3763K16286j98343
33426a05802l96946J23155N26711J38043l33035j19571K59715R5194k05695m0727
33416e8958K01565O368j97956O4942L01436M070l04452n4901K57718K4216l10562
33405f6514j15192K42667J53098r8248J0454K12913P9578r6316L3412J04893j75246
33394B85499l16456K3545K79759J4721k27400J8731K17509r9924l61307l1638
33384a96961L37927J52570j29869K7317J73462j60808m25420p6243L27043J43355
$$ y = [265137, 364753, 37708, -330106, -172186, 256455, 321769, 109273, 161709, 420605, 380555, 71861, -40773, 44433, -37281, -200817, -61404, 266269, 352372, 247922, 292706, 371475, 186563, -10991, 169673, 423177, 230180, -147508, -123745, 92541, -105802, -502748, -379593, 147118, 285161, -47874, -167445, 92270, 187464, -18231, -58958, 142607, 148975, -48981, 15961, 317397, 321467, 17015, -37886, 219832, 244048, -66514, -181706, 60961, 214059, 115811, 126265, 339178, 418756, 322440, 355852, 460745, 285499, -30957, -7412, 272347, 287068, 59668, 78399, 295908, 195984, -165323, -196961, 140966, 293536, 163667, 190984, 364446, 203638, -221782, -298025, 29018, 172373]
33374A72373j82019n4671J34662r0625k48510J15035L80244l6644m88209k01499
33364d99863L43806L29559k705l1518N3432j19772j77171J84330L63355p0726
33354C72727m22817q1265L26617J05511k30681j9631K71201L6990k42433N35K47904
33343C64658n2058l23375Q037L14776l6575m05536r2465K99214N0361k72420K1196
33332a24187L40365o499l83101m3259L70548M8377m06191j49840K76721O4562
33322a2504k47626J19487N61340K10773l69260k46291J58705K0507k56948L2962
33312b8855L79473O2508l60459j39178J87045o8227k92577J59896N17411L5771
33302D52808m26787J5390N01965L1968n61452j58603N09817K73795k84495j03705
$$ y = [172373, -9646, -64317, 70345, -20280, -268790, -153755, 226489, 189845, -298364, -499863, -156057, 173502, 170797, 139279, 192711, 72939, -104232, 80098, 443453, 372727, -50090, -131355, 195262, 300773, 70092, 50461, 321662, 358652, 116219, 116754, 364658, 312600, -10775, -2738, 312038, 275463, -130073, -222538, 76676, 127037, -145383, -124187, 216178, 209679, -173422, -216681, 153867, 202244, -203947, -353787, -77066, -12504, -260130, -140643, 420697, 631470, 262210, 15919, 174624, 195131, -61817, -28855, 350618, 413126, 52667, -86511, 100534, 32307, -260270, -100374, 417037, 452808, 26021, 41411, 543376, 575344, 13892, -144711, 365106, 638901, 354406, 250701]
33292B50701K42718j77041o07391l0033O81274K83588m47175j57470N26071K56271
33282H21513m44004k80673K87655P0400m35087r2657N07947J82650m52795j64009
33272I40M52479J57794m56113j72157L81426Q160n63886q1735O34452J99819n54020
33261G159j24274O78417K44022o59433l14280N98292K86149o82597m83144M53165
33251C476L53750m40150k62804N38233L67013l90210j81537N48039K74266m65154
33241C44922j26738O53657K64712n85334k01051O46463J56101q43191l93854O77772
33231E93459K55445q90712n05619P49325N41215n90928l26965Q17573M86887q14588
33221C15092o33730O31456N23505o32912m32703P65455N32079p38114n29486P93033
$$ y = [250701, 493419, 316378, -291013, -321046, 360228, 643816, 196641, 39171, 565242, 821513, 377509, 96836, 384491, 454891, 19804, -72853, 435094, 617744, 164949, 940, 453419, 611213, 155100, -17057, 364369, 372529, -191357, -273092, 361360, 561179, 7159, -117115, 561302, 805324, 145891, -168389, 429903, 716052, 33455, -449689, 3476, 357226, -82924, -345728, 192505, 559518, 169308, -12229, 535810, 810076, 344922, 218184, 871841, 1136553, 551219, 350168, 996631, 1152732, 309541, -84313, 593459, 848904, -41808, -547427, 201898, 743113, 152185, -174780, 642793, 1129680, 315092, -318638, 312818, 836323, 203411, -229292, 536163, 1068242, 330128, -199358, 593675]
33211E93675O52456o49150n44822O75217M83909p41590m42795Q80932N37883r01891
33201E43824n62842R99627P49804q31844o39783Q70551N54778j060343o97800
33192g4028J072047Q04775r35390n84981J237104Q02358j189933p63452J348069
33183A716569Q90587j395598r34884J590269J274057j344343j113252J556471
33175B239876J341598j353680r77781J978584J578915j632329j219668K300002
33167D255517J951195j805584j378531K891271K766135j531498j038870M132937
33159A0242572M191253q14947j02977O153684N677472j252979j70030Q939552
33151C2863600R172334R20350N764525K3647384K5514970J0613910K5550199Q6089726
$$ y = [593675, 1246131, 596981, 52159, 727376, 1211285, 469695, 26900, 907832, 1445715, 543824, -19018, 980609, 1730413, 898569, 258786, 1129337, 1684115, 623772, -74028, 998019, 1802794, 867404, 282423, 1519527, 2321885, 1131952, 368500, 1716569, 2607156, 1211558, 276674, 1866943, 3141000, 1796657, 683405, 2239876, 3581474, 2227794, 1250013, 3228597, 4807512, 3175183, 1955515, 4255517, 6206712, 4401128, 3022597, 5913868, 8680003, 7148505, 6109635, 10242572, 14433825, 13618878, 13515901, 19669585, 25347057, 24094078, 23924048, 32863600, 42035934, 42956284, 48720809, 72368193, 97883163, 108497073, 134047272, 220136998]
33143B20136998J21889561N9785560o1223927j26255267r1338511k7381448q435423
33136H7177543k2697900k2638809n867034q50896r096998r270855n2561J610350
33128A8312840n075599n513912J231827K500937k778208l563347J224591J875762
33120H214891k489465k995645J221743J961925j763751k460778R33053J614230
33112D236203j424924j934917R94859J528808j176319j620395R97317J448330
33104C048962j065813j552402Q38181J372589q51396j386255O74063J141499q60468
33095A358960j344107N68289J096677o24258j023671O91426J058073p15811j263338
33086a97760L07669Q82823m03041p00070O53117Q58512o16637r25281M93349Q27888
$$ y = [220136998, 342026559, 401812119, 340588192, 214332925, 122994414, 95612966, 87177543, 64479643, 41840834, 35973800, 35122904, 26025906, 16755051, 16702490, 18312840, 13237241, 7723329, 8955156, 11456093, 8677885, 5114538, 6339129, 8214891, 5725426, 2729781, 3951524, 5913449, 4149698, 1688920, 2621973, 4236203, 2811279, 876362, 1871221, 3400029, 2223710, 603315, 1600632, 3048962, 1983149, 430747, 1268928, 2641517, 1790121, 403866, 1077929, 2219428, 1358960, 14853, 583142, 1679819, 1055561, 31890, 723316, 1781389, 1065578, -197760, 109909, 992732, 589691, -110379, 542738, 1401250, 784613, -140668, 352681, 1180569]
33076A180569n18152q19849M96342P42541o38917r32888N02992R68531l42085
33067F39084q89050K20239O80656l27376o39955M29861P04750m85306r35819J40951
33057d61965O83784j17767l98617N00173P33460k72850o44515J93884M07856n11222
33047A12221o78641M16830Q14126j38247n74460K03527M70067l67640n69718L99596
33037H7661O98093k96130p11247K06248O46030k39151p21868J31257P09593N55
33027E11041n78200k7747M38401m3446l67032J60156M24115j56382m24003J43401
33017H0304L50033k77692m78362K16089M74336k24265n27367J45773M65057j79809
33007D4097m81715J76954M80842k16593n71993J58164O60626O3915m65891k2354
$$ y = [1180569, 662417, -157432, 338910, 1081451, 442534, -490354, 12638, 981169, 639084, -249966, -29727, 650929, 323553, -316402, 113459, 818209, 332903, -602916, -461965, 221819, 104052, -294565, 205608, 939068, 666218, 21703, 215587, 623443, 112221, -566420, -149590, 664536, 526289, -48171, 155356, 625423, 257783, -311935, 87661, 785754, 489624, -221623, -15375, 630655, 391504, -330364, -199107, 510486, 511041, -67159, -94906, 343495, 300049, -66983, 93173, 517288, 360906, -63097, 80304, 430337, 152645, -325717, -109628, 364708, 140443, -386924, -241151, 223906, 44097, -437618, -260664, 220178, 3585, -568408, -410244, 250382, 314297, -151594, -173948]
32997a73948M09416J9477k93216J53795M36298q2181m50571k4679K76650j48365
32987A22676l75754J55792M65796m4311l83037J01108M48781k8333m24271l2408
32977F039L09180r8295m81019j51800K17879K9427j14735K15563L39601r5188
32967A76652k98344J05252K93505j06183k49493J96093K98829k81409m88015J41713
32957b11400N09762j5041m32610l6756L14957k4701k46919K07341M53643r8550
32947D19726n15644r3883L12108k5903l26564J03514M75068N7735l90601q2226
32937f6670L39632J18788k08349j2550J62989k01702m55639n7007K96073J0856
32927g3579k36940J28292L94692l2928l87223K8457M71119J36391l49975j53699
$$ y = [-173948, 235468, 254945, -38271, 115524, 551822, 469641, 19070, -5609, 271041, 122676, -253078, -97286, 368510, 324199, -58838, 42270, 491051, 462718, 38447, 6039, 315219, 216924, -264095, -415895, -198016, -168589, -283324, -67761, 271840, 176652, -121692, -16440, 277065, 170882, -78611, 117482, 416311, 134902, -353113, -211400, 298362, 283321, -149289, -186045, 128912, 104211, -142708, 64633, 518276, 419726, -95918, -189801, 122307, 96404, -230160, -126646, 348422, 406157, 15556, -66670, 272962, 391750, 183401, 170851, 333840, 132138, -323501, -380508, -84435, -73579, -310519, -182227, 212465, 179537, -207686, -179229, 291890, 428281, 78306, -75393]
32917g5393K46878R7857j99116j1236K37056j9596l04772n8548K28572R328k17512
32906f6482O2137K97449l8531l49615n0077K84510N1860j95205J16338L79352
32896D91736k2263m37264j26098L34908J38784k70368j30098J88369P232k84894
32886a09956l7450L26345J09242l09311k10816J27592P8713j04229Q3116K88268
32876B41514K0381k76312m5796K53723K3366k77222j6071L31745N7052m02845
32866i0465k60070J67660J15960j82168m1177L01129J80490j66801p0433K73908
32856B28033K17783r6559j03743M6511j11157l04698l9295L15974J26600k89804
32846a0355k14533J57929J35356j69019j33870J48313J12994j45269j05313J29361
$$ y = [-75393, 171485, 269342, 70226, 58990, 296046, 276450, -28322, -86870, 141702, 151030, -66482, -4345, 293104, 254573, -95042, -145119, 139391, 191251, -3954, 112384, 491736, 469473, 32209, -93889, 241019, 379803, 109435, -20663, 167706, 174938, -109956, -147406, 178939, 288181, -21130, -231946, -104354, -25641, -129870, -46754, 241514, 261895, -14417, -60213, 193510, 216876, -60346, -76417, 255328, 312380, -90465, -350535, -182875, -66915, -249083, -290260, 10869, 191359, 24558, -45875, 228033, 445816, 349257, 245514, 292025, 180868, -123830, -163125, 152849, 279449, -10355, -224888, -66959, 68397, -100622, -234492, -86179, 26815, -118454, -223767, -94406]
32836i4406Q5364r4929L0399K36967L2345l10791j72628K65463L27592K2280r2299
32825B35357L7546J6557j32579q4289M9733m0785j66543l146J86243J3281k39923
32814a28548j21551J22739M1207j29931L7968K58010N9011k53321j41594J34048
32804a21962L8211j72657L4300L53819J60463k81449k71223M9005L5191j96191
32794c72493n2337K99244K14751j56029j32105J73744O8558l33775k57887K53750
32784b94579L38077j48036l86352o4018J70082k5538j51075N5310J23387j41810
32774e24552j98717J76755L19197k27110q07688n45307L91788J042866Q73810
32765E01042K44730j85046j63640K4596l290k15373k32033M5319K10663n935k63759
$$ y = [-94406, -9042, -103971, -73572, 163395, 195740, -115051, -287679, -22216, 305376, 327656, 235357, 272903, 289460, 156881, 72592, 122325, 81540, -85003, -88149, 98094, 111375, -128548, -250099, -127360, -86153, -216084, -178116, 79894, 138905, -114416, -256010, -121962, -83751, -256408, -222108, 131711, 292174, 10725, -260498, -211493, -176302, -372493, -424830, -125586, 89165, -66864, -198969, -25225, 43333, -290442, -548329, -294579, 43498, -104538, -490890, -554908, -384826, -410364, -561439, -506129, -382742, -524552, -723269, -546514, -227317, -454427, -1262115, -1807422, -1415634, -372768, 501042, 745772, 560726, 397086, 421682, 418392, 203019, -29014, 16305, 226968, 221033, -42726]
32754d2726j61809J10867J52793L3973O0897J59394O8215j02334p5841N1438K1209
32743B76076p4792k6254K0409j32156k42859l1895K27954J37779j02509n0018
32733A735J75492J34359j15706j53573K7125O2003r0295j40902m7492j2165k8168
32722a87587L2105M5885j19861k14633J4366K94782K34247j5848o8017K2970j5242
32711B3167p3815Q0854K43279J03870j33841j06598L8714k5199j35420J7692K12311
32700B45014Q4657j34167k9926J74675K0658k73767j66522J92799K00159j27753
32690A85827k14491M6067J87825M8020o7095n9173j22744j93691l1622K03825
32680a7252J45628j01254j40971p669k0827r8856N3383K55031J16519j72974j16778
$$ y = [-42726, -204535, -93668, 59125, 93098, 153995, 313389, 381604, 279270, 203429, 254867, 276076, 201284, 175030, 195439, 63283, -179576, -211471, 16483, 154262, 51753, 1735, 177227, 311586, 195880, 42307, 69432, 131435, 41140, -99762, -147254, -159419, -187587, -155482, -109597, -229458, -444091, -429725, -134943, 99304, 83456, 15439, 38409, 23167, -50648, 30206, 273485, 377355, 243514, 136916, 175630, 150431, 15011, 32703, 245014, 329671, 195504, 165578, 340253, 360911, 87144, -79378, 113421, 313580, 185827, -28664, 17403, 205228, 253248, 186153, 126980, 4236, -189455, -221077, -17252, 128376, 27122, -113849, -121518, -142345, -241201, -187818, 67213, 183732, 10758, -106020]
32669a06020J86448K19427k1088r6486N754o8111k25731n9371K86889K69728p6240
32658C15199j95965j6676M889j71908j05081K03208K35909p6403k09691M95J16216
32647A00192l8097j00421O1852J07755o4370j15634M2023P9196p1464q7944N7228
32636b9684J9162j88380j42180J67272K35284n8320k20742k6341J29788J342j10086
32625b22885N651J02311J9886k9054M9522M7807m6808K8311K36496K08565p2130
32614C27672j91857m4140K5791o2691R396K24406J30456k91439m38052o3685K89535
32603h4608J88431o1574o6419K7772k6819q8214R155Q7452n306r8108o4011m5755
32591b28004q1479J9144K15914J73637j25522k47360j9445J73685O6958p1330
$$ y = [-106020, 80428, 299855, 278767, 182281, 188035, 119924, -105807, -165178, 121711, 391439, 315199, 119234, 102558, 107447, -64461, -169542, 33666, 269575, 193172, -16519, -16024, 100192, 62095, -38326, 23526, 131281, 66911, -48723, -6700, 72496, 1032, -86912, -29684, -10522, -198902, -341082, -173810, 61474, 3154, -217588, -243929, -114141, -112799, -222885, -217234, -114923, -95037, -124091, -74569, -26762, -73570, -45259, 191237, 399802, 327672, 135815, 91675, 117466, 54775, 64171, 288577, 419033, 127594, -310458, -374143, -84608, 103823, 42249, -24170, 3602, -23217, -111431, -102276, -14824, -20130, -118238, -182249, -228004, -309483, -290339, -74425, 99212, -26310, -273670, -293115, -119430, -52472, -123802]
32581a23802Q192J10080L5719n0181n312Q005q8126q0426Q6671J28505n1787j36192
32569a58654L9831J81264P5818m6963N702L6051j02989j78352k1594J30798P1437
32558C2349j5674N0565R3487n1302j85371r8607O1970P9070J3776M07n805m0763
32546f5898L317J16968R5849q7075j67899l1447Q8014K6763n3605j9817k001p3572
32534a70403o5714Q4784J57969L7204o6834Q572J04879N3763m4691n5150l6061
32523H318n7648n2397O292K0583l4341o6805o6087q8389o0775J01004K32075J27477
32511F9307o5028o2285M6908j8101j55712m6762J90277J42326j30105j53193J03437
32500g8931J59262q8299j67441Q6250K11489l1932k20512l0267K14112J53481
$$ y = [-123802, -115610, -5530, 30189, -19992, -25304, -17299, -105425, -185851, -99180, 29325, -22462, -158654, -118823, 62441, 138259, 91296, 96998, 133049, 30060, -148292, -169886, -39088, 32349, 16675, 67240, 160727, 109425, -75946, -174553, -112583, -33513, -19737, -19330, -25135, -65898, -62581, 54387, 150236, 63161, -104738, -136185, -48171, -21408, -75013, -94830, -96831, -170403, -236117, -151333, 6636, 43840, -22994, -14422, 90457, 144220, 99529, 44379, 8318, -49330, -101727, -95435, -74852, -109193, -175998, -242085, -330474, -391249, -290245, -58170, 69307, 4279, -58006, -11098, -29199, -184911, -231673, -41396, 100930, -29175, -182368, -78931, 80331, -7968, -175409, -89159, 122330, 90398, -130114, -160381, 53731, 207212]
32490B07212k8121m7670j4826p9249p7475P7695J16361j01196k54564q8844J47454
32479a43223J46486K1980P16J9311l4358m1020P3148J25528K0850m6225K1958
32468A65151J8697j43245k04340j7526J61760J12229p664n557K8111j0822k2532
32457G4262L1377J3312o7617j7566J19008N5298j81296k03539O0364K00401L3047
32446A17051j04553m581O6425n0627q6573P9281J24020r1050j94700K1567K01762
32435G8022R0591k871J61246K57891J4850k48251k04044q6857j57141j53437J49142
32424a00859L65068J09137k87258l06773p1376j943n0966O4164K08681Q4287j42063
32413a29901j06093R4565J14776O570N1728J61707M6389j86998j87187J7144R1304
$$ y = [207212, 179091, 131421, 116595, 37346, -40129, 37566, 153927, 52731, -201833, -290677, -143223, 3263, 25243, 25959, 45270, 10912, -30108, 43040, 168568, 189418, 143193, 165151, 183848, 40603, -163737, -181263, -19503, 92726, 85062, 79505, 107616, 96794, 74262, 105639, 118951, 51334, 33768, 152776, 208074, 26778, -176761, -116397, 84004, 117051, 12498, 7917, 74342, 23715, -62858, 16423, 140443, 49393, -145307, -123740, 78022, 168613, 165742, 326988, 584879, 599729, 351478, 147434, 60577, -96564, -250001, -100859, 264209, 373346, 86088, -220685, -292061, -294004, -344970, -280806, -72125, 12162, -129901, -235994, -141429, -26653, -20083, 31645, 193352, 239741, 52743, -134444, -117300, -25996]
32402b5996j4714n7286J2474K2091m4075o1977o3301j27570j14455J09713L29210
32391c5886K57813J5402o3391M3494R1835J4603m8566n2789n2136k1362M7952
32380A96969L1031r8807j34935J5644J17278J2641o8854O6303J80932K1904j92401
32369A47705j35057O5206Q2243l6156k7461O8659K7730r6217q1406K6423J3673
32358E5342r1104r7868k1122m613j5921M5218Q7024j535r0391l4391L8902j9882
32346a50341p3554K6330J04850k9747j88628j01022J13379J65069P8908O4363
32336I607R8623L0526p6076p2411k7818o6896r3863L469R1338M0067q263P4824
32324C127J31646L8114k5464N3735M7501j54422k23033M7747K82642J17282j69665
$$ y = [-25996, -40710, -97996, -85522, -63431, -107506, -169483, -232784, -360354, -474809, -365096, -35886, 221927, 237329, 173938, 217432, 309267, 323870, 275304, 222515, 170379, 149017, 196969, 228000, 129193, -5742, 9902, 127180, 139821, 70967, 137270, 318202, 340106, 147705, 12648, 77854, 160097, 123941, 96480, 165139, 192869, 96652, 15246, 41669, 55342, -35762, -133630, -154752, -159365, -175286, -130068, -43044, -44579, -134970, -169361, -130459, -150341, -223895, -197565, -92715, -122462, -311090, -412112, -298733, -133664, -54756, 9607, 108230, 138756, 62680, -9731, -37549, -104445, -198308, -194839, -103501, -63434, -71697, 3127, 134773, 172887, 147423, 201158, 248659, 94237, -128796, -81049, 201593, 318875, 149210]
32313A49210j57815n003o3693j76039k7648J48038m1338l39371k04242K25184
32303d92717L28249M4574q7496J01121J92180r102j72084q2269M7653N8194Q1920
32292A0223J60880J17108o7429j70557j14979m8157j5165O3829J14156O623j14312
32281e7780j8432J69964J55466m697l0967L7140n0638k03776j10308J50572J93353
32270B29897Q93o6771N7788O0868j25516j88497j6666J20630P7834K0117K3090
32259A93667l1274r5009K1962K12932J53959j26198k57069j48530p6519j07569
32249b59648o365K08693K13412J603m0832J53168J61075j63501l62863j27133
32239b22391J73323Q6956k33729l38432j29076J48023K91766K43241K9170j72470
$$ y = [149210, -8605, -13608, -77301, -253340, -280988, -132950, -174288, -513659, -717901, -492717, -164468, -119894, -207390, -106269, 85911, 76809, -95275, -177544, -129891, -71697, 10223, 171103, 288211, 220782, 50225, -64754, -112911, -128076, -64247, 49909, 56532, -57780, -76212, 93752, 249218, 244521, 213554, 250694, 200056, -3720, -114028, 36544, 229897, 230790, 164019, 221807, 282675, 157159, -31338, -48004, 72626, 150460, 170577, 193667, 162393, 67384, 89346, 302278, 456237, 330039, 72970, -75560, -152079, -259648, -266013, -57320, 156092, 157695, 116863, 270031, 431106, 267605, -95258, -222391, -49068, 37888, -195841, -534273, -663349, -515326, -223560, 19681, 48851, -123619]
32229a23619j39763O5689J35675r061r4363L2800J51884N6831j28139j99613j53309
32218d04988n7100P6969J65924Q0640r7445j27640R931R4692O9526J00781J83619
32207I4909J03621j14689j57731M4835J74131O7082l5386K6399M8469r7611j78661
32196b4632l2866J09402L8006o8528K167J10834N9660l3874J4391R9908M4687
32185C19155o6333o8065k1848n6647j06880p3894m7163j09124j25004J5182J49254
32174a91367J01917n927J8373R0391J9576j18984q8406J20032K70226K13979L4830
32163D64640j05064j11197j43R6302M4596j06099j69617r6094k6873k8575K068
32152c6056Q8959Q9981k2818o5835K4319M4345j02546j78674k611K04713J61840
$$ y = [-123619, -263382, -197693, -62018, -71079, -165442, -132642, 19242, 76073, -52066, -251679, -404988, -462088, -385119, -219195, -138555, -236000, -363640, -353709, -259017, -189491, -88710, 94909, 198530, 83841, -73890, -29055, 145076, 212158, 176772, 203171, 251640, 154029, -24632, -57498, 51904, 89910, 21382, 23549, 134383, 194043, 160169, 174560, 274468, 319155, 252822, 184757, 162909, 106262, -618, -74512, -121675, -230799, -355803, -340621, -191367, -89450, -95377, -77004, 13387, 32963, -86021, -174427, -54395, 215831, 429810, 464640, 359576, 248379, 248236, 344538, 389134, 283035, 113418, 17324, -9549, -38124, -36056, 52903, 142884, 120066, 54231, 78550, 122895, 20349, -158325, -160936, 43777, 205617]
32141B05617j9284n6722J3910m7683k03932j69702Q9154K53107J17304j25907
32131E5862j84027l2516J32978J64115O6912o3840j21841n3972P9577J35421L1984
32120B10653j38850j90939o0453R4252P7842p0895j13647L9528J70568O6889j47099
32109f2151j89018l2564R6955R5212Q2566J22229J02253k4050j13843o5326J6098
32098B8361N543m2483j2369P2001R0324J006j17150j57093p5153O7582J48606
32087I175J15447M4606J2537j7145q1568r7423k320Q4215L4678m1992L8084J98556
32075B96850J97010J8075j15255j19467j34109j91956j28727P5877J70189O392
32065G4879k01900j83957J5405J51554J23069K2080n5452q8251p5307k6103K1017
$$ y = [205617, 186333, 129611, 143521, 95838, -108094, -277796, -188642, 64465, 181769, 55862, -128165, -160681, -27703, 136412, 203324, 139484, 17643, -36329, 43248, 178669, 210653, 71803, -119136, -179589, -85337, -7495, -78390, -192037, -152509, 18059, 84948, -62151, -251169, -283733, -186778, -91566, -9000, 113229, 215482, 191432, 77589, 12263, 28361, 33904, -8579, -20948, 51053, 141377, 142383, 25233, -131860, -207013, -139431, 9175, 124622, 169228, 181765, 164620, 83052, -14371, -16691, 67524, 102202, 60210, 98294, 296850, 493860, 511935, 396680, 277213, 143104, -48852, -177579, -101702, 68487, 74879, -127021, -310978, -295573, -144019, -20950, 1130, -54322, -142573, -217880, -243983, -222966]
32054b22966L9457M4900N6058O7747P2910O4590K7277k4571l7797q114j0521o8050
32042I20q0932J3260J11770J00503K6983j2324l1718n5064n545J21029J37155
32031C26037n6715k34985j53420N6346R6350k5421o2691K9632P4435L0616K6070
32020A06254O5331L3353l5284p844O0865J0910j02878j02337l4326p0054j26409
32009b02419O277K06853J44990j37480k33812j7141J79180J20084l1697r3839
31999e9004j19055j33054k3692J56179J62817q007m9205J38107K44329O3768j66307
31988B06876j62487j533R2006P3135p194j39280k35414j42815P6454J54389K7760
31977e8103o2311P440O1251m844l4719M4377N4950o9782j15889K1082J24298M1219
$$ y = [-222966, -183509, -138609, -82551, -14804, 58106, 122696, 149973, 125402, 87605, 79491, 68970, 920, -80012, -66752, 45018, 145521, 172504, 160180, 128462, 73398, 67853, 188882, 326037, 269322, 34337, -119083, -62737, 33613, 8192, -54499, -24867, 49568, 80184, 106254, 171585, 204938, 169654, 161810, 222675, 233585, 130707, 28370, -5956, -76010, -202419, -196142, 10711, 155701, 18221, -215591, -232732, -53552, 66532, 34835, -59004, -178059, -311113, -334805, -178626, -15809, -23816, -73021, 65086, 309415, 373183, 206876, 44389, 42856, 134862, 207997, 200803, 61523, -173891, -316706, -240252, -85863, -58103, -120414, -112974, -51723, -56567, -91286, -46909, 8041, -61741, -177630, -156548, -32250, 8969]
31965H969n9057k1986L6511J5609K6506R8493M9174j35151j68931M3896J83591
31954G7624M4485j12187m0841O1786k9897j25732l015J23166k4380k37104j39432
31943d05527J70330K87075J44303K1536J9459j8530j15113j05588K4604R4650
31933A17199L6772k8227k8383k2201m9669q4410j04417p7380M1235J81901J72880
31922A55300K290j08966l4594O3967K9463l9527j7215J1453m3711p5705j2861
31911g0106o263j36608j90078p100J96313J66140L1261M8015J41223P1243j12887
31900A31153j67504p9153l4201n4706k689J18364J72200J42708J09386M5251j00622
31889B80187k03285j10084P9203J27309k324j34709j43708m0703J08347J95366
$$ y = [8969, -50088, -72074, -35563, -19954, 6552, 105045, 154219, 19068, -149863, -105967, 77624, 122109, 9922, -30919, 30867, 970, -124762, -127777, -4611, -28991, -266095, -405527, -235197, 51878, 196181, 217717, 237176, 218646, 103533, -2055, 22549, 117199, 153971, 125744, 97361, 75160, 25491, -58919, -163336, -240716, -199481, -17580, 155300, 157590, 48624, 14030, 77997, 107460, 67933, 50718, 62171, 18460, -57245, -70106, -76369, -212977, -403055, -410155, -213842, -47702, -16441, 31574, 172797, 244040, 131153, -36351, -115504, -149705, -204411, -207100, -88736, 83464, 226172, 335558, 380809, 280187, 76902, -33182, 46021, 173330, 171006, 36297, -107411, -148114, -39767, 155599]
31879A55599J15959n9613j17793k4824L48j29995j99119p7329L7108L461J4058
31868b82140J87206K51319J1500k17627q8393J82489J81044j7709o2489J6897
31858A62097n3585j83363o6792J69360J05977k14514l07119n1835J37993N3939
31848b47842o374J45382K36624N6822j48126j03618N7511Q2375N200j4693j622
31837F1639m4476p4464R70J00684J00240K9434r568j980J3352K3643J3170l1485
31825A81159n4264k169L5888o0353j96307j44767R8233K65341J83441k0137j42118
31814A43947j41208q2995k2095n716m7163n9980L6883J47919J07960m8202j24052
31803i4702o9242k6927n5917m4250M8889R8270M1084q116L5395Q6775N4863j2890
$$ y = [155599, 271558, 211945, 94152, 69328, 69676, -60319, -259438, -336767, -299659, -296198, -282140, -94934, 156385, 167885, -49742, -138135, 44354, 225398, 207689, 145200, 162097, 108512, -74851, -141643, 27717, 133694, -80820, -387939, -439774, -301781, -247842, -254216, -108834, 127790, 184612, 36486, -67132, -9621, 72754, 77954, 63261, 61639, 17163, -57301, -56331, 44353, 144593, 174027, 164459, 162479, 175831, 199474, 212644, 181159, 126895, 124726, 160614, 100261, -96046, -240813, -142580, 122761, 306202, 286065, 143947, 2739, -80256, -102351, -108067, -155230, -215210, -178327, -30408, 77552, 29350, -94702, -163944, -190871, -246788, -291038, -242149, -143879, -102795, -110911, -75516, 11259, 66122, 53232]
31791E3232l8088k7796r994K1567M0698q432r2770r7395L619R8555R7549L2771
31779G3516k4943m2336l561P5900J08732K2439j09342j35306k9646Q0234Q8051
31768A03738J1122p1454r0705j9411Q3392J00008Q315n7682L768R7509P1965n7313
31756A83252j49717j31249l2161Q1947J19171J6398j20940q9677R5937J66251
31746A39212J4109j03489R757J39854L1986j51541j16589L3926j1065k00864k04864
31735d19568J2374J60533J43540J53196K24096J49131q7101k15530j28808k9899
31725c8036k7894K2306J47141J23187r5862j97766M968K35340J64754r7923k12280
31714B7935j04142J8642K0142l6611m8760J7010J28295J92995J26718j8489q5216
$$ y = [53232, 15144, -12652, -22646, -1079, 39619, 31187, -61583, -158978, -155359, -56804, 40745, 73516, 48573, 6237, 2676, 78576, 187308, 209747, 100405, -34901, -64547, 15687, 103738, 114860, 43406, -47299, -66710, 16682, 116690, 125005, 67323, 71091, 168600, 240565, 183252, 33535, -97714, -129875, -47928, 71243, 87641, -33299, -122976, -27039, 139212, 153321, 49832, 59589, 199443, 231429, 79888, -36701, -2775, -13840, -214704, -419568, -407194, -246661, -103121, 50075, 274171, 423302, 336201, 120671, -8137, -38036, -65930, -43624, 103517, 226704, 130842, -66924, -61956, 173384, 338138, 240215, 27935, -76207, -57565, -37423, -74034, -122794, -105784, 22511, 215506, 342224, 323735, 238519]
31703B38519k1644N1786L3215k8921m5654p291N2305R9626Q2711k2984j44511
31692B87157j93594j88408j73676r4538P9861J96976J10092m9283m9021N8635
31682a5799L1814j21596j44369J8120J24175N7334q668L2429L6988p2071j21800
31671a83443L032J38787J09086j6588q8885r1762n4287L7269J17441N2996j09285
31660h5639j41562N209R8010P867p7873L124J06136M5788r1691j22012n1756R681
31648b94718M9163Q0547N4218m320L9609J74511J79786j4578j57907p1073N5743
31637I0981P571p3572L6530K05858J42035j12284k34701j02350R6142J81439J42078
31626C79727J8156j19493j24086N0154J89242Q8672r5750n7300J57066J87501
$$ y = [238519, 216875, 268661, 301876, 272955, 227301, 220010, 272315, 371941, 454652, 431668, 287157, 93563, -94845, -268521, -363059, -283198, -86222, 23870, -25413, -74434, -15799, 16015, -105581, -249950, -231830, -107655, -50321, -58989, -26560, 10428, -61643, -183443, -180411, -41624, 67462, 50874, -38011, -129773, -184060, -146791, -29350, 23646, -85639, -227201, -221992, -123982, -116115, -193988, -190864, -84728, -38940, -130631, -252643, -304399, -294718, -245555, -165008, -110790, -115110, -75501, 99010, 278796, 264218, 106311, 35238, 90981, 98552, 24980, 61510, 267368, 409403, 297119, 62418, -39932, 56210, 237649, 379727, 397883, 278390, 154304, 204458, 393700, 482372, 386622, 329322, 486388, 673889]
31616F73889p8591l23567k67297k7060J23814J17141N1255k0704r0673j08543
31606D9664n2123o447m9712j20782j03359P615J12472J38302Q7493m388q1989
31595b3254p5409K3213J04902N4512p8840j16151Q054J30104P3189q8224j17593
31584a05497M0555J69316R2716p3057j08349j2478L6493j9971n9370j1587L4551
31573a6678M674l8496j8719K9453L8164J4486k692k0493n7967q5874n7586K7044
31561a84684J14804J37006O5702l6189o0494l06J5682q1039j55450n8517J15396
31550a28089J45255J8621n9007P461Q1415M7462j7957r355M5145P1835N9584P188
31538B69558r7327j79735j12347P9627J92048J08732m4311r9073o2537l5765m3145
$$ y = [673889, 595298, 271731, 4434, -22626, 101188, 218329, 269584, 248880, 158207, 49664, -2459, -8906, -58618, -179400, -282759, -275144, -162672, -24370, 63123, 58735, -23254, -98663, -75450, 29452, 83964, 5124, -111027, -102973, 27131, 100320, 12096, -105497, -64942, 104374, 197090, 124033, 15684, 3206, 39699, 19728, -39642, -51229, -16678, -12004, -50500, -69219, -39766, -1602, 12884, 10192, -10301, -68268, -154142, -211728, -184684, -69880, 67126, 132828, 96639, 36145, 35839, 51521, -29518, -184968, -243485, -128089, 17166, 35787, -23220, -15759, 65656, 113118, 95161, 85806, 130951, 202786, 262370, 269558, 172231, -7504, -119851, -40224, 151824, 260556, 216245, 117172, 54635, 18870, -24275]
31527b4275m8643m0963j4860L9398O9642j26j16195j22258L185J01903R6869R9323
31515D3000J50706Q7345j55764l17905j46171J89256L02276J33857j6684J0958
31505B80874L1142j08622k31402j11083J37161J91042k1744k29897k01011k1874
31495b85414Q6924P6900M8883L1566k6641q2890k6952R0607O9516j18509k27142
31484c63152r1966J03986J11365p659k2557P4570J03996N0104P0821J63197J25429
31473C18134q8308k47732j82015j1242O7517L5420j5328l8204j7086O3224J41008
31462B5388J03620l6355j21900p2694R170J4261k9784m6922j5084O2973J55582
31451D8255J49347l1897k35286k09962K5264J68598O3909r3185q8810Q783M2176
$$ y = [-24275, -72918, -113881, -128741, -89343, -19701, -19827, -136022, -258280, -255095, -153192, -56323, 43000, 193706, 281051, 125287, -192618, -338789, -149533, 152743, 286600, 269916, 280874, 312016, 203394, -28008, -139091, -1930, 189112, 167368, -62529, -263540, -285414, -198490, -121590, -72707, -41141, -67782, -150672, -177624, -87017, -17501, -136010, -363152, -455118, -351132, -239767, -247426, -269983, -195413, -91417, -41313, 29508, 192705, 318134, 229826, -17906, -199921, -211163, -143646, -108226, -123554, -161758, -178844, -115620, 25388, 129008, 92653, -29247, -101941, -92771, -78510, -108294, -155216, -170300, -107327, 48255, 197602, 165705, -69581, -279543, -254279, -85681, -21772, -114957, -203767, -194984, -152808]
31440a52808L9806R2475J25102K1621j29409j34117J4794J31720J01361k698o0141
31429D7706m7851k3108k8328l5620J3418J01560J16903P670j03398p5293L8271
31418A1930Q5148O5797Q7883J13909O831j71688j88621j6317R9393L2667m6609
31407H0323j0182Q902r2506j52238k4277J32941J00432m6520q0384J6331P6539
31396I361M1484J295K388P519R863L5997O8648O9982L2169n1216j65722j95542
31384a33774l0561J92847J82601p3946k20911m6243J79939J19390j17375j76043
31374a24076j1679J04309M5207l3939r171M7761N1553K6840O838k2739n1072m5653
31362a5821k9889m4758n8947k4855K3243L6057M7916R2059R9257J2558q3490r0968
$$ y = [-152808, -113002, -20527, 104575, 126196, -3213, -137330, -122536, 9184, 110545, 107847, 47706, -145, -23253, -51581, -87201, -73783, 27777, 144680, 152350, 48952, -26341, 11930, 97078, 162875, 250758, 364667, 371498, 199810, 11189, -5128, 94265, 126932, 80323, 70141, 79043, -13463, -165701, -189978, -57037, 43395, -3125, -83509, -67178, 9361, 50845, 52140, 54528, 62047, 71910, 107907, 176555, 246537, 278706, 227490, 61768, -133774, -164335, 28512, 211113, 137167, -83744, -129987, 49952, 169342, 51967, -124076, -135755, -31446, 13761, -20178, -29349, 18412, 69965, 96805, 103643, 80904, 29832, -15821, -45710, -90468, -149415, -174270, -151027, -114970, -67054, 25005, 124262, 136820, 53330, -37638]
31350c7638o2352p7822o0805Q8424K53529K18123j0199j99433k10487j23647m2425
31339b64732L7948J25410J58881J11299N3128M8992O4293K5066p1550j41456j01965
31328D5314K4563J11890P3428k2580n8712n1516r6865j57597r5177O8189J38133
31317b0930O0349Q880O2313M9429j20045k26339p3444J60737J80731J8964o3446
31306C7199m198L0216k3687n3993j6831K060k1358j0879M4210O7437M3950L0976
31294A25102K9661n782n5618o9970p0739q0034k2209J38953K51489J60176l4814
31283C66215j20101j02000j50320k50222j89676P7256L10164L01067J14249o4250
31273B92382j44646j32866o4156m727j275M401Q9505J74853R5973j22031k33525
$$ y = [-37638, -99990, -177812, -238617, -150193, 103336, 321459, 311260, 111827, -98660, -222307, -264732, -226784, -101374, 57507, 168806, 221934, 270926, 335219, 360285, 288735, 147279, 45314, 69877, 181767, 255195, 232615, 173903, 122387, 25522, -132075, -227252, -159063, -20930, 39419, 48299, 110612, 160041, 39996, -186343, -259787, -99050, 81681, 100645, 37199, 33001, 63217, 39530, -14463, -31294, -29234, -50592, -61471, -17261, 50176, 94126, 125102, 154763, 148981, 93363, 23393, -47346, -127380, -149589, -10636, 240853, 401029, 366215, 246114, 144114, -6206, -256428, -446104, -368848, -58684, 242383, 356632, 292382, 147736, 14870, -49286, -54013, -55288, -50887, 38618, 213471, 309444, 187413, -46112]
31262d6112q6808J71325K84976J71452n6455k47578l11598k36511q6644M5451
31252c98502J16425J34223R6579k547j07288j25230m0855O1996J10106J13716
31242d1377J10998R7058M2058m8359j17797j06332j6922P2483Q8626M6965J4232
31231A41633j24m5820j23161j54180q4976M7992J63258J85375P5179r7771j50986
31220d3581Q708K10222K11571M2942m9856L407J8896q7226j49273o3312K4807
31209A27305n193l7397L3227P9299j9570j24300n9097Q4341J02267l556q9424
31198H7902j21744j45630j19178M987J30432J40269P3657K1503k5960p5772m0196
31187f9730Q3411J24870J6545n3786K6938N8939j12702k55759j05414J59793J88510
$$ y = [-46112, -132920, 38405, 323381, 494833, 438378, 190800, -120798, -357309, -443953, -398502, -282077, -147854, -51275, -53822, -161110, -286340, -327195, -265199, -155093, -41377, 69621, 166679, 208737, 160378, 42581, -63751, -80673, -8190, 80436, 127401, 141633, 141509, 95689, -27472, -181652, -266628, -218636, -55378, 129997, 205176, 107405, -43581, -34873, 175349, 386920, 429862, 380006, 383413, 402309, 315083, 165810, 102498, 127305, 122112, 84715, 117942, 197241, 177671, 53371, -5726, 78615, 180882, 177326, 87902, -33842, -179472, -298650, -293663, -163231, -22962, 50695, 72198, 46238, -29534, -69730, 13681, 138551, 155096, 101310, 128248, 187187, 74485, -181274, -286688, -126895, 61615]
31176F1615K8381l360R9644M8384j81224k67802q1791J04447N7652r6050j22223
31165c52327M828J48873J87388P8815r2008j39976o666J06061K0580j11091m4433
31154a99956J29360J17535q3411j86798q5446L0657M0952L7826O4181K9191n8702
31143a64611o6875R212M3070L8327R9857J52206K5864j66110j16738J52958K49933
31132B57093l283l05372l42525j76160o633J27228K31788K28812J25226O8392
31122B04566Q7450K9923j22470j60710j3564R2679J1475q0991j8707O3004P00
31111I3355q8520k7437J01153J07980M642o9691q2425o9832j1788P4781O9638
31100A01856n2278j18562k4072P9781M0815l7376k161O7258K2642o6948m6738
$$ y = [61615, 89996, 86636, 186280, 234664, 53440, -214362, -296153, -191706, -134054, -230104, -352327, -347499, -198626, -11238, 67577, -24431, -164407, -171073, -65012, -44432, -155523, -199956, -70596, 46939, -36472, -223270, -308716, -278059, -237107, -199281, -135100, -105909, -164611, -231486, -222274, -179204, -140877, -41020, 111186, 137050, -29060, -145798, 7160, 257093, 253810, -51562, -394087, -570247, -576880, -449652, -217864, 10948, 136174, 204566, 292016, 321939, 199469, 38759, 25195, 117874, 129349, 48358, 29651, 92655, 93355, 4835, -22602, 78551, 186531, 191173, 121482, 39057, -30775, -42563, 32218, 101856, 49578, -68984, -93056, -13275, 27540, -9836, -11997, 55261, 77903, 10955, -35783]
31089c5783L0767P470p6351m4551R7292J58462O9772k7456k0406K9869K1818m4515
31077A66388j00619r6860l6640K1154N667p5118j23436p3464L0461J16227J67933
31066A693J80169J22517J8301l4405j402J7300n2972j20070n9831P1374R4812
31055B37486l3357j47340r1932O6842J26478J7858j03628q3738M107j2809j04169
31044a24202o8873J06500J72365J5922j19958j7489J55630J35455k775l1241r012
31033B12322j32810k74523j31616J95645K61977l0665k65166j58790N9354J02393
31023a61879M9906P8534J15692L5002o9014n6060J8506M0496K1709l303n2081
31012A7508n4258R7590K54805J10782k61521l69861l2628K70328J11897k13103
$$ y = [-35783, -5016, 2454, -73897, -118448, -21156, 137306, 207078, 179622, 159216, 189085, 210903, 166388, 65769, -31091, -67731, -46577, -40910, -116028, -239464, -312928, -282467, -166240, 1693, 181862, 304379, 322680, 288275, 286873, 304173, 251201, 131131, 71300, 142674, 237486, 204129, 56789, -35143, 31699, 158177, 176035, 72407, -11331, -7224, -20033, -124202, -193075, -86575, 85790, 101712, -18246, -35735, 119895, 255350, 252575, 221334, 212322, 79512, -195011, -326627, -130982, 130995, 100330, -164836, -323626, -264272, -161879, -111973, -33439, 82253, 117255, 48241, -7819, 10687, 51183, 72892, 69589, 17508, -36750, 60840, 315645, 426427, 164906, -204955, -237583, 32745, 144642, -68461]
31002f8461j76767J42382K37739L021j68489o2905Q1118L6899q6861j02865j5701
30991a80890Q0028J41847J32015J2188j50473k15744j39627N22J25379J77932
30981a6823R2496j04913k26874j25133R1266K01859J72046J24919Q8307j3970
30971B83180j52507j91579j05369j4602L398j2187k0211k1307K817N7986O9701
30960a00680j3683q4830k241J73085K33141J12036m0693q7502n3312k2732k1428
30949I1161l9347o5981o6709p371P5562J03325O4595K4674J5574q664q0250j39398
30937c2829r6469L8545J32203P4197o4995j04047o919M9991m1473j14407K0078
30926a46125K32979K45718O8565l3213N607k4635j77234k14354m0141Q6893k2235
$$ y = [-68461, -245228, -102846, 134893, 137914, -30575, -93480, -12362, 24537, -62324, -165189, -180890, -100862, 40985, 173000, 185188, 34715, -181029, -320656, -320134, -194755, -16823, 75673, -29240, -256114, -381247, -289981, -88122, 83924, 208843, 297150, 283180, 130673, -60906, -166275, -180877, -177479, -189666, -209877, -231184, -228367, -170381, -100680, -114363, -199193, -201434, -28349, 204792, 316828, 276135, 188633, 135321, 112589, 91161, 51814, -14167, -80876, -88247, -12685, 90640, 155235, 179909, 195483, 186819, 106569, -32829, -129298, -90753, 41450, 115647, 50652, -53395, -60314, -10323, -51796, -166203, -146125, 86854, 332572, 401137, 367924, 373531, 348896, 171662, -42692, -82833, 4060, -18175]
30915a8175j70362j24147J0439L8149L3204J32638K00135M8425j71385j63019
30905a84098M3164J52589O3891n7574j06633j26673j04058K6382J75321J67946
30895E0257K3837o9617n2741k8750k2149N0313J63090J74470O1371m4761p4701
30884B30619q4344r6456o9510l0073n4149j11996j00611k2451L3607O4020J25963
30873a15381J71540R9132m7719j22161j00168q1149q4781l9233M4607P9739P0502
30862a25072Q7631J00298K8751o3625m3025M9378M7537n1208p8276J4876Q6971
30851E4236N7482J0259J0826K4005M4393J05442J33132P715j91277k26043m4377
30840a4207J33278J37086M3660k9443j03558j97584k04677n8254J21236J81563
$$ y = [-18175, -188537, -312684, -302245, -264096, -230892, -98254, 101881, 150306, -21079, -184098, -140934, 11655, 75546, 17972, -88661, -215334, -319392, -293010, -117689, 50257, 74094, 4477, -48264, -77014, -99163, -48850, 114240, 288710, 350081, 305320, 230619, 146275, 49819, -19691, -49764, -103913, -215909, -316520, -338971, -305364, -241344, -115381, 56159, 155291, 107572, -14589, -114757, -195906, -280687, -319920, -275313, -195574, -125072, -37441, 62857, 91608, 27983, -15042, 34336, 81873, 30665, -47611, -32735, 54236, 111718, 121977, 132803, 156808, 201201, 306643, 439775, 447490, 256213, 30170, -14207, 119071, 256157, 299817, 270374, 166816, -30768, -235445, -293699, -172463, 9100]
30830I100J34134Q3569N7925J3517o0364j27196j52145j20933m7177K9032Q5854
30819i4684J32682J37852L2052j31995j53024L4195J84234O7219j53412j48314
30809i3195O1028J45946J103j30262r6161l4497m0083Q837J47626J85698N1204
30798B07244l8456M3104Q5553p8565k37737j40657P4622J17585J2212j6544L5954
30787F4315Q221o3763q856J14462Q2879q1709j26995q762M6081l5476n3574N6138
30775g039O6349j14933k09724j3282K21570J52775j17885k20559p9621N4808O0995
30764b06546O8918J27773R6833n4277j36907n5244K9536j1871n6741K7292J22371
30753d8863N4703r9384j26373m123R1412N7941l3491p7578k8274J04078K23348
$$ y = [9100, 143234, 226803, 284728, 298245, 237881, 110685, -41460, -162393, -209570, -180538, -94684, 37998, 175850, 207902, 75907, -77117, -42922, 141312, 208531, 55119, -93195, -32167, 113779, 114882, -15380, -111541, -146038, -186121, -177284, -29658, 156040, 207244, 168788, 211892, 297445, 218880, -18857, -159514, -84892, 32693, 44905, 28361, 64315, 72536, 8773, -83, 114379, 197258, 115549, -11446, -20208, 25873, -9603, -63177, -7039, 59310, -55623, -265347, -278629, -57059, 95716, -22169, -242728, -322349, -267541, -206546, -137628, -9855, 86978, 32701, -104206, -159450, -129914, -141785, -198526, -171234, -48863, 5840, -93544, -219917, -224040, -132628, -74687, -108178, -185756, -214030, -109952, 113396]
30742A13396J84632p946j34912m8082Q8667M0856j28899j80569r1464m0184m9084
30731b53589L1515J79020J78006P521p8187L3697J23891J5035j42230j35106l811
30720d4238R0403J06851O7107m7930j80802j72335j2107Q4544N873o6872K6371
30709a43135J50841J27172L6209L6096P1591J9347n1141k3347J3048q0836k13592
30698e7747j97490m8982P7256J33041J37727M6139j12141j35233M6676J56214
30688D5460l5837k85267k09284J01660K16398K2896j64137j32549o192P4981J34168
30677b37703J61338P2441o9748q9512J952K5138l0796k06J06098Q0482q6831j34558
30665b01905M4881K23702K05116Q2382N448l7458p3657m1035L6132J1047j17650
$$ y = [113396, 298028, 290082, 155170, 107088, 195755, 236611, 107712, -72857, -164321, -204505, -253589, -222074, -43054, 134952, 142473, 64286, 97983, 221874, 236909, 94679, -40427, -44238, 46165, 153016, 220123, 172193, -8609, -180944, -193051, -108507, -102634, -169506, -143135, 7706, 134878, 171087, 207183, 278774, 298121, 246980, 223633, 236681, 155845, -57747, -255237, -304219, -226963, -93922, 43805, 89944, -22197, -157430, -110754, 45460, 9623, -275644, -484928, -383268, -166870, -143974, -308111, -440660, -446852, -371871, -237703, -76365, -3924, -73672, -163184, -161232, -136094, -166890, -167096, -60998, 19484, -67347, -201905, -157024, 66678, 271794, 354176, 359624, 322166, 248509, 207474, 243606, 254653, 137003]
30654A37003j47206j2016O9704n2308k03812j65574l53R1774O9647J7840l1034
30643b26335o6013k1660J04717J73585Q5764n9039j10731p0104k5670L468M2379
30632a69639O6974M3352o198m6356o7837m9918K0513P8404N3890J8376R3519K07745
30620B42825J53973o6315j91865q7289N2484J9325j01886j18601l9450M039P458
30609a25302N5680J24721J18466N0516J6165J7169k6295j04578j10922k2164M1997
30598C5453q152r0870o2960O6588J26745J8536j22678r6387P3977J67613R1780
30587A99645J521K3703N4749k8697j34689j18148l1789p639j6986K8669O1372
30576C1711r740o4127N1558K06734J55083m9616j30655l9424J0804m7742m5839
$$ y = [137003, -10203, -22219, 47485, -4823, -208635, -374209, -374562, -282788, -213141, -195301, -226335, -292348, -314008, -209291, -35706, 50058, -8981, -119712, -189816, -215486, -212018, -169639, -102665, -59313, -65511, -111867, -179704, -229622, -209109, -130705, -76815, -58439, 35080, 242825, 396798, 330483, 138618, 51329, 103813, 123138, 21252, -97349, -136799, -132760, -125302, -69622, 55099, 173565, 224081, 240246, 257415, 231120, 126542, 15620, -6544, 35453, 27301, -63569, -126529, -59941, 66804, 85340, -37338, -133725, -59748, 107865, 199645, 201166, 224869, 279618, 250921, 116232, -1916, -33705, -41344, -58330, -29661, 31711, 21971, -42156, 9402, 216136, 371219, 321603, 190948, 151524, 162328, 114586, 68747]
30565F8747P3127J43868Q0083j2704p4107j51529j96311r8603N0600M9222m8969
30554a16576l681J61405J69218r330r1443K722K4288r7600j01573P9980J29428
30543A46838q5462k27538o5370J29342R0758J2286J05226J43311r2430l06775
30533a49814j49801J41856J22693j03595j01249J07237J03600j45813k07896O4307
30523c18475K75640J42207q6496p6348J03753J84329J04485r978q0732r5760l2926
30512A09699P9615J22584K2467j31256j80017p1341Q9238J39108K3704j28787
30502G5014j55877q1969o4541j06952l4413J61635K12438j3524k29470j25967
30492c63626J51658K35353R5911J7296Q7296R0718p0975j99774j37928j1451m793
$$ y = [68747, 141874, 285742, 365825, 353121, 279014, 127485, -68826, -167429, -116829, -67607, -116576, -120257, 41148, 210366, 201036, 109593, 112315, 136603, 39003, -62570, 17410, 146838, 61376, -166162, -231532, -102190, -11432, 854, 106080, 249391, 156961, -149814, -299615, -157759, -35066, -138661, -239910, -132673, -29073, -174886, -382782, -318475, -42835, 99372, 12876, -63472, 40281, 224610, 329095, 319117, 238385, 142625, 109699, 189314, 311898, 334365, 203109, 23092, -48249, 40989, 180097, 203801, 75014, -80863, -162832, -227373, -334325, -368738, -207103, 5335, -8189, -237659, -363626, -211968, 23385, 119296, 136592, 223888, 314606, 243631, 43857, -94071, -105522, -110315]
30481a10315q7004r8151J0166J30153J39132L1872p0140n4633K5941J6284r2808
30470a59503j19661J8447J40207P4072o3973o2543N0736R3308M2593K3381M6932
30459H3996P973q4754j00827j1699O7597O3202J1303m5463q8019p2368J9707J17031
30447c2321J50045J35824Q5270m2875j83888j50657N3092J17256j29135l64054
30437c61443j94050K25876L81424J35699j23826q6801J05858J72973O8601p0891
30427B53420j30910p6755L0872N1526n5677j14999J4735J62881Q1334j29715j55051
30416f8339K4263J17682K4674l8575L2382O5249j6986l7149P0359R4239o3783
30405B04016j71737o2480P0527K7326m4207N3933J77223Q7359j04482j13230K9540
$$ y = [-110315, -197319, -295470, -285304, -155151, -16019, 15853, -54287, -108920, -82979, -66695, -159503, -279164, -260717, -120510, -46438, -110411, -172954, -122218, -28910, 13683, 37064, 83996, 91969, 7215, -93612, -105311, -37714, 25488, 36791, -8672, -96691, -169059, -149352, -32321, 117724, 253548, 338818, 295943, 112055, -38602, 14490, 131746, 2611, -361443, -555493, -329617, 51807, 187506, 63680, -23121, 82737, 255710, 324311, 253420, 122510, 45755, 76627, 128153, 72476, -42523, -27788, 135093, 216427, 86712, -68339, -44076, 73606, 98280, 59705, 92087, 157336, 140350, 103201, 173560, 267799, 204016, 32279, -30201, 40326, 67652, 23445, 77378, 254601, 341960, 237478, 124248, 153788]
30394A53788M0152j17379j72612j7673J11756L3670q9103k8479J41221J64811
30384B20152p511j59200j19789K6552R5107M8027p067q438r936m9973o6399p763
30372d6238N6898L5351l5721m4120K1056N7501J0247n8575p2043k5179M2371Q8479
30360C0027Q1108L3674J2581L8113J5755j28023k74379k22023K0676K03434J49934
30349c9123k1052p6296K5367J16984P1313m4732q1944m897P9264P2693N612k9763
30337G3426j2569R259K0593M1213M1888k2808r4656o3331L8410M9085o1839j21433
30325a02762k3443J06436J29346J00921J14926J08199J324j08171q8668K424K6962
30314B67494o648j0319o243n6574j00426n7316l09k8170o0368L1518J75398J95646
$$ y = [153788, 193940, 76561, -96051, -113724, -1968, 31702, -57401, -85880, 55341, 220152, 212641, 53441, -66348, -39796, 55311, 103338, 96271, 87833, 77897, 27924, -38475, -46238, 10660, 46011, 10290, -33830, -12774, 44727, 54974, -3601, -75644, -100823, -58452, 30027, 111135, 144809, 157390, 195503, 211258, 83235, -191144, -413167, -392491, -189057, -39123, -60175, -136471, -111104, 5880, 77193, 32461, -49483, -54380, 24884, 97577, 103189, 73426, 60857, 70116, 90709, 131922, 173810, 151002, 56346, -6985, 31425, 80510, 18671, -102762, -126205, -19769, 109577, 210498, 325424, 433623, 434947, 326776, 238108, 240532, 267494, 260846, 250527, 244284, 187710, 87284, 29968, 29659, 1489, -58879, -27361, 148037, 343683]
30302C43683Q2959l4079j03743j40931j04287Q558N5668m2268j19460k3399R8296
30291B0997M2148q3582n6557M8854J5995q0956q655J55176J22381q4320j59144
30280f7663m5993J1394m0814J731J39359J23535m4518n9632J24308J70141m3369
30269B68479j90114p2795M7886m4248j39546k0013J46431J38035M1561j1744j12905
30258E1027k82322k76408m560K19053J68532Q2359J91144K57853J8484k75570
30248A49592k45207j8472L1803o5718k8731R0622K4958j40719q3519J50623K01792
30237F7024K9021m5606O0687P1116j00972j88490q0276k2821j39342j76431M2683
30226d83407K73430K22580k868q2797N4893J86454J13965j15786k73299j81266
$$ y = [343683, 426642, 392563, 288820, 147889, 43602, 52160, 107828, 65560, -53900, -77299, 20997, 63145, -20437, -76994, -28140, -12145, -93101, -101756, 53420, 175801, 91481, -67663, -113656, -102262, -143076, -141345, -1986, 121549, 77031, 17399, 141707, 311848, 268479, 78365, 5570, 53456, 9208, -130338, -150351, -3920, 134115, 175676, 163932, 51027, -231295, -507703, -512263, -293210, -124678, -42319, 148825, 406678, 425162, 149592, -95615, -114087, -82284, -148002, -176733, -86111, -61153, -201872, -285391, -134768, 67024, 96045, 50439, 111126, 182242, 81270, -107220, -187496, -210317, -349659, -526090, -483407, -209977, 12603, 9735, -73062, -18169, 168285, 282250, 166464, -106835, -288101]
30216b88101O6177J70670J5653j37991l2234J63308J09934j29684j75535L6678
30206b01125J41127n3433k59231j82824N1821J70392J46727J03768N5057k4323
30196e2044n7960p608J0092p2450j15951J688J59554J73091O1480l5072p3661
30185h841p8129j8609J04683J65581O6483r8163j71168j32088m8568N2641J35116
30174c1062J02699m7458j40282n0941R2556R8199o988n9411k6855k417l124L2121
30162d2963Q6223P9696J4773m0777p3706r7643o8440L1059R5548M3890j8483L7490
30150D6667J21257N8193r1014r5989O7325J58745L5130j54529k06025j04047M1406
30139a22881J34466J05114n5350k07867j76292k653Q2077M437l9079Q0962J93792
$$ y = [-288101, -221924, -51254, -35601, -173592, -205826, -42518, 67416, -62268, -237803, -201125, -59998, -113431, -372662, -555486, -503665, -333273, -186546, -82778, -27721, -52044, -110004, -117612, -107520, -179970, -295921, -294233, -134679, 38412, 99892, 64820, -8841, -86970, -105579, -896, 164685, 231168, 133005, -38163, -170251, -218819, -166178, -31062, 71637, 24179, -116103, -167044, -74488, 23711, 16723, -42688, -69543, -71960, -75084, -42963, 43260, 122956, 137729, 96952, 23246, -74397, -142837, -111778, -16230, 27660, 9177, 46667, 167924, 226117, 135103, 39114, 106439, 265184, 300314, 145785, -60240, -164287, -122881, 11585, 116699, 61349, -146518, -322810, -325463, -243386, -238949, -278028, -197066, -3274]
30128c274J02898q4316j17543J8407J10945N4105l1655j6406O8004J07102M7136
30117B55403o7100j36143r2401J5823O6745K8915M835N6850J00488O4087L1234
30106C28736Q4492J19612k120j95366k48664j39442m4495n0551o2994j6025L0373
30095a96444M1891P0094J13122R3275K2712J2339O2853L7915q6449j48805p2427
30084d9924m10l5629n2472O5790J90072J48983J7281k0315K4307L679q3318j08201
30072I9843o1005m7408n9714J6801J55208J67919o141j80346j65864o22J39121
30061E7792J47673N0559n6431q2643k2316K5494j9310r2638p6802J0242M0439
30050a7941j7772n7869j7761L4168L4559J9027K5484J7161k8668m8108J4021R8564
$$ y = [-3274, 99624, 15308, -102235, -83828, 27117, 81222, 49567, 33161, 101165, 208267, 255403, 188303, 52160, -40241, -24418, 42327, 71242, 76077, 132927, 233415, 297502, 328736, 413228, 532840, 530720, 335354, 86690, -52752, -97247, -147798, -210792, -226817, -196444, -154553, -84459, 28663, 121938, 144650, 156989, 219842, 257757, 171308, 22503, -49924, -50334, -85963, -138435, -72645, 117427, 266410, 283691, 263376, 287683, 291362, 208044, 99843, 38838, -8570, -68284, -51483, 103725, 271644, 265503, 85157, -80707, -81329, 57792, 205465, 256024, 199593, 116950, 94634, 120128, 100818, 8180, -68622, -58380, -17941, -35713, -93582, -111343, -77175, -42616, -23589, 1895, 19056, -9612, -57720, -43699, 54865]
30038E4865R7822j084r4202q2063R437M9472k9930j09956k1178J83121K34842
30027B91146J8878k20676k00504M816R8032L627p4315r509R0682J13194Q5392
30016B00763M0082m7150j21960o5499P8196R9149o0353j90461j29156P098M1782
30005a47509j370j1338O095N798L6833J24575J52297M0598p5358l8345O6956M7696
29993B06928p9291j20007j4443R0814P8242p581p4000q2382k7323O0657R0862
29982A22476O503j04317j04194J398Q1103O6270Q94p2905j39051j30020J4330
29971b57513J91490K01836K4287j19186n6487J01213J27638o731j20280q1563
29961D704L8597R2392M0794l5587o2129m3044j4626J4030M1775L8576j7012q2133
$$ y = [54865, 152687, 151603, 57401, -24662, -15225, 34247, 4317, -105639, -126817, 56304, 291146, 310024, 89348, -111156, -106340, -8308, -4681, -78996, -88505, 2177, 115371, 200763, 240845, 193695, 71735, 6236, 84432, 183581, 123228, -67233, -196389, -189291, -147509, -148879, -160217, -154122, -148324, -111491, 13084, 165381, 205979, 130621, 92276, 159232, 206928, 127637, 7630, -6813, 84001, 162243, 154662, 80662, -1720, -29043, 31614, 122476, 128979, 24662, -79532, -78134, 2969, 69239, 70133, -2772, -141823, -271843, -257513, -66023, 135813, 160100, 40914, -15573, 85640, 213278, 206547, 86267, 4704, 43301, 135693, 176487, 140900, 78771, 35727, 21101, 35131, 76906, 115482, 98470, 16337]
29949A6337r3499o0989m7902n6832k3850N1739P5618J3602k2935N8039J59672
29938F9000J19487l7349j10570n234J27578R5050p3731j59162l0247J82201K28884
$$ y = [16337, -77162, -138151, -186053, -242885, -266735, -214996, -139378, -125776, -148711, -90672, 69000, 188487, 151138, 40568, 35334, 162912, 257962, 184231, 25069, -5178, 177023, 405907]
$$ [...]
##END NTUPLES=NMR SPECTRUM
##END=
