##TITLE=31Pdec_12-2021
 CDCl3, 24 sc
 11.03.2021
##JCAMPDX= 6.0         $$ Bruker NMR JCAMP-DX V2.0
##DATA TYPE= NMR SPECTRUM
##DATA CLASS= NTUPLES
##ORIGIN= UXNMR, Bruker Analytische Messtechnik GmbH
##OWNER= root
$$ XWIN-NMR		Version 3.5
$$ Fri Mar 12 10:28:46 2021 Russian Standard Time (UT+4h)  she@DPX200
##.OBSERVE FREQUENCY= 81.013821
##.OBSERVE NUCLEUS= ^31P
##.ACQUISITION MODE= SIMULTANEOUS
##.ACQUISITION SCHEME= undefined
##.AVERAGES= 24
##.DIGITISER RES= 16
##SPECTROMETER/DATA SYSTEM= spect
##.PULSE SEQUENCE= zgpg30
##.SOLVENT NAME= CDCl3
##.SHIFT REFERENCE= (INTERNAL, CDCl3, 0, 248.564)
##AUDIT TRAIL= $$ (NUMBER, WHEN, WHO, WHERE, WHAT)
$$ ##TITLE= Audit trail, XWIN-NMR		Version 3.5
$$ ##JCAMPDX= 5.01
$$ ##ORIGIN= Bruker BioSpin GmbH
$$ ##OWNER= she
$$ F:/spectra/data/she/nmr/P31/1/pdata/1/auditp.txt
$$ ##AUDIT TRAIL=  $$ (NUMBER, WHEN, WHO, WHERE, WHAT)
(   1,<2021-03-12 10:27:43.67 +0400>,<she>,<DPX200>,
      <created by zg, POWCHK disabled, PULCHK disabled
       configuration hash MD5:
       00 E9 B6 7A A2 85 ED C7 34 08 36 98 17 FE 4E 26
       data hash MD5: 32K
       F3 97 EB 7C F5 A7 9B 2C 03 EE 78 DB 39 6D 68 8B>)
(   2,<2021-03-12 10:27:48.17 +0400>,<she>,<DPX200>,
      <Start of raw data processing
       efp BC_mod = 2 LB = 1 FT_mod = 6 PKNL = 1 PHC0 = -4077.886 PHC1 = 80.40097 SI = 64K 
       data hash MD5: 64K
       65 82 72 4F 6A 11 78 7F 21 C0 80 1C 72 36 A1 24>)
(   3,<2021-03-12 10:28:13.62 +0400>,<she>,<DPX200>,
      <pk PHC0 = -60.65922 PHC1 = 172.2 
       data hash MD5: 64K
       10 1F 28 30 EB 83 4B A2 1C 3A BB 0F AB 38 99 7A>)
(   4,<2021-03-12 10:28:17.28 +0400>,<she>,<DPX200>,
      <abs ABSG = 5 
       data hash MD5: 64K
       35 9B D9 C7 F2 CB 4D 25 9A E9 10 E2 F4 75 16 55>)
$$ ##END=
$$ 
$$ hash MD5
$$ 20 20 3F 05 F8 7F F3 5B AF C4 CC 4F 45 78 B2 6D
##$RELAX= 
##$RELAX= 
##$RELAX= 
##$RELAX= 
##$RELAX= 
##$RELAX= 
##$RELAX= 
##$RELAX= 
$$ Bruker specific parameters
$$ --------------------------
##$DU= <F:/spectra>
##$EXPNO= 1
##$NAME= <P31>
##$PROCNO= 1
##$TYPE= <nmr>
##$USER= <she>
##$AMP= (0..31)
100 100 100 100 100 100 100 100 100 100 100 100 100 100 100 100 100 100 
100 100 100 100 100 100 100 100 100 100 100 100 100 100 
##$AQSEQ= 0
##$AQ_mod= 1
##$AUNM= <au_zg>
##$AUTOPOS= <>
##$BF1= 81.014009
##$BF2= 200.13
##$BF3= 200.13
##$BF4= 200.13
##$BF5= 200.13
##$BF6= 200.13
##$BF7= 200.13
##$BF8= 200.13
##$BYTORDA= 1
##$CFDGTYP= 0
##$CFRGTYP= 5
##$CHEMSTR= <none>
##$CNST= (0..31)
1 1 145 1 1 1 1 1 1 1 1 1 1 1 1 1 1 1 1 1 1 1 1 1 1 1 1 1 1 1 1 1 
##$CPDPRG= <waltz16>
##$CPDPRG1= <>
##$CPDPRG2= <waltz16>
##$CPDPRG3= <>
##$CPDPRG4= <mlev>
##$CPDPRG5= <mlev>
##$CPDPRG6= <mlev>
##$CPDPRG7= <mlev>
##$CPDPRG8= <mlev>
##$CPDPRGB= <>
##$CPDPRGT= <>
##$D= (0..31)
0 1 0 0 0 0 0 0 0 0 0 0.03 2e-05 3e-06 0 0 0 0 0 0 0 0 0 0 0 0 0 0 0 0 
0 0 
##$DATE= 1615530463
##$DBL= (0..7)
120 120 120 11 120 120 24 19 
##$DBP= (0..7)
150 150 150 150 150 150 150 150 
##$DBP07= 0
##$DBPNAM0= <>
##$DBPNAM1= <>
##$DBPNAM2= <>
$$ [...]
##$SUBNAM3= <"">
##$SUBNAM4= <"">
##$SUBNAM5= <"">
##$SUBNAM6= <"">
##$SUBNAM7= <"">
##$SUBNAM8= <"">
##$SUBNAM9= <"">
##$SW= 501.771253377433
##$SWIBOX= (0..15)
0 1 3 0 0 0 0 0 0 0 0 0 0 0 0 0 
##$SW_h= 40650.406504065
##$TD= 32768
##$TD0= 1
##$TE= 0
##$TE2= 300
##$TE3= 300
##$TEG= 300
##$TL= (0..7)
0 120 53 12 22 120 120 120 
##$TP= (0..7)
150 150 150 150 150 150 150 150 
##$TP07= 0
##$TPNAME0= <>
##$TPNAME1= <>
##$TPNAME2= <>
##$TPNAME3= <>
##$TPNAME4= <>
##$TPNAME5= <>
##$TPNAME6= <>
##$TPNAME7= <>
##$TPOAL= (0..7)
0.5 0.5 0.5 0.5 0.5 0.5 0.5 0.5 
##$TPOFFS= (0..7)
0 0 0 0 0 0 0 0 
##$TUNHIN= 0
##$TUNHOUT= 0
##$TUNXOUT= 0
##$USERA1= <user>
##$USERA2= <user>
##$USERA3= <user>
##$USERA4= <user>
##$USERA5= <user>
##$V9= 5
##$VALIST= <valist>
##$VCLIST= <CCCCCCCCCCCCCCC>
##$VD= 0
##$VDLIST= <DDDDDDDDDDDDDDD>
##$VPLIST= <PPPPPPPPPPPPPPP>
##$VTLIST= <TTTTTTTTTTTTTTT>
##$WBST= 1024
##$WBSW= 4
##$XGAIN= (0..3)
0 0 0 0 
##$XL= 0
##$YL= 0
##$YMAX_a= 17125
##$YMIN_a= -17258
##$ZGOPTNS= <>
##$ZL1= 120
##$ZL2= 120
##$ZL3= 120
##$ZL4= 120
##$ABSF1= 248.5645
##$ABSF2= -253.2056
##$ABSG= 5
##$ABSL= 3
##$ALPHA= 0
##$AQORDER= 0
##$ASSFAC= 0
##$ASSFACI= 0
##$ASSFACX= 0
##$ASSWID= 0
##$AUNMP= <proc_1d>
##$AZFE= 0.1
##$AZFW= 0.5
##$BCFW= 0
##$BC_mod= 2
##$BYTORDP= 0
##$COROFFS= 0
##$CY= -3
##$DATMOD= 1
##$DC= 0
##$DFILT= <>
##$DTYPP= 0
##$F1P= 0
##$F2P= 0
##$FCOR= 1
##$FTSIZE= 65536
##$FT_mod= 6
##$GAMMA= 0
##$GB= 0
##$INTBC= 1
##$INTSCL= 5.30512e-09
##$ISEN= 30
##$LB= 1
##$LEV0= 0
##$LPBIN= 0
##$MAXI= 10000
##$MC2= 0
##$MEAN= 0
##$ME_mod= 0
##$MI= 50
##$NCOEF= 0
##$NC_proc= -3
##$NLEV= 6
##$NOISF1= 182.463
##$NOISF2= 159.3651
##$NSP= 0
##$NTH_PI= 0
##$NZP= 0
##$OFFSET= 248.5645
##$PC= 4
##$PHC0= -4138.545
##$PHC1= 252.601
##$PH_mod= 1
##$PKNL= yes
##$PPARMOD= 0
##$PSCAL= 0
##$PSIGN= 0
##$REVERSE= no
##$SF= 81.014009
##$SI= 65536
##$SIGF1= 159.3651
##$SIGF2= -187.1042
##$SINO= 113.3802
##$SIOLD= 16384
##$SREGLST= <1H.CDCl3>
##$SSB= 0
##$STSI= 65536
##$STSR= 0
##$SW_p= 40650.406504065
##$SYMM= 0
##$S_DEV= 0
##$TDeff= 32768
##$TDoff= 0
##$TI= <>
##$TILT= no
##$TM1= 0
##$TM2= 0
##$TOPLEV= 0
##$USERP1= <user>
##$USERP2= <user>
##$USERP3= <user>
##$USERP4= <user>
##$USERP5= <user>
##$WDW= 1
##$XDIM= 65536
##$YMAX_p= 311936259
##$YMIN_p= -6288848
$$ End of Bruker specific parameters
$$ ---------------------------------
##NTUPLES= NMR SPECTRUM
##VAR_NAME=  FREQUENCY,     SPECTRUM/REAL,   SPECTRUM/IMAG
##SYMBOL=    X,             R,               I
##VAR_TYPE=  INDEPENDENT,   DEPENDENT,       DEPENDENT
##VAR_FORM=  AFFN,          ASDF,            ASDF
##VAR_DIM=   65536,         65536,           65536
##UNITS=     HZ,            ARBITRARY UNITS, ARBITRARY UNITS
##FACTOR=    0.620285442955139, 1,           1
##FIRST=     20137.2065510759, 0,            0
##LAST=      -20513.1999529892, 0,           0
##MIN=       -20513.1999529892, -6288848,    0
##MAX=       20137.2065510759, 311936259,    0
$$ Real data points
##PAGE= N=1
##DATA TABLE= (X++(R..R)), XYDATA
$$ [...]
36223B24460r9152j02783N8236p606j80359r5507J48106J58470q5093k69660k74654
36212e25542j92043n589K94966M56917K70885l2121j20015r9321k45618l99869
36202e97350j92003K59650M61613L12671J76864J86887P8281j96302k94216j12332
36192H3763k6279k31466l54180o7141L35812L82270J08721j08771j56971j87888
36182b22130j90256l618K90273L81113J70584r6398j84153j06251K2176J36088
36172A97428J64838M4915j19688j04071J12023K41260P3293j86727j92101J6943
36162B48113N4897j99037l52287o6439L76158M12744m527l45826k56460K5613
36152a07051J36592Q5194M5720k054r9910o7561J79246L08837K7378l33868k18890
$$ y = [224460, 125308, 22525, 80761, 73155, -107204, -202711, -54605, 103865, 18772, -250888, -525542, -717585, -723174, -428208, 28709, 299594, 267473, 147458, 48137, -197481, -597350, -789353, -529703, -68090, 244581, 421445, 608332, 686613, 490311, 196095, 83763, 57484, -173982, -528162, -595303, -259491, 122779, 231500, 122729, -34242, -222130, -412386, -416004, -125731, 255382, 425966, 329568, 145415, 39164, 61340, 197428, 362266, 407181, 287493, 183422, 295445, 536705, 609998, 423271, 231170, 248113, 303010, 103973, -248314, -314753, 61405, 474149, 469622, 123796, -132664, -107051, 29541, 114735, 160455, 158401, 58491, -9070, 170176, 479013, 506391, 172523, -46367]
36141d6367K58284M08321j3688m75986m97143k36150l0699J11195K46921K19184
36131e6128J0329o0875J16814J50386j66614l40118N6403N23776L07773l42169
36121A99577m59148J50959O06209L10847k17692k64692L9195J24223p0062j48088
36111B71328K0779J77572J48086J5252j23600k45202k92131k24289j15013j1212
36101c78430J70775M14661M53918J18039l25383m69020k88694p6699K7613J06200
36091b47020J43303J3105k06745k54078p4029J01818J28713J16353J46517J12501
36081a9562k9309r9581M1740K53893K95595J22479j11229k39544j96149n2385
36071c4052R781j10667k59764k16669m2568Q128o4220J7287K84152L69838J00293
$$ y = [-46367, 211917, 620238, 606550, 130564, -366579, -602729, -633428, -522233, -275312, -56128, -45799, -106674, 10140, 160526, -6088, -346206, -289803, 233973, 541746, 199577, -259571, -108612, 497597, 808444, 590752, 326060, 365255, 489478, 419416, 271328, 292107, 469679, 617765, 633017, 509417, 264215, -27916, -252205, -367218, -378430, -207655, 207006, 660924, 778963, 453580, -15440, -304134, -380833, -353220, -247020, -103717, -90612, -297357, -551435, -625464, -523646, -394933, -278580, -132063, -19562, -48871, -148452, -106712, 147181, 442776, 565255, 454026, 214482, 18333, -34052, -24271, -134938, -394702, -611371, -653939, -645811, -710031, -692744, -408592, -38754, 61539]
36060F1539j47718k3728K00623Q0091k11160j22494L21853M53334l4532n86976
36050i168n76997j35825J69650J42095J6520n0565j07557j25484m136J53299J33971
36039c94197O504O9889L39361M28577J08068l04300l40452J5641L50302L30214
36029F09607q985l96813n56925l58382P0091L86545L52828J06387j6817Q1277
36019B68813J61215J3994k32424k83012o7890J65695J63462k8656j51423r9248
36009h9474n6863j78163k76056p2278K96873L63320J3335k65312o8137L11461
35999b1294L29089J5386j30008L9370J47913q565j49383o7829K562j30969k18082
35988a91810k3566J79703L0801k75363k65263N4060K29208R4236m2043J6443O6843
$$ y = [61539, -86179, -109907, 90716, 170807, -40353, -162847, 159006, 612340, 577808, -9168, -586165, -721990, -552340, -410245, -393725, -444290, -551847, -677331, -681467, -528168, -394197, -387693, -317804, 21557, 450134, 558202, 253902, -86550, -70909, 279393, 609607, 600622, 203809, -353116, -711498, -641407, -254862, 97966, 204353, 187536, 268813, 430028, 444022, 211598, -71414, -139304, 26391, 189853, 161197, 9774, -89474, -146337, -324500, -600556, -672834, -375961, -12641, 694, -264618, -332755, -21294, 307795, 323181, 193173, 232543, 380456, 371891, 222508, 154679, 157241, 26272, -191810, -215376, -35673, -4872, -280235, -545498, -491438, -262230, -167994, -210037, -193594, -126751]
35977a26751m6425j28831r926J21654M1241j00916p830K63557L49048J08344j62704
35966C00461j43168P0949J06510j57563m00032k93100L0894J75249P0332M1814
35956a97654K27292L07611M8098k49235k02927K4491L1172j02937K5287L43671
35946B54869L13387j67000m99475k80685J04455J43586l1056J2106K51656L15008
35936D16851J09991j22165k43977k77350j37579K41900N70065M28462j19808n32889
35926C33501m77412j81989j4764k0907k4001N9823J78009K55126K23770N7769
35916C88925j43360k10601j03989M2201R9896O5437j2490r3838j14976k5502J08854
35905E57J51275O7489m2813q9075n7692M4985J80610K18543M8717k21104l34239
$$ y = [-126751, -173176, -302007, -311933, -190279, -149038, -249954, -257784, 5773, 354821, 463165, 300461, 157293, 228242, 334752, 177189, -222843, -515943, -485049, -309800, -239468, -197654, 29638, 337249, 385347, 136112, -66815, -42324, -11152, -114089, -88802, 254869, 568256, 401256, -98219, -378904, -274449, -130863, -161919, -149813, 101843, 416851, 526842, 404677, 160700, -116650, -254229, -12329, 557736, 986198, 866390, 333501, -143911, -325900, -340664, -361571, -385572, -325749, -147740, 107386, 331156, 388925, 245565, 34964, -69025, -26824, 73072, 138509, 126019, 32181, -82795, -108297, 557, 151832, 219321, 176508, 87433, 29741, 74726, 255336, 473879, 522596, 301492, -32747]
35894c2747j95365K1292J12526N9060m5649j32794j51865o1559P3374Q2238r8167
35883c69656k76994j97754J40575M45373M38548J56096r7058q7938Q6003J26729
35873C63924q5017l25473k95805J1670L01845L10149P1602j51407j63626l0304
35863G558L6499l0413o6475N1381J68738P6950j13214j02480R8776J46530o6567
35852B07283j84882N2564L66600L57201R3085p6206q1167j13006j98359j95122
35842B27991j14471p3034k1203J13676J49288o0703k10126N3732M16984K39923
35832G22057l82235o22117j51386L59741K95361n0540j39325p2656j88004k79735
35822e08839K4870M33052L23535k16212m53300j22028K44418K27688R4877J78986
$$ y = [-32747, -228112, -206820, -94294, -35234, -80883, -213677, -365542, -427101, -353727, -271489, -369656, -646650, -844404, -703829, -258456, 180092, 336188, 239130, 151192, 237195, 363924, 278907, -46566, -342371, -330701, -28856, 281293, 352895, 201488, 37862, 7558, 44057, 13644, -52831, -1450, 167288, 244238, 131024, 28544, 127320, 273850, 207283, 22401, 74965, 441565, 798766, 891851, 815645, 734478, 621472, 423113, 227991, 113520, 40486, 19283, 132959, 282247, 221544, 11418, 65150, 482134, 722057, 339822, -282295, -433681, -73940, 221421, 170881, 31556, -41100, -229104, -508839, -483969, -50917, 272618, 56406, -396894, -518922, -274504, -46816, 48061, 227047]
35812B27047K72572N8591k63455k57662O0935K55470J00226j77310k81222j77393
35802a82201P325J74339K48357J61942l2165j45388p0850N9396N6675n0076q2610
35791A44744k0419k0621r3846k7379K13714K82089n8104m42429l31719J63306
35781a90664L75615N1040k95845j96361J04654J54766M1841J34155L46956K46549
35771G72706j90937m66598k79214P7073J78970J970j84767j98626m9608J57076
35761a81955K78799K11233O431j62250j90386j15367r438Q2942J14356P0361K5581
35750A30307M4937O4230O79p4365l5027P8235J13927M2813l7325p6192p7067j3223
35738A61929O6644k2970l00994m03697l4916M74265N10164O5316k20079K506L25555
$$ y = [227047, 499619, 558210, 294755, 37093, 98028, 353498, 453724, 276414, -4808, -182201, -174876, -537, 247820, 409762, 377597, 232209, 161359, 220755, 277430, 227354, 144744, 124325, 103704, 9858, -17521, 196193, 478282, 420178, -22251, -353970, -190664, 184951, 235991, -59854, -256215, -151561, 3205, 45046, 179201, 526157, 772706, 581769, 115171, -164043, -86970, 92000, 93970, -90797, -289423, -339031, -181955, 96844, 308077, 314508, 152258, -38128, -153495, -162933, -79991, 34365, 104726, 130307, 175244, 239474, 240153, 165788, 130761, 208996, 322923, 365736, 328411, 252219, 175152, 161929, 228573, 205603, -95391, -499088, -534004, -59739, 450425, 515741, 295662, 298168, 623723]
35727F23723K71068m1404k26876k30693k16314j74024l8468M2414n6494j28622
35717a75690N4138K92396K22365r4973k56963j20575P7906J68722K15934K29993
35707F13253J03813j02211j68856r6751j36457l33108l84611j22012J77738J83024
35697b66178k6522j26182j1436J33308J30716j1047j53212j38819P2777L05143
35687i1452L14833J10242l9863M310O8729Mo4708J7777P7427r3859l22738k80317
35675b99615k8002P0668l8413k2100K21565L25601N9954k29035j32759J63390
35665I1254J63505j64316l49775j32732K05132L06459J85642N4766k5896j25794
35655B08245k44415l09117k72092j11897J39222L04359J80268j48951l14767j28242
$$ y = [623723, 894791, 853387, 626511, 395818, 179504, 5480, -32988, 9426, -47068, -175690, -121552, 170844, 393209, 298236, 41273, -79302, -1396, 167326, 383260, 613253, 717066, 614855, 445999, 349248, 212791, -120317, -504928, -626940, -449202, -266178, -292700, -418882, -430318, -297010, -166294, -177341, -330553, -469372, -396595, -91452, 223381, 333623, 293760, 298070, 366799, 366803, 302095, 319872, 397299, 303440, -19298, -299615, -327617, -256949, -295362, -317462, -95897, 229704, 289658, 60623, -72136, 91254, 254759, 90443, -259332, -392064, -186932, 119527, 305169, 359935, 334039, 208245, -36170, -345287, -617379, -729276, -590054, -285695, -105427, -254378, -569145, -697387]
35645f97387J55354K19312J28981J41446K44737K06356p324j83068k02704j35801
35635a30098j3884J72652K57459L7851l08748l22698Q5793M36037L24455n0998
35625D87821k55385k05982j01185j7214P8651R7003l8878j57694p2773P1980L1685
35614h1971r0165j9527J56310J00287j47526j65824J32624L00596Q4877j33846
35604A35835L2379L20775K30193j80724l92601j98774P4247J08683l0412j23940
35594b4339r6478M501J05278J13136n10j00419m2068Q3149O1021r4084j41944
35583a32757K4J32341J07883L9021N0361N8487l6606j35522j06320j6551j709
35572d1348k1829M3238J39681R8514p9294j89975r5416J16240K53629K01943j2165
$$ y = [-697387, -542033, -322721, -193740, -52294, 192443, 398799, 391475, 208407, 5703, -130098, -143982, 28670, 286129, 323980, 15232, -307466, -221673, 214364, 538819, 487821, 232436, 26454, -74731, -91945, -13294, 83709, 44831, -112863, -185636, -113656, -81971, -172136, -191663, -35353, 64934, -82592, -248416, -115792, 184804, 269681, 135835, 168214, 488989, 719182, 538458, 145857, -52917, 21330, 130013, 99601, -24339, -120817, -116316, -11038, 102098, 101588, 1169, -40899, 42250, 103271, 9187, -132757, -132733, -392, 107491, 146512, 196873, 255360, 218754, 83232, -23088, -39639, -41348, -63177, -19939, 119742, 218256, 138962, -51013, -146429, -30189, 223440, 425383, 413218]
35561D13218k35983k88943j40212M2890J13602J40648K44792L20176J43525k36898
35551E16815m63971l17768n939J26951L2448o2499j1019J00967J29334M3517r0395
35540a559j83183j59337j7707J19473J08539k8440j05504j5286J17148J12650
35530e3206J149k6627R1372K05922J99213J40527R9321k1629k71795m11513j82050
35519b29316K23979L16379Q220k14107k4157K23544P7015k27500j19804L08088
35509C42341L37250k33198o50074k89514L73358M51345n2257l25922k2742K84194
35499B14781P7586l20428l21012L4855K41136J25080k4882k7207k4480j07357
35489a31928j39231o1955k3899o5157k721J96672K56220M1868j38996j4962J59002
$$ y = [413218, 177235, -111708, -251920, -209030, -95428, 45220, 290012, 610188, 753713, 516815, 52844, -264924, -270863, -143912, -111464, -173963, -184982, -84015, 45319, 88836, -1559, -184742, -344079, -361786, -242313, -133774, -162214, -267718, -283004, -165856, -53206, -52057, -78684, 12688, 218610, 417823, 558350, 657671, 636042, 364247, -47266, -229316, -5337, 311042, 319262, 105155, 80998, 304542, 381557, 154057, 34253, 342341, 679591, 446393, -203681, -493195, -119837, 331508, 279251, -46671, -69413, 214781, 292367, -28061, -349073, -314218, -73082, 51998, 27116, -91, -24571, -131928, -271159, -333114, -357013, -422170, -424891, -228219, 28001, 69869, -69127, -84089, 74913]
35478G4913J4434k50885j49034K38878L07334q6926l29066j5838L70764K21953
35468C96527k31602l13524K1192J68959j34817m41855l13111R2726L46825K92933
35458a15747O6513j46274k00226o3474Q6678M4316r7117m8748K02203L34509J86004
35447B48637k7519j04152j20975j49959p0612J15674J39355q8498k11199M8140
35437b21108L80866L10479r1534l27034j84307P2790J68528R8228m1782j86774
35427b1648k47981j73424n9969p449O2234K21305K97668J08588j75754k32280
35417b28710p2285K0160j9622J0425J46324J82061P5259L4890J11531Q5448r9212
35406B46269j66026K7264J92348L9450k63596l47458j70229n292o072m1540N4535
$$ y = [74913, 89347, -161538, -310572, -71694, 235640, 148714, -180352, -196190, 174574, 396527, 164925, -148599, -127407, 41552, -93265, -535120, -848231, -755505, -408680, -115747, -49234, -195508, -395734, -459208, -372530, -328214, -425331, -474079, -271876, 62633, 248637, 221118, 116966, -4009, -153968, -224580, -108906, 30449, -58049, -269248, -221108, 159758, 470237, 378703, 51669, -132638, -59848, 108680, 206908, 165126, -21648, -269629, -443053, -503022, -510471, -448237, -226932, 70736, 179324, 3570, -228710, -300995, -280835, -300457, -290032, -143708, 38353, 113612, 148502, 260033, 345481, 246269, 80243, 107507, 299855, 339305, 75709, -271749, -441978, -447270, -453342, -494882, -440347]
35395d40347K53540L78082L01434R2037m8001l1573r335j25257k39874j17869
35385A2837J55913K34685J4087k14482k02864o0946m745m2225o5300m2123K8912
35374a86251J61845K57866J52780q7459j62629K1338J70065M6775j70440k16685
35364a2795j57704j68860j29121J70147N38947N33420R0086l49113m23127k60301
35354a68421j69115j64935k1135L04641N14460L22918j23046l42635j12613K00585
35344B40704J17495k48940l19236Q3646M15500J93378k78938l62262j5053K08760
35334C5054K2712k24321j51893Q9931J13183j01685j96581L1343L46354M02763
35324C66860K00452M5407Q8547J16500q3578l42070l35524q5378R3170J06090
$$ y = [-440347, -186807, 191275, 492709, 584746, 536745, 505172, 495837, 370580, 130706, 12837, 168750, 403435, 417522, 203040, 176, -60770, -65515, -107740, -173040, -215163, -186251, -24406, 233460, 386240, 298781, 136152, 157490, 327555, 374330, 203890, -12795, -170499, -339359, -468480, -298333, 240614, 774034, 864120, 515007, 91880, -168421, -337536, -502471, -523606, -218965, 295495, 618413, 495367, 152732, 40119, 240704, 358199, 109259, -209977, -126331, 289169, 482547, 203609, -158653, -173706, 35054, 57766, -166555, -318448, -228517, -115334, -217019, -413600, -382257, -35903, 366860, 567312, 612719, 701266, 817766, 734188, 392118, 56594, -28784, 64386, 170476]
35314A70476J60372K74067J49901k61942n03255k44296J66933J99596q5112k13848
35304a87108o7720L5312n0374j04420Q864J30366J38781J31289J68660J54312
35294C57962O7279K9419N0141j6016j67648k00760o5410J3551p7433j14752R4623
35283b9044L50918L21210J9968k17600j81782J805J05262P6448K9245M1955M8613
35272E66998m9894k12166k80358j94521p5539l3520j3956O3922J40504J30616
35262D2086R4492J26691J67567J01321m1754j56247k41344l22843l00546q8743
35252f19320J81075L10149K83770J68313p7142m08152m98170j18470M02328N21160
35242A45541K18237m8898q5944j45803l22909l07047O1336M44597M74005K18884
$$ y = [170476, 330848, 604915, 754816, 492874, -10381, -254677, -87744, 111852, 26740, -187108, -254828, -219516, -269890, -374310, -365446, -235080, -96299, 34990, 203650, 357962, 425241, 454660, 504801, 488785, 321137, 120377, 54967, 68518, -8915, -123667, -29044, 321874, 643084, 663052, 445452, 263670, 265475, 370737, 447185, 476430, 518385, 566998, 517104, 304938, 24580, -169941, -245480, -279000, -292956, -229034, -88530, 42086, 136578, 263269, 430836, 532157, 490403, 334156, 92812, -230031, -530577, -619320, -438245, -128096, 155674, 323987, 246845, -161307, -659477, -777947, -375619, 145541, 363778, 314880, 228936, 83133, -239776, -546823, -485487, -40890, 433115, 651999]
35232F51999l3080j59026j69070q4126k2708j28448k74179j57373J83005L24637
35222A31631J04001j14201l6156J18606O6340o3952n9997m9896j84007k30399
35212c18030N0163L92315L68655M6806j61641j50473j51191k29058k11967p7792
35202d42213N152J1569P1792J74034J86812J36917J38665J08520r7752l17899
35192b4403k36500J00510K97797J71593l9736p4317N1277J88865K29352R0694
35182G55132k00392l94722k53840Q6702K44986Q6745j63767k85187k51070q8958
35172d64371J40602K38546P0381j31033k2746K78188K87108j09656m28076k67607
35162d08664J47941L37090J81919n8408j53107r6957j2771J693j8549M8351J65181
$$ y = [651999, 618919, 459893, 290823, 206697, 183989, 55541, -218638, -376011, -193006, 131631, 235632, 121431, 85275, 203881, 270221, 206269, 146272, 96376, -87631, -318030, -267867, 124448, 493103, 539909, 378268, 227795, 76604, -152454, -364421, -442213, -437061, -425492, -353700, -179666, 7146, 144063, 282728, 391248, 293496, -24403, -260903, -160393, 137404, 308997, 269261, 194944, 246221, 435086, 664438, 755132, 554740, 160018, -93822, -7120, 237866, 324611, 160844, -124343, -375413, -464371, -323769, -85223, -14842, -145875, -168621, 109567, 396675, 287019, -141057, -408664, -260723, 76367, 258286, 199878, 46771, -50186, -62957, -61264, -79813, -31462, 133719]
35151A33719O9730l08337n34433j81525M38905N78095J05667l03949j80130J36188
35141d6070J62398q033n2577j3388p7680j29455K607J39981N9278n7414N6009
35130C5656K21666J11781j36977j43647L5288J8242j89436j95341N7625J65897
35120a9246k9422j75438l8140J13630K2951j02872J1603K13577J88354k3265j29133
35109C2599n0008L6003J6399n4372j14835j46782j20989n6761n4804j22313q4127
35098g19990J50291L56369K62768l6602j97270j12181j1389n3936r7811J9348
35088d40403K03881K73132K32600K00836J68911M0373j37378j94430j12720q2984
35078A51818k04682k99749j73621N9178J14799l6401j15394M6917K54264K45611
$$ y = [133719, 203449, -104888, -639321, -820846, -381941, 196154, 301821, -2128, -182258, -46070, 116328, 108295, 55718, 42330, -35350, -164805, -162198, -22217, 37061, -20353, 35656, 257322, 369103, 232126, 88479, 123767, 142009, -47427, -242768, -185143, -19246, -48668, -224106, -262246, -148616, -125665, -228537, -216934, -3357, 184997, 161732, 32599, -17409, 18594, 34993, -19379, -134214, -280996, -401985, -458746, -513550, -635863, -719990, -569699, -213330, 49438, 12836, -184434, -296615, -308004, -361940, -459751, -440403, -236522, 36610, 269210, 470046, 638957, 679330, 541952, 347522, 234802, 151818, -52864, -352613, -526234, -467056, -352257, -388658, -504052, -457135, -202871, 42740]
35068D2740Q1126K3207J26896J86449P9766o5008j04080p5110n8693k3607M5463
35057B59149J9589j81227l67746k79682K9727K30647J53971k4307q9727n9908
35047c09514l8008k858P9932R9633l1655j62093q2983J36933K36564J44629K9558
35036A00138j6603p0801j36557j07249l3910j07275k61142j53058K61335N06425
35026a8697K46610j68466k18314J5496Q1888m8185r298K22811K51954j5337j67059
35015A73403J5123J97587Q5299j19142j42452q0429q5338l6603J18085J09272
35005B34805j57503k67383M9987L28298L1696n05853n17779P859L42232J74326
34995b79315j8803J28743L32157K60264N0387q4611k20268l72068k88760N6598
$$ y = [42740, 123866, 147073, 273969, 460418, 540184, 475176, 371096, 295986, 237293, 213686, 259149, 278738, 97511, -270235, -549917, -520190, -289543, -135572, -159879, -249606, -309514, -347522, -350380, -270448, -170815, -202470, -364563, -447546, -310613, -74049, 70580, 100138, 83535, 12734, -123823, -231072, -264982, -372257, -633399, -786457, -525122, -18697, 227913, 59447, -158867, -143371, -61483, -109668, -118966, 103845, 355799, 340462, 173403, 188526, 386113, 471412, 352270, 209818, 129389, 44051, 7448, 125533, 234805, 77302, -190081, -140094, 188204, 219900, -285953, -803732, -795873, -453641, -279315, -298118, -169375, 162782, 423046, 473433, 388822, 168554, -203514, -492274, -435676]
34985d35676K42779M8088j35247L8459K45161N2297k92582k57119P7160J89109
34975b27571K2992O971K05217J81065j69422l35269k1689L21036J91531j90278
34965a5417k61078M0613K79051K07017P352r9841j13042q4922p289O7770K6995
34954D7209r6896j06390O9420K17417J08134j73874l18517j85483L4743J02926
34944c01311M9335P7555K08450K19717J926k17196j68815P0630K06399J55591
34934C02281Q9666P7160q190j66138j77376J9245J49771J8190j67660j49055m7357
34923e9463r7637j62129M5164L63143L32219m0461k05897P4925L30816J35565
34913G16245k12881k12189K4397L2193j60766j05046K13670K67746j23032m21193
$$ y = [-435676, -192897, -144809, -280056, -241597, 3564, 55861, -236721, -493840, -416680, -227571, -204579, -197608, 7609, 188674, 19252, -316017, -337706, -16670, 174861, -15417, -276495, -235882, 43169, 250186, 257538, 157697, 44655, -40267, -47556, 20214, 47209, -49687, -156077, -86657, 130760, 238894, 65020, -253497, -438980, -404237, -301311, -251976, -174421, 34029, 253746, 255672, 38476, -130339, -59709, 146690, 302281, 391947, 469107, 460917, 294779, 117403, 136648, 286419, 304609, 136949, -12106, -59463, -157100, -319229, -274065, 89078, 421297, 380836, 174939, 249864, 580680, 716245, 503364, 291175, 315572, 347765, 186999, 81953, 295623, 563369, 440337, 19144]
34903A9144j97974J92913J95822r3561j74748J0071M6608k03645l66453j57686
34893g29509K02293L41173J95147m2484j95122j81585j4681J56408J58549K1715
34883h8096o8819o5246p2340n5066J46320M20930L82245m1636l77228k58283K4206
34872e3013M492k14601j83629J15476K63801J27349K8728J24466J39493r2150
34862B60412k89768j97067j853K7384k283J26256K77509J74890q0049j19534J01375
34851B77272K12582j9844l59608m28659j57775J98714L56769K33459j3254j30738
34841A68918l3294R1640L1575j47966k03880q7261r061j00034k09644j45759M2541
34830f02225J54101J10625J9197J5380J36814L05151L58535J65417j97319m32547
$$ y = [19144, -178830, 14083, 209905, 116344, -58404, -48333, -1725, -205370, -571823, -729509, -527216, -186043, 9104, -33380, -228502, -410087, -424768, -268360, -109811, -88096, -156915, -222161, -294501, -349567, -203247, 217683, 599928, 558292, 181064, -77219, -53013, -48521, -263122, -446751, -331275, -67474, 59875, 88603, 213069, 352562, 260412, -29356, -226423, -228276, -200892, -203175, -76919, 200590, 375480, 295431, 175897, 277272, 489854, 470010, 110402, -318257, -476032, -277318, 79451, 312910, 299656, 168918, 135624, 227264, 258839, 110873, -93007, -180268, -189329, -289363, -499007, -644766, -602225, -448124, -337499, -318302, -302922, -166108, 139043, 497578, 662995, 465676, 33129]
34820C3129l14627J7519J89233M4176j61093j08704J44635K56044R0410r4969
34810I5753n1023Q2098Q010k29240k70460K2080L31710L10656K1381k09789k23763
34799a12587j31524q6737j25015j73188j03874J38145L76557L19070l4672k85017
34789b18842j38283J61817J94071j716k4132K09364L10772L6634l28009l88765
34779a87089j59763N3339Q6182K2299j526P2706J97663K23230L1941k60241l79626
34768c00885k36999l1577M9902M3216L7607K1634Q970Q0853J66011L9472k75364
34757c97160l82865n5038L56048L69943M0882j91848j56851m6287M2428K04238
34747b16510L59239K44485j07855k85638q1872J72235R9937j71855k46709m9724
$$ y = [33129, -281498, -263979, -74746, -30570, -191663, -300367, -155732, 100312, 190722, 95753, 44730, 126828, 134838, -94402, -364862, -342782, -11072, 299584, 320965, 111176, -112587, -244111, -330848, -455863, -629051, -732925, -594780, -218223, 100847, 66175, -218842, -357125, -195308, -1237, -2953, -27085, 182279, 493051, 529685, 201676, -187089, -346852, -293513, -207331, -185032, -186558, -113852, 83811, 307041, 338982, 78741, -300885, -537884, -569461, -519559, -476343, -438736, -417102, -408132, -327279, -161268, -121796, -397160, -780025, -835063, -479015, -109072, -68190, -260038, -416889, -463176, -420748, -216510, 142729, 387214, 279359, -6279, -88151, 84084, 184021, 12166, -234543, -284267]
34737b84267J35429J30197N2665M1564N8967M8026P3513J67793J86288k358k54814
34726C53003k85510o7276J06242L8798r0575l2766J23581J03271r8810k13792
34716f3834j28229q703K8708N6218Q0251j1795j47341p5644J66611J89840j22565
34705c6483l33171j09704K34578K59069P9169M7510Q7197q2161l08139k25977
34695c88112N2047J12631j0002O3293K76326J92481j55867k38422M2408J66532
34685A13315o3081j78314O4367K31097M0568j05699R2227K39124J1193j70871
34675B73926Q4140L24483J4903m27873k66447K81706L66880j18452m51819k90681
34665b09234m7835j6953J3835J40689J19837n0249k9208J91167J89009j10476
$$ y = [-284267, -148838, -18641, 34024, 75588, 134555, 182581, 256094, 423887, 610175, 607817, 353003, 67493, 217, 106459, 145257, 54682, 21916, 145497, 248768, 149958, -63834, -192063, -200766, -172058, -115840, -35589, -47384, -194725, -270369, -103758, 86082, -36483, -369654, -479358, -244780, 14289, 93458, 140968, 228165, 146004, -162135, -388112, -336065, -223434, -233436, -170143, 106183, 298664, 142797, -95625, -53217, 113315, 50234, -128080, -63713, 167384, 207952, 102253, 194480, 433604, 444797, 273926, 358066, 682549, 697452, 269579, 3132, 284838, 651718, 533266, 81447, -209234, -257069, -274022, -260187, -119498, 339, -49910, -79118, 112049, 301058, 190582]
34655A90582k37680j996J63782j0205j56786L4010K56576J70971l286L5897Q9078
34644E30943j14719l12782j12771K91872L74212M8933l00423m09981l03037k8152
34634c35905L21354M54416J88958j78764k19707J216N4872j66399l25306j97168
34624d02433N3322K00735K18186J47285J0112q5079j0965J49979J68665k229j64518
34613B83060j53481Q62J71376K18124M1357k53062l44528r0644K01493J90676
34603B65233L4091J07159L12293J86662k91292n66425l37735K901L4760o3960
34593c16313O7672L12743L00882N5730o0792N4272J37245K8278j26057j75220
34583B78440j53695j07633m178J09144Q9821o4506j63152r1675M1124J05329J23234
$$ y = [190582, -47098, -49094, 114688, 104483, -52303, -18293, 238283, 409254, 405968, 441865, 530943, 416224, 103442, -9329, 282543, 656755, 705688, 405265, -4716, -307753, -335905, -14551, 439865, 628823, 450059, 230352, 231568, 286440, 120041, -205265, -402433, -349111, -148376, 69810, 217095, 227207, 142128, 131163, 281142, 449807, 447578, 283060, 129579, 130441, 301817, 519941, 561298, 308236, -36292, -126936, 74557, 265233, 299324, 406483, 718776, 905438, 614146, 47721, -290014, -287113, -252353, -316313, -248641, 64102, 364984, 420714, 359922, 414194, 551439, 579717, 453660, 278440, 124745, 17112, 12934, 122078, 211899, 147393, -15759, -107434, -66310, 39019, 162253]
34572A62253J45281J23039K8025m7302l8870l4215j09952j71297j15071l6462
34562i4571p4014j38590l8552J65125K03181K7770q6236K1177J28773K763j93610
34551g6784j40190J20242K19790Q921k28217j76389J12960L35718K96207N4105
34541E26363j79112k10143k2348J73302J31733j33920l42803k69549J6057K66061
34531d4359L06983J42016q3335j74182n9958Q7298L8586j55819j92533M2871K57080
34520A64648J34644k03288l37509r5809K32949K58604n4362l52384k91954O3883
34510d80578L07771J79295j13653j94277l0557Q0927n401j15239r8302l6636j1955
34499e18605M4668J38068J22785j7200p8889J2233O2795j1068j3276J09919P8428
$$ y = [162253, 307534, 430573, 458598, 411296, 372426, 338211, 228259, 56962, -58109, -94571, -168585, -307175, -345727, -180602, 22579, 50349, -35887, -14710, 114063, 116826, -76784, -216974, -96732, 123058, 131979, -96238, -272627, -159667, 176051, 472258, 526363, 347251, 137108, 114760, 288062, 419795, 285875, -56928, -326477, -310420, -44359, 262624, 404640, 321305, 147123, 87165, 174463, 213049, 57230, -135303, -92432, 164648, 299292, 96004, -241505, -337314, -104365, 154239, 99877, -252507, -544461, -480578, -172807, 6488, -107165, -301442, -331999, -251072, -256473, -371712, -470014, -506650, -518605, -473937, -335869, -213084, -230284, -309173, -296940, -234145, -245213, -258489, -148570, -70142]
34488g0142j82457k41052J62317N34180K96239k72482m22776p0103J75251M1085
34478d9940r5466n292K1050j70743k24360J01035M48213L85881K6641k25305k27856
34467a6142r7999O3760J69136J06327o2915j06296N278L989k28616m30515l55378
34456i49371q8475J95164M36114M95552J82582l02201m09371j2650L30482K20003
34446I7829L356J00025K70365J24732j19356p0052N1425j65707m19128j00256
34436b26767N44571O07205o9087n86333l45832J25850J08139k49873l26055m302
34426d22484K87683K53804R334j68097r1658J87967L42422R3644l26846l80174
34416b14405l953K31784k3973l54570k36752J59461L03848J37928M2811J44664
$$ y = [-70142, -252599, -493651, -331334, 202846, 499085, 226603, -196173, -266276, -91025, -49940, -145406, -150698, -129648, -300391, -524751, -423716, 24497, 410378, 437019, 211714, -16142, -114141, -50381, 118755, 225082, 162167, 55871, 61149, 65138, -163478, -593993, -949371, -1037846, -842682, -406568, 88984, 271566, -30635, -440006, -452656, -122174, 97829, 101185, 201210, 471575, 596307, 476951, 406899, 458324, 292617, -126511, -226767, 317804, 925009, 855922, 269589, -76243, 49607, 157746, -92127, -418182, -422484, -134801, 119003, 128337, -39760, -131418, 56549, 398971, 492615, 165769, -214405, -218358, 13426, -10547, -365117, -601869, -442408, -138560, -632, 42179, 186843]
34406A86843J85623M6167q5532j10165j68739l01983l12405j04129J24487J82538
34396c57295J50321J75829J98276P7325j17576j70252n7441k4437k27064m30595
34386g82909k56992K64428O06911L60031k09221m49277j28053L28114M30298J76924
34376C40254j06868k14119j48620K1243J76329J58143k0084r6876Q9955L02952
34366E02309K03368j39067l21390j72663M3600M8087q7800j18918J3104J55189
34356A25819J83306J17682J8386j13039k74385l60396k24443J03858L45462K51151
34346A73401o7102k46203j33650M8432O5550j7856k8621J4551l405m6556o976
34335b48435P0644P1982M0353Q8994J54650Q8051n5563q1571N550P158j06511
$$ y = [186843, 372466, 418633, 333101, 222936, 54197, -247786, -560191, -664320, -539833, -357295, -206974, -31145, 167131, 244456, 126880, -43372, -100813, -125250, -352314, -782909, -1039901, -775473, -168562, 191469, -17752, -467029, -595082, -266968, 163330, 340254, 233386, 19267, -129353, -108110, 68219, 226362, 206278, 109402, 199357, 502309, 705677, 566610, 245220, 72557, 116157, 164244, 76444, -42474, -29370, 125819, 309125, 426807, 445193, 332154, 57769, -302627, -527070, -423212, -77750, 173401, 106299, -139904, -273554, -225122, -159572, -177428, -206049, -191498, -194903, -241459, -248435, -177791, -105809, -65456, 23538, 178188, 266239, 210676, 129105, 134655, 141813, 35302]
34324C5302j24544M1671J90536J38336l2057j53548k03131k18663j73371p2563
34314e72032j6898m1676m2805K8977P1994M3466O0896J49116J18612r3166j91204
34303d84720P0247M30284M29671P7043j77971j15505P645n4524j87506k05008
34293b10344j53945j29771p1079L6228J4406j78363k22569J19024N22934M80031
34283B06552N3309j85356J2139K54473J57998j14750k11972j42986j37268j86400
34273b94261r9283R7651J68836N7315l8499j528N1728J3593m3898k5750L3599
34262h0497O2342O1190M9696J8855n185M0536J40956J86452J18321K568p6548
34251E18686j14847j57686k41608l59025m09578k43692J26027M31253M40097K76659
$$ y = [35302, -89242, -47571, 142965, 281301, 249244, 95696, -107435, -326098, -499469, -572032, -588930, -630606, -673411, -644434, -572440, -528974, -468078, -318962, -200350, -293516, -484720, -414473, 15811, 445482, 522525, 344554, 229049, 236694, 182170, -5336, -210344, -364289, -494060, -565139, -528911, -514505, -692868, -915437, -796413, -273479, 206552, 259861, 74505, 86644, 341117, 499115, 384365, 172393, 29407, -107861, -294261, -393544, -295893, -127057, -69742, -108241, -109769, -58041, -44448, -88346, -114096, -80497, -18155, 43035, 92731, 111586, 106401, 146937, 287893, 474345, 592666, 595234, 518686, 403839, 246153, 4545, -354480, -764058, -1007750, -881723, -450470, -10373, 266286]
34241B66286K27677K86578J81800j37983l79098l46258j89954q3622K4132J57254
34231F812J35881r7222k54994j02397J61581K22061J23445Q4267M8197j62192
34221A65439l81362k58997J39499L37053J18048j91032k27117l5980J36125K04806
34211F482K18773J82589Q6617j6823q1466j09884r1536l0244l0413j74735l23747
34200c64387k61270m5337M4366o1463j30931l6917N6926L1084J8180J11764J64162
34189d73823P5971Q040P7294J14191j3547j05158K6796J65789L6947j59533k7508
34178b74541L19288L48913n9069l79874k07763J76427K66032K8309j75204j51086
34168a08568k4970O0285R2652O5176m3687j46020j04805M6570J17918M0451l0388
$$ y = [266286, 493963, 780541, 962341, 824358, 445260, 99002, -90952, -174574, -150442, 6812, 142693, 45471, -209523, -311920, -150339, 71722, 195167, 279434, 327631, 165439, -215923, -474920, -335421, 1632, 119680, -71352, -298469, -334449, -198324, 6482, 225255, 407844, 494461, 477638, 396172, 286288, 194752, 164508, 134095, -40640, -364387, -625657, -670994, -626628, -688091, -819022, -855939, -799013, -767929, -749749, -637985, -473823, -397852, -389812, -312518, -198327, -211874, -317032, -290236, -124447, -87500, -247033, -274541, 44747, 393660, 334591, -45283, -253046, -76619, 189413, 217722, 42518, -108568, -133538, -73253, 19399, 84575, 40888, -105132, -209937, -163367, -45449, -4998, -35386]
34157c5386L7778J47689J23945k4634j21177o3732N3392O8854n2439j70651j14482
34146a50843J02545K37328Q5358k11765k90872o1483J31425L493k17192j24511
34136d96517K15124L33959P4801j83372j23635P9458J33838P3631M5166l6880
34126A15573k64109m08990k22020J13265K23037J14038Q8156J84434J62043Q049
34116A13476j5449J18995J11652j27426k78721j24288J18147J66038M6394q7886
34106D0932k00520k41477q1817K18701L62207K18427P37j15462k14137l08473
34096c20882j92074J28975K67314M1859j65308k1719J84026N2585k10402j54751
34086c90377J22336J73300j07r642J48375P7869k32269k93845N0364L08543J18441
$$ y = [-35386, 2392, 150081, 274026, 249392, 128215, 64483, 117875, 186729, 134290, -36361, -150843, -48298, 189030, 274388, 62623, -228249, -289732, -158307, -154814, -372006, -496517, -281393, 52566, 127367, -56005, -179640, -100182, 33656, 107287, 152453, 115573, -148536, -557526, -779546, -666281, -443244, -329206, -241050, -56616, 105427, 113476, 98027, 217022, 328674, 201248, -77473, -201761, -83614, 82424, 128818, 40932, -159588, -401065, -482882, -264181, 98026, 316453, 317190, 201728, -12409, -320882, -512956, -383981, -116667, -74808, -240116, -261835, -77809, -25224, -235626, -390377, -268041, -94741, -94848, -104490, 43885, 121754, -110515, -404360, -353996, -45453, 72988]
34075G2988j89365j45433J61157L09064J70127m2048j51820j54455r9022n8633
34065a27440j12534k09990j73870M8108K74036L20558K01214L2135r5201j09091
34055D7925j7900O876j61417l15441j38773K54931L87912J24908j02343K8274
34045A14952K45380J73012p0674j46232o8978p6929j28662J906K28663K07573
34035D80011j05039l44780k62636l0408Q0794N6367L7343O7002R1062R1967R2037
34024B53720P5058m740j38988k29712j67106L1945J95854J85628P9479M1882L5743
34013C58763j23894l95650m59575j81383J17771Q0207j83373k67403l2088K71846
34003h14779L82506K94927J59430R2041R2479N2344j06257k47704j35753J73392
$$ y = [72988, -116377, -261810, -100653, 208411, 378538, 336490, 184670, 30215, -68807, -127440, -239974, -449964, -623834, -575726, -301690, 18868, 220082, 252217, 157016, 47925, 30025, 36901, -124516, -439957, -578730, -323799, 64113, 189021, 86678, 114952, 360332, 533344, 462670, 316438, 247460, 170531, 41869, 43775, 272438, 480011, 374972, 30192, -232444, -262852, -182058, -125691, -88348, -21346, 69716, 161683, 253720, 328778, 324038, 185050, -44662, -211768, -179823, 16031, 201659, 281138, 323020, 358763, 234869, -160781, -620356, -801739, -683968, -603761, -787134, -1054537, -1086625, -814779, -432273, -137346, 22084, 114125, 206604, 258948, 152691, -95013, -230766, -57374]
33993e7374K86596K0228k59844j47115J76131K17903n9199k24378r8135J5183
33983a30004q3597j39977P9278L39837K87178k665j51417l5892Q5854r885k06155
33972C2555k22170K2897L01258L18141L1418l06275m31741l20414j03780J38251
33962e39860L63986M50176K91463l853j97578j94575q5195L5380J12307O0136
33952B92387j29672k55634j24693J32253K24102J33581Q0571R2548j0149j92851
33942B42443k03415o4923j00742l17431k73642J68774M72490K03547k60254k94931
33932d28084N0256K54474J77612J05581J15141K7440p3355Q5640L48500K21505
33922H84710k97306n88268l17416R6414J96246J19446J50001J49930p7119k61663
$$ y = [-57374, 229222, 249450, -10394, -157509, 18622, 236525, 177326, -47052, -145187, -130004, -213601, -353578, -274300, 65537, 352715, 350050, 198633, 162741, 248595, 238710, 32555, -189615, -166718, 134540, 452681, 484099, 177824, -253917, -574331, -678111, -539860, -175874, 274302, 565765, 561912, 364334, 169759, 84564, 119944, 232251, 292387, 162715, -92919, -217612, -85359, 138743, 272324, 352895, 445443, 435294, 242443, 39028, -25895, -126637, -444068, -717710, -548936, -76446, 127101, -133153, -428084, -377828, -123354, 54258, 159839, 274980, 302420, 229065, 314705, 663205, 884710, 587404, -864, -318280, -221866, -25620, 93826, 243827, 393757, 316638, 54975]
33912E4975o8890K56384K28937p1745j41948P8857J21723j62869l04827n996L22391
33901C06992K07860j14633q4020K76582L85182O994l83741l12204L1770J38341
33891D59123o3328j76750q340J30075o5165l71255l27861Q4678L90099K63294
33881C14570p5336k43165j98216j24451k9866J98516M25487L39412m2848k84884
33871B79219j10279J99833K13267n9108k50395j87437m8769q313j3191L0752Q7923
33860A33502J00986R4125P9201J0544q3876q2922J7468M0130r2300j80465m9519
33849a3126J15191O608k94186l65682n1236K93885L10191J17980N4383J34466
33839C08474J02088p5840j34884K6018J50947L8946j38785j46909o8713r7228
$$ y = [54975, -13915, 242469, 471406, 399661, 257713, 336570, 458293, 295424, -9403, -15399, 306992, 514852, 400219, 316199, 592781, 977963, 984957, 601216, 289012, 320782, 459123, 395795, 219045, 210705, 340780, 275615, -95640, -423501, -338823, 51276, 314570, 239234, -3931, -202147, -326598, -356464, -157948, 267539, 606951, 564103, 279219, 168940, 368773, 582040, 522932, 272537, 85100, 36331, 28018, 14827, 45579, 133502, 234488, 328613, 407814, 418358, 334482, 251560, 269028, 309158, 216858, 36393, -13126, 102065, 108673, -185513, -551195, -602431, -308546, 1645, 119625, 174008, 308474, 410562, 334722, 199838, 225856, 376803, 415749, 276964, 130055, 61342, -35886]
33829c5886j29680O4133L50725L23934o0653l42037k10377N1290M2665j42592
33819h8478j41461N4541J32313K7812Q706J48432J61932p1822k19870l135L07661
33808C16631K54564j27853l64623k09925Q0560J78775Q9869K0106N1859R5272
33798C85235N5962n7793j50813j28843j6906L1209p2730j91892j36149M5160J30025
33787a07535P3810N5786J27854R0830j34628k75032q5353K28269K67299J6244
33777B57544j58843n9304J13305J18427j4709j35200j82606j36410K2341J70417
33767e038Q7767j96409l25812r1924K23696K44275M9828P18J32379J28257j05993
33756A41744k48462o6088K21914K81814J20982r278J444M1744j1368j52056k54533
$$ y = [-35886, -165566, -101433, 249292, 573226, 512573, 170536, -39841, 11449, 54114, -88478, -229939, -175398, -43085, -15273, -6567, 141865, 303797, 231975, 12105, 8970, 316631, 571195, 443342, 78719, -131206, -50646, 128129, 217998, 238104, 289963, 385235, 441197, 383404, 232591, 103748, 86842, 118051, 45321, -146571, -282720, -237560, -107535, -33725, 22061, 149915, 240745, 106117, -168915, -254268, -25999, 241300, 257544, 98701, 39397, 152702, 271129, 256420, 121220, -61386, -197796, -175455, -5038, 82729, -113680, -439492, -531416, -307720, -63445, -13617, -12899, 119480, 247737, 141744, -106718, -172806, 49108, 330922, 451904, 442626, 444070, 485814, 474446, 322390, 67857]
33745F7857j56695J56209M20926L31769l8125k79141j96145m5635q2777j82149
33735c906j39567m7394n5268k4861J97512L83922K32875q4477j49316L6203R3014
33724D38737p0306j51279l4792L7424k9729j5925J33173J39289j01889l02590
33714D2113k82005k33198k61017j29102K35196M51975K70088O240K499O5846r1151
33703G7484k51934q4617J97379J54715j39433k71398j97045j71291j38465J40226
33693f84379M41951K74965k54816m62228j01345K78097K06171o3241p7969J33794
33683c09000K50560J66394J1979p6085q684J93820K96978J04829j47354n1138
33673D32299K80841K88472j38265m12200j62338J78253R4913k00944j87527J22804
$$ y = [67857, -88838, 67371, 488297, 820066, 781941, 502800, 306655, 261020, 178243, -3906, -143473, -190867, -246135, -270996, -73484, 310438, 543313, 458836, 309520, 345723, 438737, 368431, 217152, 182360, 219784, 190055, 174130, 307303, 446592, 344703, 42113, -239892, -473090, -734107, -863209, -628013, -176038, 94050, 100290, 102789, 168635, 77484, -174450, -259067, -61688, 93027, -46406, -317804, -514849, -686140, -824605, -684379, -242428, 32537, -222279, -684507, -785852, -507755, -301584, -364825, -442794, -309000, -58440, 107954, 119933, 43848, 35164, 228984, 525962, 630791, 483437, 432299, 713140, 1001612, 863347, 451147, 288809, 467062, 561975, 361031, 173504, 296308]
33663B96308K91210J58215n5542j91121k56721k15896n4133N0105m6789j72851
33653a97215q8659J24021K17049J65382J04262L7148q9878j75165j17254k8803
33643d9112k5526L687J39579J87279Q055j63467r3628L6963J750K277K69778M82539
33631H00174J95972l47262n03574k07615K4242R755P4163K62092J60941k77794
33621A91094m70358r5827L55282L28127q649j47315k087J43792J42824M4483j16878
33610C64488k77608k87975j35484o032M2201J62720L16503J89958k23423l94957
33600b49609k013M78180L91181j50856m58198k34558J44664K71365J62302K9352
33590C81810m3217p6772p4371j8324R0061J83908J10800j94390m77402l61906
$$ y = [296308, 587518, 745733, 690191, 499070, 242349, 26453, -27680, 22425, -24364, -197215, -285874, -161853, 55196, 220578, 324840, 361988, 272110, 96945, -20309, -49112, -74638, -70951, 68628, 255907, 263962, 100495, 6867, 43830, 45580, 47857, 317635, 800174, 996146, 648884, 145310, -62305, -38063, -28308, 45855, 307947, 468888, 191094, -279264, -375091, -19809, 308318, 299669, 152354, 150267, 294059, 436883, 481366, 364488, 86880, -201095, -336579, -342611, -300410, -137690, 178813, 368771, 145348, -249609, -251622, 226558, 617739, 466883, 8685, -225873, -81209, 190156, 352458, 381810, 338593, 261821, 187450, 169126, 259187, 443095, 553895, 359505, -117897, -479803]
33580d79803R5161L48086Q1084l20705l19184L3457K69982K07821N7287k8148
33570e4962q6017r4596J9776J40684O5877j51761k61375j86492o0967N7050K09853
33559d02930L21371K57040Q2194j3626j1792k0515j4410Q6416J68945R1553J876
33548E46122J15559K65433J08514k59936l80206j39730Q1070N3065j2477M0168
33538D17582K8009j38383k04356l0595J08014j2928j73473j02415P4414J20293
33528H6162J08108J84758J97284l7872l12710k89684k5070J56735J64748J34905
33518C67364P2291q0882j41783Q6163L48428J96049k79940m77915j55125K26524
33508A61174K26080L3864M2271J82984J08210j86263l47077k06280J6252O8900
$$ y = [-479803, -384642, -36556, 44528, -276177, -595361, -561904, -291922, -84101, -26814, -54962, -140979, -235575, -215799, -75115, -9238, -160999, -422374, -608866, -669833, -612783, -402930, -81559, 175481, 257675, 244049, 232257, 211742, 197332, 283748, 452693, 544246, 546122, 661681, 927114, 1035628, 775692, 395486, 255756, 336826, 389891, 377414, 417582, 445591, 307208, 102852, 72257, 180271, 167343, -6130, -108545, -34131, 86162, 194270, 379028, 576312, 538440, 225730, -63954, -89024, 67711, 232459, 367364, 439655, 358773, 216990, 303153, 651581, 847630, 567690, 89775, -65350, 161174, 387254, 421118, 463389, 646373, 754583, 568320, 221243, 14963, 31215, 100115]
33498A00115m3531j67426j83933m2796K06856L74339K77529r980k01808j43628
33488A65737J6955O4221j6625q8120o3039L5568J23916R1527j02637k88637j93393
33477b54527J76421M25309K47464j32378k67210j21232m4765j62199k07722m6430
33467c87269P7213K808m5098R7925J71627n0659k70789j05205K34791K47937k5646
33456e2365q1163J81867L05873Q6467r8754m781M1335k11275l78764m5342M58636
33445B01734M73124k797l28152j71375J05568R3072j11670j92256j06965m0013
33435g9730n8488n7752K6990J24269J32106L6098p6043q9335L0911J94966K67510
33424D51502J86297j370j83537k51551j77378n0387J1152l896j5053P162J6314
$$ y = [100115, 56584, -110842, -294775, -337571, -130715, 243624, 521153, 511173, 309365, 165737, 182692, 246913, 230288, 142168, 79129, 114697, 238613, 330140, 227503, -61134, -254527, -78106, 347203, 594667, 462289, 195079, 73847, 29082, -133117, -340839, -387269, -310056, -307248, -352346, -254421, -82794, -133453, -404242, -509447, -274656, -26719, -52365, -133528, 48339, 354212, 440679, 341925, 337144, 378479, 167204, -211560, -256902, 201734, 674858, 672061, 343909, 172534, 278102, 371174, 259504, 67248, -39717, -79730, -138218, -195970, -168980, -44711, 87395, 123493, 47450, -41885, -10974, 183992, 451502, 637799, 636429, 452892, 201341, 23963, -26424, -15272, -19168, -34221, -27059, -10745]
33413a0745N129J2031L660q5148j68409o6575J88827L26812K16938N3582K5746
33402E01848M1040l9386j32313j34451j62153k98003l09738J3421L98600L89070
33392B67935M3202j17306J02138K79252L7005l92413n27826k88550J6613J81493
33382c98457K69381L39974L04150J28643j7298K5335J33978K8466l08040n10377
33372d245k80296J63544L17360M8237k48818k04479R2011L34592L90341K58554
33362H66801p4758m66910n49330j68732K82974L35621Q3812k5487Q5885Q3635
33352D53511j40843k78832j30651J06257K06548K03569J67238L9986j46587j99486
33342B80710o6761O3888R2583J35039K05419J16916j32532k29437k3260J96399
$$ y = [-10745, -5616, 6415, 10075, -75073, -243482, -310057, -121230, 205582, 422520, 476102, 501848, 542888, 503502, 371189, 236738, 74585, -223418, -533156, -519735, -121135, 267935, 311137, 193831, 295969, 575221, 612226, 219813, -308013, -596563, -579950, -398457, -129076, 210898, 515048, 643691, 626393, 651728, 785706, 814172, 506132, -4245, -284541, -120997, 196363, 244600, -4218, -208697, -116686, 217906, 608247, 866801, 792043, 325133, -224197, -392929, -109955, 225666, 309478, 283991, 369876, 453511, 312668, 33836, -96815, 9442, 215990, 419559, 586797, 626783, 480196, 280710, 213949, 277837, 370420, 505459, 710878, 827794, 695262, 465825, 442565, 638964]
33332F38964J53579p234n5521q7585k43483l05898k8766L34589L18875l0762k09525
33321D77233l1231J17223p4028l41429k47482J82215M97735L97094L7449k20281
33311G94498k21905j05280m4231l2796J4056N0420l7194j82377j74682N778J21832
33300A88119N7200J6033J62740L01065J82489n1217p1285R4021R2211j70754l45276
33289D55346j57678J75731K54028L4673j44800k6696K59763L76440J68180j80928
33279A214059l67997k90088r1516O5796J56828J95271J30641n0505k25656k64638
33269D72195j87545q5355L4091J86553K73470J75122l7465j37389p439K29641
33259I15879L47094K04968j54395n00426n48667k30782J84560L57848K50433J09147
$$ y = [638964, 792543, 785309, 729788, 642203, 398720, 92822, 64056, 398645, 717520, 686758, 477233, 446002, 563225, 489197, 147768, -99714, 82501, 580236, 977330, 1014779, 794498, 572593, 467313, 423082, 390286, 404342, 454762, 417568, 235191, 60509, 66287, 188119, 245319, 261352, 424092, 725157, 907646, 856429, 785144, 879165, 971376, 800622, 455346, 297668, 473399, 727427, 762100, 617300, 590604, 850367, 1226807, 1394987, 1214059, 846062, 555974, 464458, 530254, 687082, 882353, 1012994, 962489, 736833, 472195, 284650, 199295, 233386, 419939, 693409, 868531, 831066, 693677, 686238, 915879, 1262973, 1467941, 1313546, 813120, 264453, 33671, 218231, 576079, 826512, 935659]
33249I35659J00140J22159K8308j19261j34838J8015J62523J31535k5013j12103
33239A107124l6977R7982J67975J91948K41389K66977J62657k9593j46957j51226
33229A871299j77084k85298l34448j92316N6738K23333K39201J79897J35627J32833
33219A849782J25487K6241j81541l50986k96488k9896K40362L55185L23465K04554
33209B266165M5067n1134J8064J73701K08820O9263q3379j18540o6450J8455J22256
33198B602288J75944J07083J0374N1973J98157K66617K22155J58595M7163j60330
33188C680019k38653P9144N85116P62994N00032J79185N3473L9192J33996M39422
33178F213920P19810N93945K43283K28296N36926O30385N09551P50753J319079
$$ y = [935659, 1035799, 1157958, 1186266, 1067005, 932167, 950182, 1112705, 1244240, 1219227, 1107124, 1070147, 1168129, 1336104, 1528052, 1769441, 2036418, 2199075, 2169482, 2022525, 1871299, 1694215, 1408917, 1074469, 882153, 938891, 1162224, 1401425, 1581322, 1716949, 1849782, 1975269, 2001510, 1819969, 1468983, 1172495, 1142599, 1382961, 1738146, 2061611, 2266165, 2311232, 2260098, 2278162, 2451863, 2660683, 2729946, 2646567, 2528027, 2461577, 2480032, 2602288, 2778232, 2885315, 2895689, 2947662, 3145819, 3412436, 3634591, 3793186, 3840349, 3680019, 3441366, 3520510, 4105626, 4868620, 5368652, 5547837, 5601310, 5640502, 5774498, 6213920, 6933730, 7527675, 7770958, 7999254, 8536180, 9166565, 9676116, 10426869, 11745948]
33169A1745948J495002J279481J571502K477166K896985K505704K573720L828828
33161C0374336N135915N575754O138844P783021R620211J1007930J3498748J8187087
33153A07321846K3235522K7386442L3413547M2480196M6171521L1927185m91424
33146C11444835l3864973m9723298m6232995l5676606k7952938k2978432j7703585
33139G7312008j2898720j0546936r577236p744434n259602l810679l547824l268548
33131B0658029k565756j972011j638675j302152j075753j163556j215061q53687
33123H871378m21877m39857p37493p99249n84243m02079l28421k67980k72636
33114D617543l66542l81362k95124l47471n36730m74854n2759K58270J23963j36308
$$ y = [11745948, 13240950, 14520431, 16091933, 18569099, 21466084, 23971788, 26545508, 30374336, 35510251, 41086005, 47224849, 55007870, 64628081, 75636011, 89134759, 107321846, 130557368, 157943810, 191357357, 233837553, 280009074, 311936259, 311444835, 277579862, 227856564, 181623569, 145946963, 117994025, 95015593, 77312008, 64413288, 53866352, 44289116, 36544682, 31285080, 27474401, 23926577, 20658029, 18092273, 16120262, 14481587, 13179435, 12103682, 10940126, 9725065, 8871378, 8449501, 8009644, 7272151, 6472902, 5888659, 5486580, 5158159, 4890179, 4617543, 4251001, 3869639, 3574515, 3227044, 2690314, 2215460, 2162701, 2420971, 2544934, 2408626]
33104B408626j32124j1636p2259k12237k06863j44165j74010j69805p425J50231
33094A428333J59636J36273J25004n1553l46183l68043k7488K05775M9974j18535
33084A193193L1357J70866o2289l44791k19077O7222j3792l22571k79548J35787
33074C56357L46565J07155j76949j27446J25617K46051R7528k18140m50913l47639
33064d1814N2879L60236K94076L8812j00095j34938j77401r4506J84235L05095
33054F86579l4308m71820m32526l8548P4192k15879l51948l1625L52011L98223
33044f5649K57788K29076K57954J54813k9303j32331j42025j12837l9662L0447
33034D08271j4433j31795j36493k7842j8795j32863j06963J40969K96654J36235
$$ y = [2408626, 2276502, 2264866, 2192607, 1980370, 1773507, 1629342, 1455332, 1285527, 1278102, 1428333, 1587969, 1724242, 1849246, 1797693, 1451510, 1083467, 1055979, 1261754, 1311728, 1193193, 1224550, 1395416, 1333127, 988336, 769259, 836481, 822689, 500118, 220570, 356357, 702922, 810077, 633128, 505682, 631299, 877350, 974878, 756738, 305825, -41814, 11065, 371301, 665377, 704189, 604094, 469156, 291755, 197249, 381484, 686579, 652271, 180451, -252075, -290623, -216431, -432310, -784258, -815883, -463872, -65649, 192139, 421215, 679169, 833982, 804679, 672348, 530323, 417486, 377824, 408271, 393838, 262043, 125550, 97708, 78913, -53950, -160913, -19944, 276710, 412945]
33024D12945r6741r4438K2833l1496j87053j62153R501L2566j07112q5206K00557
33013h5797M00512K21828j30417k52517p8004J32225J97840J51321K6990k00484
33003C83497m28318m18689r8623K87614M42184L15734N3800k16377m03430l83396
32993d66004j18389J98413K97024J28755j15393k47011k06895j3482K35480L51775
32983D4273K41619P3269O2392J35730N3328j67628k54121j24305o299k9688k9814
32972a244J01243J86515P8197p9989j14675r2319j11648q3132L9954O0455j45253
32961a61896l27652k00037R8798K03144M7699j21294j48054o3876J15476L54488
32951b03204M31653J57574k56800l75520j02624K11569K50122M9734j79410k88068
$$ y = [412945, 316204, 221766, 244599, 213103, 26050, -136103, -126602, -94036, -201148, -286354, -85797, 314715, 536543, 406126, 153609, 75605, 207830, 405670, 556991, 583981, 383497, -44821, -463510, -562133, -274519, 167665, 483399, 537199, 320822, -82608, -466004, -584393, -385980, -88956, 39799, -75594, -322605, -529500, -542982, -307502, 44273, 285892, 359161, 421553, 557283, 610611, 442983, 188862, 64557, 58258, 28570, -1244, 99999, 286514, 364711, 284722, 170047, 77728, -33920, -117052, -77098, -16643, -161896, -489548, -689585, -590787, -387643, -339944, -461238, -609292, -673168, -557692, -203204, 228449, 386023, 129223, -246297, -348921, -137352, 112770, 162504, -16906, -304974]
32941c04974j99380O6211L11598L10427Q5733j22800j68062q9481O3285K55119
32931B07676L25911J13184k33236l36341r2742J60800J15435r9710j57591j8066
32921a4680N0472j15091l24020k57959J15453M35125L23802j34167m29253k29949
32911e80267J93622L24023O3960j98425j59711M2475J19408L9409j7834K3882
32901a49458O0060K0067J715J16748K76857K65770N3545j05763k0892J17395p537
32890F28507l29417m48271k09644Q8672J58295O2924l2627j16008j51489k139
32880c51197K48658K58846l1788k17160q6890j4976k65417m01629J1858N45541
32870c04154M87156j7342k29513l0425K8437j84492j96391P5244J08728k03025
$$ y = [-304974, -504354, -438143, -126545, 183882, 269615, 146815, -21247, -110728, -47443, 207676, 533587, 646771, 413535, 77194, -15548, 145252, 260687, 160977, 3386, -14680, 35792, -79299, -403319, -661278, -545825, -110700, 213102, 78935, -350318, -580267, -386645, -62622, 1338, -197087, -356798, -314323, -194915, -155506, -173340, -149458, -89398, -69331, -67616, 49132, 325989, 591759, 645304, 539541, 518649, 636044, 628507, 299090, -149181, -358825, -270153, -111858, -48934, -81561, -197569, -349058, -351197, -102539, 156307, 124519, -92641, -179531, -194507, -459924, -861553, -849695, -304154, 183002, 165660, -63853, -94278, -65841, -250333, -446724, -371480, -262752, -465777]
32860d65777k64350J26137L20475k2096k26188K45121P31168L75068m21753n81165
32850a83360k9062K83012n6060l73616j15403L09109K84039o6162j86261M8194
32840h5570K62224J99895J5377m7198j416m1063k09834k91921j12876J49688J65848
32829C154n2362j49277N176R7601q0987k39159o5753K18440K20952L7588M4612
32818C9985J94002Q9712k61039l57946O511L82197L10313n8956k62577j49457
32808f7255N3145J09316m596j37000j03805R4209J79957p2521m16038l42322J97167
32797e09743O21650M60977l9487l10664k02812k3010m583q0268j13716n8925Q9788
32786a70793K61230K52194l6749l28176k20606K34491M97129K15039l06771n09473
$$ y = [-465777, -730127, -603990, -283515, -305611, -531799, -286678, 444490, 819558, 397805, -183360, -212422, 70590, 14530, -359086, -474489, -165380, 118659, 52497, -133764, -85570, 176654, 376549, 391926, 344728, 343312, 302249, 92415, -199506, -312382, -162694, 3154, -49208, -198485, -193309, -95708, -176695, -415854, -481607, -263167, -42215, -4627, 39985, 233987, 323699, 62660, -295286, -288775, 93422, 403735, 344779, 82202, -67255, -14110, 95206, 90610, -46390, -150195, -55986, 123971, 51450, -364588, -706910, -509743, 111907, 572884, 533397, 222733, 19921, -3089, -7672, -87940, -201656, -260581, -170793, 90437, 342631, 305882, -22294, -242900, -8409, 488720, 703759, 396988, -112485]
32776a12485k77887M362P528j82716k59649n4042L43185O64449O31683J93762
32766I58190l33454n08540k42306R3152J42547R017L5580K56528L37238Q1515
32756H29467k56454l05932o8263J09412k29k31261k64630m3497J61917J12548
32746D3078q7386j47718n53J37765J33734J28299K29525K47601j7414l87319n05288
32735b25676l29215j15624J7712J58012K56887J37398j00941j12686J23503K00610
32725I980m0277j82846Q0909L65562J71262k69731l14146Q0779K99357M4234k40076
32714E007j18896J81848K19394M2784K0238J71407J44920j60035l79924k37066
32704a10323K2777Ok48138k95208P99K76738K06580l6647r0276N2358J19992N0433
$$ y = [-112485, -390372, -386010, -378482, -561198, -820847, -874889, -531704, 132745, 764428, 958190, 624736, 116196, -126110, -32958, 109589, 118606, 154186, 410714, 747952, 829467, 573013, 267081, 198818, 308230, 308001, 76740, -187890, -231387, -69470, 43078, -44308, -192026, -192579, -54814, 78920, 207219, 436744, 684345, 666931, 279612, -225676, -554891, -670515, -652803, -494791, -237904, -100506, -201447, -314133, -190630, 9980, -30297, -213143, -132234, 233328, 404590, 134859, -179287, -98508, 200849, 245083, 5007, -113889, 67959, 287353, 330137, 350375, 521782, 666702, 506667, 126743, -110323, -87546, -87540, -335678, -630886, -630087, -353349, -146769, -183416, -273692, -221334, -101342, -50909]
32692e0909L0288Q8826M8155p1471o616K44493K81667p4082l85212j97422K38935
32681A46652K99503j02948m18638k82531J0481J1312k36903l16987m0931L21562
32671f09428M13564K13142p559o6229n4802r3167p5206J42660M01157L70394L0344
32660F64870k64968k67416j00318L9066J30533J49029l4776l58195m73895k09211
32650g25281J45054K56051J85730J38836P8178p2880j29074O5491K82512K39052
32640D63669N1906l6355j18736l41062m30528q7187L55029L07338j42737l50382
32630c29045j24373P9866J7620j9085J18226J34351p8700j57847P3251K50264
32620c5472J10720o2206k691O7388o2647j41446L4399J49905o3159k40115L4216
$$ y = [-50909, -20621, 68205, 116360, 44889, 38273, 282766, 564433, 490351, 105139, -92283, 146652, 446155, 343207, -75431, -357962, -347481, -336169, -573072, -890059, -930990, -609428, -195864, 17278, 9719, -56510, -111312, -204479, -279685, -137025, 264132, 634526, 664870, 399902, 132486, 32168, 71234, 201767, 350796, 316020, -42175, -516070, -725281, -580227, -324176, -138446, 390, 78568, 5688, -123386, -57895, 224617, 463669, 515575, 479220, 360484, 19422, -411106, -498293, -143264, 164074, 21337, -329045, -453418, -373552, -355932, -375017, -256791, -122440, -201140, -358987, -285736, -35472, 75248, 13042, 10351, 77739, 15092, -126354, -91955, 57950, -5209, -245324, -211108]
32609b11108M30624L36105j48896l72969j53235O3632L1360J3993J63267K03654
32599C56427l4934k61937j85492L5900Q5714k9555o9160L7880J28827Q2602k2290
32588A23982l0429R1690K01849J36752p7771k40571k30977j34799m9405P0179
32578a39500K35692K77765Q6580j46828j81310r5758j21332k04080q5433K04941
32568a69263L14656J00795j52364j88247j31330j74361j89515M0684L65279L91889
32558B08223O6670j87522l5290K98602L34701J309k77893j82967Q3673J40820
32548D50326k1819j15061n9967p7805k50192l39014j80227M0344R8161O6136J11926
32537b77192J74669J08959j1879j3211P2910P6953j9668j04163j49802j82222
$$ y = [-211108, 219516, 555621, 406725, 33756, -119479, -55847, -24487, -10494, 152773, 356427, 321493, 59556, -125936, -90036, -4322, -33877, -103037, -65157, 63670, 146272, 123982, 93553, 185243, 387092, 523844, 446073, 205502, -25475, -160274, -209679, -139500, 96192, 373957, 460537, 313709, 132399, 36641, -84691, -288771, -374204, -169263, 145393, 246188, 93824, -94423, -225753, -400114, -589629, -548945, -183666, 208223, 274893, 87371, 52081, 350683, 685384, 686693, 408800, 225833, 309506, 450326, 428507, 313446, 253479, 175674, -74518, -413532, -593759, -553415, -455254, -389118, -277192, -102523, 6436, -5443, -18654, 54256, 131209, 111541, 7378, -142424, -324646]
32527c24646j33941K1020J04796j5393j39003j5987J96520J51900q1240q7802
32517c23776J97773L46518J22367j39667p8490J54529J99127K6974j40092k21183
32507A44080k60920j96035L4626K54144K26007P026j44329j53661j52671j53220
32497c94953k789K87309M41205K70556n5770k26987j57680j8813K3147k2372m9350
32486I3503k1876j3277p8104j32924m7812J37249K13187R5646j8096N8247J66602
32475D52345J3627l20181l95235m5813K97673J65771k75208m43327j58774J41329
32465e67793Q2260j21761o2058K09435K83435N7653r4222R4170L54411K64467
32455D99997j33019l76213k08361J05392J71733j1062j09699L8207J98723J04398
$$ y = [-324646, -458587, -437567, -332771, -348164, -487167, -503154, -306634, -154734, -235974, -323776, -126003, 220515, 342882, 203215, 124725, 279254, 478381, 505355, 365263, 144080, -116840, -312875, -278249, -24105, 201902, 208928, 64599, -89062, -241733, -394953, -397742, -110433, 330772, 601328, 545558, 318571, 160891, 142078, 165225, 142853, 93503, 71627, 58350, -19754, -152678, -200490, -63241, 149946, 245592, 227496, 285743, 452345, 465972, 145791, -249444, -295257, 2416, 168187, -107021, -550348, -709122, -567793, -485533, -607294, -669352, -459917, -176482, -118829, -213051, -118881, 235530, 499997, 366978, -9235, -217596, -112204, 59529, 48467, -61232, -23025, 175698, 280096]
32445B80096j34455j86357J392J25607O901j30581m2891J10807K9935j94464j85560
32434c19570J11177L16246J87042o4919j71534j78292k05112j52870O5026K49269
32424a63537J97500O9825J28150K59598J44298j77469l15870j36444K9533r6931
32414f1347l26358k90498N6009M10819M89970K81094l876j38166p8504J0192m1655
32403C07680k03462l04632k51299r1861P9707J78336J44489K1975m7790j9538
32393a86395k3332j15630j14694R9075K86854J62521j21836j67336N7141J93522
32383F9890Q6681k9040m533l035j09674j30506J3666P9167o5741j56153K8483
32372b20795K64550K52728R6765N7829Q7227m930j27803p5619M4375j9649j80775
$$ y = [280096, 145641, -40716, -39324, 86283, 93184, -37397, -80288, 30519, 60454, -134010, -319570, -208393, 107853, 294895, 229976, 58442, -119850, -324962, -477832, -412806, -163537, 33963, 103788, 231938, 491536, 635834, 458365, 142495, 6051, 35584, -61347, -387705, -678203, -622194, -211375, 278595, 559689, 555813, 417647, 339143, 349335, 307680, 104218, -200414, -451713, -543574, -463867, -285531, -141042, -119067, -166857, -186395, -209727, -325357, -440051, -340976, -54122, 108399, -13437, -180773, -123632, 69890, 156571, 127531, 122998, 119963, 10289, -120217, -106551, -27384, -93125, -249278, -220795, 43755, 296483, 393248, 451077, 538304, 533374, 405571, 329952, 374327, 354678, 173903]
32361A73903j38501P9110J46327o73q0251K3033R9289M4802K3390P3812j6953
32350D27288k68886l54052j30691O1033m9611j78756M0168L86083L47205n7959
32340B21822k77107m9715K38584J60700j74384l57524k25693M7939K34010K23065
32330D1697M6577j17541o7992J55261K48742L1603k77128l45047j63716K2305
32320d25239J12326J86097K00391O652k72735k56975J27819M26684K66301r4077
32310B77244j72518j266j238k29905k83200j0661J92329L1409j94152q6704K06164
32299b72498K59217M9197q4793l3458m723m9062L4731K42698K54776m1901k91929
32288F2255j74367J33307K61787J70283O3638n337j15032j96828j31337m4249
$$ y = [173903, 35402, 114512, 260839, 260166, 179915, 202948, 302237, 347039, 370429, 444241, 427288, 158402, -195650, -326341, -265308, -314919, -493675, -453507, -67424, 279781, 221822, -55285, -105000, 133584, 294284, 119900, -237624, -463317, -415378, -181368, 41697, 88274, -29267, -97259, 58002, 306744, 338347, 61219, -283828, -447544, -425239, -312913, -126816, 73575, 80227, -192508, -449483, -321664, 105020, 371321, 277244, 104726, 103460, 102222, -127683, -410883, -421544, -229215, -197806, -391958, -478662, -272498, -13281, 35916, -48877, -82335, -87058, -136120, -101389, 141309, 396085, 354184, 62255, -112112, 21195, 282982, 453265, 516903, 511566, 396534, 199706, 68369, 24120]
32278B4120j45332l03188j69961K23759M07061J57264j31669l6523K52569K44645
32268E22745r1365l03839j59713L6182o5895l52748m27069j29429K97981N01828
32258a71322L54022L1604j68741j11864O0221J15511L515j23223j13692N0524
32248g3445K76488L90725K21195j72848m19118k25699J70185K42936j05807m11032
32238a06420l18095k3476J35605J50870J31812j33k31386k10453K36148O13114
32228C77586L56617k51105m18507l1595K19266j0589k11331L5808L21220J29259
32218E16629k64204k57296Q8968K11739o527j35932J126P4919j05578k54551j26887
32207b57594P8145R9010M8087J55877L18269K32363j14374l78173k95594P351
$$ y = [24120, -121212, -424400, -594361, -370602, 36459, 193723, 62054, 25531, 278100, 522745, 431380, 127541, -32172, 4010, -61885, -414633, -841702, -971131, -673150, -171322, 182700, 214304, 45563, -66301, -6080, 109431, 112946, -10277, -123969, -73445, 203043, 593768, 814963, 642115, 222997, -2702, 167483, 410419, 304612, -106420, -424515, -447991, -312386, -161516, -29704, -29837, -261223, -471676, -235528, 377586, 734203, 483098, 64591, 32996, 252262, 241673, 30342, 66150, 387370, 516629, 252425, -4871, 84097, 295836, 289309, 153377, 154503, 229422, 123844, -130707, -257594, -179449, -80439, -32352, 123525, 441794, 674157, 559783, 181610, -113984, -106633]
32197a06633K09732J89671J13844J38031J48738n0478l51403l96385j01513J56955
32187d9441P8748j14550q2910M0003q4660l07054j49338L37563N11739J21679
32177C01779k57909j16619K15183J78447p6913j5196K96163K57349k41729n75599
32167c5044l23610J30345K13667p8420l58137m07931k29984J55953N85142O59269
32157C11250K03263l37160l72794L6095K87770J13338j19344o2489J10158Q5100
32147B55187q0867j41073q3455m7855j5094Q5708J13419p6066k64103j22040K05277
32136a70962K21445j43836l47232l0400M18210M32789P0743j70809j18005l3025
32126A28918n9107l4926R2291J04300q5759k19984q9425J32714J77280Q0872N4861
$$ y = [-106633, 103099, 292770, 406614, 544645, 693383, 642905, 291502, -104883, -206396, -49441, 29307, -85243, -168153, -128150, -212810, -519864, -669202, -331639, 180100, 301779, 43870, -72749, 142434, 320881, 243968, 228772, 524935, 782284, 540555, -35044, -358654, -228309, -14642, -93062, -451199, -859130, -1089114, -933161, -348019, 311250, 514513, 177353, -195441, -159346, 128424, 241762, 122418, 59929, 170087, 255187, 174320, 33247, -50208, -98063, -113157, -27449, 85970, 9904, -254199, -376239, -170962, 50483, -93353, -440585, -470985, -52775, 380014, 450757, 279948, 161943, 128918, 69811, 34885, 127176, 231476, 145717, -74267, -163692, -30978, 146302, 227174, 282035]
32115B82035J14615J04800N538m2534L227K1161o4243j73828k04266j37724m989
32104i6208J41711K05653J15736n1611j26400n6193K9115K811r0791j04620K9537
32093a260K27057L21837K00018q7011l29983l36089j18185J23178K02362R1563
32083B93487j07675k48586k06889K0139K52189K69932O9989j20112j34047n9513
32073B8914n4465r5061n6129M1664O0289M19J9717J46001J77470l477j86549j05679
32061b6886J40286J87324o9047l02720k19028L2183J07175j9808p3747M0779R6782
32050a06707l5562j31557K0448K33363J97427j2361n9731Q5901J13518m9273o4148
32039A91318K06118L37305k9779n18676m71571Q2556M57582K98755r413n2165
$$ y = [282035, 396650, 501450, 506988, 464454, 467681, 488842, 424599, 250771, 46505, -91219, -96208, 45503, 251156, 366892, 315281, 188881, 132688, 161803, 164614, 73823, -30797, -1260, 225797, 547634, 747652, 660641, 330658, -5431, -123616, -438, 201924, 293487, 185812, -62774, -269663, -249524, 2665, 272597, 342586, 222474, 88427, 28914, -25551, -120612, -176741, -135077, -74788, -74369, -54652, 91349, 268819, 265342, 78793, -26886, 113400, 300724, 231677, -71043, -290071, -257888, -150713, -170521, -244268, -203489, -106707, -142269, -273826, -253378, -20015, 177412, 165051, 105320, 191221, 304739, 255466, 191318, 397436, 734741, 704962, 186286, -285285, -202729, 254853, 553608, 544195, 492030]
32029D92030L8342l924o4424L4962O5903k47395o21798n24354p966L14623J69762
32018c54239m1354M5322K20045J55021k9274k9804J13120J62522J42072K18748
32008F02179K64736o89m48320n67102j61453L44967M59682J80233j63711l50869
31998A59653l39559j38800J26426J88613m6173k69420j39203K01189K87506M447
31988C4679k41383j01478K61252M53578L40897O3825k24733m02568l17501L5807
31978i7625L52945L03769l7074k78554k22049m2851L8390J523r6372k14879k20675
31967e13452L0858L77848M09742L3397k99238j80123J93116L50046K13975O1060
31957F77229j4215j48606k95214k22352L1967J26766n5801k24970j53514J3235
$$ y = [492030, 530372, 526448, 462024, 496986, 562889, 315494, -306304, -830658, -838624, -524001, -354239, -395593, -350271, -130226, 24795, -4479, -34283, 78837, 241359, 383431, 602179, 866915, 866226, 417906, -149196, -310649, 34318, 494000, 674233, 510522, 159653, -179906, -318706, -192280, -3667, -49840, -319260, -458463, -257274, 30232, 34679, -206704, -308182, -46930, 406648, 747545, 811370, 586637, 184069, -133432, -97625, 255320, 559089, 522015, 243461, 21412, -21439, 16951, 18474, -77898, -292777, -513452, -482594, -104746, 304996, 338393, 39155, -140968, 52148, 402194, 616169, 677229, 663014, 514408, 219194, -3158, 28809, 155575, 99774, -125196, -278710, -265475]
31947b65475P7147Q4251J13906Q0745l7209n8140P8869J17456j18142l66557k72319
31936e65468R5466L62495L44587J50502p4431k32686k20684n8006L1355r1565
31926b58435k35046j66323J0094N4298J2438Q8785K19869J64335m5123j28168
31916b83276j4862R2903J07530J27304J22893m4120k52929j93760J09418K64360
31906C5461J18869k3789L2887M4432j81453l62622j74173J96866L16892J28883
31896A32253o0541r1691r5031j64850j92035o1412J71046L36292L02737R1970
31886C68738j13462j52019q4156p8219j08827J198K11778K41989K2858j48128
31876A61750q0551R870p6370j25566J11968L98045K85684j92543n20674l81241
$$ y = [-265475, -188328, -104077, 9829, 90574, 53365, -4775, 74094, 191550, 73408, -293149, -565468, -470002, -107507, 237080, 387582, 313151, 80465, -140219, -198225, -166870, -258435, -493481, -659804, -649710, -595412, -582974, -494189, -274320, -109985, -155108, -283276, -298138, -205235, -97705, 29599, 152492, 108372, -144557, -338317, -228899, 35461, 154330, 130541, 163428, 207860, 26407, -336215, -510388, -313522, 3370, 132253, 71712, -19979, -115010, -279860, -471895, -533307, -362261, -25969, 276768, 368738, 255276, 103257, 19101, -59118, -167945, -166747, 45031, 287020, 309878, 161750, 81199, 91069, 14699, -110867, 1101, 399146, 684830, 492287, -28387, -409628]
31866d09628j9919J21573q5552l72124l78015l4989L29435L63715J52786P5896
31856b56822J91821J42699j90946l87299j34866K30639K49797L8202j3041Q0970
31846d8846N2862m0782K6189J27215J5772j04601J04708L88403K16117k55173
31836D81864l44337J2686J50622j50256k83633O5642L05582m9732n17079m35519
31826g64160p552J51959L5161P6030K90094L03963P4981o1906O960O2292p998
31815A59824j06121k04727l29652l34382p0227K84029M04633K64137R2639N903
31805A66056m2036o6831q5004j73840k56946p6362L44392N31883K22306j55045
31795D08573j03472J75946J82503m2269j02038j8891j23559l40204k90340j0049
$$ y = [-409628, -429547, -307974, -393526, -765650, -1143665, -1178654, -849219, -485504, -332718, -256822, -65001, 77698, -113248, -500547, -635413, -404774, -154977, -116775, -129816, -48846, 4016, -36766, -10577, 116638, 132410, 27809, 132517, 520920, 737037, 481864, 137527, 150213, 300835, 150579, -133054, -67412, 238170, 188438, -328641, -764160, -771712, -619753, -584592, -508562, -218468, 85495, 160476, 98570, 105530, 167822, 159824, 53703, -151024, -480676, -815058, -885285, -601256, -196623, 67514, 160153, 166056, 124020, 57189, -27815, -201655, -458601, -534963, -190571, 341312, 563618, 408573, 305101, 481047, 663550, 621281, 519243, 500352, 376793, 36589, -253751, -263800]
31785b63800J30422J29971K61419L71593P8404l79583l68774L4843J13697k01361
31775i3169j54036M35767O87920J04543n27755l96528O9781N0080k98315k81597
31765d03309O7996J70183j9234n2634J06342J04431k6843N3763K45516J20065
31755C66276k62370m05116k22875j03861j25112M1485L73105M00032K9834k24978
31745a33580o4029J78672J71048O6083Q1594J16012N9321K7217L7530j01438l51947
31734H6483l58904m3804J87314J03643L0318K32188L92982J42928k83191l94064
31724I5893j68767K4769L3685O525J1565l3625j15018j15658j5641J10143K06267
31713D0138K01395K9346j67006r8367K12221L25925Q133l50147k77374Q1032K22333
$$ y = [-263800, -133378, -3407, 258012, 629605, 708009, 328426, -40348, -5505, 108192, -93169, -247205, 188562, 876482, 981025, 453270, 56742, 126523, 176603, -121712, -403309, -335313, -165130, -184364, -236998, -130656, -26225, -53068, 695, 246211, 366276, 103906, -301210, -524085, -627946, -753058, -711573, -338468, 61564, 91398, -133580, -197609, -18937, 152111, 218194, 299788, 415800, 475121, 502338, 539868, 438430, 86483, -272421, -316225, -128911, -25268, 5050, 237238, 630220, 773148, 489957, 95893, -72874, -48105, -14420, -7895, 3670, -29955, -144973, -260631, -276272, -166129, 40138, 241533, 270879, 103873, 5506, 217727, 543652, 551785, 201638, -75736, 5296, 227629]
31702B27629L6243j55716j78506j59817j60595q5001L1665K7114p1060p3738J5560
31691e46222J8964l7395N9695K68466K64792k1459k18631n5516K27374K52433
31681B12501M8387n2879Q1159K38835J78104q6910l10892k60061L2782K46291
31671C27317J07249k44943l90900j65843J34888J77325J2700q1487j7443O0498
31661h0639N3654L166o7171j92830l22076l01854q4538J71953K92403K83504K59422
31650A4994K43600J61817M897j26614j63305j46743j21481m9151Q7512J84154
31640H9680J39280K2721j8185J2261j9202j27887j65385o1857N7907P4151K9561
31629C3045k910n2571j36033j57987o5397L4120N9227J18535K92624L81014J30096
$$ y = [227629, 263872, 108156, -70350, -230167, -390762, -475763, -444098, -416984, -488044, -561782, -546222, -527258, -564653, -504958, -236492, 28300, 6841, -211790, -267306, -39932, 212501, 260888, 208009, 289168, 528003, 706107, 619197, 308305, 48244, 81026, 327317, 434566, 189623, -201277, -367120, -232232, -54907, -42207, -123694, -141137, -80639, -26985, -23819, -90990, -283820, -605896, -907750, -992288, -820335, -527932, -244428, 14994, 258594, 420411, 425308, 298694, 135389, -11354, -132835, -181986, -94474, 89680, 228960, 251681, 233496, 245757, 226555, 98668, -66717, -128574, -70667, 3484, 33045, 30135, -22436, -158469, -316456, -381853, -347733, -288506, -169971, 122653, 503667, 633763]
31618F33763l33420n72191l81112k7638J34020Q7113N3035J12334J19322k1586
31608a96360j55494n0638K70036M90849L67295M7623j10986j9565N1037q9792
31598F04005k53347j84915J2953L6520j30686j87031Q354K08325J53621l7716
31588B30083n3200J53043L04874K09180N861r5550j57394l57901n61623l88348
31578g10975J68319N42436L22384j10141j23728J80304J48146l00630m77685p3549
31568d35119K70216K0879l05533J901N72046M63787k84218o28247j12502M63226
31558B6436K94137l06921n38112k68770J7687P1606Q0159J76879K31670J26907
31548h8322n6671j44529k2853K38862L57509J12125k83487l54710k2489K51249
$$ y = [633763, 300343, -271848, -652960, -680598, -546578, -459465, -406430, -294096, -174774, -196360, -351854, -402492, -132456, 358393, 725688, 773311, 662325, 642760, 693797, 604005, 350658, 165743, 178696, 215216, 84530, -102501, -94147, 114178, 267799, 230083, 176883, 329926, 634800, 843980, 849841, 754291, 596897, 238996, -322627, -710975, -542656, -220, 322164, 212023, 88295, 268599, 416745, 116115, -361570, -435119, -164903, -144024, -449557, -447656, 124390, 588177, 303959, -324288, -436790, 26436, 320573, 13652, -524460, -793230, -775543, -703937, -623778, -446899, -215229, -88322, -144993, -289522, -312375, -73513, 283996, 396121, 112634, -242076, -264565, -13316]
31538a3316J55455k0177P5961K53584J47359j15262j36153M8911M7706j76410
31528B67658k35517l301J69993O9499n4723Q354N1975j10539k16636K9340L79673
31517C55776L41806p4012l54863k22631M3244J06350K5040J8791P5427N1158j8777
31506C47309R750R1948L8069j43738j94851K1159K78236K55939m7035l02393k41336
31495A13057L7444J89544L6031k08129j96404P8717K42339M3801k86708l76599
31485c26907k25868r1137L902K32819M82159L94927L335j84678L8982K12364m3380
31474D96518l68853k52886J13172J74647n5650q8521J35547J45821k06070m68868
31464c75143l38094p4025O5616K38576N29628N68685R6515m62839n01580q1316
$$ y = [-13316, 142139, 121962, 197923, 451507, 598866, 483604, 347451, 396362, 444068, 267658, 32141, 28840, 198833, 268332, 213609, 221963, 273938, 163399, -53237, -23897, 355776, 697582, 623570, 268707, 46076, 89320, 195670, 220710, 239501, 314928, 366086, 347309, 357059, 449007, 487076, 343338, 148487, 169646, 447882, 703821, 656786, 354393, 113057, 150501, 340045, 376076, 167947, -28457, 50260, 292599, 336400, 49692, -326907, -552775, -643912, -640010, -407191, 74968, 469895, 473230, 288552, 327534, 539898, 496518, 127665, -125221, -12049, 162598, 106948, 18427, 153974, 299795, 93725, -375143, -713237, -787262, -721646, -483070, 46558, 615243, 711758, 248919, -252661, -333977]
31454c33977J91829L6498k06925j54707J26107L17254K86395J58433O4931j6112
31444D69726j43403k27183r6375K09341L66575J37871k89122n16208m04434j28397
31434f21609J36854L19128L17203Q1825j86077k16375m4362P4396P3367P3248
31424G598M1845j38198l00337j56695J59958K12623l3695j53660M951J09612J2872
31413b33126J3319K12446K42532m2283k22855n1529Q1002j23682k83134l6881
31403d44191K34322N7051k60852j49233K24511K69645M606m4643J80065K04539
31393B75820r7558l00592j64710N4074J14984P7009J4678p3140o0538J44430K83631
31382B68088P2481k44626j97846J27690K07376o2752k48427j45981l7057q5958
$$ y = [-333977, -142148, -105650, -312575, -467282, -341175, -23921, 262474, 420907, 485838, 469726, 326323, 99140, 2765, 212106, 578681, 716552, 427430, -88778, -493212, -621609, -484755, -165627, 151576, 233401, 47324, -169051, -213413, -139017, -65650, 7598, 49443, -88755, -389092, -545787, -385829, -173206, -206901, -360561, -355610, -245998, -233126, -219807, -7361, 235171, 192888, -29967, -81496, -494, -124176, -407310, -444191, -209869, -152818, -413670, -562903, -338392, -68747, -64141, -108784, 71281, 275820, 178262, -122330, -287040, -232966, -117982, -40973, -26295, -99435, -159973, -15543, 268088, 340569, 95943, -101903, 25787, 233163, 170411, -78016, -223997, -261054, -347012]
31372c47012q8572M3183J07393O2329J20327K67779K23641n869q3173K8191k4872
31361C03345k84088l13816L0788K81997J11282j61578j55450p407L801n1524j7615
31350b60265M435o4373m1809J48158K51523J35649N7466J63783J60303j53552
31340D01318m46015l60926p7987N1059N3428R6956P8728q4294j17950J50165L39500
31329H3982Q4934k53498q8507M03240M82814k3382m67658l33931J21598L53966
31319C63558K18858k4820j11749j80J35644Q3675j34840k52324j46295n8336j92568
31308a19377l21597j40212J80405K31475M3155K3305K29828K32100j58790m93094
31298b92802k98375K28909M81113K31609j40401k03187p791N4010j70997l60648
$$ y = [-347012, -435584, -392401, -285008, -222679, -102352, 165427, 389068, 383199, 300026, 328217, 303345, 19257, -294559, -263771, 18226, 129508, -32070, -187520, -194927, -191126, -242650, -260265, -255830, -320203, -362012, -213854, 37669, 173318, 230784, 394567, 554870, 401318, -44697, -405623, -483610, -432551, -379123, -282167, -203439, -287733, -405683, -255518, 83982, 168916, -84582, -173089, 230151, 712965, 689583, 221925, -112006, 9592, 363558, 582416, 557596, 445847, 445667, 581311, 664986, 530146, 277822, 131527, 73191, -119377, -440974, -581186, -400781, -169306, -126151, -102846, 126982, 359082, 200292, -292802, -591177, -362268, 118845, 350454, 210053, 6866, -925, 53085, -117912, -478560]
31288d78560j66504K48099L84609J10079j49802m7023J88326J44090j35713k52525
31278a54924n2663K11031K62827P7576j88469l16775j46319K07082L47855O1210
31268C08431l24643l16085Q4229L95768K99342m7953l30242m03280k75029l5851
31258f45313J27062P8633m7165N122K15825K84690Q3083j45083j55882m9477n9239
31247c07744j60062j17255J20529K91215J57915j41889k26227M8271L66734L24944
31237C56431o3239l88050l53514q5616J01903P9897k9428l3423J34174L04652
31227B3787J95982k05561m73272k18974L16967N19964K44802l8462k5289J0242
31217C50186j91321l76315k38048M2957J35098Q5337R0309O8743p7756r1729K27777
$$ y = [-478560, -645064, -396965, -12356, 97723, -52079, -99102, 89224, 233314, 97601, -154924, -207587, 3444, 266271, 343847, 155378, -161397, -307716, -100634, 247221, 308431, -16212, -332297, -248068, 147700, 447042, 399089, 68847, -334433, -609462, -645313, -518251, -439618, -486783, -481661, -265836, 18854, 101937, -43146, -199028, -248505, -307744, -467806, -585061, -464532, -173317, -15402, -157291, -383518, -335247, 31487, 356431, 293192, -94858, -448372, -533988, -432085, -352188, -381616, -415039, -280865, 23787, 219769, 14208, -459064, -678038, -361071, 158893, 403695, 365233, 339944, 350186, 158865, -217450, -455498, -412541, -277443, -192106, -101797, -33054, -110810, -202539, 25238]
31206B5238N03587K52455l00459m78628j31468K28723K34076M4858r0776j32387
31196A55219n0838J75717L14174R5933k66100k69622R4128K65361l4536l82985
31186I6451l10148O1211K94954K18470k9439k52441k87464p5097J99678K51337
31176A67512P5786n2665k2015j3949j14325j34923L5393K15808K30526J45068
31166E32216O3604l9488j50376j44927j9330O0461M0401L8225M6477r4175l19150
31155A3938l06720J0566K61724J77176l0524p3651m4003j49392k72646j57182
31145e70714J34353K87456J83294Q805l9018M8559J65127K09054J40405L844j14391
31134D56774j59762j06179M3162J55706K0050l04941l77149O5261N90497N65857
$$ y = [25238, 528825, 781280, 480821, 2193, -129275, 99448, 333524, 378382, 287606, 155219, 104381, 280098, 594272, 690205, 424105, 154483, 248611, 513972, 479436, 96451, -213697, -152486, 142468, 360938, 331499, 79058, -208406, -283503, -83825, 167512, 243298, 190633, 168618, 154669, 40344, -94579, -59186, 156622, 387148, 532216, 595820, 556332, 405956, 261029, 241699, 302160, 342561, 380786, 427263, 333088, 13938, -292782, -282216, -20492, 156684, 126160, 52509, 8506, -140886, -413532, -570714, -436361, -148905, 34389, 43194, 4176, 52735, 217862, 426916, 567321, 571165, 456774, 297012, 190833, 233995, 389701, 409751, 104810, -272339, -207078, 383419, 949276]
31124I49276O1147k73371k02509j48509l36152l83939m1327K95174K28933M744
31114A53467J8721J24592l2151l22506l39950q3816Q6081M2114k8234l2563m6105
31103d60350m3228P1640K14575K14290R0344j7726q7539j37883q0201Q9204J41826
31092e048m3820k07180r9455P5268J567j82164j20380J20380J58481l5796j01011
31081d39158P8923J96494O7723q4148l8186R4335J17560M6307n297k0371l7849
31070b3667o2123q0867o5469K6402J31787O9386j76332l01583p0650K78020L28552
31059E3456Q4837q3999k3481O8758O2391M9510N0527m3878j70856j13858Q6984
31048B0391J20944p3119j55907N5943K45165P6788k53703k78688Q2431M18575
$$ y = [949276, 1010423, 737052, 534543, 386034, 49882, -334057, -375384, -80210, 148723, 153467, 172188, 296780, 264629, -57877, -397827, -481643, -395562, -353448, -381682, -414245, -460350, -503578, -431938, -217363, -3073, 87271, 69545, -17994, -155877, -236078, -146874, -5048, -48868, -256048, -355503, -280235, -278668, -460832, -581212, -460832, -302351, -338147, -439158, -360235, -163741, -96018, -180166, -218352, -124017, -6457, 39850, 34553, 14182, -23667, -85790, -166657, -232126, -205724, -73937, -4551, -180883, -482466, -553116, -275096, 53456, 138293, 54294, 30813, 99571, 161962, 211472, 261999, 218121, 47265, -66593, 20391, 141335, 68216, -87691, -31748, 213417, 290205, 36502, -242186, -159755, 258820]
31038B58820L50366m8268l81967l82350j64233j9969j3223N5280K29994K28515
31028A12965p9334k97827k3431M44190M40246o0943l71225j26109K03045J04780
31018C46357k07979k45846l7564K4360j26118j95329o5248Q2436J35170J63471
31008a26290J70523N8839j27889k09031j43005n7997M089J24895K65278K46401
30998B05813N2409q5396k3841P3165p28j69986k00885n8934N1812k162j03606
30987b62339p3219P8325J91732J94328J58564J16009l0560l00843m66673k87162
30977f81838J16612L44030K21677J1537L192J16912J12098Q334N985Q0346N929
30966C44814j90166j69320J63323L81130J09667l65752m60599j34358Q9902l5277
$$ y = [258820, 609186, 560918, 178951, -203399, -367632, -387601, -400824, -345544, -115550, 112965, 33631, -264196, -287627, 156563, 596809, 535866, 164641, 38532, 241577, 346357, 138378, -107468, -145032, -120672, -246790, -442119, -507367, -424931, -289761, -126290, 44233, 103072, -24817, -233848, -376853, -434850, -430761, -305866, -40588, 205813, 258222, 172826, 148985, 222150, 221422, 51436, -149449, -208383, -156571, -158733, -262339, -335558, -257233, -65501, 128827, 287391, 403400, 372840, 71997, -394676, -681838, -565226, -221196, 481, 12018, 15210, 132122, 244220, 252554, 258539, 338885, 344814, 154648, -14672, 148651, 529781, 639448, 273696, -186903, -321261, -231359, -266636]
30956b66636j35126Q7402K94614P6197k92175k26435K00475L21710n8397l24132
30946c22503k4219M08607L56953k3178j24383J14660J88664p9235k75394j35990
30936H3982L7923l7269j19624J02755L97402K91080j79843m73735k82847J11434
30926f8742K91309J91966L289j57018k65942k55112q0672J26779J77276P3582
30916C6715q922J7671P5002R3635Q0169o166k18078m01113k77937J07917L17153
30905a83954J17238j20457L1962L58744L13094j12388l72613k17485J0054K4075
30895a51730j5563L8156J6426j23736p5567K34214L37032m6646m29246k61670
30885d78330J78722K46423l3015j00178J46242K52551O1236p9728k3095l8473
$$ y = [-266636, -401762, -314360, -19746, 56451, -235724, -462159, -261684, 60026, 1629, -322503, -346722, 61885, 418838, 395660, 271277, 385937, 574601, 495366, 219972, 83982, 121905, 84636, -34988, 67767, 465169, 756249, 576406, 102671, -180176, -68742, 222567, 414533, 417822, 260804, -5138, -260250, -340922, -214143, -36867, 36715, 27793, 45464, 120466, 214101, 294270, 288104, 70026, -331087, -609024, -501107, -183954, -66716, -187173, -155211, 203533, 516627, 404239, 31626, -185859, -175805, -151730, -167293, -129137, -112711, -236447, -312014, -77800, 259232, 212586, -216660, -478330, -299608, -53185, -86200, -186378, -40136, 212415, 273651, 193923, 170828, 132355]
30875A32355j82225j23562J79773K66989o4057l52582j89017J69405K82005J71202
30865B90286P3738l9729k37866k78021J8019L14758K01723j30002j75765O5586
30855A02727J20663j49668l25390j15509K01058K28533M640j43902p8975M6589
30845a09234O1971k1764o9720k524R3194N3526j35822k70773j71021P4778K19293
30834b78096J64099L7927l1P4819J61169J25968o0343k20169j14230K01042L17255
30823D09410j9548m70754m66899K0876L96855K20288k25261l45328j5173L26330
30813a69204K97031J4534j49665o3078P8587P7644k6893q4974o8378o6330j07001
30802b67727j16252n9245j348J3179L3309Q7146J01408L3369q979Q4112K13554
$$ y = [132355, -49870, -173432, 6341, 273330, 209273, -143309, -332326, -162921, 119084, 290286, 364024, 324295, 86429, -191592, -173573, 141185, 342908, 212906, 37141, 102727, 223390, 73722, -251668, -367177, -166119, 62414, 67054, -76848, -155823, -109234, -47263, -69027, -138747, -141271, -48077, 5449, -130373, -401146, -572167, -497389, -278096, -113997, -76070, -76101, -1282, 159887, 285855, 225512, 5343, -108887, 92155, 409410, 389862, -80892, -547791, -526915, -130060, 90228, -135033, -480361, -495534, -169204, 127827, 142361, -7304, -70382, 8205, 85849, 58956, -26018, -94396, -160726, -267727, -383979, -443224, -444572, -431393, -398084, -310938, -209530, -176161, -185140, -101028, 112526]
30791A12526J76481k8647j81453j63332j13863j61551j83347k5223J70560J29459
30781b68390r9708j55882R7878L43770K76200L3305p7110n2942q2447j27828j3991
30770a27145J52369P9192j89367k75326o3827J26226R0433K1530O4813M5822r9013
30759a74293p9154K07639L25972m8739n08115m69303n7176J55047O2389N1610
30749e34123K34127L09101J80901J00330J37276P7547q3220r3317K3950m4106
30739C08466k69413k27516J50451L63488J32580j58682j26896M3862O1197L9520
30729C17057J24735P1295k95391n73429l05154K54742M51953J62626j18029n9119
30719C1286J17114P8239j58551l16452j96123J35659L87848L13956J2324j61333
$$ y = [112526, 289007, 260360, 78907, -84425, -198288, -359839, -543186, -568409, -397849, -268390, -368098, -523980, -426102, -82332, 193868, 227173, 150063, 97121, 14674, -113154, -127145, 25224, 104416, -84951, -360277, -424104, -297878, -207445, -185915, -121102, -75280, -174293, -253447, -45808, 280164, 231425, -276690, -745993, -803169, -648122, -585733, -534123, -299996, 9105, 190006, 290336, 427612, 505159, 421939, 328622, 352572, 308466, 39053, -188463, -38012, 325476, 458056, 299374, 172478, 216340, 277537, 317057, 441792, 513087, 217696, -355733, -660887, -406145, 45808, 208434, 90405, 31286, 148400, 226639, 68088, -248364, -444487, -308828, 79020, 392976, 405300, 243967]
30709B43967n2714J09687Q9259m3371j16094j28550j41222j22371p3926p6130
30699c11465p2811R7947L30284K78818o5132k57288r9839K5427j48331k65645
30689d88035N045L12072J86325j48622j77200L6865O3809q7232r5211k9270j63687
30678e85141k73336O1134N48564M76139q8400l09059O5600L05946m4097m30687
30668b73337k81419P5115Q2593j11852o9071J13103P4587p6508J7496K69572K95805
30657A16084Q3999m4784p145J7893M087L2624k5591k76415l96942l9043M53712
30646h1521L85132k10407n12965j29400L12673J49571l19753l58353P5646L48940
30636c40437J52206j23175o0971K13644L24481J65059q8325k67271l04008j70890
$$ y = [243967, 191253, 300940, 390199, 346828, 230734, 102184, -39038, -161409, -235335, -311465, -384276, -286329, 43955, 322773, 257641, 353, -99486, -74059, -222390, -488035, -482990, -170918, 15407, -133215, -310415, -273550, -209741, -296973, -392184, -421454, -585141, -858477, -797343, -248779, 227360, 138960, -170099, -104499, 201447, 157350, -273337, -554756, -479641, -397048, -508900, -577971, -464868, -390281, -466789, -449293, -179721, 116084, 200083, 155299, 148154, 166047, 170134, 202758, 177167, -99248, -496190, -535233, -81521, 303611, 93204, -419761, -549161, -236488, -86917, -406670, -765023, -689377, -340437, -188231, -311406, -372377, -158733, 165748, 330807, 242482, -24789, -328797, -499687]
30626d99687O9810K18957J20808j09742j72656N9586L46859L25314m3003l45605
30616b9359j69874L27365N18230J15582l54018k24959L17128M33009j41281o55321
30606A36502m23546J96677M01356J05103j22266m2298K9958p1491j25993o5449
30596A8553j18958k74096j93768J34123K57798K4304j18869Q5213K18246n6902
30586b4356l25993r4242L34635L22760p8835k70704q1757Q1974K936p2585K9336
30575a76831J41674J24468O8145L8056k5076r1022m2551Q2347J32774J03416P6337
30564D31737m383j82324k41334o76K55644J02503l31729m84939j83499J50691
30554d88309J86855R2756J08690J54234P6811m6651p7668m5155l9044o0650p8973
$$ y = [-499687, -429877, -210920, -90112, -199854, -372510, -312924, 33935, 359249, 316246, -29359, -199233, 128132, 646362, 761944, 407926, 182967, 500095, 933104, 791823, 136502, -287044, -90367, 310989, 416092, 293826, 251528, 281486, 209995, 84002, 18553, -100405, -374501, -568269, -434146, -176348, -152044, -270913, -185700, 32546, -24356, -350349, -444591, -109956, 212804, 133969, -136735, -218492, -136518, -133582, -206167, -176831, -35157, 89311, 157456, 195512, 170436, 79414, 36863, 119210, 251984, 355400, 431737, 427354, 245030, 3696, 3020, 258664, 361167, 29438, -455501, -639000, -488309, -301454, -208698, -100008, 54226, 131037, 84386, 6718, -38437, -77481, -138131, -217104]
30543b17104p1078K1594J94672K64681P9731j90368k33377l4999J25007Q8515
30533B7274l3342r9921q0216R825R8603P3583j9754K2467J81828J48351j13781
30522B14917j63772J63198L19566o4759m07229q0813M11501J88323m68738n32150
30512d19956J6443J96949j88481k31792L45642O00676O5872l56364J5589M37169
30502D81747J05107m05082k22011K49963J16147l89101m00065J337N1267k14226
30492f24917r3708L51999L41644j63915l21465J12358L57737j4788l76983j66492
30482e98530K17106J97201n2848p0211Q0673N1078j25551j51301j252R7864P4146
30471b81625O1774J38581K30904K09497j4756l68771n58877l28372J74872M86097
$$ y = [-217104, -288182, -266588, -71916, 192765, 272496, 82128, -151249, -186248, -61241, 27274, -6068, -105989, -186205, -176380, -77777, -4194, -23948, -1481, 180347, 328698, 214917, 51145, 214343, 533909, 469150, 61921, -18892, 392609, 580932, 112194, -419956, -403513, -206564, -395045, -626837, -281195, 319481, 385353, 28989, 44578, 481747, 586854, 181772, -40239, 209724, 325871, -63230, -463295, -461958, -410691, -624917, -718625, -366626, -24982, -188897, -510362, -398004, -40267, -55055, -432038, -598530, -381424, -184223, -237071, -307282, -226609, -175531, -301082, -452383, -453635, -355771, -281625, -219851, -81270, 149634, 359131, 344375, -24396, -583273, -911645, -736773, -250676]
30461b50676L43692l7522k45604q9132K52110L77053L9488n08555p03293l49574
30451a172013J13515K38825J59742K19977L32337J88015j17671k07690m5885P9674
30441b11174R3915J36997J33905p5964k59165n1043L34362L13726j13502l12723
30431a0666k9950K45887J50342k0930L7800J03745m9353j52657M9541K52009O0239
30420F36007l32861m33630j66335J23727J90235M7738j96113l53447k03747J80868
30410e07558L83321J95330m1406M1148K66478K48751K6055r3697j07902k42025
30400A68495m24900l53111m4467J54173J32104J29308K24351J72912r0865k23537
30390a55537N809L00347K43704j07426l42173k59308k5653J41878J83104J16783
$$ y = [-250676, 93016, 55494, -190110, -279242, -27132, 349921, 389409, -119146, -822439, -1172013, -1058498, -819673, -659931, -439954, -107617, 80398, -37273, -244963, -290848, -211174, -117259, 19738, 153643, 77679, -181486, -232529, 101833, 415559, 302057, -10666, -40616, 205271, 355613, 334683, 372483, 476228, 426875, 274218, 323759, 575768, 636007, 303146, -130484, -296819, -173092, 17143, 64881, -131232, -484679, -688426, -507558, -124237, 71093, 29687, 70835, 337313, 586064, 612119, 518422, 410520, 168495, -256405, -609516, -653983, -499810, -367706, -238398, -14047, 158865, 68000, -155537, -149728, 150619, 394323, 286897, -55276, -314584, -340237, -198359, -15255, 101528]
30380A01528j715m1257P5896J96456R9210j46888k33187q1039J8957j18552k44727
30369c75318o8301K61716L83763K56005J02156k8349k23375l33693j39988J25234
30359d0150p394m24626m51479R3370N17641L06688q1210j5769K74818J86774j68311
30348A90352j87473J33641J98169j37672l32040j02472J39705L9526j54083j04633
30338c16980O6640R8024M9922J09783K20174J92900O410j97643k61814r2298K12805
30327H7923L30980Q3378k22038j75954P7139N0092k42253k45835K03304N29057
30317D75793K70961k43991m36000k41528J7021J61772J92081Q4409j04054j72954
30307C510p9965m7882j64000j96378l5144N4197r6117k01169J2037L13546L20970
$$ y = [101528, 99813, 58556, 134452, 330908, 430118, 283230, 50043, -30996, -12039, -130591, -375318, -443619, -181903, 201860, 457865, 560021, 531672, 308297, -25396, -165384, -40150, -47544, -472170, -923649, -830279, -312638, -5950, -87160, -102929, 171889, 358663, 190352, 2879, 136520, 334689, 197017, -135023, -237495, -97790, -58264, -212347, -316980, -250340, -152316, -102394, 7389, 227563, 420463, 426873, 229230, -32584, -124882, 87923, 418903, 502281, 280243, 104289, 181428, 231520, -10733, -256568, -53264, 475793, 746754, 502763, 66763, -174765, -157744, 4028, 196109, 280518, 176464, 3510, -76455, -124337, -288337, -484715, -519859, -465662, -561779, -762948, -750911, -437365, -116395]
30296a16395P1830j19313j43198r3256N921J46343K02507J18809K9207j4156j43514
30285e5215l02274j62582K88665N12673J71983k83468k65460P8033J84612k2837
30275A44130j52872n8877N1933R3252J39199R7532j37199l10906j12786K44675
30265a919K78253j3298j88767r3378R301j206J7190K5603j77070m49196l96988
30254i91475m2252J71804J22841J52046L46969L40384M5040p3412K06136M02639
30244F80720J04050l34322l58267n0803J18282L7251o5229j03774j06811M5254
30234c3649L50968M01009p6941n82759l99713K96005N79978J07557m06571k91240
30224e5356J46326K30900m3653j75096m7970j8085j79451j71711J54226M02204
$$ y = [-116395, -44565, -163878, -307076, -400332, -394411, -248068, -45561, 73248, 102455, 88299, -55215, -357489, -520071, -231406, 281267, 453250, 169782, -95678, -17645, 166967, 144130, -8742, -67619, -15686, 77566, 216765, 314297, 177098, -133808, -246594, -1919, 276334, 263036, 74269, -19109, -9808, -11014, 6176, 31779, -145291, -594487, -991475, -1033727, -861923, -739082, -587036, -240067, 100317, 145357, 71945, 278081, 680720, 784770, 450448, 92181, 41378, 159660, 196911, 131682, 27908, -78903, -33649, 317319, 718328, 641387, 58628, -341085, -45080, 534898, 642455, 235884, -55356, 90970, 321870, 278217, 103121, 55151, 37066, -142385, -314096, -159870, 242334]
30214B42334K28061j20966j98113q781J06309N6595N0752J23311M2696k32447
30204B89751l78522j63576J95163L32528J97493J6082n6009m1407M011O0499J01822
30193E57835R5563K1451j38254l37618l99936j87317J33859K24609M5877o1338
30183d5269J03901K89525K02130m4688j69135j71120k17847k66770j62639J3648
30173d68264N8171K8500J51518L82277M17842J71405r8503j82162j44874j01500
30163B14410m7709L477k8174j08678p7547R2585K15610J51767j9238j42934j49124
30152A04445l3689J45228K22656O3440k12361l16214j50869P8264J48703N7112
30142A06715o3670j04421k2902J23879J71438K0696j79223j86462k879J28661
$$ y = [242334, 470395, 349429, 151316, 142535, 248844, 305439, 356191, 479502, 522198, 289751, -88771, -252347, -57184, 275344, 472837, 488919, 432910, 391503, 395514, 456013, 557835, 653398, 674849, 536595, 198977, -200959, -388276, -254417, -29808, 16069, -45269, 58632, 348157, 550287, 505599, 336464, 165344, -52503, -319273, -481912, -468264, -410093, -381593, -230075, 152202, 570044, 741449, 642946, 460784, 315910, 214410, 166701, 170178, 142004, 33326, -44221, 48364, 263974, 415741, 396503, 253569, 104445, 70756, 215984, 438640, 502080, 289719, -26495, -177364, -99100, 49603, 106715, 43045, -61376, -84278, 39601, 211039, 231735, 52512, -133950, -136829, -8168]
30132h168P0331o3410j28778j22471q0760L570R5987J10075M9573L1707J16801
30121G4457K19949K20641P6638j54608l21318k66412k5635J48630R4339m5296
30111B1385p2706m2494r4338j51022p7326J3235m0979p9003J39994M23072L54220
30100C94038q682j72381l388O4446k13584m59598k82444J19043L00018J80318
30090h2214j0543j18242r8038P9501K83180K33445p8906k56711n8151J95139J05078
30079A93538j83524k49688o1409P2499P4382J50882L12562K92434J2629k41943
30069C72362k39997j03513m8687n4479L6729K17697K85343R9193k18309l89016
$$ y = [-8168, 62163, -1247, -130025, -252496, -333256, -329686, -233699, -123624, -74051, -42344, 74457, 294406, 515047, 591685, 437077, 115759, -150653, -176288, -27658, 66681, 21385, -51321, -93815, -188153, -339175, -416501, -403266, -444245, -523248, -383254, 39818, 394038, 385356, 212975, 209587, 274033, 60449, -399149, -681593, -562550, -262532, -82214, -92757, -210999, -309037, -229536, 53644, 287089, 208183, -48528, -106679, 88460, 193538, 10014, -239674, -301083, -228584, -154202, -3320, 309242, 601676, 614305, 372362, 132365, 28852, -19835, -74314, -37585, 180112, 465455, 564648, 346339, -42677]
$$ [...]
##END NTUPLES=NMR SPECTRUM
##END=
