##TITLE=31Pdec_115-2024-Bay
 CDCl3, 64 sc
 26.12.2024
##JCAMPDX= 6.0         $$ Bruker NMR JCAMP-DX V2.0
##DATA TYPE= NMR SPECTRUM
##DATA CLASS= NTUPLES
##ORIGIN= UXNMR, Bruker Analytische Messtechnik GmbH
##OWNER= root
$$ XWIN-NMR		Version 3.5
$$ Thu Dec 26 14:44:25 2024 Russian Standard Time (UT+4h)  she@DPX200
##.OBSERVE FREQUENCY= 81.013821
##.OBSERVE NUCLEUS= ^31P
##.ACQUISITION MODE= SIMULTANEOUS
##.ACQUISITION SCHEME= undefined
##.AVERAGES= 64
##.DIGITISER RES= 17
##SPECTROMETER/DATA SYSTEM= spect
##.PULSE SEQUENCE= zgpg30
##.SOLVENT NAME= CDCl3
##.SHIFT REFERENCE= (INTERNAL, CDCl3, 0, 198.062)
##AUDIT TRAIL= $$ (NUMBER, WHEN, WHO, WHERE, WHAT)
$$ ##TITLE= Audit trail, XWIN-NMR		Version 3.5
$$ ##JCAMPDX= 5.01
$$ ##ORIGIN= Bruker BioSpin GmbH
$$ ##OWNER= she
$$ F:/spectra/data/she/nmr/P31/2/pdata/1/auditp.txt
$$ ##AUDIT TRAIL=  $$ (NUMBER, WHEN, WHO, WHERE, WHAT)
(   1,<2024-12-26 14:43:35.03 +0400>,<she>,<DPX200>,
      <continue with go, POWCHK disabled, PULCHK disabled
       configuration hash MD5:
       00 E9 B6 7A A2 85 ED C7 34 08 36 98 17 FE 4E 26
       data hash MD5: 32K
       5C 43 66 99 29 5B 67 E9 EE BC 0F A7 3C 64 6A 42>)
(   2,<2024-12-26 14:43:36.98 +0400>,<she>,<DPX200>,
      <Start of raw data processing
       efp BC_mod = 2 LB = 1.5 FT_mod = 6 PKNL = 1 PHC0 = 2055.164 PHC1 = 181.0863 SI = 64K 
       data hash MD5: 64K
       D8 7F 74 8A F1 6D 27 3B F1 12 B9 FD 78 D4 0F D7>)
(   3,<2024-12-26 14:43:54.09 +0400>,<she>,<DPX200>,
      <pk PHC0 = 88.33949 PHC1 = -153.2 
       data hash MD5: 64K
       3A 84 E8 57 5E D9 A1 A8 50 09 89 29 EC 72 88 A6>)
(   4,<2024-12-26 14:43:57.96 +0400>,<she>,<DPX200>,
      <abs ABSG = 5 
       data hash MD5: 64K
       4E 6A 40 5A 08 49 C0 F5 E4 44 24 DD 4A E3 02 65>)
$$ ##END=
$$ 
$$ hash MD5
$$ 5C EF 76 28 B8 91 73 12 28 01 E0 37 00 D5 97 90
##$RELAX= 
##$RELAX= 
##$RELAX= 
##$RELAX= 
##$RELAX= 
##$RELAX= 
##$RELAX= 
##$RELAX= 
$$ Bruker specific parameters
$$ --------------------------
##$DU= <F:/spectra>
##$EXPNO= 2
##$NAME= <P31>
##$PROCNO= 1
##$TYPE= <nmr>
##$USER= <she>
##$AMP= (0..31)
100 100 100 100 100 100 100 100 100 100 100 100 100 100 100 100 100 100 
100 100 100 100 100 100 100 100 100 100 100 100 100 100 
##$AQSEQ= 0
##$AQ_mod= 1
##$AUNM= <au_zg>
##$AUTOPOS= <>
##$BF1= 81.014009
##$BF2= 200.13
##$BF3= 200.13
##$BF4= 200.13
##$BF5= 200.13
##$BF6= 200.13
##$BF7= 200.13
##$BF8= 200.13
##$BYTORDA= 1
##$CFDGTYP= 0
##$CFRGTYP= 5
##$CHEMSTR= <none>
##$CNST= (0..31)
1 1 145 1 1 1 1 1 1 1 1 1 1 1 1 1 1 1 1 1 1 1 1 1 1 1 1 1 1 1 1 1 
##$CPDPRG= <waltz16>
##$CPDPRG1= <>
##$CPDPRG2= <waltz16>
##$CPDPRG3= <>
##$CPDPRG4= <mlev>
##$CPDPRG5= <mlev>
##$CPDPRG6= <mlev>
##$CPDPRG7= <mlev>
##$CPDPRG8= <mlev>
##$CPDPRGB= <>
##$CPDPRGT= <>
##$D= (0..31)
0 1 0 0 0 0 0 0 0 0.06 0 0.03 2e-05 3e-06 0 0 0.0002 0 0 0 0 0 0 0 0 0 
0 0 0 0 0 0 
##$DATE= 1735209726
##$DBL= (0..7)
120 120 120 11 120 120 24 19 
##$DBP= (0..7)
150 150 150 150 150 150 150 150 
##$DBP07= 0
##$DBPNAM0= <>
##$DBPNAM1= <>
$$ [...]
##$SUBNAM3= <"">
##$SUBNAM4= <"">
##$SUBNAM5= <"">
##$SUBNAM6= <"">
##$SUBNAM7= <"">
##$SUBNAM8= <"">
##$SUBNAM9= <"">
##$SW= 400.765351723535
##$SWIBOX= (0..15)
0 1 3 0 0 0 0 0 0 0 0 0 0 0 0 0 
##$SW_h= 32467.5324675325
##$TD= 32768
##$TD0= 1
##$TE= 0
##$TE2= 300
##$TE3= 300
##$TEG= 300
##$TL= (0..7)
0 120 53 12 22 120 120 120 
##$TP= (0..7)
150 150 150 150 150 150 150 150 
##$TP07= 0
##$TPNAME0= <>
##$TPNAME1= <>
##$TPNAME2= <>
##$TPNAME3= <>
##$TPNAME4= <>
##$TPNAME5= <>
##$TPNAME6= <>
##$TPNAME7= <>
##$TPOAL= (0..7)
0.5 0.5 0.5 0.5 0.5 0.5 0.5 0.5 
##$TPOFFS= (0..7)
0 0 0 0 0 0 0 0 
##$TUNHIN= 0
##$TUNHOUT= 0
##$TUNXOUT= 0
##$USERA1= <user>
##$USERA2= <user>
##$USERA3= <user>
##$USERA4= <user>
##$USERA5= <user>
##$V9= 5
##$VALIST= <valist>
##$VCLIST= <CCCCCCCCCCCCCCC>
##$VD= 0
##$VDLIST= <DDDDDDDDDDDDDDD>
##$VPLIST= <PPPPPPPPPPPPPPP>
##$VTLIST= <TTTTTTTTTTTTTTT>
##$WBST= 1024
##$WBSW= 4
##$XGAIN= (0..3)
0 0 0 0 
##$XL= 0
##$YL= 0
##$YMAX_a= 33733
##$YMIN_a= -33130
##$ZGOPTNS= <>
##$ZL1= 120
##$ZL2= 120
##$ZL3= 120
##$ZL4= 120
##$ABSF1= 198.0616
##$ABSF2= -202.7028
##$ABSG= 5
##$ABSL= 3
##$ALPHA= 0
##$AQORDER= 0
##$ASSFAC= 0
##$ASSFACI= 0
##$ASSFACX= 0
##$ASSWID= 0
##$AUNMP= <proc_1d>
##$AZFE= 0.1
##$AZFW= 0.5
##$BCFW= 0
##$BC_mod= 2
##$BYTORDP= 0
##$COROFFS= 0
##$CY= -3
##$DATMOD= 1
##$DC= 0
##$DFILT= <>
##$DTYPP= 0
##$F1P= 0
##$F2P= 0
##$FCOR= 1
##$FTSIZE= 65536
##$FT_mod= 6
##$GAMMA= 0
##$GB= 0
##$INTBC= 1
##$INTSCL= 9.790993e-09
##$ISEN= 30
##$LB= 1.5
##$LEV0= 0
##$LPBIN= 0
##$MAXI= 10000
##$MC2= 0
##$MEAN= 0
##$ME_mod= 0
##$MI= 50
##$NCOEF= 0
##$NC_proc= -9
##$NLEV= 6
##$NOISF1= 182.463
##$NOISF2= 159.3651
##$NSP= 0
##$NTH_PI= 0
##$NZP= 0
##$OFFSET= 198.0616
##$PC= 4
##$PHC0= 2143.504
##$PHC1= 27.88631
##$PH_mod= 1
##$PKNL= yes
##$PPARMOD= 0
##$PSCAL= 0
##$PSIGN= 0
##$REVERSE= no
##$SF= 81.0140089999434
##$SI= 65536
##$SIGF1= 159.3651
##$SIGF2= -187.1042
##$SINO= 113.3802
##$SIOLD= 16384
##$SREGLST= <1H.CDCl3>
##$SSB= 0
##$STSI= 65536
##$STSR= 0
##$SW_p= 32467.5324675325
##$SYMM= 0
##$S_DEV= 0
##$TDeff= 32768
##$TDoff= 0
##$TI= <>
##$TILT= no
##$TM1= 0
##$TM2= 0
##$TOPLEV= 0
##$USERP1= <user>
##$USERP2= <user>
##$USERP3= <user>
##$USERP4= <user>
##$USERP5= <user>
##$WDW= 1
##$XDIM= 65536
##$YMAX_p= 417828812
##$YMIN_p= -146169853
$$ End of Bruker specific parameters
$$ ---------------------------------
##NTUPLES= NMR SPECTRUM
##VAR_NAME=  FREQUENCY,     SPECTRUM/REAL,   SPECTRUM/IMAG
##SYMBOL=    X,             R,               I
##VAR_TYPE=  INDEPENDENT,   DEPENDENT,       DEPENDENT
##VAR_FORM=  AFFN,          ASDF,            ASDF
##VAR_DIM=   65536,         65536,           65536
##UNITS=     HZ,            ARBITRARY UNITS, ARBITRARY UNITS
##FACTOR=    0.49542278885378, 1,            1
##FIRST=     16045.7642231865, 0,            0
##LAST=      -16421.768244346, 0,            0
##MIN=       -16421.768244346, -146169853,   0
##MAX=       16045.7642231865, 417828812,    0
$$ Real data points
##PAGE= N=1
##DATA TABLE= (X++(R..R)), XYDATA
$$ [...]
$$ plain form
38861 -2582189 -4685629 -10728577 -11132957 -5265817 -557805 380956 2696584 9587124
38853 9587124 17754770 23640459 27200901 27813089 23019627 14190450 7933110 8269161
38845 8269161 11413521 11707311 9335603 8499059 10470551 12475888 12460065 11609549 12047970
38836 12047970 14174189 16619478 17667403 16555658 13908941 10765844 7223557 2972079
38828 2972079 -605388 -291466 5757706 15161886 22821227 25435275 23844281 20553362
38820 20553362 15852167 8197741 -1052954 -5896035 -1841283 7087910 11574695 7892468
38812 7892468 1527387 -1417529 -1655972 -2727749 -4689418 -6680049 -11328983 -19807787
38804 -19807787 -25477684 -20657685 -8812178 -1384252 -1581326 -190432 9385179 20480567
$$ packed form
38861b582189k103440o042948m04380N867140M708012R38761K315628O890540
38853I587124Q167646N885689L560442O12188m793462q829177o257340L36051
38845H269161L144360K93790k371708q36544J971492K005337j5823q50516M38421
38836A2047970K126219K445289J047925j111745k646717l143097l542287m251478
38828B972079l577467L13922O049172R404180P659341K614048j590994l290919
38820B0553362m701195p654426r250695m843081M054752Q929193M486785l682227
38812G892468o365081k944916k38443j071777j961669j990631m648934q478804
38804a9807787n669897M819999J1845507P427926j97074J390894R575611J1095388
$$ plain form
38796 20480567 23180737 18327814 14561223 15801800 18914456 21248375 23413331 25288600
38788 25288600 25264387 23682752 22409702 20981695 17429072 12897376 11183470 13203895
38780 13203895 15651782 15647223 13327297 9529772 4553235 -20511 -1683150 -386153
38772 -386153 1003232 360331 -1878248 -4411998 -5465984 -1727290 8651483 20803435
38764 20803435 25455713 19289677 9771684 6664811 11228388 16926051 18691234 17561483
38756 17561483 16667525 16341816 14642336 11073530 8079351 8398806 11419761 13499353
38748 13499353 12746270 11861648 14047827 17479877 17368764 13173510 9618477 9767153 11311514
38739 11311514 11401934 10996339 11899796 13282855 14106163 15347905 16445092 13473069 5489318
$$ packed form
38796B0480567K700170m852923l766591J240577L112656K333919K164956J875269
38788B5288600k4213j581635j273050j428007l552623m531696j713906K020425
38780A3203895K447887m559k319926l797525m976537m573746j662639J296997
38772c86153J389385o42901k238579k533750j053986L738694J0378773J2151952
38764B0803435M652278o166036r517993l106873M563577N697663J765183j129751
38756A7561483q93958l25709j699480l568806k994179L19455L020955K079592
38748A3499353p53083q84622K186179L432050j11113m195254l555033J48676J544361
38739A1311514R0420m05595R03457J383059Q23308J241742J097187k972023p983751
$$ plain form
38730 5489318 -860703 882239 6729419 6368469 -2962787 -13081813 -15886349 -11670921
38722 -11670921 -4862069 2734155 11303700 19743748 26233534 29682527 28994031 23816046
38714 23816046 17216016 13882556 14075920 13407989 10375531 9009330 10900651 10119464
38706 10119464 1513913 -9970666 -14728063 -10890273 -4846462 -915546 2437779 6163157
38698 6163157 7780207 7032717 8145097 13147812 17728339 17296658 13420267 10745322
38690 10745322 10878923 13011944 17440927 23926150 28720444 28154012 24220268 21949189
38682 21949189 21526424 17737324 7988787 -3393061 -10352371 -10950818 -6428220 1623272
38674 1623272 10177687 14083256 10755906 4446651 2123516 5430542 10063224 13040277
$$ packed form
38730E489318o350021J742942N847180l60950r331256j0119026k804536M215428
38722a1670921O808852P596224Q569545Q440048O489786L448993o88496n177985
38714B3816046o600030l333460J93364o67931l032458j366201J891321p81187
38706A0119464q605551j1484579m757397L837790O043811L930916L353325L725378
38698F163157J617050p47490J112380N002715M580527m31681l876391k674945
38690A0745322J33601K133021M428983O485223M794294n66432l933744k271079
38682B1949189m22765l789100r748537j1381848o959310n98447M522598Q051492
38674A623272Q554415L905569l327350o309255k323135L307026M632682K977053
$$ plain form
38666 13040277 16618077 23403830 30919769 34136756 32027594 28648298 27826048 29094898
38658 29094898 29373061 26798334 21906436 16297962 11458023 8299669 6559372 4667830
38650 4667830 1301219 -2737169 -5282602 -5972020 -7252945 -10652755 -13026629 -9457803
38642 -9457803 -689805 5423933 2775520 -4417720 -5803515 2372564 12824070 16971978
38634 16971978 15103674 13464031 14227690 13496632 8797491 3443859 1579135 2544132
38626 2544132 3025741 2542337 3458781 6285005 8171214 6924179 4450701 4731934 9258377
38617 9258377 15804974 21311131 24344341 24381835 20754831 14461437 9953112 11764728
38609 11764728 18528879 23340819 21865283 17383177 15458913 16653276 18248223 20237358
$$ packed form
38666A3040277L577800O785753P515939L216987k109162l379296q22250J268850
38658B9094898K78163k574727m891898n608474m839939l158354j740297j891542
38650D667830l366611m038388k545433o89418j280925l399810k373874L568826
38642i457803Q767998O113738k648413p193240j385795Q176079J0451506M147908
38634A6971978j868304j639643P63659p31058m699141n353632j864724R64997
38626B544132M81609m83404R16444K826224J886209j247035k473478K81233M526443
38617I258377O546597N506157L033210L7494l627004o293394m508325J811616
38609A1764728O764151M811940j475536m482106j924264J194363J594947J989135
$$ plain form
38601 20237358 23769884 25061146 18244009 5667552 -1683894 2479329 11817291 16947043
38593 16947043 17306062 17629084 17583791 13152634 6228482 4209930 9283810 15293222 17107977
38584 17107977 16846951 18137647 19745899 18611879 15159109 11881463 9621544 8370859
38576 8370859 8902233 10487721 9817348 5707919 2393379 4119447 8298306 8402059 2763974
38567 2763974 -3834128 -7275496 -8545417 -10026583 -11088950 -9678416 -6161472 -3051005
38559 -3051005 -1370493 960517 6526657 14602955 20575554 19879079 12570812 3174921
38551 3174921 -4083178 -8512283 -11061359 -11373874 -8674661 -4483722 -2241931 -4013154
38543 -4013154 -8282532 -10577175 -6160032 5987059 20670249 29935885 30841746 28054814
$$ packed form
38601B0237358L532526J291262o817137j2576457p351446M163223R337962N129752
38593A6947043L59019L23022m5293m431157o924152k018552N073880O009412J814755
38584A7107977k61026J290696J608252j134020l452770l277646k259919j250685
38576H370859N31374J585488o70373m109429l314540J726068M178859J03753n638085
38567B763974o598102l441368j269921j481166j062367J410534L516944L110467
38559c051005J680512K331010N566140Q076298N972599o96475p308267r395891
38551C174921p258099m429105k549076l12515K699213M190939K241791j771223
38543d013154m269378k294643M417143J2147091J4683190R265636R05861k786932
$$ plain form
38535 28054814 26930294 26560823 22766508 15509871 8708358 3885655 -701452 -4487598
38527 -4487598 -3730083 1976748 7202512 7667315 5989825 7160098 11325083 14803166
38519 14803166 16027122 16407762 16478796 15182369 12875210 11685933 12411654 13630712 14325107
38510 14325107 15051417 15973609 16034685 15170129 15559173 19175694 24917226 29367547 30214411
38501 30214411 28276846 26189787 25424173 24862492 22514872 18278629 14066041 11185967
38493 11185967 9020648 6901868 5650514 5919501 6491587 6128921 5958049 7659832 10026212
38484 10026212 10118444 7826529 6345899 7389826 8724801 7863373 5653394 4110136
38476 4110136 2859808 729622 -311888 3554500 12179525 19873458 21377369 17632693
$$ packed form
38535B8054814j124520l69471l794315p256637o801513m822703m587107l786146
38527d487598P57515N706831N225764M64803j677490J170273M164985L478083
38519A4803166J223956L80640P1034j296427k307159j189277P25721J219058O94395
38510A4325107P26310R22192O1076q64556L89044L616521N741532M450321Q46864
38501C0214411j937565k087059p65614n61681k347620m236243m212588k880074
38493A1185967k165319k118780j251354K68987N72086l62666j70872J701783K366380
38484A0026212R2232k291915j480630J043927J334975q61428k209979j543258
38476D110136j250328k130186j041510L866388Q625025P693933J503911l744676
$$ plain form
38468 17632693 13640869 11728844 9544602 4975344 545144 1039364 7685557 16578581
38460 16578581 22866884 24968821 24381596 23016059 21895584 21520628 22096650 23437462
38452 23437462 25216253 26916900 27153381 24132094 18050005 12327116 10721623 13055215
38444 13055215 15120397 13294603 8378006 4378461 4005301 5826357 5981871 2826333
38436 2826333 -551591 459383 6267495 12413856 15399391 16781307 19466403 22352695
38428 22352695 22250197 19809222 19094368 21081377 21937026 19057760 14914856 12979227
38420 12979227 13371026 14896085 17879592 21724693 22655733 18044332 11267629 8295411
38412 8295411 10509230 14529622 17966538 21010761 22790868 21065590 16695674 14293216
$$ packed form
38468A7632693l991824j912025k184242m569258m430200M94220O646193Q893024
38460A6578581O288303K101937n87225j365537j120475l74956N76022J340812
38452B3437462J778791J700647K36481l021287o082089n722889j605493K333592
38444A3055215K065182j825794m916597l999545l73160J821056J55514l155538
38436B826333l377924J010974N808112O146361K985535J381916K685096K886292
38428B2352695j02498k440975p14854J987009Q55649k879266m142904j935629
38420A2979227L91799J525059K983507L845101R31040m611401o776703k972218
38412H295411K213819M020392L436916L044223J780107j725278m369916k402458
$$ plain form
38404 14293216 16390185 19968755 20884507 19402787 19164756 22178113 26649055 28837273
38396 28837273 26022862 18814576 11364081 8021814 9100440 11298635 12574734 14374193
38388 14374193 18102633 21840827 22483807 19548516 14961488 10192942 5390331 715498
38380 715498 -2830772 -3647670 -282150 6939499 14775007 19344095 20129685 19701450 18976390
38371 18976390 15847168 10130266 6459115 8992371 15418839 19672656 19167884 16073847
38363 16073847 12819087 10108242 8599014 8533114 7723038 3732714 -1428826 -2370860 2917982
38354 2917982 10362555 14736307 14418995 10534172 4820499 -87639 -1474898 217177
38346 217177 1543872 1425125 3519637 10504971 18474264 20685299 15801498 9172291
$$ packed form
38404A4293216K096969L578570R15752j481720k38031L013357M470942K188218
38396B8837273k814411p208286p450495l342267J078626K198195J276099J799459
38388A4374193L728440L738194O42980k935291m587028m768546m802611m674833
38380G15498l546270q16898L365520P221649P835508M569088P85590m28235p25060
38371A8976390l129222n716902l671151K533256O426468M253817n04772l094037
38363A6073847l254760k710845j509228o5900q10076l990324n161540r42034N288842
38354B917982P444573M373752l17312l884823n713673m908138j387259J692075
38346B17177J326695j18747K094512O985334P969293K211035m883801o629207
$$ plain form
38338 9172291 6439503 8721221 13744940 18655769 21196131 20661917 18740705 17844721
38330 17844721 18071236 17312094 14650448 11750674 10206535 9455871 8408642 7128883
38322 7128883 5135105 60309 -8752058 -16011486 -13947616 -1632208 12360872 19465656
38314 19465656 21037654 24977871 33850033 41587278 42831808 40029464 37971185 35862062
38306 35862062 30090224 22196499 17800901 17987050 17699114 13810731 9418330 7984105
38298 7984105 8082379 7113595 6104107 6786088 7031090 3867126 -698794 -1547087 2276552
38289 2276552 6124443 5874438 2229427 -1691340 -4192668 -5235657 -4718671 -1983077
38281 -1983077 3148678 8835030 10963693 6493485 -1486511 -4253825 3922977 18515035
$$ packed form
38338I172291k732788K281718N023719M910829K540362n34214j921212q95984
38330A7844721K26515p59142k661646k899774j544139p50664j047229j279759
38322G128883j993778n074796q812367p259428K063870J2315408J3993080P104784
38314A9465656J571998L940217Q872162P737245J244530k802344k058279k109123
38306C5862062n771838p893725m395598J86149k87936l888383m392401j434225
38298G984105R8274r68784j009488O81981K45002l163964m565920q48293L823639
38289B276552L847891k50005l645011l920767k501328j042989N16986K735594
38281a983077N131755N686352K128663m470208p979996k767314Q176802J4592058
$$ plain form
38273 18515035 28962355 29654336 23887920 17554041 12743335 8516995 4730723 2965517
38265 2965517 4839909 10208149 16234098 18958544 17745412 17172122 21321749 26803756
38257 26803756 25839597 16976419 7871139 5141429 6011992 3829952 -1772176 -5332322
38249 -5332322 -4296517 -1847565 -941183 -334365 1913996 4639272 5719595 5980504 8487918
38240 8487918 14490257 21576311 25755744 24573836 18403313 9617475 1199810 -3801945
38232 -3801945 -2591947 5590241 17261862 26072466 28364816 26697140 26048086 27222498
38224 27222498 26540068 22126218 17426958 16696643 19057866 19578418 15475282 8801088
38216 8801088 2913350 -1329558 -4743997 -7002053 -6638891 -3386558 1285433 6128056
$$ packed form
38273A8515035J0447320O91981n766416o333879m810706m226340l786272j765206
38265B965517J874392N368240O025949K724446j213132n73290M149627N482007
38257B6803756r64159q863178r105280k729710Q70563k182040n602128l560146
38249e332322J035805K448952R06382O06818K248361K725276J080323K60909K507414
38240H487918O002339P086054M179433j181908o170523q785838q417665n001755
38232c801945J209998Q182188J1671621Q810604K292350j667676o49054J174412
38224B7222498o82430m413850m699260p30315K361223N20552m103136o674194
38216H801088n887738m242908l414439k258056L63162L252333M671991M842623
$$ plain form
38208 6128056 11084574 15839852 19073008 20458359 22155795 26345765 31743183 34723478
38200 34723478 34180643 33089167 34212706 36262221 36247047 34315267 33552199 34932826 35154118
38191 35154118 31077671 24831038 22119357 25145901 28968221 26454036 16582953 6310033
38183 6310033 3400815 8362335 14796979 17352864 17427536 20170485 27358847 35080969
38175 35080969 38212462 35554789 30140318 25719738 23692037 22526044 19222080 12160912
38167 12160912 3927589 759872 6946563 19028804 27553036 26247981 18205204 11293347
38159 11293347 9124905 9555125 10902112 14688073 20694551 23942185 20507614 13750469
38151 13750469 10412015 11757830 12975894 11022056 8280522 7192844 5640212 627579
$$ packed form
38208F128056M956518M755278L233156J385351J697436M189970N397418K980295
38200C4723478n42835j091476J123539K049515j5174j931780p63068J380627K21292
38191C5154118m076447o246633k711681L026544L822320k514185r871083j0272920
38183F310033k909218M961520O434644K555885P4672K742949P188362P722122
38175C5080969L131493k657673n414471m420580k027701j165993l303964p061168
38167A2160912q233323l167717O186691J2082241Q524232j305055q042777o911857
38159A1293347k168442M30220J346987L785961O006478L247634l434571o757145
38151A3750469l338454J345815J218064j953838k741534j087678j552632n012633
$$ plain form
38143 627579 -6086440 -9352228 -6692651 -590471 4801124 7164681 6211510 2216693
38135 2216693 -4391473 -11956963 -16770290 -14676425 -4833240 8350571 18252372 21232608
38127 21232608 18526664 14236802 12883591 17275059 25673294 31575623 29785234 23043320
38119 23043320 19279480 21770723 25864669 26499454 24481984 23012404 22451399 22136131
38111 22136131 23498218 26703059 27149934 20861307 11917749 9039383 14942228 23784368
38103 23784368 29080338 29299267 25378533 18412306 12025989 12114473 20315548 30330015
38095 30330015 34138466 30531657 25063248 22908062 24188722 25463657 23483232 17664371
38087 17664371 10638031 6531658 7627166 12529546 17967399 21804210 23588860 22987926
$$ packed form
38143F27579o714019l265788K659577O102180N391595K363557r53171l994817
38135B216693o608166p565490m813327K093865R843185J3183811R901801K980236
38127B1232608k705944m289862j353211M391468Q398235N902329j790389o741914
38119B3043320l763840K491243M093946O34785k017470j469580n61005l15268
38111B2136131J362087L204841M46875o288627q943558k878366N902845Q842140
38103B3784368N295970K18929l920734o966227o386317Q8484Q201075J0014467
38095C0330015L808451l606809n468409k155186J280660J274935j980425n818861
38087A7664371p026340m106373J095508M902380N437853L836811J784650o00934
$$ plain form
38079 22987926 19413007 13796841 9514704 9701588 13131421 14434749 10315108 4545709
38071 4545709 3746498 8169745 10805673 7541800 3819228 6945083 15047673 19659359
38063 19659359 18040835 16285369 19194328 23377252 23388091 19708787 16513466 14956831
38055 14956831 13271963 11658374 12578192 16432522 20341581 21732423 21021718 20385425
38047 20385425 21303658 23451957 25027538 24270793 21322858 18246214 16883177 17387459
38039 17387459 18905236 20359278 20383539 18352991 16064041 16315129 18906375 20296046
38031 20296046 18508400 16002877 15909086 17778242 19373500 20513249 22270357 24004387
38023 24004387 24366638 24209831 25252317 26348646 24379415 19183598 14884016 15501467
$$ packed form
38079B2987926l574919n616166m282137J86884L429833J303328m119641n769399
38071D545709p99211M423247K635928l263873l722572L125855Q102590M611686
38063A9659359j618524j755466K908959M182924J0839l679304l195321j556635
38055A4956831j684868j613589R19818L854330L909059J390842p10705o36293
38047B0385425R18233K148299J575581p56745k947935l076644j363037N04282
38039A7387459J517777J454042K4261k030548k288950K51088K591246J389671
38031B0296046j787646k505523r3791J869156J595258J139749J757108J734030
38023B4004387L62251j56807J042486J096329j969231n195817m299582O17451
$$ plain form
38015 15501467 20994351 27966072 32731510 33671761 32203979 31465122 32664153 33198271
38007 33198271 30082037 24524672 20715374 20393663 21360343 21554999 21670118 22810673 24308690
37998 24308690 25392742 26703479 28167915 27196865 21490467 12864140 6091350 4085584
37990 4085584 5860466 9020023 12322126 15309692 17163163 17235380 15964014 14106894
37982 14106894 11510418 7793241 3991844 2052116 2363711 3208462 3334520 3661190 5413609
37973 5413609 8107748 10929992 14502249 18989364 21940703 21296337 19795259 22462810
37965 22462810 29414226 35143902 35970559 34098384 32597729 30709178 27028729 23393176
37957 23393176 21701125 20077904 16682289 14737522 18500284 25577709 28721677 25263279
$$ packed form
38015A5501467N492884O971721M765438R40251j467782p38857J199031N34118
38007C3198271l116234n557365l809298l21711R66680J94656J15119J140555J498017
37998B4308690J084052J310737J464436r71050n706398q626327o772790k005766
37990D085584J774882L159557L302103K987566J853471P2217j271366j857120
37982A4106894k596476l717177l801397j939728L11595Q44751J26058L26670J752419
37973E413609K694139K822244L572257M487115K951339o44366j501078K667551
37965B2462810O951416N729676Q26657j872175j500655j888551l680449l635553
37957B3393176j692051j623221l395615j944767L762762P077425L143968l458398
$$ plain form
37949 25263279 19887011 17409211 17422691 17638881 18523521 21894183 26894362 29527795 25911772
37940 25911772 16059057 5398551 1437738 6644712 15250144 19293958 16815370 11528954
37932 11528954 6220268 767918 -4022248 -5610194 -3601295 -467157 2372120 5461320
37924 5461320 7918920 7547325 5369915 5625962 9660092 13878857 15289821 14887780 14066866
37915 14066866 12395382 10900281 12444291 16204219 17109945 14119099 13305326 17998250
37907 17998250 21488116 16118645 5404879 -452963 1494446 5343164 7351769 10180567
37899 10180567 15174650 18151747 16136352 12786862 13168127 16470294 17627426 14668559
37891 14668559 11622894 13909317 21600760 27874592 25713002 16709666 10416159 12905471
$$ packed form
37949B5263279n376268k477800J3480K16190Q84640L370662N000179K633433l616023
37940B5911772r852715j0660506l960813N206974Q605432M043814k478588n286416
37932A1528954n308686n452350m790166j587946K008899L134138K839277L089200
37924E461320K457600l71595k177410K56047M034130M218765J410964m02041q20914
37915A4066866j671484j495101J544010L759928R05726k990846q13773M692924
37907A7998250L489866n369471j0713766n857842J947409L848718K008605K828798
37899A0180567M994083K977097k015395l349490L81265L302167J157132k958867
37891A4668559l045665K286423P691443O273832k161590r003336o293507K489312
$$ plain form
37883 12905471 19404993 21905682 20316700 20124243 21794926 20650994 16979312 17467628
37875 17467628 24121011 29648347 28142457 23683829 22861534 24237071 21982403 16421459
37867 16421459 13708539 16307577 20222376 21787739 21817361 22173635 22739323 23134922 23837395
37858 23837395 24185290 22339654 18712572 16679980 18103626 20499379 20797096 19998117
37850 19998117 21342469 24857690 26999915 26220784 25783286 28838717 32783066 32046036
37842 32046036 26084088 20428061 18384309 16200555 10367850 6006220 11260288 23938674
37834 23938674 31024749 24118674 9659279 -35689 -1038514 1944358 5568648 10903862
37826 10903862 17361019 20533554 18182825 13854731 12031741 12608143 12386041 9925287
$$ packed form
37883A2905471O499522K500689j588982j92457J670683j143932l671682M88316
37875A7467628O653383N527336j505890m458628q22295J375537k254668n560944
37867A6421459k712920K599038L914799J565363K9622L56274N65688L95599P02473
37858B3837395L47895j845636l627082k032592J423646K395753K97717p98979
37850A9998117J344352L515221K142225p79131m37498L055431L944349p37030
37842C2046036n961948n656027k043752k183754n832705m361630N254068J2678386
37834B3938674P086075o906075j4459395r694968j002825K982872L624290N335214
37826A0903862O457157L172535k350729m328094j822990N76402k22102k460754
$$ plain form
37818 9925287 6809194 5311110 6243057 8274967 8747978 6360524 3408688 3623072 7165404
37809 7165404 9913933 9067797 7421705 9820434 16550263 22907159 25294523 25275029 26441551
37800 26441551 28990022 29585327 26586143 23264769 24100183 28686744 31730733 29690945
37792 29690945 25063366 22320143 21662910 19862162 16293767 14268021 15733130 18242129
37784 18242129 18880998 18156510 17674631 16813823 15016782 15150563 20193665 27447938 30779762
37775 30779762 29057298 27652529 30007663 32487783 30740988 26938299 25932029 27084966
37767 27084966 25704946 21406948 18842490 19592956 19353582 15097064 9516505 5554730
37759 5554730 1987439 -1519756 -373471 7892925 16696741 18106739 15182086 18271029
$$ packed form
37818I925287l116093j498084R31947K031910M73011k387454k951836K14384L542332
37809G165404K748529q46136j646092K398729O729829O356896K387364j9494J166522
37800B6441551K548471N95305k999184l321374Q35414M586561L043989k039788
37792B9690945m627579k743223o57233j800748l568395k025746J465109K508999
37784A8242129O38869p24488m81879q60808j797041J33781N043102P254273L331824
37775C0779762j722464j404769K355134K480120j746795l802689j006270J152937
37767B7084966j380020m297998k564458P50466k39374m256518n580559l961775
37759E554730l567291l507195J146285Q266396Q803816J409998k924653L088943
$$ plain form
37751 18271029 29334450 38709201 39374195 36017798 35876274 37938792 37148982 33766785
37743 33766785 31671828 30827616 28189477 24163252 22033862 22189350 22639573 24390438
37735 24390438 30302335 38380801 41832101 37190489 28231676 20809989 17493404 17800855
37727 17800855 19661938 19703144 15893393 10964607 9836383 13108567 16805488 18828548
37719 18828548 21064915 24227773 25711985 24520228 23602575 24900350 26386287 26394609 26395489
37710 26395489 26915547 25664902 22900840 23185072 27356301 28239825 20514604 10470155
37702 10470155 8753034 16364583 25218975 30284598 32994723 33798364 30548130 25524105
37694 25524105 25344726 30683959 33438529 28314969 20996285 19837369 24616511 29224129
$$ packed form
37751A8271029J1063421R374751O64994l356397j41524K062518p89810l382197
37743C3766785k094957q44212k638139m026225k129390J55488M50223J750865
37735B4390438N911897Q078466L451300m641612q958813p421687l316585L07451
37727A7800855J861083M1206l809751m928786j128224L272184L696921K023060
37719A8828548K236367L162858J484212j191757r17653J297775J485937Q322Q80
37710B6395489N20058j250645k764062K84232M171229Q83524p725221j0044449
37702A0470155j717121P611549Q854392N065623K710125Q03641l250234n024025
37694B5524105j79379N339233K754570n123560p318684j158916M779142M607618
$$ plain form
37686 29224129 31585828 34455857 38294977 39645260 36746131 32053890 28378967 26037845
37678 26037845 24727610 25202884 27461009 28972335 26517536 19922133 13563294 13474226
37670 13474226 21786147 33908466 42534511 44671346 43137281 41219914 38830355 35092431
37662 35092431 31402846 29167255 26863508 22698326 18807611 19352111 24765451 30776793
37654 30776793 33304220 32202862 30182889 29832943 31581456 33128678 31451338 26795127
37646 26795127 23539113 25142825 29464178 31486537 29482038 25659940 21981531 19018223
37638 19018223 18241402 21016693 24840162 24888556 20711708 17552897 19172359 22884140
37630 22884140 23981153 21820625 18781242 16151035 14421451 15314406 19556663 23789605
$$ packed form
37686B9224129K361699K870029L839120J350283k899129m692241l674923k341122
37678B6037845j310235M75274K258125J511326k454799o595403o358839q9068
37670A3474226Q311921J2122319Q626045K136835j534065j917367k389559l737924
37662C5092431l689585k235591k303747m165182l890715N44500N413340O011342
37654C0776793K527427j101358k019973l49946J748513J547222j677340m656211
37646B6795127l256014J603712M321353K022359k004499l822098l678409k963308
37638A9018223p76821K775291L823469M8394m176848l158811J619462L711781
37630B2884140J097013k160528l039383k630207j729584Q92955M242257M232942
$$ plain form
37622 23789605 23380507 18006416 11614283 7517427 6694572 10350788 19965690 33589284
37614 33589284 45462443 51510314 53255539 54397094 55195040 52684530 45861200 38138594
37606 38138594 33614418 32036554 29052174 21932517 14006955 11768556 17382772 25929478
37598 25929478 31288400 32952622 34726612 38106540 40626879 40893395 41112512 42571623
37590 42571623 42148447 37051078 30980918 30795623 36867536 41282753 37741388 29956066
37582 29956066 27021877 32309675 40558737 45365424 45662362 43836061 41028778 37050481
37574 37050481 33018044 30897672 30719770 30672552 30068310 30075024 31105561 31576021 30214058
37565 30214058 27916700 26105869 24579857 22410840 20054574 19126415 20566855 24129782
$$ packed form
37622B3789605m09098n374091o392133m096856q22855L656216R614902J3623594
37614C3589284J1873159O047871J745225J141555P97946k510510o823330p722606
37606C8138594m524176j577864k984380p119657p925562k238399N614216Q546706
37598B5929478N358922J664222J773990L379928K520339K66516K19117J459111
37590D2571623m23176n097369o070160j85295O071913M415217l541365p785322
37582B9956066k934189N287798Q249062M806687K96938j826301k807283l978297
37574C7050481m032437k120372j77902m7218o04242O714J030537M70460j361963
37565C0214058k297358j810831j526012k169017k356266r28159J440440L562927
$$ plain form
37557 24129782 29050375 33891187 36183337 33872878 27516917 20165989 14866256 12874326
37549 12874326 14109339 18194166 24501169 31720864 38045053 42084761 43782417 44182660
37541 44182660 43647719 40405230 32184830 20070923 9603925 6553162 11602042 19868645
37533 19868645 25428979 26010153 24093749 24136619 27979485 32443094 32517444 27435088 21840569
37524 21840569 19938744 20797655 21367983 21517062 22654811 23337413 20832615 16543619 15218907
37515 15218907 18273566 22280330 24996719 28257209 33156027 37022383 37906494 37875255
37507 37875255 38611016 37789434 33835898 30461775 31424992 33893917 32971805 30682903 33602412
37498 33602412 41953714 47904273 45997870 39473155 34408313 32896888 34218417 37543113
$$ packed form
37557B4129782M920593M840812K292150k310459o355961p350928n299733j991930
37549A2874326J235013M084827O307003P219695O324189M039708J697656M00243
37541D4182660n34941l242489q220400j2113907j0466998l050763N048880Q266603
37533A9868645N560334N81174j916404M2870L842866M463609P4350n082356n594519
37524B1840569j901825Q58911N70328J49079J137749O82602k504798m288996j324712
37515A5218907L054659M006764K716389L260490M898818L866356Q84111l1239
37507C7875255P35761q21582l953536l374123R63217K468925r22112k288902K919509
37498C3602412Q351302N950559j906403o524715n064842j511425J321529L324696
$$ plain form
37490 37543113 40383281 38969781 33809752 30944991 33874216 37956191 37297008 33924796
37482 33924796 34756794 41428884 48513359 50855529 47716409 40398402 31110241 24304675
37474 24304675 23709272 26707149 26318642 20385543 14413540 13423478 15683477 17583493
37466 17583493 20219005 26244157 33040548 35037658 32705837 33819488 43419725 55714551
37458 55714551 59229683 49396378 33571618 22782397 20109801 19344399 14924545 9952439
37450 9952439 11631356 20618836 29254597 30831154 26632954 22148714 20115058 20282962
37442 20282962 22946488 28256167 33050894 32566191 26120006 18807630 16946882 22874412
37434 22874412 33390195 41640924 41755274 34277669 26624174 25795926 30997927 35690054
$$ packed form
37490C7543113K840168j413500n160029k864761K929225M081975o59183l372212
37482C3924796Q31998O672090P084475K342170l139120p318007r288161o805566
37474B4304675n95403K997877l88507n933099n972003r90062K259999J900016
37466A7583493K635512O025152O796391J997110k331821J113651R600237J2294826
37458E5714551L515132r833305j5824760j0789221k672596p65402m419854m972106
37450I952439J678917Q987480Q635761J576557m198200m484240k033656J67904
37442B0282962K663526N309679M794727m84703o446185p312376j860748N927530
37434B2874412J0515783Q250729J14350p477605p653495q28248N202001M692127
$$ plain form
37426 35690054 36107954 34581170 34475131 35348642 34481766 31003541 27056201 25565013 26872832
37417 26872832 27222722 22543386 15384927 14766689 24919544 37162555 39619626 33648059
37409 33648059 32178596 40571467 48442142 45087102 34837589 29898170 33799754 40214030
37401 40214030 44400107 47057997 48387193 46637149 42835023 40160039 38177218 33805574
37393 33805574 28191724 26182160 28343543 30073748 29647897 30168302 31820734 29870864
37385 29870864 23809658 21173060 27084610 35882226 38910752 35869203 32506542 31399467
37377 31399467 31770247 35079940 43189597 52510399 57256107 58152918 61080635 66582690
37369 66582690 67527925 59289087 46639327 37566347 34342150 33712890 32810032 31718437
$$ packed form
37426C5690054M17900j526784j06039Q73511q66876l478225l947340j491188J307819
37417B6872832L49890m679336p158459o18238J0152855J2243011K457071n971567
37409C3648059j469463Q392871P870675l355040j0249513m939419L901584O414276
37401D0214030M186077K657890J329196j750044l802126k674984j982821m371644
37393C3805574n613850k009564K161383J730205m25851N20405J652432j949870
37385B9870864o061206k636598N911550Q797616L028526l041549l362661j107075
37377C1399467L70780L309693Q109657R320802M745708Q96811K927717N502055
37369F6582690R45235q238838j2649760r072980l224197o29260r02858j091595
$$ plain form
37361 31718437 31849767 34131068 38085763 41743515 43388480 43570451 44059132 45153806
37353 45153806 45881883 46204720 46543681 45914242 43796319 43161504 47304114 53480032 54670338
37344 54670338 49185566 43725909 44327847 48497271 49593372 45485941 39237932 34090877
37336 34090877 31537009 31990066 33588659 32359095 27332582 23587618 26180771 32762593
37328 32762593 36707261 36366770 36281958 39507595 43675781 45299697 43552144 38843978
37320 38843978 32050307 26793020 28402757 37883846 49303405 55134198 52479913 43581297
37312 43581297 33362389 27506994 29063530 34596893 36875546 33844464 31849745 37238227
37304 37238227 48034084 57492563 62850891 65984721 67606731 66249096 62511092 59459623
$$ packed form
37361C1718437J31330K281301L954695L657752J644965J81971M88681J094674
37353D5153806P28077L22837L38961o29439k117923o34815M142610O175918J190306
37344E4670338n484772n459657O01938M169424J096101m107431o248009n147055
37336C4090877k553868M53057J598593j229564n026513l744964K593153O581822
37328C2762593L944668l40491q4812L225637M168186J623916j747553m708166
37320C8843978o793671n257287J609737R481089J1419559N830793k654285q898616
37312D3581297j0218908n855395J556536N533363K278653l031082j994719N388482
37304C7238227J0795857R458479N358328L133830J622010j357635l738004l051469
$$ plain form
37296 59459623 58359094 57687294 56232921 53308209 46539869 34746209 23537057 22030752
37288 22030752 31392203 41590700 42878761 36298061 29260413 25186277 22777729 22300767
37280 22300767 25987466 32885596 39062626 43470905 48837333 55792999 60532239 59990374
37272 59990374 55833339 51567749 48707775 47426571 47885832 48697747 46734843 41129551
37264 41129551 35537306 33767703 34634729 33943382 30732272 28594408 30542002 34880367
37256 34880367 37301536 36043801 33871726 34824072 39524524 44616705 47163861 48183910
37248 48183910 50287847 53165317 54234792 53240892 52601706 52616058 50188427 44030152 37554471
37239 37554471 34183840 33126058 32830627 35229008 42127764 49741392 52050195 48909416
$$ packed form
37296E9459623j100529o71800j454373k924712o768340j1793660j1209152j506305
37288B2030752R361451J0198497J288061o580700p037648m074136k408548m76962
37280B2300767L686699O898130O177030M408279N366428O955666M739240n41865
37272E9990374m157035m265590k859974j281204M59261Q11915j962904n605292
37264D1129551n592245j769603Q67026o91347l211110k137864J947594M338365
37256C4880367K421169j257735k172075R52346M700452N092181K547156J020049
37248D8183910K103937K877470J069475r93900o39186J4352k427631o158275o475681
37239C7554471l370631j057782k95431K398381O898756P613628K308803l140779
$$ plain form
37231 48909416 46024931 46775207 48626511 48621427 48285358 51053741 57410684 64231694 67366990
37222 67366990 64448038 57205049 51208397 50865567 54337044 55852684 53122011 49434150
37214 49434150 48128041 48599207 49015521 49675637 51873677 55947130 61764629 68483064
37206 68483064 72689786 70092374 61025120 51486031 46821642 47068225 49927189 54361616
37198 54361616 58465819 57811887 50470249 41411283 37491279 39240067 41314251 39991445
37190 39991445 36613695 34402065 35225630 38925850 42851148 42882348 37958116 32750956
37182 32750956 32860218 38318314 44787170 49531623 52320317 52006855 47376063 41140907
37174 41140907 38061458 38614892 39208460 39080280 41607306 47438178 52030778 52769479 53382792
$$ packed form
37231D8909416k884485P50276J851304n084l36069K768383O356943O821010L135296
37222F7366990k918952p242989n996652l42830L471477J515640k730673l687861
37214D9434150j306109M71166M16314O60116K198040M073453N817499O718435
37206F8483064M206722k597412r067254r539089m664389K46583K858964M434427
37198E4361616M104203o53932p341638r058966l920004J748788K074184j322806
37190C9991445l377750k211630Q23565L700220L925298L1200m924232n207160
37182C2750956J09262N458096O468856M744453K788694l13462m630792o235156
37174D1140907l079449N53434N93568j28180K527026N830872M592600P38701O13313
$$ plain form
37165 53382792 57420439 61549731 60085433 53521348 47916491 47261026 50410165 54501215
37157 54501215 57633901 58646364 57557879 56217306 56029560 55474342 52350382 47844963
37149 47844963 45457538 45991053 46511641 44763348 42144464 41571895 44459309 50571509
37141 50571509 58891449 67415381 73460847 75525104 74355339 71610009 68145536 64163961
37133 64163961 60340873 57918583 57609428 58677735 59310875 58227261 56074026 54853287
37125 54853287 55744295 57991274 60165448 61684208 62498287 62245446 60915271 59888962
37117 59888962 60955186 64062602 66918893 67267304 65285431 63491928 64195250 66975887
37109 66975887 69058089 68682468 67605009 69067903 73408174 77137866 76652496 71441525
$$ packed form
37165E3382792M037647M129292j464298o564085n604857o55465L149139M091050
37157E4501215L132686J012463j088485j340573j87746n55218l123960m505419
37149D7844963k387425N33515N20588j748293k618884n72569K887414O112200
37141E0571509Q319940Q523932O045466K064257j169765k745330l464473l981575
37133F4163961l823088k422290l09155J068307O33140j083614k153235j220739
37125E4853287Q91008K246979K174174J518760Q14079k52841j330175j026309
37117E9888962J066224L107416K856291L48411j981873j793503P03322K780637
37109F6975887K082202l75621j077459J462894M340271L729692m85370n210971
$$ plain form
37101 71441525 63494570 55668725 51509384 54199625 63368511 74075300 80975155 82907552
37093 82907552 82120807 80376392 77901944 75152494 73043422 71542797 69976745 68572323
37085 68572323 67930758 67322026 65561525 63510852 63545962 66063174 68220044 66831863 61592859
37076 61592859 55379079 52171149 54014420 58714308 61381349 59954989 58172046 60856694
37068 60856694 67447712 73274646 76382827 79071405 82586249 84799365 84494211 83707116
37060 83707116 83667926 82369342 78947486 76618488 77425712 77323204 71383719 61987082 56663618
37051 56663618 58423272 63036421 65921882 66913793 67299421 66773723 65351224 64591534 64593828
37042 64593828 62853592 58553492 55192486 56114296 59755603 62437739 63828193 65829582
$$ packed form
37101G1441525p946955p825845m159341K690241R168886J0706789O899855J932397
37093H2907552p86745j744415k474448k749450k109072j500625j566052j404422
37085F8572323o41565o08732j760501k050673L5110K517212K156870j388181n239004
37076F1592859o213780l207930J843271M699888K667041j426360j782943K684648
37068F0856694O591018N826934L108181K688578L514844K213116l05154p87095
37060H3707116l9190j298584l421856k328998Q07224j02508n939485r396637n323464
37051E6663618J759654M613149K885461R91911L85628n25698j422499p59690K294
37042F4593828j740236m300100l361006R21810L641307K682136J390454K001389
$$ plain form
37034 65829582 67276740 64289395 56648636 50216068 51053771 58873326 67658532 71726007
37026 71726007 70549659 68687352 71235370 78200603 83554443 81643194 74302545 68912936
37018 68912936 68976214 70086772 67067109 61628256 59478563 62255128 66851416 71773767
37010 71773767 79008194 88461410 95078388 94436078 88730013 84353545 84764909 87906336
37002 87906336 89681492 87954991 83681409 79725324 78189890 77873265 75319236 69611647
36994 69611647 64787719 65560261 71601478 78195344 81757515 82206424 80390746 76423771
36986 76423771 71403663 67997478 67491488 67765337 65769970 61189545 56641006 55057446
36978 55057446 57640751 63463458 70182858 75759968 80087749 84442631 89327539 93879619
$$ packed form
37034F5829582J447158k987345p640759o432568Q37703P819555Q785206M067475
37026G1726007j176348j862307K548018O965233N353840j911249p340649n389609
37018F8912936O3278J110558l019663n438853k149693K776565M596288M922351
37010G1773767P234427R453216O616978o42310n706065m376468M11364L141427
37002H7906336J775156j726501m273582l956085j535434l16625k554029n707589
36994F9611647m823928P72542O041217O593866L562171M48909j815678l966975
36986G6423771n020108l406185n05990K73849j995367m580425m548539j583560
36978E5057446K583305N822707O719400N577110M327781M354882M884908M552080
$$ plain form
36970 93879619 97212886 98534269 95860397 87428695 75800142 67788227 67476475 70952348
36962 70952348 71201556 67445885 66058706 71744253 80982357 85756744 81799876 71797577
36954 71797577 62125211 57911446 59952099 64637719 67297243 66687459 65778241 67588085
36946 67588085 71394686 74078139 73940359 71642493 68516033 66128046 66777344 71449407
36938 71449407 76742856 76706018 69566999 60808738 57396007 60029165 63409368 63613091
36930 63613091 62442752 63762740 67949925 72009668 74181259 76057933 79486595 82908044
36922 82908044 82500245 77010081 69953789 65934740 65756415 66983867 68808981 73319556
36914 73319556 80707906 86316917 85687923 80914303 78111335 79037080 79445231 76445516
$$ packed form
36970I3879619L333267J321383k673872q431702j1628553q011915l11752L475873
36962G0952348K49208l755671j387179N685547R238104M774387l956868j0002299
36954G1797577r672366m213765K040653M685620K659524o09784r09218J809844
36946F7588085L806601K683453j37780k297866l126460k387987O49298M672063
36938G1449407N293449l6838p139019q758261l412731K633158L380203K03723
36930F3613091j170339J319988M187185M059743K171591J876674L428662L421449
36922H2908044m07799n490164p056292m019049j78325J227452J825114M510575
36914G3319556P388350N609011o28994m773620k802968R25745M08151k999715
$$ plain form
36906 76445516 73020207 72912298 74861961 75515999 75412096 77730027 82215559 84680947
36898 84680947 82987045 80207025 80699103 85048602 89764890 90779129 87079185 81886983
36890 81886983 79754950 81476015 83220426 82384601 82225919 87498476 97018138 104781395
36882 104781395 107960783 109159933 110258478 108903127 103040347 94987962 88663681 85850808
36874 85850808 87084808 92776865 100906205 106559795 106521525 102162038 96079127 89064617
36866 89064617 82501265 79785868 81878824 84723192 84818734 84293146 86582584 90498779
36858 90498779 93278734 96082913 100627281 103367500 100169821 94896124 95300029 100722383
36850 100722383 102310835 96789346 91580952 93135357 97946305 99858706 99625145 101116429
$$ packed form
36906G6445516l425309j07909J949663O54038j03903K317931M485532K465388
36898H4680947j693902k780020M92078M349499M716288J014239l699944n192202
36890H1886983k132033J721065J744411q35825j58682N272557R519662P763257
36882A04781395L179388J199150J098545j355351n862780q052385o324281k812873
36874H5850808J234000N692057Q129340N653590l8270m359487o082911p014510
36866H9064617o563352k715397K092956K844368R5542n25588K289438L916195
36858I0498779K779955K804179M544368K740219l197679n273697M03905N422354
36850A00722383J588452n521489n208394J554405M810948J912401k33561J491284
$$ plain form
36842 101116429 102869263 100087094 92589506 85305721 82419382 85055528 92518277 101559969
36834 101559969 106591910 105087329 101020491 98893875 96824249 90694517 83063728 81525907
36826 81525907 88444362 98196804 105158983 108843315 109913577 106741064 98896056 90373485
36818 90373485 86419918 88999952 96387919 104706902 109413427 108705734 106371932 107747868
36810 107747868 112173258 113905087 111659557 111477784 116960589 122393716 120950255 115403211
36802 115403211 113929839 117631734 119478397 115343036 109176951 105824935 104795711 103896679
36794 103896679 104102783 107099064 111303985 114014018 115336786 116828694 118058105 117634001
36786 117634001 116199350 115385993 115118076 115159069 118037615 126283984 136882421 142727712
$$ packed form
36842A01116429J752834k782169p497588p283785k886339K636146P462749R041692
36834A01559969N031941j504581m066838k126616k069626o129732p630789j537821
36826H1525907O918455R752442O962179L684332J070262l172513p845008q522571
36818I0373485l953567K580034P387967Q318983M706525p07693k333802J375936
36810A07747868M425390J731829k245530j81773N482805N433127j443461n547044
36802A15403211j473372L701895J846663m135361o166085l352016j029224q99032
36794A03896679K06104K996281M204921K710033J322768J491908J229411m24104
36786A17634001j434651q13357k67917M0993K878546Q246369J0598437N845291
$$ plain form
36778 142727712 140653519 134360021 128071768 121371861 113013400 106134894 105227282 109623435
36770 109623435 114441671 117547594 121373092 127308955 132297199 132836809 129687079 126655894
36762 126655894 126428677 128880843 131737930 131746635 127125388 120104323 115058121 113033464
36754 113033464 110789829 106810617 104711824 107521332 111916474 112982537 112517459 116580513
36746 116580513 125186067 130897252 129329517 125187855 124688128 126982145 127602674 126628589
36738 126628589 127726104 130806008 131441681 127941576 124315246 124892453 129554722 135764032
36730 135764032 142057738 147424650 149994151 149395872 148876357 151646125 155314096 153487701
36722 153487701 144590502 136507251 139072269 152145116 164400288 165459811 156642968 147043985
$$ packed form
36778A42727712k074193o293498o288253o699907q358461o878506r07612M396153
36770A09623435M818236L105923L825498N935863M988244N39610l149730l031185
36762A26655894k27217K452166K857087Q705m621247p021065n046202k024657
36754A13033464k243635l979212k098793K809508M395142J066063m65078M063054
36746A16580513Q605554N711185j567735m141662m99727K294017O20529r74085
36738A26628589J097515L079904O35673l500105l626330N77207M662269O209310
36730A35764032O293706N366912K569501n98279n19515K769768L667971j826395
36722A53487701q897199q083251K565018J3072847J2255172J059523q816843r598983
$$ plain form
36714 147043985 141191389 135412364 126546021 118596502 117211646 121305896 125147688 127073755
36706 127073755 130698570 137304393 142503484 142801593 141137279 142069465 144213982 142308471
36698 142308471 136289079 133532504 140151524 153094550 163580035 166641757 164198940 159597553
36690 159597553 153481362 146712914 143356711 146393125 152134803 153974497 151793798 152169277
36682 152169277 157468572 160907869 157108336 152174393 155599834 165053811 168834325 164001073
36674 164001073 161872586 170953540 183253798 185457007 177597218 170795304 169393480 166358405
36666 166358405 157471665 149696162 150526706 156585823 159506906 158541510 160172775 167157450
36658 167157450 174523234 176616830 173181778 167790431 164278259 165425240 171246666 177245014
$$ packed form
36714A47043985n852596n779025q866343p949519j384856M094250L841792J926067
36706A27073755L624815O605823N199091K98109j664314R32186K144517j905511
36698A42308471o019392k756575O619020J2943026J0485485L061722k442817m601387
36690A59597553o116191o768448l356203L036414N741678J839694k180699L75479
36682A52169277N299295L439297l799533m933943L425441R453977L780514m833252
36674A64001073k128487R080954J2300258K203209p859789o801914j401824l035075
36666A66358405q886740p775503Q30544O059117K921083r65396J631265O984675
36658A67157450P365784K093596l435052n391347l512172J146981N821426N998348
$$ plain form
36650 177245014 177741210 172648649 168136596 168960486 173036953 175623543 175762621 175444821
36642 175444821 174913874 173083893 171615356 174071482 180351195 185637229 186435665 184973482
36634 184973482 185748613 189637546 193452686 194327589 192766877 191465508 191857425 191839671 187477114
36625 187477114 178162395 169306689 167320064 171846049 176255050 176895334 178005534 184709744
36617 184709744 194507866 199996216 198284394 193368949 190045823 189859237 192804200 198176167
36609 198176167 202544764 201172595 193792563 186282284 184743134 189895504 198065315 204856860
36601 204856860 207028036 204444005 201974983 205830616 215704793 224216056 226869606 228325959
36593 228325959 234476870 242105689 242501673 233561629 222212196 215273551 213580116 215248195
$$ packed form
36650A77245014M96196n092561m512053Q23890M076467K586590J39078l17800
36642A75444821n30947j829981j468537K456126O279713N286034P98436j462183
36634A84973482P75131L888933L815140Q74903j560712j301369L91917j7754m362557
36625A87477114r314719q855706j986625M525985M409001O40284J110200O704210
36617A84709744R798122N488350j711822m915445l323126j86586K944963N371967
36609A98176167M368597j372169p380032p510279j539150N152370Q169811O791545
36601B04856860K171176k584031k469022L855633R874177Q511263K653550J456353
36593B28325959O150911P628819L95984q940044j1349433o938645j693435J668079
$$ plain form
36585 215248195 218848409 221951168 221861628 220027297 221322526 226828335 231678921 232441381
36577 232441381 231891705 232996811 232793939 227393276 219789052 216541441 217978620 217826301
36569 217826301 213100624 208853304 210828392 217369928 221762197 220568609 216789160 215438277
36561 215438277 218206929 222782714 226190140 227978482 230077417 233934925 238609009 242093732
36553 242093732 243772303 244649486 245513214 245805922 244350719 240691034 235781408 231569430
36545 231569430 229564642 229698523 230984996 232878980 234860793 235353099 233498917 232163984
36537 232163984 235858854 244074138 249931994 248328469 242752685 240269975 241718168 241563684
36529 241563684 236822071 231149099 229190699 231163914 234796065 239149736 244235433 249283975
$$ packed form
36585B15248195L600214L102759q9540j834331J295229N505809M850586P62460
36577B32441381n49676J105106k02872n400663p604224l247611J437179j52319
36569B17826301m725677m247320J975088O541536M392269j193588l779449j350883
36561B15438277K768652M575785L407426J788342K098935L857508M674084L484723
36553B42093732J678571Q77183Q63728K92708j455203l659685m909626m211978
36545B31569430k004788J33881J286473J893984J981813M92306j854182j334933
36537B32163984L694870Q215284N857856j603525n575784k482710J448193j54484
36529B41563684m741613n672972j958400J973215L632151M353671N085697N048542
$$ plain form
36521 249283975 253596454 257515072 261102321 263482001 264537684 265281490 265452379 263073789
36513 263073789 257934606 253305198 252362030 254752851 258293664 261876720 264719252 265043362
36505 265043362 262305681 259316113 259590460 263613031 269550002 275827468 280657481 281256076
36497 281256076 277066623 272329881 271686348 274167783 275463849 275338344 277923210 284091414
36489 284091414 288428911 285926432 278063835 269858856 263787045 259263865 255945278 254593860
36481 254593860 255480659 257866248 260680830 262989815 264741571 267191734 270819971 272957052
36473 272957052 270540454 265816812 265297421 270985635 276617029 275909205 270940357 267918703
36465 267918703 267726271 266555890 264280633 265183834 269579836 271363179 266891434 261219023
$$ packed form
36521B49283975M312479L918618L587249K379680J055683P43806J70889k378590
36513B63073789n139183m629408r43168K390821L540813L583056K842532L24110
36505B65043362k737681k989568K74347M022571N936971O277466M830013N98595
36497B81256076m189453m736742o43533K481435J296066j25505K584866O168204
36489B84091414M337497k502479p862597q204979o071811m523180l318587j351418
36481B54593860Q86799K385589K814582K308985J751756K450163L628237K137081
36473B72957052k416598m723642n19391N688214N631394p07824m968848l021654
36465B67918703j92432j170381k275257R03201M396002J783343m471745n672411
$$ plain form
36457 261219023 261475643 267536852 273516122 276112706 276934852 277731784 278066408 278291659 280915299
36448 280915299 286996888 293248837 294742059 290040175 282830792 278779836 280829113 286748783
36440 286748783 291004253 289716745 284131905 278879543 277066081 277935252 279171052 279961940
36432 279961940 280907801 281966155 282081657 280946769 279830953 279737273 279246297 275378742 267013153
36423 267013153 256796857 249116525 246505265 248319097 252093360 255196996 255707857 253201524
36415 253201524 249143989 245853981 245003400 247443840 253440101 261510562 267870229 269535842
36407 269535842 268072091 267747785 269682732 270810511 269331040 267336721 266126853 263239764
36399 263239764 257865367 255324203 260581011 269680238 274162223 273073416 273249737 276822502
$$ packed form
36457B61219023K56620O061209N979270K596584Q22146P96932L34624K25251K623640
36448B80915299O081589O251949J493222m701884p209383m050956K049277N919670
36440B86748783M255470j287508n584840n252362j813462Q69171J235800P90888
36432B79961940R45861J058354J15502j134888j115816r3680m90976l867555q365589
36423B67013153j0216296p680332k611260J813832L774263L103636N10861k506333
36415B53201524m057535l290008q50581K440440N996261Q070461O359667J665613
36407B69535842j463751l24306J934947J127779j479471j994319j209868k887089
36399B63239764n374397k541164N256808R099227M481985j088807J76321L572765
$$ plain form
36391 276822502 276555338 267428850 255777859 250665144 251158488 249784325 245890080 246928580
36383 246928580 255822427 264801250 265395253 259577096 256557959 260939776 268016898 270328729
36375 270328729 266096413 260475368 259485871 263526485 267550443 267638513 265400704 264080751
36367 264080751 262546338 257269933 249692861 246474732 250771981 257812460 261917628 263675858
36359 263675858 265966990 266542485 260829063 250922392 245109448 247020610 250812585 249924117
36351 249924117 245929419 244407295 245274907 242922979 235417021 228212178 226922590 230062749
36343 230062749 231617473 228583398 223121198 218544165 216376660 217310448 221871139 228642471
36335 228642471 233889579 235031085 233688678 233597632 235929091 238276713 238059681 235180316
$$ packed form
36391B76822502k67164r126488j1650991n112715M93344j374163l894245J038500
36383B46928580Q893847Q978823N94003n818157l019137M381817P077122K311831
36375B70328729m232316n621045r89497M040614M023958Q8070k237809j319953
36367B64080751j534413n276405p577072l218129M297249P040479M105168J758230
36359B63675858K291132N75495n713422r906671n812944J911162L791975q88468
36351B49924117l994698j522124Q67612k351928p505958p204843j289588L140159
36343B30062749J554724l034075n462200m577033k167505R33788M560691O771332
36335B28642471N247108J141506j342407r1046K331459K347622k17032k879365
$$ plain form
36327 235180316 231077367 226981885 224030866 223510845 225284762 226684518 224798819 219999933
36319 219999933 215704256 214052470 213110903 209541880 203337613 198303609 197663764 200667087
36311 200667087 204403726 207657295 211193137 214782646 216301462 214600919 211541961 209900270
36303 209900270 210409476 211976221 213395423 213314927 210154943 204677437 201609505 205270663
36295 205270663 213309717 218102623 215573381 209755850 206965371 208189537 209559618 207904785
36287 207904785 202738128 194567449 185119555 178588114 178497301 182507579 183862115 179626462
36279 179626462 174610655 174914309 179953108 183905858 183721589 182057919 181954264 181936626 178487421
36270 178487421 171629655 165523784 163687254 165531219 168018522 169147774 168949858 168352409
$$ packed form
36327B35180316m102949m095482k951019n20021J773917J399756j885699m798886
36319B19999933m295677j651786r41567l569023o204267n034004o39845L003323
36311B00667087L736639L253569L535842L589509J518816j700543l058958j641691
36303B09900270N09206J566745J419202q0496l159984n477506l067932L661158
36295B05270663Q039054M792906k529242n817531k790479J224166J370081j654833
36287B07904785n166657q170679r447894o531441r0813M010278J354536m235653
36279A79626462n015807L03654N038799L952750j84269j663670j03655j7638l449205
36270A78487421o857766o105871j836530J843965K487303J129252j97916n97449
$$ plain form
36262 168352409 168323605 169248796 169849541 167725695 162868642 159739207 162862757 170093384
36254 170093384 173596766 169186285 161832756 159363645 162911501 166720385 165765446 159910665
36246 159910665 151600268 143897062 141015629 146121500 156832006 166637346 172716090 178384207
36238 178384207 185086736 186706317 177502298 163053238 156120883 161190881 169690492 172787266
36230 172787266 172531868 175363009 179383853 175780186 162233225 147757870 141682563 142806071
36222 142806071 143221535 139617694 136179932 137461644 142888969 149118149 154444231 158976076
36214 158976076 162367620 163510476 162011878 158671819 154536849 150069992 145094463 139322375
36206 139322375 133353328 129231665 129082222 132486572 135851560 135487921 131557090 128411551
$$ packed form
36262A68352409k8804R25191O00745k123846m857053l129435L123550P230627
36254A70093384L503382m410481p353529k469111L547856L808884r54939n854781
36246A59910665q310397p703206k881433N105871J0710506R805340O078744N668117
36238A78384207O702529J619581r204019j4449060o932355N069998Q499611L096774
36230A72787266k55398K831141M020844l603667j3546961j4475355o075307J123508
36222A42806071M15464l603841l437762J281712N427325O229180N326082M531845
36214A58976076L391544J142856j498598l340059m134970m466857m975529n772088
36206A39322375n969047m121663j49443L404350L364988l63639l930831l145539
$$ plain form
36198 128411551 130402617 136967824 142019553 139088590 127874907 115385079 109785791 113188450
36190 113188450 120846119 126632949 128196655 127447928 127788231 130976016 135383798 137300345
36182 137300345 135004909 130937115 128315431 126750043 123823061 119940438 117636497 116235996
36174 116235996 112230936 106293160 104487851 109468915 115577386 117150377 117029397 120734012
36166 120734012 125868294 125137608 118417719 113490302 114050250 114983420 112114190 109304455
36158 109304455 111526376 116779846 120263240 122219602 125762053 129786723 130198077 127089303
36150 127089303 125221012 127244513 130865905 133179248 133864999 133108929 129727008 123064093
36142 123064093 114826869 107893771 104487178 105485948 109522774 112475181 110190100 102909164
$$ packed form
36198A28411551J991066O565207N051729k930963j1213683j2489828n599288L402659
36190A13188450P657669N786830J563706p48727L40303L187785M407782J916547
36182A37300345k295436m067794k621684j565388k926982l882623k303941j400501
36174A16235996m005060n937776j805309M981064O108471J572991j20980L704615
36166A20734012N134282p30686o719889m927417N59948R33170k869230k809735
36158A09304455K221921N253470L483394J956362L542451M024670M11354l108774
36150A27089303j868291K023501L621392K313343O85751p56070l381921o662915
36142A23064093q237224o933098l406593R98770M036826K952407k285081p280936
$$ plain form
36134 102909164 95535700 92500712 93447233 94690120 93644796 90671056 87470340 85287739
36126 85287739 84930635 87396268 93176505 100562430 105624711 105375105 101154284 97635436
36118 97635436 97987786 101236610 104882087 108264714 111834443 114710986 115476132 114933451
36110 114933451 115607437 118031260 119508898 117603930 113566277 111001824 111664249 113755813
36102 113755813 114449341 112969059 110331088 106798124 101456835 94828194 89863469 88569418
36094 88569418 89155643 88935575 88696967 90714262 93130302 90969181 83696157 77148060
36086 77148060 75775730 77233938 77558771 77343766 78553732 79102384 76290281 73136760
36078 73136760 74907003 80283863 82412794 79104420 75829318 77013132 80106135 81157289
$$ packed form
36134A02909164p373464l034988R46521J242887j045324k973740l200716k182601
36126H5287739l57104K465633N780237P385925N062281k49606m220821l518848
36118I7635436L52350L248824L645477L382627L569729K876543P65146n42681
36110A14933451O73986K423823J477638j904968m037653k564453O62425K091564
36102A13755813O93528j480282k637971l532964n341289o628641m964725j294051
36094H8569418N86225k20068k38608K017295K416040k161121p273024o548097
36086G7148060j372330J458208L24833k15005J209966N48652k812103l153521
36078G3136760J770243N376860K128931l308374l275102J183814L093003J051154
$$ plain form
36070 81157289 81535804 85167350 91903196 97277858 97577654 92863956 86123184 80940097
36062 80940097 78815394 77973157 76291547 75257115 78046309 83390146 85451132 81496649
36054 81496649 75725643 72997631 72672502 72003761 71789840 73839205 75488772 72381453
36046 72381453 65943055 62756316 65931498 71552270 74780077 75470264 75899259 76263307
36038 76263307 75118813 72470401 70001342 68917864 69039769 69472504 69169855 67460004
36030 67460004 64980984 63688883 65180549 69265680 74612072 80192832 85277233 88454703
36022 88454703 88223235 85403739 83837206 86591603 91172807 90878742 82793056 72669255
36014 72669255 68892432 72422674 76461545 76365683 75489497 79011440 85811542 90312238
$$ packed form
36070H1157289L78515L631546O735846N374662K99796m713698o740772n183087
36062H0940097k124703q42237j681610j034432K789194N343837K060986l954483
36054H1496649n771006k728012l25129o68741k13921K049365J649567l107319
36046G2381453o438398l186739L175182N620772L227807O90187M28995L64048
36038G6263307j144494k648412k469059j083478J21905M32735l02649j709851
36030F7460004k479020j292101J491666M085131N346392N580760N084401L177470
36022H8454703k31468k819496j566533K754397M581204k94065q085686j0123801
36014G2669255l776823L530242M038871r5862q76186L521943O800102M500696
$$ plain form
36006 90312238 90252793 88567110 88304208 89358994 90348219 90574200 89325678 85538438 79256285
35997 79256285 72294089 66993025 64884406 65973657 68274969 68876205 66763188 63686191
35989 63686191 61175546 58679091 56717438 59312704 69101721 81047012 85854778 80662669
35981 80662669 72651399 70570647 75520762 81516798 82623007 77914392 71287298 67796499
35973 67796499 68986455 71350596 70675744 67379946 65267098 65773203 66903985 67535949
35965 67535949 68393092 68294891 64457624 58075349 54444545 55176834 55741732 54101030 55701722
35956 55701722 64285650 73065115 72843335 65841836 62958217 68225875 74383535 74655370
35948 74655370 70946434 67962272 66304535 65056333 65421476 67554916 68222872 65601283
$$ packed form
36006I0312238n9445j685683k62902J054786R89225K25981j248522l787240o282153
35997G9256285o962196n301064k108619J089251K301312O01236k113017l076997
35989F3686191k510645k496455j961653K595266R789017J1945291M807766n192109
35981H0662669q011270k080752M950115N996036J106209m708615o627094l490799
35973F7796499J189956K364141o74852l295798k112848N06105J130782O31964
35965F7535949Q57143r8201l837267o382275l630804P32289N64898j640702J600692
35956E5701722Q583928Q779465k21780p001499k883619N267658O157660K71835
35948G4655370l708936k984162j657737j248202L65143K133440O67956k621589
$$ plain form
35940 65601283 62584146 61763213 61281963 59760342 60895205 67523091 74406058 73459563
35932 73459563 64659714 55702968 51593842 50438519 49271078 47805258 45533149 41173409
35924 41173409 37038154 38525898 46440946 54435165 57231301 57169339 59006040 62326563
35916 62326563 63905872 64509705 67614862 72688197 75341048 74235228 72699607 72302816
35908 72302816 69411563 60626792 48537916 39362487 36718201 39861556 46252425 53177883
35900 53177883 57867989 59025516 58682592 60451298 65029759 68752519 67538067 61451523
35892 61451523 54526637 50742016 51042418 53618447 55746428 55607303 53906932 53924484 58206842
35883 58206842 64530761 67085948 63099085 56606425 53876152 56756219 62671275 68974614
$$ packed form
35940F5601283l017137q20933m81250j521621J134863O627886O882967r46495
35932G3459563q799849q956746m109126j155323j167441j465820k272109m359740
35924D1173409m135255J487744P915048P994219K796136o1962J836701L320523
35916F2326563J579309O03833L105157N073335K652851j105820j535621l96791
35908G2302816k891253q784771j2088876r175429k644286L143355O390869O925458
35900E3177883M690106J157527l42924J768706M578461L722760j214452o086544
35892F1451523o924886l784621L00402K576029K127981j39125j700371J7552M282358
35883E8206842O323919K555187l986863o492660k730273K880067N915056O303339
$$ plain form
35875 68974614 73659592 73510001 66886046 58569797 56413776 61441832 66084695 64420568
35867 64420568 59103460 54954543 51099301 44756063 38667309 38098205 42452770 46227846
35859 46227846 47468175 49392146 53815527 58544457 61672525 63383726 63072596 59685543
35851 59685543 55390550 53681964 53126302 48574683 39882506 33615449 33957678 37562086
35843 37562086 40233156 43229962 49132439 56055829 60209609 60841352 59203443 55967653
35835 55967653 52692314 52027788 53168427 51045585 43505549 35110478 30129158 26551739
35827 26551739 21706551 18819251 21922075 28392266 33227402 37277127 44134951 51810354
35819 51810354 55182226 54583181 54068324 52962664 47783209 41597200 41973467 48952560
$$ packed form
35875F8974614M684978j49591o623955q316249k156021N028056M642863j664127
35867F4420568n317108m148917l855242o343238o088754n69104M354565L775076
35859D6227846J240329J923971M423381M728930L128068J711201l11130l387053
35851E9685543m294993j708586n55662m551619q692177o267057L42229L604408
35843C7562086K671070K996806N902477O923390M153780O31743j637909l235790
35835E5967653l275339o64526J140639k122842p540036q395071m981320l577419
35827B6551739m845188k887300L102824O470191M835136M049725O857824P675403
35819E1810354L371872n99045n14857j105660n179455o186009L76267O979093
$$ plain form
35811 48952560 54435563 55368219 58088971 66158087 72841416 70864265 62350760 53677266
35803 53677266 46969321 42406128 42683340 48178889 52469043 50029596 45023645 45261467
35795 45261467 50130841 52287826 50111652 50358471 57160455 65172172 66769173 61776370
35787 61776370 56804398 57149103 61731591 64938364 62023591 53418992 44658356 41740093
35779 41740093 45989332 53132833 57120720 55314831 50893278 49801666 54149719 59403564
35771 59403564 59928140 55971952 51961865 49172721 45179798 40673674 40546583 45898634
35763 45898634 50856622 51040778 49884058 51882501 54558372 53205403 49680697 49239939
35755 49239939 50872089 48448287 41135329 35402507 35404617 37627596 37411911 35639300 35713690
$$ packed form
35811D8952560N483003R32656K720752Q069116O683329j977151q513505q673494
35803E3677266o707945m563193K77212N495549M290154k439447n005951K37822
35795D5261467M869374K156985k176174K46819O801984Q011717J597001m992803
35787F1776370m971972L44705M582488L206773k914773q604599q760636k918263
35779D1740093M249239P143501L987887j805889m421553j091612M348053N253845
35771E9403564N24576l956188m010087k789144l992923m506124j27091N352051
35763D5898634M957988J84156j156720J998443K675871j352969l524706m40758
35755D9239939J632150k423802p312958n732822K110K222979k15685j772611P4390
$$ plain form
35746 35713690 37470193 37696651 35259922 33038232 34645777 40056228 44938463 45329883
35738 45329883 43038975 43939024 49612789 54049960 51611503 44954670 40642040 39791455
35730 39791455 38973726 38534983 42755441 51299190 57476647 57258453 54406933 53997742 55729186
35721 55729186 56617443 55968125 54342714 51302340 47648188 46671321 49501786 51940585
35713 51940585 49834698 45458721 44231819 46206013 45430350 38608249 30974418 31291081
35705 31291081 41840002 54887500 59655811 52599618 40097499 31020437 28477771 30075740
35697 30075740 33532552 38030064 40980811 38512938 30743324 22963385 19647672 20080443
35689 20080443 21663853 24638892 30888359 39699212 46960206 48051895 41136123 29254676
$$ packed form
35746C5713690J756503K26458k436729k221690J607545N410451M882235L91420
35738D5329883k290908R00049N673765M437171k438457o656833m312630q50585
35730C9791455q17729m38743M220458Q543749O177457k18194k851520m09191J731444
35721E5729186Q88257o49318j625411l040374l654152r76867K830465K438799
35713E1940585k105887m375977j226902J974194p75663o822101p633831L16663
35705C1291081J0548921J3047498M768311p056193j2502119r077062k542666J597969
35697C0075740L456812M497512K950747k467873p769614p779939l315713M32771
35689B0080443J583410K975039O249467Q810853P260994J091689o915772j1881447
$$ plain form
35681 29254676 19441421 17329630 21871283 27496470 31404773 35409616 40431982 43853811
35673 43853811 44142928 43770857 44947465 46296809 46504065 47289432 49450795 49964451 47183260
35664 47183260 45215056 48068433 52459884 52295764 48355828 47132176 50492194 52762675
35656 52762675 49246445 42454735 37897302 37609304 39972611 42943414 45244889 46277513
35648 46277513 46650736 47845609 50569200 54211150 57797456 60363200 60929663 59535870
35640 59535870 57544811 55478485 51930019 46637645 42823823 43457533 46707688 48673868
35632 48673868 49199209 50547857 51453715 48351604 43001317 42447903 48714442 54146357
35624 54146357 51231433 42785625 37329304 37394193 38315618 37239267 36818149 38833038 39861510
$$ packed form
35681B9254676r813255k111791M541653N625187L908303M004843N022366L421829
35673D3853811K89117l72071J176608J349344K07256P85367K161363N13656k781191
35664D7183260j968204K853377M391451j64120l939936j223652L360018K270481
35656E2762675l516230o791710m557433k87998K363307K970803K301475J032624
35648D6277513L73223J194873K723591L641950L586306K565744N66463j393793
35640E9535870j991059k066326l548466n292374l813822O33710L250155J966180
35632D8673868N25341J348648R05858l102111n350287n53414O266539N431915
35624E4146357k914924q445808n456321O4889R21425j076351m21118K014889J028472
$$ plain form
35615 39861510 36618385 31846888 30682798 33169074 35024014 35369310 38467740 45910764
35607 45910764 51876327 50489898 44925112 43534789 47911596 51034463 48277032 43883208
35599 43883208 43321602 44770092 43116199 38389079 34641659 33325915 33672029 37417420
35591 37417420 46291985 55443006 56452881 48169012 38635179 34592539 34499461 33913800
35583 33913800 32169397 30498502 28314886 25443055 24756757 28785683 35917230 42769844
35575 42769844 47918603 50770610 49692826 44492419 38469870 34968331 33949138 34604239
35567 34604239 38526214 46574470 54782846 57583888 54114329 48021313 42353598 38158746
35559 38158746 36756974 39066075 42809425 44238372 43155658 43232326 46862475 52248845
$$ packed form
35615C9861510l243125m771497j164090K486276J854940L45296L098430P443024
35607D5910764N965563j386429n564786j390323M376807L122867k757431m393824
35599D3883208n61606J448490j653893m727120l747420j315744L46114L745391
35591C7417420Q874565R151021J009875q283869r533833m042640r3078n85661
35583C3913800j744403j670895k183616k871831o86298M028926P131547O852614
35575D2769844N148759K852007j077784n200407o022549l501539j019193O55101
35567C4604239L921975Q048256Q208376K801042l469559o093016n667715m194852
35559C8158746j401772K309101L743350J428947j082714P6668L630149N386370
$$ plain form
35551 52248845 55948462 56059899 52707936 47554607 43167433 41229360 41319380 42390288
35543 42390288 44072892 44801290 40912089 31190695 21077223 18126571 23270029 30277489
35535 30277489 33900886 34446811 33790315 31693910 28392056 27001586 30064820 35733329
35527 35733329 39956663 40879926 38969477 34543460 27937864 21520813 19214767 23470931
35519 23470931 33143129 43825934 50178296 49455537 43740740 37732121 33894167 31236274
35511 31236274 29153916 29815250 34770693 41008912 43094328 38960940 31770523 26124932
35503 26124932 23950806 24269012 25666210 28044769 31983937 36911851 40791515 42185930
35495 42185930 41874701 41344164 40390298 37823700 34033800 30796192 28709352 27142441
$$ packed form
35551E2248845L699617J11437l351963n153329m387174j938073R0020J070908
35543D2390288J682604P28398l889201r721394j0113472k950652N143458P007460
35535C0277489L623397N45925o56496k096405l301854j390470L063234N668509
35527C5733329M223334R23263j910449m426017o605596o417051k306046M256164
35519B3470931R672198J0682805O352362p22759n714797o008619l837954k657893
35511C1236274k082358O61334M955443O238219K085416m133388p190417n645591
35503B6124932k174126L18206J397198K378559L939168M927914L879664J394415
35495D2185930l11229n30537r53866k566598l789900l237608k086840j566911
$$ plain form
35487 27142441 26801575 29595512 35214527 40528614 43539112 45420103 47389415 48302027
35479 48302027 47175592 45574289 45301037 45874099 46350359 47262740 48326219 46751663 41038901
35470 41038901 34500550 31666758 32772216 35075130 37775922 41551485 44655777 44384393
35462 44384393 42214768 42776165 47087881 51078884 51783813 50867733 50447099 49204748 44885543
35453 44885543 37877198 30358576 24191128 21088516 22248502 26034021 28383946 27453425
35445 27453425 25934504 27106136 30388227 32386877 30842851 26490703 22669185 23654916
35437 23654916 30997734 40572588 45557342 43041945 35431790 25873276 16652382 12227811
35429 12227811 17460299 29991060 40099460 42087380 40581959 41246333 41521491 37379766
$$ packed form
35487B7142441l40866K793937N619015N314087L010498J880991J969312R12612
35479D8302027j126435j601303k73252N73062M76260R12381J063479j574556n712762
35470D1038901o538351k833792J105458K302914K700792L775563L104292k71384
35462D4384393k169625N61397M311716L991003P04929r16080m20634j242351m319205
35453D4885543p008345p518622o167448l102612J159986L785519K349925r30521
35445B7453425j518921J171632L282091J998650j544026m352148l821518R85731
35437B3654916P342818R574854M984754k515397p610155r558514r220894m424571
35429A2227811N232488J2530761J0108400J987920j505421O64374K75158m141725
$$ plain form
35421 37379766 33541678 37297695 45143336 46305266 39537670 35906439 42377232 52145500
35413 52145500 55777139 53898231 52725640 53109554 51189765 46517929 42777493 41583713
35405 41583713 40667729 37949699 33921333 30288690 28556498 29086002 29878512 27925728
35397 27925728 23374788 20120859 20475345 21975929 21672032 20417944 20009728 19351430 17297931
35388 17297931 16361047 18912149 21881542 20467002 15997577 14824125 19473411 25780341
35380 25780341 29358705 30371699 30651960 30194148 28691836 27854347 29986089 35332413
35372 35332413 41594142 45194647 43568150 37912323 32902468 31542203 31406976 28761574
35364 28761574 24986213 24863589 29162726 33694313 36003369 37835969 39678892 38466526
$$ packed form
35421C7379766l838088L756017P845641J161930o767596l631231O470793R768268
35413E2145500L631639j878908j172591L83914j919789m671836l740436j193780
35405D1583713r15984k718030m028366l632643j732192N29504P92510j952784
35397B7925728m550940l253929L54486J500584l03897j254088m08216o58298k053499
35388A7297931r36884K551102K969393j414540m469425j173452M649286O306930
35380B5780341L578364J012994K80261m57812j502312q37489K131742N346324
35372C5332413O261729L600505j626497n655827n009855j360265j35227k645402
35364B8761574l775361j22624M299137M531587K309056J832600J842923j212366
$$ plain form
35356 38466526 33825789 31613552 36413766 43836208 45923734 42733636 42548906 49795900
35348 49795900 58150220 58738751 51636819 44671818 41969430 38999021 31027539 21978557
35340 21978557 19633083 23604588 24658931 17793692 9980217 10515565 18225355 24337847
35332 24337847 25369521 26064336 29981806 34160902 34802124 32679146 30537510 29325472
35324 29325472 28987558 29312733 28647899 25724760 23702806 27510467 35852663 41616932
35316 41616932 42399452 44065615 50135691 54552941 51047356 43938987 41946987 45059139
35308 45059139 45749390 41177182 35955673 33216983 30641319 26386270 22486602 20886309
35300 20886309 21447476 24858705 32007965 39312673 40460474 34815306 28867951 27181926
$$ packed form
35356C8466526m640737k212237M800214P422442K087526l190098j84730P246994
35348D9795900Q354320N88531p101932o965001k702388k970409p971482r048982
35340B1978557k345474L971505J054343o865239p813475N35348P709790O112492
35332B4337847J031674O94815L917470M179096O41222k122978k141636j212038
35324B9325472l37914L25175o64834k923139k021954L807661Q342196N764269
35316D1616932P82520J666163O070076M417250l505585p108369j992000L112152
35308D5059139O90251m572208n221509k738690k575664m255049l899668j600293
35300B0886309N61167L411229P149260P304708J147801n645168n947355j686025
$$ plain form
35292 27181926 27157398 25432735 24044898 26217268 30387753 32995417 34093024 35813315
35284 35813315 37637564 37387108 35220116 32929644 30760561 28307054 26946185 27786777
35276 27786777 28642941 26889708 24257445 24703545 27951711 29218476 25706998 19926447
35268 19926447 16161240 16805882 22329915 31111305 38449913 39560673 35302993 31828391
35260 31828391 32796154 35092845 34352918 31236153 28939271 27476716 24941819 22762797
35252 22762797 24631609 30273944 34977083 36182138 36136225 36391480 34245439 27917461
35244 27917461 21621149 20802342 23962529 23890852 17028410 7805449 3039234 5186484
35236 5186484 12006717 19815247 25295275 26253477 22803513 17294193 12190435 8475415
$$ packed form
35292B7181926k4528j724663j387837K172370M170485K607664J097607J720291
35284C5813315J824249k50456k166992k290472k169083k453507j360869Q40592
35276B7786777Q56164j753233k632263M46100L248166J266765l511478n780551
35268A9926447l765207O44642N524033Q781390P338608J110760m257680l474602
35260C1828391R67763K296691p39927l116765k296882j462555k534897k179022
35252B2762797J868812N642335M703139J205055m5913K55255k146041o327978
35244B7917461o296312q18807L160187p1677o862442r222961m766215K147250
35236E186484O820233P808530N480028R58202l449964n509320n103758l715020
$$ plain form
35228 8475415 5918296 3541452 98211 -3900294 -4727641 1368539 12924204 23713715
35220 23713715 29213354 30094262 28703729 25588803 21323058 18482429 18996802 21645213
35212 21645213 24362601 26812672 28813851 29208414 28703787 30362411 33998245 33868327
35204 33868327 26583827 17979861 16194001 20184194 21822941 18309157 15204023 16625937
35196 16625937 19661567 20677427 20893389 22629120 25181813 27538376 30464810 32743420
35188 32743420 30191780 22459767 16386984 17600376 22113736 21771229 15909845 11913689
35180 11913689 14814728 21566080 26334030 27336222 26949524 27835749 30677270 34373998
35172 34373998 37143908 37566002 34989683 29746927 24020868 21503535 23498692 25688694
$$ packed form
35228H475415k557119k376844l443241l998505q27347O096180J1555665J0789511
35220B3713715N499639Q80908j390533l114926m265745k840629N14373K648411
35212B1645213K717388K450071K001179L94563n04627J658624L635834j29918
35204C3868327p284500q603966j785860L990193J638747l513784l105134J421914
35196A6625937L035630J015860K15962J735731K552693K356563K926434K278610
35188C2743420k551640p732013o072783J213392M513360l42507n861384l996156
35180A1913689K901039O751352M767950J002192l86698Q86225K841521L696728
35172C4373998K769910M22094k576319n242756n726059k517333J995157K190002
$$ plain form
35164 25688694 22718738 16769112 16541119 25020261 33456327 32508100 25343750 23016926
35156 23016926 28884707 34969265 34035345 28356734 24246409 23476146 23705617 23825380 25031620
35147 25031620 27989959 31397147 32836018 30363941 24538226 19066485 17543176 19413312
35139 19413312 21421167 22820990 25731868 29825613 30849004 26488668 20178283 16390436
35131 16390436 15150756 14333130 14679122 18472624 24632075 29124936 29972385 28661303
35123 28661303 26861950 24880007 23359502 23301231 23741898 22220114 18524642 15691552
35115 15691552 16415157 20575617 26841882 33957610 39387700 39958471 36209340 33472416
35107 33472416 35623481 39822648 40930016 39357054 39858529 42975509 43158457 37288448
$$ packed form
35164B5688694k969956n949626k27993Q479142Q436066r48227p164350k326824
35156B3016926N867781O084558r33920n678611m110325p70263K29471J19763J206240
35147B5031620K958339L407188J438871k472077n825715n471741j523309J870136
35139A9413312K007855J399823K910878M093745J023391m360336o310385l787847
35131A6390436j239680q17626L45992L793502O159451M492861Q47449j311082
35123B8661303j799353j981943j520505n8271M40667j521784l695472k833090
35115A5691552P23605M160460O266265P115728N430090N70771l749131k736924
35107C3472416K151065M199167J107368j572962N01475L116980J82948n870009
$$ plain form
35099 37288448 30419052 29419239 33743100 36549594 33669528 27614261 22842902 20492132
35091 20492132 18879127 17094056 16577733 19351492 24752314 28252662 25464270 18410269
35083 18410269 15353893 21780348 33485580 41919118 44556034 45413340 46357743 43966233
35075 43966233 36311425 27272064 21239049 17948604 15696551 15369004 17114421 16787273
35067 16787273 11206570 4778981 4980399 11778752 17248302 16659881 14873341 19218200
35059 19218200 29517283 38291402 39292171 33398519 26636483 24097096 26035138 29279348
35051 29279348 31760814 34477827 38424478 41366884 40066751 35133443 30870326 29657995
35043 29657995 28781783 24094630 15221366 5728594 -695539 -2613676 -113145 6127067
$$ packed form
35099C7288448o869396r99813M323861K806494k880066o055267m771359k350770
35091B0492132j613005j785071n16323K773759N400822L500348k788392p054001
35083A8410269l056376O426455J1705232Q433538K636916Q57306R44403k391510
35075D3966233p654808r039361o033015l290445k252053l27547J745417l27148
35067A6787273n580703o427589K01418O798353N469550n88421j786540M344859
35059A9218200J0299083Q774119J000769n893652o762036k539387J938042L244210
35051B9279348K481466K717013L946651K942406j300133m933308m263117j212331
35043B9657995q76212m687153q873264r492772o424133j918137K500531O240212
$$ plain form
35035 6127067 14205498 20756213 23117025 21971725 20533013 20450564 19859740 16691385 12485804
35026 12485804 10803087 12809760 16978027 22262282 28105480 31697075 29864469 24853262
35018 24853262 23560043 28598310 34278442 34406635 29936733 25156131 20542349 14725527
35010 14725527 10331962 11502220 17010797 21779261 24448264 27611229 30933437 30448538
35002 30448538 25676954 21494434 20962286 21386222 19746213 17368253 16427467 15807862 13662488
34993 13662488 11238444 11220011 14127086 18215332 21056840 20219184 15113194 9378451
34985 9378451 8357960 12604578 16872173 17142610 15345733 15003813 15533453 13889642 9634475
34976 9634475 5632206 5157973 9915633 18811232 27168066 29765875 26590203 23099271
$$ packed form
35035F127067Q078431O550715K360812j145300j438712q2449n90824l168355m205581
35026A2485804j682717K006673M168267N284255N843198L591595j832606n011207
35018B4853262j293219N038267N680132J28193m469902m780602m613782n816822
35010A4725527m393565J170258N508577M768464K669003L162965L322208m84899
35002C0448538m771584m182520n32148M23936j640009k377960r40786o19605k145374
34993A3662488k424044j8433K907075M088246K841508q37656n105990n734743
34985I378451j020491M246618M267595K70437j796877l41920N29640j643811m255167
34976I634475m002269m74233M757660Q895599Q356834K597809l175672l490932
$$ plain form
34968 23099271 23036545 23915997 21736544 16843160 12138210 8538485 5897225 6035002 10698715
34959 10698715 17785231 23285684 26187294 28224095 29519169 27868121 22526271 16198431
34951 16198431 12748500 14086183 18889839 23410167 24431542 22362225 20334207 19943666
34943 19943666 19958591 19627443 20140142 21640880 22323348 22305956 24545322 29283460 31508274
34934 31508274 27418469 19951581 14221967 11035318 9031144 9287250 12400875 14508957
34926 14508957 12716191 11873112 18565931 29625746 34442880 29201068 21594682 19790968
34918 19790968 23030908 25303918 22743559 15045397 4725117 -2408303 -814977 7704012
34910 7704012 14414211 13831610 9768494 8700195 11281202 13994624 15728868 18354550
$$ packed form
34968B3099271o2726Q79452k179453m893384m704950l599725k641260J37777M663713
34959A0698715P086516N500453K901610K036801J295074j651048n341850o327840
34951A6198431l449931J337683M803656M520328J021375k069317k028018l90541
34943A9943666J4925l31148N12699J500738O82468j7392K239366M738138K224814
34934C1508274m089805p466888n729614l186649k004174K56106L113625K108082
34926A4508957j792766q43079O692819J1059815M817134n241812p606386j803714
34918A9790968L239940K273010k560359p698162j0320280p133420J593326Q518989
34910G704012O710199n82601m063116j068299K581007K713422J734244K625682
$$ plain form
34902 18354550 22575849 26912982 30037913 31679520 31929847 31105766 29183666 24716739
34894 24716739 16458562 6795689 640728 -309401 1075521 3216744 8803049 18925778
34886 18925778 28269265 30731861 27359967 24027300 22917898 21195472 17251867 13029184
34878 13029184 9556756 5000713 -921224 -4325881 -1810690 4387004 8695696 8962306
34870 8962306 8631111 11863926 17949478 21770496 19903377 15293313 14564316 20534958
34862 20534958 28834638 32849497 30787391 26490451 24365124 25511886 28324182 30447896
34854 30447896 29684617 25192425 19006067 14687941 13035579 10702886 5079634 -959033
34846 -959033 -2444611 -67713 -242496 -5683092 -10077729 -6194373 3347168 8693918
$$ packed form
34902A8354550M221299M337133L124931J641607K50327q24081j922100m466927
34894B4716739q258177r662873o154961r50129J384922K141223N586305J0122729
34886A8925778R343487K462596l371894l332667j109402j722426l943605m222683
34878A3029184l472428m556043n921937l404657K515191O197694M308692K66610
34870H962306l31195L232815O085552L821018j867119m610064p28997N970642
34862B0534958Q299680M014859k062106m296940k125327J146762K812296K123714
34854C0447896p63279m492192o186358m318126j652362k332693n623252o038667
34846i59033j485578K376898j74783n440596m394637L883356R541541N346750
$$ plain form
34838 8693918 5372019 -1272072 -4848743 -5235068 -4582322 -1410177 6820254 18470765
34830 18470765 29249545 36691933 39849482 37567703 31142749 25806839 24889244 24958852
34822 24958852 21570403 17080000 17003602 21147543 25080530 28278452 32870699 35620296
34814 35620296 30605242 20624773 16197780 20559239 25008107 23081076 19865465 21284969
34806 21284969 23069788 18855661 12607917 13358267 21454148 29013202 31558601 30812250
34798 30812250 27759154 21585838 15197101 13672097 16221912 16578842 12693270 9690034
34790 9690034 11368848 14622428 14985170 13148314 13116938 17046774 23866728 30286380 32019775
34781 32019775 27139739 19529656 16092642 19252591 24740662 27459531 26470029 23381249
$$ packed form
34838H693918l321899o644091l576671l86325O52746L172145Q230431J1650511
34830A8470765J0778780P442388L157549k281779o424954n335910r17595O9608
34822B4958852l388449m490403p6398M143941L932987L197922M592247K749597
34814C5620296n015054r980469m426993M361459M448868j927031l215611J419504
34806B1284969J784819m214127o247744P50350Q095881P559054K545399p46351
34798C0812250l053096o173316o388737j525004K549815L56930l885572l003236
34790I690034J678814L253580L62742j836856l1376L929836O819954O419652J733395
34781C2019775m880036p610083l437014L159949N488071K718869r89502l088780
$$ plain form
34773 23381249 19445370 16133256 15593475 18049849 20483008 19943195 17181802 15631816
34765 15631816 17378540 20788104 21827138 18103216 12065702 8779882 9471931 9811312
34757 9811312 7021807 5475524 10401494 18111484 18954913 10313599 598087 -1307197
34749 -1307197 4714192 13227805 20248621 23884200 22705249 17633412 12525723 9671961
34741 9671961 7502473 5252111 5900424 10760579 15120204 14390940 11655029 13189819
34733 13189819 18216929 19552595 14351430 7897975 5302211 5184853 4439248 4379016 7793835
34724 7793835 12895498 15113077 13989512 13874540 17299330 21491445 23124376 23394866
34716 23394866 25410696 28283822 27643296 22271223 16777489 15939145 18839519 20969502
$$ packed form
34773B3381249l935879l312114n39781K456374K433159n39813k761393j549986
34765A5631816J746724L409564J039034l723922o037514l285820O92049L39381
34757I811312k789505j546283M925970P709990Q43429q641314r715512j905284
34749a307197O021389Q513613P020816L635579j178951n071837n107689k853762
34741I671961k169488k250362O48313M860155M359625p29264k735911J534790
34733A3189819N027110J335666n201165o453455k595764j17358p45605o0232L414819
34724G793835N101663K217579j123565j14972L424790M192115J632931K70490
34716B3394866K015830K873126o40526n372073n493734q38344K900374K129983
$$ plain form
34708 20969502 20332971 18519710 16777914 14573725 12294851 11989513 13961640 15091110
34700 15091110 12430536 7044809 2773228 2267631 5403461 10374395 14911600 17173449
34692 17173449 16752167 14691160 12230270 10231982 9772093 11709873 15175855 18123595
34684 18123595 19997418 21912434 23344269 21267544 14703149 7967114 6410941 10081768
34676 10081768 14615247 17644383 20813302 25332291 29373860 31384963 32665698 34140673
34668 34140673 33233015 27546790 20225145 17356862 19813411 21838803 19388748 16001022
34660 16001022 17163596 21685050 23114732 18671884 12281110 8642866 8627355 11459165
34652 11459165 17010088 23665070 27569829 26919471 24389509 22846021 21482946 18984576
$$ packed form
34708B0969502o36531j813261j741796k204189k278874l05338J972127J129470
34700A5091110k660574n385727m271581n05597L135830M970934M537205K261849
34692A7173449m21282k061007k460890j998288m59889J937780L465982K947740
34684A8123595J873823J915016J431835k076725o564395o736035j556173L670827
34676A0081768M533479L029136L168919M518989M041569K011103J280735J474975
34668C4140673r07658n686225p321645k868283K456549K025392k450055l387726
34660A6001022J162574M521454J429682m442848o390774l638244j5511K831810
34652A1459165N550923O654982L904759o50358k529962j543488j363075k498370
$$ plain form
34644 18984576 17385441 18918591 21310904 20282601 15186667 8704369 3070508 552736
34636 552736 5036538 17496517 31131626 36772281 32975191 25902157 20143097 15512214
34628 15512214 12232971 12127338 13692376 12873149 10407222 11626086 16811290 18942178
34620 18942178 14389734 8916146 8683074 11726187 13424914 14326774 16511294 17618519
34612 17618519 15381627 13681358 16751980 20813975 19134435 13019955 10012067 12388580
34604 12388580 14880494 13478959 9732726 6287529 4534779 6805971 14435358 22954978
34596 22954978 25468161 21985877 19527666 21581759 23468360 20368112 14403095 10728394
34588 10728394 10960747 13349659 15822312 16371175 13738230 9922430 9001442 11834013
$$ packed form
34644A8984576j599135J533150K392313j028303n095934o482298n633861k517772
34636E52736M483802J2459979J3635109N640655l797090p073034n759060m630883
34628A5512214l279243j05633J565038q19227k465927J218864N185204K130888
34620A8942178m552444n473588k33072L043113J698727R01860K184520J107225
34612A7618519k236892j700269L070622M061995j679540o114480l007888K376513
34604A2388580K491914j401535l746233l445197j752750K271192P629387Q519620
34596B2954978K513183l482284k458211K054093J886601l100248n965017l674701
34588A0728394K32353K388912K472653N48863k632945l815800r20988K832571
$$ plain form
34580 11834013 15144298 16997133 19018801 21514807 21185175 16669293 12079466 11289286
34572 11289286 12247519 11092775 9056721 10658614 16619303 22839283 25805315 25560147
34564 25560147 23645885 21121523 18765197 17081140 15958566 15554191 16820558 19766706
34556 19766706 22100585 21278262 17487215 13529303 12294885 14753033 19035186 20964798
34548 20964798 17494304 10622053 5785026 5311146 6173746 5741389 6099121 9330186 11683556
34539 11683556 7644549 -1136667 -6192602 -2493777 5596331 10203156 8683732 4592063
34531 4592063 2452487 4072470 8563169 13331347 15333436 13540802 10527334 9891101
34523 9891101 11447970 10737772 4828584 -2762928 -5545869 -2275217 1332218 301805
$$ packed form
34580A1834013L310285J852835K021668K496006l29632m515882m589827p90180
34572A1289286R58233j154744k036054J601893N960689O219980K966032k45168
34564B5560147j914262k524362k356326j684057j122574m04375J266367K946148
34556A9766706K333879q22323l791047l957912j234418K458148M282153J929612
34548B0964798l470494o872251m837027m73880Q62600m32357L57732L231065K353370
34539A1683556m039007q781216n055935L698825Q090108M606825j519424m091669
34531D592063k139576J619983M490699M768178K002089j792634l013468o36233
34523I891101J556869p10198n909188p591512k782941L270652L607435j030413
$$ plain form
34515 301805 -3054761 -2794268 2576167 8946709 12309773 11985182 8629971 3068320 -2157771
34506 -2157771 -3714003 -1571613 385213 -891980 -4609376 -8653773 -12059599 -13602292
34498 -13602292 -11297834 -5807889 -1793229 -2955220 -7180833 -8998472 -5783088 304877
34490 304877 5395911 7270152 6639862 6255883 7755304 9128079 7221308 2728640 -499877
34481 -499877 -1598299 -3868028 -8178596 -9929947 -5712598 1359865 6938800 11914202
34473 11914202 18598985 24164161 24350511 21662379 23005058 29460934 34595361 33617549
34465 33617549 28909071 25332566 24574627 25361620 25582484 23489191 20091643 19981645 25651763
34456 25651763 31823564 31017401 24613985 21567636 24799625 26384173 19821258 10134540
$$ packed form
34515C01805l356566K60493N370435O370542L363064l24591l355211n561651n226091
34506b157771j556232K142390J956826j277193l717396m044397l405826j542693
34498a3602292K304458N489945M014660j161991m225613j817639L215384O087965
34490C04877N091034J874241o30290l83979J499421J372775j906771m492668l228517
34481d99877j098422k269729m310568j751351M217349P072463N578935M975402
34473A1914202O684783N565176J86350k688132J342679O455876N134427r77812
34465C3617549m708478l576505p57939P86993K20864k093293l397548j09998N670118
34456B5651763O171801q06163o403416l046349L231989J584548o562915r686718
$$ plain form
34448 10134540 6095409 7614129 7700962 4005336 1465377 4146272 10185596 15476964
34440 15476964 18157589 18450751 17084746 15028631 13196696 11890459 11091907 10599813
34432 10599813 9542924 7638413 7430827 12013729 18951833 20716097 14699893 8860366
34424 8860366 12146929 22109749 28301178 26499547 22498784 21589643 21688306 19307161 15838917
34415 15838917 13944357 12760253 11312739 12643820 19103741 26141787 26682742 20926084
34407 20926084 16380380 17638029 20951904 20638158 16776546 13602935 12758396 11621691
34399 11621691 7868572 3034424 866779 3481818 9845023 17276974 23559645 27598770
34391 27598770 28874890 27157378 22904970 17340771 11837167 7682753 6394739 8892979
$$ packed form
34448A0134540m039131J518720Q6833l695626k539959K680895O039324N291368
34440A5476964K680625K93162j366005k056115j831935j306237p98552m92094
34432A0599813j056889j904511k07586M582902O938104J764264o016204n839527
34424H860366L286563R962820O191429j801631m000763r09141R8663k381145l468244
34415A5838917j894560j184104j447514J331081O459921P038046N40955n756658
34407B0926084m545704J257649L313875l13746l861612l173611q44539j136705
34399A1621691l753119m834148k167645K615039O363205P431951O282671M039125
34391B7598770J276120j717512m252408n564199n503604m154414j288014K498240
$$ plain form
34383 8892979 13477919 16042585 14248937 10863985 10582423 13470428 14363189 10005147
34375 10005147 4059418 2335612 4696750 5235075 382626 -6566111 -10064048 -8462692
34367 -8462692 -3705223 2488454 9175401 14571661 17458529 19758437 24073590 28309662
34359 28309662 26741870 18072500 8528282 3928640 2125928 -2181079 -7702267 -7878252
34351 -7878252 -1558907 4523739 6045276 7339902 13035868 18935892 17765069 10790945
34343 10790945 6378238 8045357 11219811 12196596 12825189 14156957 12672534 6958189
34335 6958189 2223827 3103737 6702505 8161078 8655099 11435107 13848407 11352906
34327 11352906 7226839 9220337 16495356 18985861 12056665 3621600 2764191 8188875
$$ packed form
34383H892979M584940K564666j793648l384952k81562K888005Q92761m358042
34375A0005147n945729j723806K361138N38325m852449o948737l497937J601356
34367h462692M757469O193677O686947N396260K886868K299908M315153M236072
34359B8309662j567792q669370r544218m599642j802712m307007n521188j75985
34351g878252O319345O082646J521537J294626N695966N900024j170823o974124
34343A0790945m412707J667119L174454R76785O28593J331768j484423n714345
34335F958189m734362Q79910L598768J458573M94021K780008K413300k495501
34327A1352906m126067J993498P275019K490505o929196q435065q57409N424684
$$ plain form
34319 8188875 12871283 14458910 15375670 16834878 18565001 21643130 26433435 30017416
34311 30017416 30225014 29665956 31057333 31334435 25976980 17000671 10559358 8043125
34303 8043125 5912780 3495563 3904401 6759288 7095959 3444046 595963 1533876 2386203
34294 2386203 -920773 -5978954 -8257298 -8197634 -9041072 -10208355 -7952712 -1651580 4835524
34285 4835524 8207459 9157101 10490178 13701313 17373840 17835417 12259970 2468650
34277 2468650 -5372821 -6325337 -1095561 6121332 12585171 18059930 22454260 25001803
34269 25001803 25592714 25070754 23989777 22061045 18908779 15064503 12470489 13480407
34261 13480407 17921795 21567810 20014284 14442699 10693703 11623013 13478419 11662630
$$ packed form
34319H188875M682408J587627R16760J459208J730123L078129M790305L583981
34311C0017416K07598n59058J391377K77102n357455q976309o441313k516233
34303H043125k130345k417217M08838K854887L36671l651913k848083R37913Q52327
34294B386203l306976n058181k278344N9664q43438j167283K255643O301132O487104
34285D835524L371935R49642J333077L211135L672527M61577n575447r791320
34277B468650p841471r52516N229776P216893O463839N474759M394330K547543
34269B5001803N90911n21960j080977j928732l152266l844276k594014J009918
34261A3480407M441388L646015j553526n571585l748996R29310J855406j815789
$$ plain form
34253 11662630 7089637 4254168 5410221 9352473 13746558 15814551 12953424 6103114
34245 6103114 819533 1643603 7012133 13014043 19688058 28605613 35976898 34845601
34237 34845601 24968726 14542910 9953450 8950775 6885392 4779282 6501454 10955289
34229 10955289 12435469 8222593 1738257 -2262088 -2684326 -1663750 -1464605 -2781467
34221 -2781467 -4695502 -5515860 -4485629 -2921665 -2727455 -3615835 -3091303 101460 3683365
34212 3683365 4408521 2425620 1162799 2247984 2492756 -1932927 -9120977 -12019138
34204 -12019138 -6129252 5607319 16665595 23238377 24813247 21178232 12825491 3620924
34196 3620924 -1177854 -842958 -172820 -2967930 -6903721 -6940102 -1978734 4500264 9610235
$$ packed form
34253A1662630m572993k835469J156053L942252M394085K067993k861127o850310
34245F103114n283581Q24070N368530O001910O674015Q917555P371285j131297
34237C4845601r876875j0425816m589460j002675k065383k106110J722172M453835
34229A0955289J480180m212876o484336m000345m22238J020576J99145j316862
34221b781467j914035q20358J030231J563964J94210q88380N24532L192763L581905
34212C683365P25156j982901j262821J085185K44772m425683p188050k898161
34204a2019138N889886J1736571J1058276O572782J574870l635015q352741r204567
34196C620924m798778L34896O70138k795110l935791l6381M961368O478998N109971
$$ plain form
34187 9610235 14066816 19506899 24917906 27252929 24875358 19125130 12677204 7653758
34179 7653758 5619767 7657301 12562684 15699282 12289567 2758756 -7056401 -12139633
34171 -12139633 -12970576 -12614931 -11307909 -6684611 1578851 10255069 15720531 16502735
34163 16502735 13007257 7265833 3046889 3389640 7059439 9685387 9415140 9200710
34155 9200710 12079855 16364393 17706217 14602453 9444798 4656435 291251 -4005639
34147 -4005639 -6729260 -5846008 -1658328 3345843 7692845 12356754 17908512 21641242
34139 21641242 19861626 12956140 5908280 3168157 4902340 8690131 12235476 13281088
34131 13281088 9948625 3498781 -1726983 -3577468 -4709466 -7117049 -7288382 -1399605
$$ packed form
34187I610235M456581N440083N411007K335023k377571n750228o447926n023446
34179G653758k033991K037534M905383L136598l409715r530811r815157n083232
34171a2139633q30943L55645J307022M623298Q263462Q676218N465462P82204
34163A6502735l495478n741424m218944L42751L669799K625948k70247k14430
34155I200710K879145M284538J341824l103764n157655m788363m365184m296890
34147d005639k723621Q83252M187680N004171M347002M663909N551758L732730
34139B1641242j779616o905486p047860k740123J734183L787791L545345J045612
34131A3281088l332463o449844n225764j850485j131998k407583j71333N888777
$$ plain form
34123 -1399605 6939267 9746434 4902265 -1745150 -4411976 -2747928 713977 3346916
34115 3346916 2307706 -3178114 -8686005 -8790548 -4763433 -2285652 -1254969 4436251
34107 4436251 15071676 21783604 19455243 14781642 15297989 17888880 16149895 12616593
34099 12616593 13636823 16460512 12739869 3389112 -1255750 2753226 7041958 3738894
34091 3738894 -4200945 -9412930 -9879412 -7761852 -4023339 998764 5496232 8655571
34083 8655571 12141438 16111980 17196433 13612753 8963844 7446449 8127631 7548514
34075 7548514 5611952 5172418 7370187 10649733 13303478 14403894 13468861 11635675
34067 11635675 11979033 16372823 22937435 28201857 30413607 29315779 24813170 18036026
$$ packed form
34123a399605Q338872K807167m844169o647415k666826J664048L461905K632939
34115C346916j039210n485820n507891j04543M027115K477781J030683N691220
34107D436251J0635425O711928k328361m673601N16347K590891j738985l533302
34099A2616593J020230K823689l720643r350757m644862M008976M288732l303064
34091C738894p939839n211985m66482K117560L738513N022103M497468L159339
34083H655571L485867L970542J084453l583680m648909j517395O81182n79117
34075G548514j936562m39534K197769L279546K653745J100416r35033j833186
34067A1635675L43358M393790O564612N264422K211750j097828m502609o777144
$$ plain form
34059 18036026 11875163 8156047 5816829 3713647 2982052 4271030 5208723 3843974
34051 3843974 2295622 3084977 3863711 693023 -4483068 -5346309 -823461 2475318 -61614
34042 -61614 -3701087 -866465 7929924 14581318 14113013 10310680 9510668 12602898 16021070
34033 16021070 18229691 21001924 24433008 25216706 22155889 19841093 22877605 28463511
34025 28463511 29480202 24331139 18493639 15732045 13592912 9976941 8242991 11012905
$$ packed form
34059A8036026o160863l719116k339218k103182p31595J288978R37693j364749
34051C843974j548352P89355P78734l170688n176091q63241M522848L298779k536932
34042f1614l639473K834622Q796389O651394m68305l802333q00012L092230L418172
34033A6021070K208621K772233L431084P83698l060817k314796L036512N585906
34025B8463511J016691n149063n837500k761594k139133l615971j733950K769914
$$ [...]
##END NTUPLES=NMR SPECTRUM
##END=
