##TITLE=31Pdec_114-2024-Bay
 CDCl3, 24 sc
 23.12.2024
##JCAMPDX= 6.0         $$ Bruker NMR JCAMP-DX V2.0
##DATA TYPE= NMR SPECTRUM
##DATA CLASS= NTUPLES
##ORIGIN= UXNMR, Bruker Analytische Messtechnik GmbH
##OWNER= root
$$ XWIN-NMR		Version 3.5
$$ Mon Dec 23 13:54:29 2024 Russian Standard Time (UT+4h)  she@DPX200
##.OBSERVE FREQUENCY= 81.013821
##.OBSERVE NUCLEUS= ^31P
##.ACQUISITION MODE= SIMULTANEOUS
##.ACQUISITION SCHEME= undefined
##.AVERAGES= 24
##.DIGITISER RES= 17
##SPECTROMETER/DATA SYSTEM= spect
##.PULSE SEQUENCE= zgpg30
##.SOLVENT NAME= CDCl3
##.SHIFT REFERENCE= (INTERNAL, CDCl3, 0, 198.062)
##AUDIT TRAIL= $$ (NUMBER, WHEN, WHO, WHERE, WHAT)
$$ ##TITLE= Audit trail, XWIN-NMR		Version 3.5
$$ ##JCAMPDX= 5.01
$$ ##ORIGIN= Bruker BioSpin GmbH
$$ ##OWNER= she
$$ F:/spectra/data/she/nmr/P31/2/pdata/1/auditp.txt
$$ ##AUDIT TRAIL=  $$ (NUMBER, WHEN, WHO, WHERE, WHAT)
(   1,<2024-12-23 13:53:24.32 +0400>,<she>,<DPX200>,
      <created by zg, POWCHK disabled, PULCHK disabled
       configuration hash MD5:
       00 E9 B6 7A A2 85 ED C7 34 08 36 98 17 FE 4E 26
       data hash MD5: 32K
       2D 03 D4 71 8E C0 B4 37 48 EA 08 B1 B3 41 C9 C5>)
(   2,<2024-12-23 13:53:27.06 +0400>,<she>,<DPX200>,
      <Start of raw data processing
       efp BC_mod = 2 LB = 1.5 FT_mod = 6 PKNL = 1 PHC0 = 2162.596 PHC1 = 357.886 SI = 64K 
       data hash MD5: 64K
       BD BA 86 79 93 38 5E 5E 30 7B F4 A6 54 0C 64 E0>)
(   3,<2024-12-23 13:53:49.01 +0400>,<she>,<DPX200>,
      <pk PHC0 = -165.5637 PHC1 = 6.799999 
       data hash MD5: 64K
       52 1C BF 47 7A BE 00 B8 0F DA 15 67 28 CF 74 79>)
(   4,<2024-12-23 13:53:53.06 +0400>,<she>,<DPX200>,
      <abs ABSG = 5 
       data hash MD5: 64K
       BE E7 3D 18 72 4E 8D AB A7 E8 85 34 D8 96 02 41>)
$$ ##END=
$$ 
$$ hash MD5
$$ 44 64 62 E0 4C 6D 2C 79 C5 0A 08 C0 24 7A 72 6C
##$RELAX= 
##$RELAX= 
##$RELAX= 
##$RELAX= 
##$RELAX= 
##$RELAX= 
##$RELAX= 
##$RELAX= 
$$ Bruker specific parameters
$$ --------------------------
##$DU= <F:/spectra>
##$EXPNO= 2
##$NAME= <P31>
##$PROCNO= 1
##$TYPE= <nmr>
##$USER= <she>
##$AMP= (0..31)
100 100 100 100 100 100 100 100 100 100 100 100 100 100 100 100 100 100 
100 100 100 100 100 100 100 100 100 100 100 100 100 100 
##$AQSEQ= 0
##$AQ_mod= 1
##$AUNM= <au_zg>
##$AUTOPOS= <>
##$BF1= 81.014009
##$BF2= 200.13
##$BF3= 200.13
##$BF4= 200.13
##$BF5= 200.13
##$BF6= 200.13
##$BF7= 200.13
##$BF8= 200.13
##$BYTORDA= 1
##$CFDGTYP= 0
##$CFRGTYP= 5
##$CHEMSTR= <none>
##$CNST= (0..31)
1 1 145 1 1 1 1 1 1 1 1 1 1 1 1 1 1 1 1 1 1 1 1 1 1 1 1 1 1 1 1 1 
##$CPDPRG= <waltz16>
##$CPDPRG1= <>
##$CPDPRG2= <waltz16>
##$CPDPRG3= <>
##$CPDPRG4= <mlev>
##$CPDPRG5= <mlev>
##$CPDPRG6= <mlev>
##$CPDPRG7= <mlev>
##$CPDPRG8= <mlev>
##$CPDPRGB= <>
##$CPDPRGT= <>
##$D= (0..31)
0 1 0 0 0 0 0 0 0 0.06 0 0.03 2e-05 3e-06 0 0 0.0002 0 0 0 0 0 0 0 0 0 
0 0 0 0 0 0 
##$DATE= 1734947603
##$DBL= (0..7)
120 120 120 11 120 120 24 19 
##$DBP= (0..7)
150 150 150 150 150 150 150 150 
##$DBP07= 0
##$DBPNAM0= <>
##$DBPNAM1= <>
$$ [...]
##$SUBNAM3= <"">
##$SUBNAM4= <"">
##$SUBNAM5= <"">
##$SUBNAM6= <"">
##$SUBNAM7= <"">
##$SUBNAM8= <"">
##$SUBNAM9= <"">
##$SW= 400.765351723535
##$SWIBOX= (0..15)
0 1 3 0 0 0 0 0 0 0 0 0 0 0 0 0 
##$SW_h= 32467.5324675325
##$TD= 32768
##$TD0= 1
##$TE= 0
##$TE2= 300
##$TE3= 300
##$TEG= 300
##$TL= (0..7)
0 120 53 12 22 120 120 120 
##$TP= (0..7)
150 150 150 150 150 150 150 150 
##$TP07= 0
##$TPNAME0= <>
##$TPNAME1= <>
##$TPNAME2= <>
##$TPNAME3= <>
##$TPNAME4= <>
##$TPNAME5= <>
##$TPNAME6= <>
##$TPNAME7= <>
##$TPOAL= (0..7)
0.5 0.5 0.5 0.5 0.5 0.5 0.5 0.5 
##$TPOFFS= (0..7)
0 0 0 0 0 0 0 0 
##$TUNHIN= 0
##$TUNHOUT= 0
##$TUNXOUT= 0
##$USERA1= <user>
##$USERA2= <user>
##$USERA3= <user>
##$USERA4= <user>
##$USERA5= <user>
##$V9= 5
##$VALIST= <valist>
##$VCLIST= <CCCCCCCCCCCCCCC>
##$VD= 0
##$VDLIST= <DDDDDDDDDDDDDDD>
##$VPLIST= <PPPPPPPPPPPPPPP>
##$VTLIST= <TTTTTTTTTTTTTTT>
##$WBST= 1024
##$WBSW= 4
##$XGAIN= (0..3)
0 0 0 0 
##$XL= 0
##$YL= 0
##$YMAX_a= 16007
##$YMIN_a= -17140
##$ZGOPTNS= <>
##$ZL1= 120
##$ZL2= 120
##$ZL3= 120
##$ZL4= 120
##$ABSF1= 198.0616
##$ABSF2= -202.7028
##$ABSG= 5
##$ABSL= 3
##$ALPHA= 0
##$AQORDER= 0
##$ASSFAC= 0
##$ASSFACI= 0
##$ASSFACX= 0
##$ASSWID= 0
##$AUNMP= <proc_1d>
##$AZFE= 0.1
##$AZFW= 0.5
##$BCFW= 0
##$BC_mod= 2
##$BYTORDP= 0
##$COROFFS= 0
##$CY= -3
##$DATMOD= 1
##$DC= 0
##$DFILT= <>
##$DTYPP= 0
##$F1P= 0
##$F2P= 0
##$FCOR= 1
##$FTSIZE= 65536
##$FT_mod= 6
##$GAMMA= 0
##$GB= 0
##$INTBC= 1
##$INTSCL= 9.790993e-09
##$ISEN= 30
##$LB= 1.5
##$LEV0= 0
##$LPBIN= 0
##$MAXI= 10000
##$MC2= 0
##$MEAN= 0
##$ME_mod= 0
##$MI= 50
##$NCOEF= 0
##$NC_proc= -4
##$NLEV= 6
##$NOISF1= 182.463
##$NOISF2= 159.3651
##$NSP= 0
##$NTH_PI= 0
##$NZP= 0
##$OFFSET= 198.0616
##$PC= 4
##$PHC0= 1997.032
##$PHC1= 364.686
##$PH_mod= 1
##$PKNL= yes
##$PPARMOD= 0
##$PSCAL= 0
##$PSIGN= 0
##$REVERSE= no
##$SF= 81.0140089999434
##$SI= 65536
##$SIGF1= 159.3651
##$SIGF2= -187.1042
##$SINO= 113.3802
##$SIOLD= 16384
##$SREGLST= <1H.CDCl3>
##$SSB= 0
##$STSI= 65536
##$STSR= 0
##$SW_p= 32467.5324675325
##$SYMM= 0
##$S_DEV= 0
##$TDeff= 32768
##$TDoff= 0
##$TI= <>
##$TILT= no
##$TM1= 0
##$TM2= 0
##$TOPLEV= 0
##$USERP1= <user>
##$USERP2= <user>
##$USERP3= <user>
##$USERP4= <user>
##$USERP5= <user>
##$WDW= 1
##$XDIM= 65536
##$YMAX_p= 282242160
##$YMIN_p= -781781
$$ End of Bruker specific parameters
$$ ---------------------------------
##NTUPLES= NMR SPECTRUM
##VAR_NAME=  FREQUENCY,     SPECTRUM/REAL,   SPECTRUM/IMAG
##SYMBOL=    X,             R,               I
##VAR_TYPE=  INDEPENDENT,   DEPENDENT,       DEPENDENT
##VAR_FORM=  AFFN,          ASDF,            ASDF
##VAR_DIM=   65536,         65536,           65536
##UNITS=     HZ,            ARBITRARY UNITS, ARBITRARY UNITS
##FACTOR=    0.49542278885378, 1,            1
##FIRST=     16045.7642231865, 0,            0
##LAST=      -16421.768244346, 0,            0
##MIN=       -16421.768244346, -781781,      0
##MAX=       16045.7642231865, 282242160,    0
$$ Real data points
##PAGE= N=1
##DATA TABLE= (X++(R..R)), XYDATA
$$ [...]
41449 -63878 -34456 18032 81654 107924 56347 -54588 -152100 -167681 -93779 14142 88480
41438 88480 95618 34019 -85598 -230593 -334841 -343715 -279352 -223402 -218674 -221835 -176163 -98898
41426 -98898 -60329 -92766 -158796 -210030 -243976 -284732 -323916 -312171 -227786 -137824 -147809 -271077
41414 -271077 -385771 -363551 -216671 -66180 15446 58528 95835 96800 38415 -30379 -50574
41403 -50574 -31271 -16642 -19361 -34404 -68065 -95973 -49614 75613 151119 61072 -111634
41392 -111634 -169800 -73243 5748 -69900 -233768 -365667 -479848 -637986 -760893 -689858
41382 -689858 -424596 -157880 -40784 -23164 23461 115821 163390 106825 -19874 -138294
41372 -138294 -181741 -125779 -14876 58671 52669 37801 109689 248640 330684 286269 185062
41361 185062 135890 154055 166623 112724 -2613 -129512 -209631 -211175 -164383 -146527 -198094
41350 -198094 -270804 -291514 -252465 -194154 -128232 -44882 18996 6395 -50364 -33984 101879
41339 101879 256213 318878 317444 343969 387502 352267 233815 156771 192361 232130 125042
41328 125042 -107106 -280997 -276155 -173513 -139405 -217248 -282920 -199901 19820 226991 289952
41317 289952 213569 100968 22902 -42775 -139539 -238129 -255161 -163795 -43624 7175 -13858
41306 -13858 -22818 38140 142861 241970 331449 427609 508707 529534 484904 419578 374348 349005
41294 349005 315911 248809 149168 66746 70925 163550 244618 220455 130980 100667 164686 222686
41282 222686 184499 83167 5038 -21431 -15618 14468 57985 74840 49942 38597 91643
41271 91643 163566 165227 93113 39772 78281 188296 290486 307269 203261 20126 -137123
41260 -137123 -200920 -217934 -270244 -336252 -307820 -154717 5252 37345 -57940 -161100 -173568
41249 -173568 -112767 -81219 -155050 -298534 -397259 -384424 -305584 -235182 -175150 -90392 -2518
41238 -2518 34708 34595 61472 114636 118236 40930 -62403 -149422 -235541 -302541 -262361 -83913
41226 -83913 120229 217770 215282 211584 237206 235158 182225 130742 114278 90620 14400 -85412
41214 -85412 -140973 -129089 -82520 -33650 14726 59309 71623 29276 -43601 -98750 -122430 -135119
41202 -135119 -131799 -76741 17359 62213 -4129 -131656 -230575 -285639 -330227 -350798 -310136
41191 -310136 -240440 -212124 -219831 -201361 -163565 -174628 -225279 -224943 -162173 -137443 -190726 -229552
41179 -229552 -193913 -159642 -189240 -207830 -141729 -66231 -77460 -108989 -33180 114993 178945
41168 178945 119734 60030 87534 151875 176746 156609 111951 45347 -25785 -68897 -91587
41157 -91587 -131237 -177077 -168420 -83073 30565 117432 161861 171769 161955 140884 79864 -58814
41145 -58814 -212833 -217815 -15836 204609 219666 77987 28171 147207 233646 122523 -71969
41134 -71969 -133932 -36500 67277 64685 -17341 -87280 -72647 43998 204224 305569 294264
41123 294264 203524 86200 -35532 -130622 -142398 -62432 32378 66475 48426 31302 38306
41112 38306 63910 98962 115576 73658 -19539 -97619 -111468 -75187 -21127 31325 48165 2375
41100 2375 -47021 13563 192046 346904 365534 304621 277776 282229 236362 134726 54904
41089 54904 28212 -878 -79810 -179374 -232677 -203861 -112385 -6857 88881 195666 315674
41078 315674 376556 316894 214895 215709 308024 307393 124476 -85969 -144852 -94141 -87730 -135262
41066 -135262 -118607 -10967 84278 101125 77885 53746 15911 -42707 -109806 -195175 -298802
41055 -298802 -357395 -320273 -255796 -273341 -356503 -388082 -328493 -250017 -201976 -168916 -162837 -222042
41043 -222042 -302729 -304167 -226165 -173030 -177642 -161005 -98875 -72265 -92500 -37154 142667 294408
41031 294408 267147 127834 39018 12075 -67017 -220104 -334903 -329796 -244629 -165849 -145629
41020 -145629 -185777 -229274 -190391 -66567 15394 -44534 -151336 -118328 69613 222229 201072
41009 201072 93184 65292 137288 192191 161148 97633 67533 48633 -19475 -127709 -194451
40998 -194451 -171265 -111430 -108186 -183956 -271041 -295839 -251115 -182550 -133355 -111026 -85407 -14388
40986 -14388 103376 200083 198073 105419 12492 -24069 -52147 -146839 -293719 -392131 -368784
40975 -368784 -258896 -169280 -170629 -230565 -260073 -226388 -190848 -213356 -261270 -268001 -247263 -264021
40963 -264021 -303307 -270510 -142031 -12582 52427 112944 233803 355766 380442 322927 278956
40952 278956 277944 269500 236338 219766 229015 213021 143029 57501 3323 -16660 -19815 -10224
40940 -10224 13265 43593 67340 61864 4193 -89084 -152559 -142305 -94128 -66406 -50600 1347
40928 1347 81062 129741 136118 151185 193894 215802 182176 120275 58059 -17065 -96156 -109363
40916 -109363 -12209 126585 186723 128324 13530 -83297 -132026 -128216 -86950 -66246 -131337
40905 -131337 -258683 -324376 -243427 -95390 -47733 -154128 -291717 -320262 -243914 -168638 -145096
40894 -145096 -122730 -45074 75408 185172 245604 256113 257135 299596 369024 367928 243603
40883 243603 104329 101194 200153 207667 58044 -72077 -19805 127609 176021 97285 7699
40872 7699 -51948 -142419 -260113 -312986 -274626 -222751 -202299 -173761 -120321 -86531 -82191 -62954
40860 -62954 -35928 -65595 -138320 -145769 -54372 32360 41621 32089 48241 12766 -115212 -196252
40848 -196252 -85323 126221 215038 136862 62974 105680 174334 149723 58646 -5437 -30594
40837 -30594 -57516 -69260 -16496 69150 85496 3300 -72707 -31494 98338 189851 189036 170619
40825 170619 202980 238660 208806 164356 211099 324883 363132 283447 214358 242235 259605
40814 259605 142803 -20814 -40284 91876 184769 124068 9701 -23099 8992 2320 -73434
40803 -73434 -163624 -223162 -247076 -234303 -181425 -103836 -27920 29978 62588 72387 84784 128451
40791 128451 186710 202321 147909 58193 -20584 -70755 -78831 -29119 45236 64179 6780 -34148
40779 -34148 29046 141872 170325 84700 -6384 -15831 11570 -13094 -88245 -130555 -85204 22340
40767 22340 127481 177826 154937 85616 31893 39699 95651 154614 197756 229756 230648 165872
40755 165872 58098 -5133 27970 104351 142333 146017 185062 273254 333971 303303 217448
40744 217448 168965 205058 289910 344985 313937 213680 132279 146311 227967 266723 196133
40733 196133 61340 -53201 -111589 -112146 -43099 86322 200910 209495 97527 -64839 -190464
40722 -190464 -221672 -146513 -20613 56163 42292 8403 30332 66193 25327 -68287 -94345
40711 -94345 -22904 34199 -6323 -86968 -125814 -144981 -197559 -241981 -191903 -53498 77665
40700 77665 136891 133019 91375 29200 -23791 -50225 -82132 -148292 -197777 -152177 -31419 53193
40688 53193 43155 -5989 -24215 -7225 33813 119154 238880 309150 262548 142974 42578
40677 42578 -24534 -110758 -215198 -261019 -206681 -107805 -35269 12849 73022 130049 126943 51216
40665 51216 -37458 -73782 -48271 6406 59924 99275 125110 156546 221166 311743 364031 312212
40653 312212 169588 25280 -46899 -50135 -27806 922 44565 102438 155545 185590 181873
40642 181873 140948 81386 45344 56046 78128 46687 -62343 -205624 -308121 -310166 -199007
40631 -199007 -27367 107184 136886 83788 29026 32489 99933 199227 267805 233936 96636
40620 96636 -26703 -6639 137946 257318 259170 196807 144132 78553 -48843 -203357 -308615
40609 -308615 -348511 -350675 -311799 -221814 -129537 -97468 -109259 -102640 -78211 -91242 -144806 -180042
40597 -180042 -175718 -171508 -180996 -163283 -97388 -8578 92011 210293 295247 257359 99082
40586 99082 -57694 -116215 -96354 -44875 44697 157445 199055 106339 -50513 -162025 -210025
40575 -210025 -214143 -125627 91977 316178 348281 157466 -72250 -162867 -113934 -29729 25180
40564 25180 45465 32974 -8569 -53086 -65077 -25411 57038 137404 152535 87200 10390 -2383
40552 -2383 29003 19949 -57180 -145936 -198240 -228343 -265790 -309021 -331765 -293169 -157990 38980
40540 38980 180218 195677 172962 234098 330386 297692 116574 -41002 -65135 -50217 -109078
40529 -109078 -195789 -224687 -236377 -302893 -360413 -293059 -133483 -32639 -48365 -91712 -82011
40518 -82011 -46115 -51160 -118797 -213545 -261583 -199414 -58390 36221 14225 -40112 -12403 80428
40506 80428 151534 200691 276068 325983 247444 72971 -47626 -64898 -78301 -143227 -188027
40495 -188027 -174361 -186001 -278310 -373866 -399372 -402137 -424972 -385809 -221334 -60095 -87427
40484 -87427 -275310 -402468 -342555 -191817 -83779 -9561 103473 224690 238092 108682
40474 108682 -55857 -137772 -148925 -182665 -250294 -249765 -128085 7144 18674 -74290 -150015
40463 -150015 -190709 -291645 -452049 -516683 -400028 -233000 -175693 -190500 -137489 -20193
40453 -20193 23623 -47301 -111676 -74387 5645 29032 4161 10240 59325 64665 -48275 -227796
40441 -227796 -319935 -231632 -58771 11100 -54392 -66308 134257 431324 552886 400211
40431 400211 135487 -54267 -149332 -218637 -270047 -257971 -169311 -27127 148561 323166
40421 323166 424522 395622 257244 85386 -50834 -103696 -42749 109345 255796 295921
40411 295921 222239 115014 39483 -17358 -95597 -177286 -187543 -88669 50878 116027 78808
40400 78808 36064 85849 195731 240522 159917 28065 -39832 -8059 63789 90938 39406
40389 39406 -36869 -30563 107882 283783 327563 175702 -49315 -163739 -102426 42527 132107
40378 132107 104986 14960 -32007 10063 71436 44207 -87513 -237070 -337882 -410606 -474342
40367 -474342 -461839 -302836 -61018 100451 100218 20687 -9885 39004 104310 128415 104862
40356 104862 49574 -20091 -75993 -92500 -85638 -105908 -165265 -195055 -115900 56343 214168
40345 214168 273352 244023 174051 73516 -61862 -191266 -256971 -262211 -262592 -277981 -268403 -207026
40333 -207026 -120369 -34589 63438 175129 244665 212218 90755 -47370 -142862 -179099 -163419
40322 -163419 -116763 -67411 -21715 44388 133336 188020 153479 65799 24168 65650 117742
40311 117742 99236 29222 -972 53379 137166 168132 143464 153225 273502 449134 514489
40300 514489 364732 94768 -79575 -52402 62969 86786 -744 -41615 95259 345283
40290 345283 508574 449073 208676 -53535 -200752 -202813 -118514 -20175 61213 126497 169319
40279 169319 175813 159394 153408 149106 83023 -71483 -229950 -269094 -161583 12030 171774
40268 171774 294766 369179 371322 309366 222081 112452 -44251 -200582 -237351 -121570 19000
40257 19000 54808 15403 4959 27768 9680 -56322 -111351 -151939 -224023 -303707 -309810 -242903
40245 -242903 -189341 -171090 -119089 -25536 13463 -34653 -57121 33371 151050 156904 44521
40234 44521 -89621 -191207 -261336 -277532 -205931 -68599 78017 203034 278379 251276 126344
40223 126344 28205 75960 214392 270265 172556 24443 -50076 -43772 -27037 -41385 -68939
40212 -68939 -72211 -39588 -923 8183 3158 34233 94379 104969 41394 4216 81864 195102
40200 195102 184656 31143 -117248 -131794 -19402 150433 330048 475402 528968 467255
40190 467255 322983 147487 -4516 -65641 -6667 99424 139383 95698 49410 44375 36185
40179 36185 -7465 -49932 -66669 -98371 -172583 -240947 -247973 -208559 -170216 -148031 -143517 -182666
40167 -182666 -282952 -406032 -478745 -449344 -320740 -162149 -81533 -128967 -222875 -234613 -151021
40156 -151021 -78634 -77795 -86772 -45620 -2338 -34036 -129446 -210024 -218031 -139324 6804 157318
40144 157318 238794 249045 250994 260750 218060 100890 -21843 -100872 -173819 -259613 -288006
40133 -288006 -218375 -131326 -101279 -70540 29166 112434 43530 -145905 -288140 -301409 -245726
40122 -245726 -180273 -110166 -74584 -144414 -302529 -437695 -480212 -446982 -353249 -203965 -86900
40111 -86900 -131882 -321322 -459748 -402848 -224106 -88195 -47917 -43842 -31020 -16839 -14407
40100 -14407 -30523 -73415 -121936 -118215 -35476 78159 161871 212671 253797 268356 214496 91917
40088 91917 -43174 -126361 -137647 -119237 -137508 -201036 -230578 -157080 -34914 12352 -39712
40077 -39712 -82230 -25875 92698 189644 239891 256394 234033 176056 127321 123475 140336 134891
40065 134891 101700 58214 16784 -3064 13972 32053 -6882 -80184 -88646 -2107 86984 108606
40053 108606 116554 168915 206985 161328 94902 107874 155805 106275 -49923 -186805 -240285
40042 -240285 -280516 -365056 -441816 -440808 -368777 -272050 -181092 -121145 -105152 -92432 -26544 68571
40030 68571 110106 90913 99394 173476 231701 200951 124508 80823 74653 79966 116516 195418
40018 195418 243868 182298 50220 -33215 -25873 -5844 -55431 -157932 -215703 -138644 70155
40007 70155 283473 334850 183391 -31706 -147606 -148117 -113577 -55886 77942 249734 317206
39996 317206 225432 97654 58013 54189 -43215 -228048 -365680 -389030 -366844 -365445 -355891
39985 -355891 -302410 -247305 -238711 -242807 -206044 -154443 -145252 -155035 -113516 -35495 -13233 -63219
39973 -63219 -86762 -27325 29626 -12679 -105756 -122971 -41298 37806 32747 -37243 -110900 -145115
39961 -145115 -110430 -3147 116628 162981 128122 99041 147386 246866 316952 299686 176491
39950 176491 -30456 -237872 -335697 -291130 -186144 -112517 -63997 24321 161846 281964
39940 281964 322372 281522 202460 137262 120311 141025 144507 88229 -1585 -51501 -16596 81290
39928 81290 182311 237121 235576 208587 201482 234286 287356 321485 299934 204781 67578 -22117
39916 -22117 7317 112630 171916 139430 94637 94386 58702 -105521 -321128 -400846 -287546
39905 -287546 -125284 -63751 -85338 -76234 4312 95597 137067 130033 105850 82763 62537 40502
39893 40502 6493 -51573 -132334 -205364 -219284 -147730 -36738 20858 -15656 -84820 -105414
39882 -105414 -81595 -73364 -85726 -69144 -38687 -99893 -298959 -509175 -545844 -377392 -158801
39871 -158801 -52997 -67216 -79222 8901 165976 268333 223696 54571 -135054 -258831
39861 -258831 -301319 -291907 -262106 -229429 -188012 -108761 13333 104318 59051 -120365 -281386
39850 -281386 -274602 -128841 -14603 -40335 -145483 -207416 -195726 -178986 -208273 -246015 -220711
39839 -220711 -123370 -22499 16844 5359 345 16140 435 -85745 -195078 -234138 -168694
39828 -168694 -62282 -9934 -52848 -157465 -255855 -297065 -274017 -218793 -177964 -187183 -255204
39817 -255204 -356678 -439067 -450385 -371287 -224790 -63730 50187 83725 78031 135036 308363
39806 308363 512809 599161 527756 407556 346103 335871 331840 359552 459254 573789 597268
39795 597268 521960 441692 409323 386389 348531 339562 378358 402264 367060 330595 358501 401140
39783 401140 357910 239744 172785 229782 329249 325294 152266 -129199 -379719 -461263 -327463
39772 -327463 -72666 139174 223123 227116 223898 199704 99028 -54905 -157478 -146027 -66487
39761 -66487 7198 73093 180391 336990 487532 581647 621908 628955 589821 472390 287934
39750 287934 113916 33970 50628 71317 3806 -130464 -205597 -135504 15411 106147 92251
39739 92251 70680 140749 277945 381357 395362 325630 172644 -60549 -287706 -357385 -211555
39728 -211555 15897 119485 28750 -146735 -260779 -262386 -186415 -84495 -7554 -9550 -100313
39717 -100313 -199982 -200561 -93207 8240 -1618 -98361 -171341 -161060 -107458 -74804 -80623 -106190
39705 -106190 -134119 -157007 -176436 -206088 -252591 -289299 -279649 -230037 -181257 -141854 -79939 816
39693 816 33491 -25172 -124650 -182539 -182946 -171347 -184712 -229517 -294022 -336477 -300390 -194965
39681 -194965 -116285 -121803 -130138 -33784 126723 211160 183362 141668 138272 101583 -18661 -151998
39669 -151998 -221025 -251106 -289312 -309746 -291841 -304511 -395217 -459418 -354586 -116344 68190
39658 68190 99579 59234 52814 81252 107993 148616 225278 301971 332806 329516 325902 315461
39646 315461 278588 236673 220261 207135 152058 65500 1855 -30592 -86331 -191325 -289030
39635 -289030 -311812 -266854 -209482 -162208 -116369 -99660 -170028 -319811 -444539 -451305 -360975
39624 -360975 -257667 -172764 -82413 1442 19572 -40486 -106039 -104863 -39514 50147 145396
39613 145396 229786 257837 198226 89399 8522 -7075 18843 43338 43002 25940 24269 59264
39601 59264 106620 125069 123015 148170 196553 193212 97144 -33818 -124589 -167129 -171429 -101740
39589 -101740 60376 242804 358374 412288 451132 455364 389937 322679 360498 473774 514335
39578 514335 424354 304910 249739 235623 224323 248124 315431 333029 219020 26578 -129875
39567 -129875 -214932 -257784 -254787 -184792 -91369 -52935 -72493 -71537 49 104492 172580 175942
39555 175942 139530 116974 154170 249416 350464 407262 415463 395298 354887 297330 234358
39544 234358 161521 45370 -130007 -321857 -462701 -517601 -487346 -385166 -240355 -96523
39534 -96523 26907 146780 261677 319549 279344 176425 84157 33454 9957 3620 12405
39523 12405 17012 4314 5544 60390 143673 172482 95897 -50514 -184496 -250671 -252799 -228312
39511 -228312 -196474 -137619 -34603 82973 172392 242739 331469 422033 458643 451273 475732
39500 475732 539226 544725 443854 325928 277355 248826 164223 72925 63395 91498 44728
39489 44728 -58555 -89841 -22639 28380 -3358 -51960 -60043 -71762 -131614 -203047 -245539 -274283
39477 -274283 -288797 -238847 -121265 -18793 21425 58098 133588 172316 94425 -38766 -93352
39466 -93352 -32175 73197 158726 203675 181315 76060 -50506 -97485 -48066 4758 -24314
39455 -24314 -111924 -161226 -113477 -12519 35255 -28523 -142211 -186879 -125668 -41117 -20499
39444 -20499 -58628 -108810 -170962 -262080 -332679 -292748 -129384 52321 122728 41092 -120481
39433 -120481 -241451 -243972 -144164 -23993 41028 17901 -93350 -251368 -356004 -309980 -134124
39422 -134124 30465 74991 32322 -3735 -11512 -31626 -67361 -74478 -39942 -4425 -1700 -25351
39410 -25351 -64144 -131362 -241663 -373080 -461610 -444250 -329490 -218566 -215858 -313062 -406601
39399 -406601 -430494 -407340 -359734 -261969 -120172 -10392 27007 51774 111795 149367 108789
39388 108789 55752 73014 104642 46635 -46663 -6965 192536 375723 394762 296300 205136
39377 205136 154851 111034 83661 125881 243841 362967 387262 289055 153565 109761 178741
39366 178741 229833 154752 41821 69636 245830 381193 343837 214177 139006 142954 156294
39355 156294 145329 135401 154085 209273 285135 328207 289111 202056 159910 189015 224615 232486
39343 232486 257723 309951 304829 193695 68519 56964 172285 329105 443139 461430 376430
39332 376430 276391 293277 421771 482177 357382 173580 131291 243822 378895 484672
39322 484672 612259 754249 829445 830378 849081 949727 1128557 1381928 1681747 1898714
39312 1898714 1902320 1743851 1589083 1458719 1208155 804866 442418 289128 277472 250658
39302 250658 183559 133125 84301 -7006 -92335 -96847 -62992 -95059 -183437 -206188 -104442
39291 -104442 43908 131875 125155 54128 -24773 -54932 -24503 13213 6740 -23591 -28064 -8323
39279 -8323 5597 27709 90240 165851 194589 175320 149854 107740 679 -143563 -221177
39268 -221177 -194533 -145786 -148059 -165013 -135332 -88284 -101443 -184055 -274322 -332164 -367571 -378373
39256 -378373 -321573 -175495 -3492 79501 19402 -102750 -134682 -14073 152838 211843
39246 211843 146992 89066 132190 211363 201603 82811 -53812 -129134 -137939 -101001 -28340
39235 -28340 51436 81139 33403 -45797 -85093 -68612 -42316 -44582 -61442 -63574 -62015 -93022
39223 -93022 -151088 -178149 -141251 -86664 -75759 -89753 -56623 28405 76297 24470 -76576
39212 -76576 -144229 -181998 -248210 -334651 -361710 -302858 -234342 -222606 -225258 -166066 -70177 -43185
39200 -43185 -111992 -163228 -84829 76758 162491 91623 -53328 -143621 -149777 -133794 -138024 -140186
39188 -140186 -109836 -56759 -11106 10705 10320 5297 27311 90125 150866 137371 29622 -113338
39176 -113338 -218535 -260870 -252702 -214523 -176023 -164980 -168343 -142893 -90747 -77190 -134929 -199371
39164 -199371 -193650 -138352 -113050 -137698 -159549 -138889 -82485 -7846 60874 79883 39826 12328
39152 12328 58181 107780 39936 -119735 -201205 -120978 8783 53738 22472 -17806 -79002
39141 -79002 -196554 -316982 -359764 -339453 -317604 -283743 -202200 -131958 -158523 -224575 -181007
39130 -181007 -23416 72180 1158 -117013 -119521 -24420 30458 -1000 -37697 -16688 27982
39119 27982 34976 -7111 -65781 -103782 -101160 -60808 7931 115403 271570 423579 460135
39108 460135 324126 92841 -99831 -198622 -241322 -270601 -298412 -344724 -431583 -517471 -503330
39097 -503330 -349596 -152975 -61065 -119565 -234485 -282795 -234819 -159593 -127460 -132009 -119421
39086 -119421 -78901 -68658 -137366 -249348 -322297 -326532 -306231 -300999 -291571 -248025 -199737 -216916
39074 -216916 -326542 -474902 -576926 -584279 -506204 -390014 -292163 -244571 -226356 -180375 -80397
39063 -80397 25719 64435 23563 -38678 -72898 -90477 -121635 -157108 -162523 -130676 -88348 -59837
39051 -59837 -45939 -30827 4226 58058 90597 59053 -5982 -3992 113089 258920 308599
39040 308599 248267 168568 136903 151783 204196 289908 355997 330949 234757 174640 198412
39029 198412 233144 207171 147210 101450 50910 -28840 -86744 -62053 15251 65550 59009 3985
39017 3985 -110654 -270394 -372719 -317452 -150588 -24422 -12765 -48635 -47709 -6899 37788
39006 37788 73505 96638 88712 36422 -50154 -141829 -188759 -142513 -29197 33460 -32887 -143344
38994 -143344 -147483 -37919 44528 19693 -36025 -38004 -21421 -51511 -98749 -92380 -37251 11798
38982 11798 54815 141541 274963 387617 414377 345665 216003 78118 -19216 -63109 -87587
38971 -87587 -134939 -210918 -283643 -308547 -251031 -113537 51599 184538 273504 331084 325997
38960 325997 208816 21413 -95566 -49817 99448 221190 243051 172618 59813 -10525
38950 -10525 41606 188037 283818 236731 134352 116001 161901 117906 -79076 -301567 -377319
38939 -377319 -265329 -70401 62839 60664 -27611 -84015 -63247 -56000 -155239 -292404 -300792
38928 -300792 -139623 46117 114823 81952 37643 98 -67720 -151347 -192451 -191660 -215113
38917 -215113 -272593 -256877 -66350 231854 428309 389205 207369 90965 128570 227990
38907 227990 274580 257071 208646 120678 -12689 -135119 -199812 -248354 -329154 -388572 -350680
38896 -350680 -263325 -235680 -253437 -205687 -101946 -95957 -238315 -360393 -301748 -131236 -27037
38885 -27037 -30313 -43750 -9581 40965 81826 117726 129925 95316 47966 31891 9185 -87255
38873 -87255 -217789 -257879 -169311 -56001 -26472 -82790 -166773 -229355 -221463 -103841 78555
38862 78555 199595 191054 131461 141787 235390 329277 369125 376809 386216 390438 361180 288537
38850 288537 195770 127829 114836 134219 127461 69223 -1893 -35176 -21543 20095 71725 105262
38838 105262 85323 23780 -4872 47676 127133 140266 70960 -21050 -93048 -147481 -183996
38827 -183996 -192521 -187649 -184535 -152996 -74123 -29262 -123380 -303509 -374947 -253438 -89797
38816 -89797 -61734 -142016 -183684 -153471 -137472 -154692 -119401 -945 109785 130191 81127
38805 81127 19164 -28754 -25212 78444 237553 297726 168100 -48813 -182150 -198210 -192879
38794 -192879 -214143 -195952 -77608 91154 197294 178114 69127 -37821 -75407 -52739
38784 -52739 -24575 -8773 34253 124076 206375 216298 161643 97415 49682 19941 36237 125828
38772 125828 239639 272485 175874 6062 -146861 -232192 -236345 -162998 -41715 77516 160291
38761 160291 199011 187987 124341 42186 3612 29998 70422 66457 31255 33930 105943 189171
38749 189171 199172 136368 101251 171839 292935 340219 281233 196479 132936 38270 -107635
38738 -107635 -198031 -135516 8016 85075 80131 94601 150176 153639 71380 -3423 -5988 443
38726 443 -50238 -103090 -70551 22871 71739 31075 -41130 -65270 -19370 51923 87648 81888
38714 81888 92096 139531 136507 -4111 -210138 -318143 -304466 -312569 -415627 -498636 -449347
38703 -449347 -326744 -236628 -164607 -59533 23283 9288 -42483 -21833 57701 111571 150969
38692 150969 232627 290825 212677 70436 73327 249113 367325 260800 56082 -28991 18205
38681 18205 48682 -498 -52302 -44326 -375 54804 138793 233070 241620 92945 -139770 -275588
38669 -275588 -201672 10508 189007 243950 222394 188792 130513 23803 -81495 -124376 -134012
38658 -134012 -179590 -248288 -266608 -225015 -183491 -161960 -127546 -90059 -100012 -139554 -130550 -77879
38646 -77879 -85161 -181145 -247980 -192826 -88604 -59254 -108686 -154017 -159419 -141598 -96131 -18678
38634 -18678 30838 -21091 -153250 -261269 -277261 -233456 -215893 -284652 -417203 -507078 -455106
38623 -455106 -284942 -120645 -30550 35178 119850 168393 129605 63165 48253 51648 -5740
38612 -5740 -99565 -134931 -102567 -90602 -148514 -239299 -325559 -409089 -477405 -493447 -449532 -367989
38600 -367989 -256558 -132601 -69970 -129117 -248311 -302301 -271440 -252382 -291856 -319998 -278385
38589 -278385 -207536 -158067 -109492 -41367 -9613 -79032 -224558 -354840 -400973 -351345 -246641
38578 -246641 -170532 -188094 -254868 -243129 -101896 62836 114308 41171 -61683 -119858 -130050
38567 -130050 -121108 -122362 -150843 -190852 -208043 -205593 -224535 -264471 -263814 -197981 -130389 -109515
38555 -109515 -83302 8132 116745 159716 161377 209195 290986 298696 204609 118486 129904 187555
38543 187555 191430 138084 114765 188143 341616 492446 545025 467557 344118 307175 384429
38532 384429 454262 391514 216945 57589 -1315 32195 118809 223630 294521 281596 203622
38521 203622 141236 134671 133178 80918 9890 -7261 27937 40742 3101 -16355 41361 122069
38509 122069 122104 31389 -55433 -72305 -57125 -67119 -82662 -52917 1135 3085 -63008 -120327
38497 -120327 -104415 -48747 -28121 -48999 -41590 46601 186163 299926 335431 293297 205392
38486 205392 107524 29693 -8371 -6943 9925 8976 -27142 -83658 -118894 -93385 -10889 66921
38474 66921 68827 -8061 -88842 -110141 -94407 -98778 -113084 -68674 53370 190121 288906 361844
38462 361844 416922 411748 337654 284077 332747 429385 453066 385252 309058 257251 179804 73719
38450 73719 19352 41967 53018 535 -25603 64721 197744 231304 162669 115011 138455
38439 138455 152573 97258 22428 -11280 -23659 -51448 -68304 -32046 37560 87496 104441
38428 104441 108392 102948 83667 74464 100544 132083 107780 24223 -41481 -23241 45466 68497
38416 68497 10402 -52126 -29265 51506 67385 -33193 -145464 -141632 -43287 20753 7472
38405 7472 6225 74932 138842 115732 54687 57272 114667 128555 73938 37284 81147 158532
38393 158532 191350 164249 101982 9391 -116666 -246786 -334532 -361633 -345183 -316320 -310545
38382 -310545 -357965 -454370 -545277 -554541 -435373 -208584 28610 149411 103963 -11067 -38457
38371 -38457 62436 174774 193796 177642 256994 426511 520199 411268 163566 -53037
38361 -53037 -145737 -153535 -159374 -203827 -271413 -313764 -287713 -207135 -153406 -196970 -311050 -403395
38349 -403395 -429521 -421197 -400578 -342790 -259160 -238476 -328192 -424453 -374964 -174765 28169
38338 28169 116285 101221 39211 -43172 -106793 -91509 -14362 11124 -69577 -151752 -114526 -616
38326 -616 49659 -791 -62507 -72569 -54727 -25894 45208 157879 246377 263364 232408 192460
38314 192460 149014 100987 60669 28844 -3326 -24647 -26669 -42773 -94616 -116446 -27213 126400
38302 126400 209545 194293 194392 272531 340028 308819 225538 176031 159575 141474 133174 131558
38290 131558 77239 -25195 -42957 107655 303810 368688 310014 265613 276238 274425 256862
38279 256862 290801 354487 337892 219937 97525 19567 -60776 -143269 -145616 -61195 -7500
38268 -7500 -51222 -113933 -121904 -123850 -175514 -223088 -199354 -138394 -95542 -41670 58657 143220
38256 143220 139274 91994 94330 141593 169666 191783 270749 378081 409879 349428 300406 332686
38244 332686 387604 370716 267800 135965 35730 1202 33391 97008 151346 190324 222493
38233 222493 222765 155134 41231 -51622 -98819 -136575 -177888 -177633 -118656 -72170 -108230 -177555
38221 -177555 -156867 -17711 112519 93472 -59406 -195115 -205489 -132415 -82340 -84597 -84455
38210 -84455 -51101 -22814 -29640 -28680 40711 162609 246081 218340 93709 -48868 -139517 -161887
38198 -161887 -130787 -46019 99311 258840 331292 265153 133855 48529 19926 -20116 -76987
38187 -76987 -72405 17715 102746 100542 40825 -7952 -41080 -81068 -101649 -66508 -4278 26860
38175 26860 22997 24156 46691 77960 109596 128819 111806 73043 77362 147117 203614 165822
38163 165822 63321 -18561 -58731 -82819 -71449 9698 109284 124440 35321 -82800 -177972
38152 -177972 -259449 -315863 -298846 -217972 -166349 -206717 -287284 -305347 -216677 -65347 60629
38141 60629 101452 88159 118958 230781 324362 278161 102370 -97801 -269479 -411244 -455415
38130 -455415 -304132 -11363 210540 231780 149157 126814 190799 258053 285306 294881 299843
38119 299843 284967 239926 162111 55654 -37687 -50622 26975 119056 153808 141868 132947
38108 132947 140883 146127 131643 90764 41388 42387 134412 253493 280626 194976 90194 20013
38096 20013 -60237 -161122 -202203 -163253 -161064 -265437 -354965 -293441 -156164 -123423 -213878
38085 -213878 -289617 -286951 -270555 -269115 -228607 -150056 -115624 -132880 -92949 54446 203996
38074 203996 245631 214336 210469 246626 254477 193893 86458 -25479 -101296 -114251 -82319
38063 -82319 -59269 -66451 -66365 -27308 24503 42032 10291 -53467 -107546 -83321 57570 231805
38051 231805 270610 105976 -126973 -231386 -154313 2870 134497 213081 242857 217626
38041 217626 143792 49768 -48781 -154459 -245649 -271619 -217900 -146066 -132530 -180322 -225076
38030 -225076 -225187 -206968 -203098 -183834 -97905 27586 89170 36218 -48400 -44017 58291 152754
38018 152754 149848 56817 -61908 -139940 -120272 13846 184105 251837 158872 -699 -93297
38007 -93297 -96671 -87201 -106796 -113788 -66764 8959 63388 84204 87718 83809 84642 118772 190529
37994 190529 239677 194336 70040 -33022 -51712 -32570 -46461 -71991 -25615 106091 230565
37983 230565 258607 196969 110625 39290 -17246 -67747 -123055 -201559 -307638 -411467 -467115
37972 -467115 -443900 -345259 -228637 -199879 -323014 -510743 -572249 -423247 -198081 -93652
37962 -93652 -146676 -233657 -247725 -184008 -72895 62113 161783 142133 -487 -151039 -190497
37951 -190497 -118487 -29558 5740 5128 34767 129828 255354 341121 350622 299352 205502 64854
37939 64854 -99489 -208902 -202800 -112098 -9682 80986 171213 238473 250579 235335 241949
37928 241949 246459 184759 74609 10104 27942 71866 99680 126946 148321 123589 73288
37917 73288 79239 147374 181708 148203 142367 213306 243447 123827 -45087 -69712 74907
37906 74907 236865 306118 303459 263491 168946 27349 -97891 -169919 -209187 -218358 -161631
37895 -161631 -49379 39434 61791 65653 93132 97648 24272 -75986 -91616 3435 115638
37884 115638 149029 104785 48822 25205 35581 78225 158570 253280 301819 261899 158301
37873 158301 54993 -6598 -20801 5721 51275 70303 36789 -9831 -11096 26932 56103
37862 56103 82425 156734 259898 295279 234696 176993 199842 242112 216253 158543 160106 203416
37850 203416 189614 106898 53652 89058 163601 215808 245450 259509 225219 124046 2471
37839 2471 -71284 -72037 -18442 60489 139832 198827 217136 166526 26083 -171767 -334693 -381722
37827 -381722 -301882 -125713 107870 315853 374344 244808 54614 -38496 -27757 -12857
37817 -12857 -23559 -15963 -14428 -97022 -225336 -251234 -145776 -70940 -142885 -260707 -278099
37806 -278099 -227898 -240324 -318953 -345366 -268301 -152909 -54232 37185 117632 145427 116336
37795 116336 79166 52989 2536 -80089 -139898 -139301 -114901 -113784 -120333 -92237 -36156 2666
37783 2666 12231 29514 81403 144608 177234 166388 126378 68003 -1379 -52884 -48145 8776
37771 8776 61235 64636 35793 12217 -5194 -27662 -30326 6409 26196 -48231 -178597 -215909
37759 -215909 -84090 108387 197740 159238 109848 143412 227285 264498 213531 128444 92970
37748 92970 125566 162536 147338 112438 130392 198932 238364 207310 149872 106729 54740 -23234
37736 -23234 -77579 -61552 -12800 -4498 -49139 -101697 -125672 -110971 -62164 -10493 4672 4690
37724 4690 62372 174289 219035 124021 1139 4089 102410 130728 39870 -46226 -36698 6167
37712 6167 3800 -4173 55988 157241 209404 185843 138714 113416 106515 96938 78590 65848
37700 65848 81010 119883 129513 59566 -54116 -104696 -37392 81327 141921 106366 27246
37689 27246 -10677 47940 183711 299118 301291 204287 104106 43852 -28231 -143730 -241747
37678 -241747 -266275 -259380 -279179 -284992 -198412 -42249 78558 115682 102172 50168 -67398
37667 -67398 -214143 -272213 -178348 -10309 107431 127350 71052 -34266 -151402 -217120 -201740
37656 -201740 -157170 -145035 -143238 -87971 13933 90804 118727 148985 208900 250379 228989
37645 228989 168942 105952 23368 -95229 -191938 -185228 -80209 35547 104723 152248 219491
37634 219491 302129 373758 427434 463945 464331 401663 274323 120835 8072 -8051 63384
37623 63384 141869 154527 112860 74999 51836 14066 -14679 40518 182148 299299 303701
37612 303701 241713 206929 196869 135989 7262 -122331 -197035 -223227 -227787 -225020 -226161 -233816
37600 -233816 -229090 -201807 -176540 -167617 -139181 -66124 -396 -4959 -56110 -100545 -174878 -345132
37588 -345132 -535648 -565297 -393037 -190575 -105534 -84319 -24702 25836 -26863 -108763 -49641
37577 -49641 144050 259616 162824 -22771 -91667 -13208 73966 63990 -10626 -56300 -27710
37566 -27710 46743 101483 84529 4050 -63037 -31869 105378 267204 366599 394839 405655
37555 405655 428510 431148 377191 286367 207369 153654 107255 75223 91928 158025 223226 246700
37543 246700 234428 199208 129847 30739 -49762 -71264 -50685 -21636 21751 93126 156911
37532 156911 163250 124564 97103 92893 71486 20923 -17431 -19732 -13946 -17745 -1079 48240
37520 48240 72527 16956 -74412 -100926 -40491 16020 -19191 -127233 -222323 -258779 -256453 -237545
37508 -237545 -191126 -113082 -37078 10410 60831 159656 272287 288280 152509 -40997 -134355
37497 -134355 -79668 16086 32217 -17671 -12036 121378 315484 437384 415537 270446 53819
37486 53819 -186472 -383808 -464016 -422432 -350054 -328895 -321123 -218515 3148 234468 343914
37475 343914 292646 135485 -35324 -131163 -112124 -29261 15613 -18157 -72757 -86081 -72817
37464 -72817 -76413 -90053 -75418 -23874 49351 137279 216869 231339 164886 111373 190550 391113
37452 391113 558337 553550 387596 191569 90302 105798 153816 134144 41045 -33392 -22023
37441 -22023 33402 57573 47526 37638 5202 -96742 -231107 -293592 -235240 -86790 125621
37430 125621 382390 581042 568219 318235 -2710 -204519 -244025 -196491 -136446 -96444
37420 -96444 -75738 -37139 52318 147504 162354 107396 93964 156761 186501 114261 41791 73236
37408 73236 126159 64014 -61642 -82784 6790 35546 -73899 -200791 -240919 -253539 -308585
37397 -308585 -334770 -240855 -85452 4761 22697 60043 134680 164937 115858 59276 56731
37386 56731 67264 21559 -67322 -126301 -131463 -136570 -185835 -246067 -257533 -219165 -167313 -82792
37374 -82792 95922 333308 459780 361281 148178 24027 19859 -4878 -100721 -135387 -24820
37363 -24820 99559 78153 -31554 -46835 65800 165645 167171 139662 156090 179994 160797
37352 160797 137719 171818 238799 264223 233360 205811 231127 289773 320756 294520 256189
37341 256189 283094 384224 469387 455791 374252 308843 258610 149934 -14767 -123369 -100770
37330 -100770 407 97689 178762 247141 257602 191921 132388 161128 226111 202167 60228
37319 60228 -113071 -243945 -325753 -354026 -308037 -215653 -152695 -146625 -142270 -87609 285 73433
37307 73433 103388 75558 -13187 -128746 -216155 -257188 -269413 -246272 -157925 -19263 112535
37296 112535 223627 347480 456208 440632 260097 36984 -74690 -61126 -16064 9759
37286 9759 36653 71015 95036 133832 237281 379771 457625 414469 309194 231785 203234
37275 203234 190644 179071 187171 228883 288626 331249 327032 273549 195948 121888 63762 28821
37263 28821 22136 22813 -10958 -80507 -120330 -79268 -5117 8499 -50452 -97021 -62370 32527
37251 32527 121439 158070 130014 64399 33612 97223 213972 264983 195052 82005 30999
37240 30999 48003 64588 48570 30919 40490 68247 97518 125914 146533 139736 102727 69505
37228 69505 76365 105476 87833 -9571 -110611 -95366 42123 159719 142840 62120 71498
37217 71498 181887 249815 197575 124475 151779 260775 355710 402904 422531 407749 343484
37206 343484 258842 176305 57196 -109468 -215656 -153984 -2086 49635 -39437 -107861 -38401
37195 -38401 78775 102535 45215 15733 38503 50078 36529 52585 103830 113927 38559
37184 38559 -61172 -94638 -41654 51868 135234 178665 172355 136517 115513 133984 167373 171218
37172 171218 126360 44555 -47767 -112439 -111111 -45113 28955 52586 25166 -15594 -56094 -107239
37160 -107239 -148080 -122835 -15460 109981 170944 148493 92512 67581 104836 178682 217610
37149 217610 170082 73127 15956 21308 19584 -29536 -60714 -9731 65965 61916 -16610 -67820
37137 -67820 -41627 21867 87796 153350 178236 103392 -35778 -120700 -106492 -63083 -24654
37126 -24654 79949 280358 464785 521389 486518 452730 416779 336881 267340 294554 375301
37115 375301 377427 275631 185374 193626 263219 324663 371367 436882 546021 705618 886723
37104 886723 1012646 1023111 950515 880739 850954 838841 823195 786555 693031 549835 459482
37093 459482 510204 635310 686385 630660 567130 563165 597290 657190 764337 895498 1005530
37082 1005530 1129589 1331294 1559948 1716741 1852455 2111769 2496774 2940902 3628760
37073 3628760 4866296 6438635 7439669 7107194 5680289 4111776 3043639 2395147
37065 2395147 1868608 1421822 1131286 936260 738363 573247 511275 510415 496771 481585
37055 481585 484534 442086 305276 145385 57389 30095 9323 20037 118138 267656 366971
37044 366971 372889 322098 256736 196696 156430 124069 52279 -68408 -158387 -137218 -37102
37033 -37102 38732 49482 38610 37445 25503 -4896 -14763 20706 62692 56286 7986 -15303
37021 -15303 31174 103652 107636 13098 -93024 -107659 -50291 -39944 -125515 -211246 -189927 -85743
37009 -85743 -3206 17000 14950 14810 -164 -16022 24125 130404 224026 226134 154166 92985
36997 92985 91120 118031 114141 56561 -23796 -75014 -75276 -58962 -82454 -151974 -198754 -151057
36985 -151057 -26367 82237 121904 142268 208517 287896 286432 190874 100178 93657 134737
36974 134737 142736 95067 6882 -121616 -259038 -305151 -206727 -73266 -52053 -101870 -36496
36963 -36496 181296 342060 262733 29415 -141163 -182352 -185315 -192879 -147604 -45103 6422
36952 6422 -64610 -175603 -187249 -71268 73122 146901 151587 163568 234271 329172 366449
36941 366449 306634 188981 84547 40551 69987 151410 219597 201083 95841 -6040 -21365
36930 -21365 42245 128517 216721 316323 411072 465704 471741 438083 354289 216184 76500
36919 76500 14777 51960 130424 176167 153128 71920 -19010 -62597 -45369 -8045 15151 35234
36907 35234 62775 75452 73737 108208 186873 218020 136589 34632 49350 150390 168281
36896 168281 33222 -143565 -244248 -270840 -260769 -207093 -131210 -121280 -206566 -278908 -236865
36885 -236865 -144269 -142893 -246245 -321624 -269904 -142341 -65500 -98074 -176454 -188006 -103729
36874 -103729 -28639 -75416 -192391 -200061 -28908 172942 235609 184321 159977 185252 138972
36863 138972 -45633 -271945 -395205 -368910 -250804 -123295 -35078 17047 65747 114217
36853 114217 117186 57358 10063 65117 196907 285270 267860 201978 167817 184476 239846
36842 239846 324915 398407 385715 272237 156138 151225 259149 380758 432340 407546 342186
36831 342186 269289 214943 201935 236637 298696 350463 361739 335135 303785 286318 249119
36820 249119 147343 10770 -55594 10927 143736 219218 196372 138993 112736 119542 140998
36809 140998 181657 232759 245067 196496 156855 214905 346104 425175 387115 306233 279374
36798 279374 298360 301502 299972 365305 507095 645992 715080 720473 691745 637909 569269 503389
36786 503389 432082 339153 261211 259385 309728 301605 185143 47991 -1177 41718 111966
36775 111966 161628 154804 61061 -72135 -120661 -46655 16170 -55277 -180069 -191277 -87071
36764 -87071 -8692 2304 54419 201511 345982 388431 341421 249093 119631 -7956 -50175
36753 -50175 422 45089 32448 35599 105416 160389 120981 57865 90848 208796 304884 339928
36741 339928 356615 365773 331793 260333 204435 183472 171796 162619 172970 190432 181075 149764
36729 149764 137835 163972 211578 261603 295825 289064 241946 194990 167937 124174 46511 -975
36717 -975 40855 117932 123096 39928 -49201 -75215 -30750 62025 153501 171835 113177 86112
36705 86112 163612 236401 148533 -50409 -152322 -95170 -43405 -115085 -202172 -157548 -14554
36694 -14554 103917 182143 277091 363880 360215 269122 173339 108424 50512 10424 24610 52944
36682 52944 -2401 -153429 -294560 -342158 -321045 -278095 -197611 -64858 55033 87846 69608
36671 69608 109306 231743 336123 337585 279638 250752 244877 193282 110516 91288 133287 85098
36659 85098 -139668 -389180 -444776 -315775 -214307 -246947 -293468 -228975 -108842 -49084 -53532
36648 -53532 -69121 -107183 -181820 -209043 -113249 14035 12454 -108069 -175744 -114940 -49482
36637 -49482 -101855 -216149 -257786 -198202 -113618 -58735 -27794 -14130 -34536 -93583 -166643
36626 -166643 -221619 -239495 -225228 -213326 -243458 -311995 -363915 -348054 -265973 -158492 -64390
36615 -64390 706 49553 115391 210335 283568 258332 131272 1104 -31693 29491 100886
36604 100886 126701 128068 151256 203727 256017 290857 328692 392233 452448 440688 339723
36593 339723 240615 261795 406968 544830 546198 409931 239437 130777 107718 133980 151802
36582 151802 120591 46485 -26850 -64258 -62707 -28085 38656 116733 163273 165060 162355 186685
36570 186685 204198 166447 94757 54867 50541 3753 -137851 -317508 -420824 -382315 -219611
36559 -219611 4652 216620 344629 348177 252271 133941 57995 30916 25032 35989 90683
36548 90683 186406 244947 168365 -45746 -274529 -383166 -350891 -256230 -160967 -64810 25644
36537 25644 55466 -5474 -91762 -103835 -23833 80257 152653 191971 195543 131671 -2338
36526 -2338 -148160 -252200 -321412 -371937 -366939 -268390 -123470 -27389 -7032 -11029 -16317 -63408
36514 -63408 -157104 -207805 -131646 31835 158339 173654 108022 39195 25918 81557 169423
36503 169423 230194 244361 252679 285512 300573 239656 126570 49060 49029 88395 122790 145804
36491 145804 150003 110681 36732 -17902 -27436 -30195 -56406 -71800 -41484 -2103 -4405 -16128
36479 -16128 41181 170618 293812 369566 433778 494843 480269 357356 240820 277867 446188
36468 446188 570926 557003 501518 524685 584292 555256 435719 348563 342672 317330 187565
36457 187565 23336 -49091 -14547 44815 82582 116424 147497 145448 117977 113986 138124 132138
36445 132138 71864 24078 62811 164066 225779 180951 70518 12591 98921 296888 456364
36434 456364 450985 315635 199884 180195 179715 102122 -19881 -70675 -8927 91002 147216
36423 147216 161129 191925 284680 437741 606453 720154 720893 610227 450821 309826 208104
36412 208104 131355 72563 39625 27886 16502 597 -5280 -18032 -102591 -284046 -462044
36401 -462044 -488676 -347306 -181707 -114719 -116101 -108615 -120242 -219544 -345381 -338244 -153281
36390 -153281 73493 204594 244000 254202 231854 148975 52224 27377 88211 171354 229583
36379 229583 271873 313431 334124 300785 214479 129627 116112 180222 236873 206416 130705
36368 130705 124207 201046 235020 128309 -59800 -204075 -255955 -230429 -131815 8767 77948
36357 77948 -19560 -217635 -344414 -323452 -238315 -197649 -221047 -272416 -326769 -371424 -395858
36346 -395858 -409239 -429834 -440680 -391000 -253245 -52096 158058 311141 343384 246974 108885
36335 108885 40144 58745 90606 86254 75043 91266 112505 107126 95848 122637 187253 239197
36323 239197 229382 153750 58408 8443 35238 106520 155836 136439 39782 -112969 -268507
36312 -268507 -353000 -329374 -237204 -143992 -71454 -5287 46302 58874 44816 42175 54706 62523
36300 62523 91408 199811 374221 500093 477821 330814 165137 51814 -15261 -61114
36290 -61114 -66366 24831 236048 504982 716455 800282 784402 746952 743174 791417 893857
36279 893857 1041816 1221726 1428617 1651202 1870538 2153500 2713290 3688692 4782829
36270 4782829 5319590 4870673 3745426 2667072 2027937 1671822 1343147 1041598 862172
36261 862172 759825 641971 526101 450685 358549 213102 117181 163566 252493 210844 38734
36250 38734 -100605 -100839 -2451 107181 172790 169370 115684 76201 81953 83969 48582 39077
36238 39077 116877 222239 258862 249398 291769 392397 458925 443132 384385 322843 272106
36227 272106 267193 333156 405819 384052 266888 148632 79515 27740 -20788 -34235 -23630
36216 -23630 -54048 -133863 -186204 -169820 -143954 -169051 -218925 -239662 -228721 -204231 -154578 -75324
36204 -75324 -10987 -1965 -19063 -3150 48706 85918 87326 95752 154854 242191 297599 309649
36192 309649 326162 354094 305349 119450 -90590 -130862 20585 180706 230614 273570 418297
36181 418297 543645 456730 205855 33163 36354 76447 42336 9961 64279 127467 75646
36170 75646 -80805 -234657 -319164 -320867 -228719 -64875 81248 134389 123260 128140 164508
36159 164508 171596 100202 -24411 -116511 -98749 15815 118336 129159 111831 185070 332596
36148 332596 410501 360564 292012 301190 332056 294960 214333 156238 100163 1731 -83145 -61427
36136 -61427 50822 162364 255601 381186 520285 579011 534955 478082 472078 466644 391840
36125 391840 266804 163106 110033 85960 73172 76163 94341 105837 85892 40380 17031
36114 17031 60292 140169 157154 54432 -98321 -179406 -155755 -92697 -32727 60048 209687
36103 209687 350342 396689 360939 337000 368154 385718 308482 169816 96765 159533 284060
36092 284060 340759 290686 201718 135650 79661 8566 -36610 18639 183901 375047 486977
36081 486977 476658 377269 254500 161221 121532 132910 168186 188835 185288 203323 292601
36070 292601 416339 458282 354190 178029 54489 23006 39844 71128 106449 111735 66677
36059 66677 40936 127375 284375 350768 254765 108103 39265 31879 9308 -5136 72650
36048 72650 225193 323398 287492 177233 98772 78311 60525 1934 -69792 -92906 -51174
36037 -51174 6199 32209 41411 72018 116161 138232 144782 172506 213891 227008 221733 255799
36025 255799 329838 370767 347558 318098 321635 311768 251902 194983 195526 208593 156097 45939
36013 45939 -49106 -92257 -94739 -64879 -15414 6236 -38313 -118532 -164698 -137581 -39829 97602
36001 97602 202813 195048 86312 -1745 13945 64615 38405 -45993 -66319 27499 156530
35990 156530 230467 243180 234690 215377 158324 51670 -52744 -59152 68428 228644 271568
35979 271568 177958 77496 64936 87102 60459 7399 -2644 27222 49843 65662 96575
35968 96575 109963 55279 -45911 -110276 -73298 72333 268039 388963 330513 143272 588
35957 588 -12192 26310 51787 118515 234991 264171 141481 44700 150169 338441 372874
35946 372874 288940 345022 611588 876218 990880 1064083 1221961 1391112 1444819 1410257
35936 1410257 1396037 1414172 1393844 1312062 1214549 1136014 1063666 970983 862695 788204 791249
35925 791249 830284 802419 688063 596869 601156 614223 535867 422481 375586 352733 261539
35914 261539 168903 216820 372919 472089 482175 513894 578971 573813 521937 586583 781039
35903 781039 897238 812697 662156 602061 594552 540606 458554 406975 371746 345165 394866
35892 394866 551934 736303 865091 920200 864179 648342 373099 266952 402939 585857
35882 585857 621866 554082 530362 588510 686490 804810 901311 893620 796443 748590 803737
35871 803737 835252 752476 656556 659355 702476 694599 679620 715519 724858 632150 531675 551884
35859 551884 652937 714987 730842 756710 763498 694455 597320 558750 574190 597337 632889
35848 632889 672396 647310 568486 596544 833853 1150292 1350767 1409394 1404776 1345988 1221555
35837 1221555 1113305 1093871 1094961 1026907 943350 944056 1000721 1018016 985970 952287 937567 982317
35825 982317 1156856 1417003 1590574 1616451 1629947 1694699 1661784 1460764 1308407 1406791
35815 1406791 1625655 1722649 1704548 1719718 1756246 1719070 1675218 1754873 1914258 2034149 2136930
35804 2136930 2279058 2365386 2308545 2234404 2295239 2430722 2543186 2720643 3025528 3266431
35794 3266431 3276424 3224114 3343214 3556507 3685384 3805093 4038311 4233904 4247632 4311547
35784 4311547 4695318 5220814 5563360 5814068 6266920 6874299 7425555 8041820 8951958
35775 8951958 10001963 10948141 11984863 13378507 14873919 16155677 17592886 19747299
35767 19747299 22446595 25202931 28223190 32038262 36498343 41281690 47044655 54742594
35759 54742594 64169186 74724492 87244063 103194119 122641051 145764014 175758812
35752 175758812 215148014 256656748 282242160 276877420 243077404 198409001 159184229
35745 159184229 129827925 106991827 88107933 73103768 61476904 51879608 43959195
35738 43959195 38172052 34086186 30539443 27150159 24300058 21923339 19522782 17153003
35730 17153003 15307190 13967303 12666752 11343704 10315693 9550586 8721790 7870096
35722 7870096 7311716 6985906 6537808 5966607 5596237 5473266 5337465 5110200 4899760
35713 4899760 4618600 4109626 3570453 3346906 3365721 3252838 2954291 2758601 2744889 2689819
35703 2689819 2519664 2402484 2370783 2268625 2098648 2031930 2050344 1954384 1751026 1668176
35693 1668176 1748585 1776372 1645317 1473610 1327086 1157322 1039297 1128646 1333014 1358228
35683 1358228 1150572 979669 1004874 1062762 977958 800990 635239 489268 404604 485489
35673 485489 693110 827470 808667 773585 819114 862623 835574 800887 788058 714290 563666
35662 563666 457349 455666 465480 422411 389759 404236 404075 385137 445531 594024 693580 678745
35650 678745 651589 679158 681640 615341 574974 599508 563169 395959 239895 231076 280018
35639 280018 240005 164419 208506 364668 482042 499253 488653 493446 475098 427450 412846
35628 412846 453479 479008 423993 323847 273746 310705 367477 358379 298768 294325 389849 486574
35616 486574 469588 368735 310966 349183 431850 514018 593280 651026 665129 672601 714933
35605 714933 734124 637463 455002 309387 237947 180876 141113 194757 317799 367790 295304
35594 295304 226127 260000 317173 269259 118682 -30678 -97336 -56919 63097 173247 190194
35583 190194 154578 192424 329255 446528 457188 410959 381413 364829 345624 352894 396816
35572 396816 449741 529752 687585 875573 969060 968926 1030592 1220653 1402343 1454713 1444915
35561 1444915 1463563 1443449 1294409 1093453 975105 924983 840343 717494 622748 542924
35551 542924 422546 301624 263420 276295 228887 102904 -14304 -68952 -75803 -37214 55222
35540 55222 151182 178548 139534 88760 53312 61856 188257 438062 641446 613448 407680
35529 407680 264088 300344 395398 395807 298277 187603 114642 88145 92114 67483 -36725
35518 -36725 -160708 -178869 -90319 -61184 -204115 -398896 -427308 -242822 -15950 75368 22662
35507 22662 -56469 -73900 -37096 17306 95495 215825 333889 359236 259416 97715 -51965
35496 -51965 -172770 -257677 -261809 -164208 -30469 55585 91182 122252 147896 134355 100058
35485 100058 101975 141621 160307 131944 94418 82281 86658 87587 73338 25456 -63590 -155801
35473 -155801 -198512 -188626 -162109 -131117 -84821 -41451 -38399 -73809 -115442 -161426 -229486 -290824
35461 -290824 -286578 -217689 -149575 -114055 -74902 -12298 26696 2414 -39021 -4348 147794
35450 147794 363366 529603 554203 438113 274706 158757 111424 115296 174282 274741
35440 274741 329710 262240 135173 92355 158305 206074 158287 105669 156898 269174 324552
35429 324552 304877 280972 267913 206942 87101 -18853 -60290 -65443 -60359 -6583 127118
35418 127118 280940 352187 305242 188119 62086 -31240 -46662 49049 216361 355536
35408 355536 421757 487512 638887 837567 951754 922269 833747 800309 831670 845811 779811
35397 779811 650875 523516 445037 408982 368848 290895 190221 102425 34409 -27453 -75995
35386 -75995 -92808 -85042 -58262 31131 216289 411631 462134 333435 162547 75558 48499
35375 48499 9468 -22102 5077 53811 52789 23761 42010 100241 121021 87418 56124 48105
35363 48105 27764 -7804 -17074 -2115 -16664 -68219 -95384 -65469 -20841 -5364 -10819 -16252
35351 -16252 -18013 -2658 50860 125700 176641 190820 183486 140236 39557 -65014 -73998 23530
35339 23530 123875 145763 119006 104985 103441 81108 30488 -41733 -129499 -194545 -177819 -85665
35327 -85665 -10094 -17988 -68515 -85814 -66682 -62234 -85882 -94795 -51952 28821 95202 101229
35315 101229 53885 15018 32552 80021 103357 109654 145328 194644 183492 97660 12110 -25855
35303 -25855 -58167 -120278 -167631 -154515 -112145 -80414 -24923 101653 262040 372459 402550
35292 402550 370534 278708 133303 1805 -37661 -5390 -7929 -106563 -251771 -356224 -383378
35281 -383378 -353594 -309909 -297453 -338976 -402349 -412061 -320484 -165308 -38651 6261 6018 32811
35269 32811 100350 154882 164388 170873 219942 279392 285740 247348 230246 244704 218925 104381
35257 104381 -50812 -158829 -180613 -139829 -84105 -42687 6044 117661 298286 463941
35247 463941 536616 546287 560556 551902 447282 287741 197986 187462 133379 -508 -89488
35236 -89488 -66083 -53207 -162429 -294364 -287920 -170256 -100475 -132084 -190773 -244166 -327354
35225 -327354 -407572 -379736 -224614 -49826 59610 131098 212464 279967 280562 202478 72830
35214 72830 -62094 -135348 -96923 16987 95246 64140 -30797 -70529 17686 181683 280766
35203 280766 224205 80881 10098 70894 162616 182729 159702 166360 184447 153217 93260
35192 93260 70266 72286 37358 -17436 -11564 55973 90509 43074 -29846 -66433 -67516 -39727
35180 -39727 41606 172397 286942 323197 281119 204075 145793 152197 217094 255989 187094
35169 187094 42078 -64045 -72017 -23038 29633 75943 109964 114098 100859 105647 125187 123721
35157 123721 102182 91071 74023 825 -112043 -177359 -153616 -87860 -23765 50389 135761
35146 135761 187384 181776 151772 122960 79984 17475 -47675 -132647 -270751 -410062 -425344
35135 -425344 -276814 -71164 80708 174468 229792 207245 98408 9567 41004 135703 157137
35124 157137 82531 11140 -2250 -12943 -72860 -141812 -147753 -79976 10494 69695 75091 32832
35112 32832 -36434 -110464 -170659 -200294 -187005 -126681 -17717 135747 296031 388543 367269
35101 367269 275356 198551 166894 148953 126908 107371 59549 -73670 -276407 -440281 -478870
35090 -478870 -411686 -314600 -243782 -226770 -263214 -305665 -294575 -230050 -151703 -50928 102705
35079 102705 237028 204462 -8280 -208076 -214598 -63666 90689 189561 280332 378778 433160
35068 433160 400895 281660 103249 -64255 -128107 -73207 9124 54989 117811 245152 354339
35057 354339 349933 292789 306393 361449 318498 174823 97622 174967 284910 282597 199495
35046 199495 168776 235518 335991 419844 500240 584465 623156 564712 444088 378036 438548
35035 438548 544595 538048 381932 214442 167559 208419 227390 207591 205542 216861 182576
35024 182576 110080 74299 98815 132099 138030 118177 59240 -34772 -72422 34461 205509
35013 205509 257175 161405 95161 176569 291958 273492 131213 1189 -46999 -36821 15007
35002 15007 105667 184632 186812 118904 43063 -8568 -43146 -55565 -30112 23170 84413 154745
34990 154745 227972 264255 239710 186108 134067 65859 -16492 -39757 30351 77333 -43778
34979 -43778 -283046 -420421 -336800 -148668 -32201 -19521 -35355 -43170 -58057 -68733 -49450
34968 -49450 -31579 -74425 -164385 -220376 -209596 -184836 -186063 -179871 -140508 -124844 -196281 -312453
34956 -312453 -367922 -336207 -290920 -278168 -246937 -141334 1483 98392 126631 132164 157593
34945 157593 209463 278287 343364 367863 332327 268531 225599 210981 196220 163662 108559
34934 108559 16924 -103890 -184760 -149554 -18924 94031 105250 34849 -43414 -80354 -73675
34923 -73675 -61951 -101624 -197920 -260836 -201885 -80849 -60997 -182220 -281463 -213267 -58962
34912 -58962 -6691 -85576 -155802 -142931 -131581 -188923 -229447 -146097 8184 78496 14648
34901 14648 -76760 -83817 -11379 63025 85359 45499 -44095 -144786 -196178 -163888 -69263 47846
34889 47846 164980 248460 234145 97855 -76069 -164319 -141771 -88694 -61722 -31958 29552
34878 29552 84400 94429 97723 155456 257953 339338 361275 333092 269402 175204 61237
34867 61237 -59203 -169741 -223720 -162440 -9080 98996 44616 -119675 -224623 -181382
34857 -181382 -64148 1946 -30016 -127348 -249963 -386450 -532886 -656550 -694187 -607657
34847 -607657 -439914 -276981 -148040 -18352 105970 150141 93320 30708 38136 56128 4940
34836 4940 -60816 -34241 63942 122570 118204 113291 102594 19451 -105968 -157717 -130080 -158114
34824 -158114 -305433 -462362 -514007 -481430 -432034 -371878 -301383 -269350 -291313 -300485 -242655
34813 -242655 -136076 4247 191408 365020 393941 260701 126091 120203 178081 175386 115799
34802 115799 77241 75104 92324 149265 226145 209769 45197 -142346 -203852 -162131 -121583
34791 -121583 -76627 28962 128077 102484 -3664 -16764 125976 315113 435246 452389
34781 452389 354331 156818 -32763 -103652 -97568 -139935 -222270 -208687 -69505 53743 51802
34770 51802 -30565 -115006 -186142 -219212 -159239 -46987 -36348 -194266 -380338 -410948 -266985
34759 -266985 -69032 78541 148320 159369 155182 170830 180883 124333 1547 -115618 -185950
34748 -185950 -233054 -257424 -206227 -69209 80317 183252 255140 311326 318269 267625 217373
34737 217373 206520 202009 176662 163005 182556 201686 207135 240178 298672 293701 176467 31504
34725 31504 -32451 -16341 17748 59331 129848 207297 256207 292160 343570 388754 396317 384090
34713 384090 372006 320802 187398 6150 -145116 -223979 -220727 -133191 -7417 52326 -8205
34702 -8205 -112525 -148028 -103980 -53452 -40210 -49400 -53903 -31853 21879 55030 -9358 -143384
34690 -143384 -195818 -83440 74819 110779 21552 -79104 -152384 -238618 -317948 -321358 -268255
34679 -268255 -249144 -267980 -238003 -146681 -88053 -102638 -116738 -84584 -66345 -104325 -132588
34668 -132588 -84402 -383 45805 54152 56923 40874 -4470 -13072 92107 282814 448484
34657 448484 521729 518357 464931 356187 199439 51036 -24850 -22260 -1998 -32457 -123816
34646 -123816 -225361 -289623 -322848 -353935 -370523 -323585 -199261 -56297 18309 -23202 -158170
34635 -158170 -303348 -363854 -308536 -200443 -126784 -107065 -106221 -123039 -198415 -317298 -367598
34624 -367598 -252566 -20006 169953 204334 110545 -10330 -102039 -173917 -226143 -215213 -125377
34613 -125377 -31503 -25127 -83872 -82670 46574 227740 341987 358645 328425 305175 321004
34602 321004 379699 417227 329537 114110 -69919 -70742 67435 171935 153280 47199 -107440
34591 -107440 -292300 -422036 -384165 -199618 -17657 88559 198147 363200 480914 431025
34581 431025 244918 49269 -81159 -133315 -101010 -18948 14859 -43984 -98211 -42797 61244
34570 61244 68780 -22803 -65293 15981 120823 135441 82098 48462 60900 104104 194971 343223
34558 343223 474418 483748 363744 210680 103759 40190 -7977 -45750 -87805 -168359 -270922
34547 -270922 -305828 -221771 -96973 -43226 -50884 -22885 52558 81640 38821 32172 123299 194509
34535 194509 110536 -61779 -130885 -45082 55029 47474 -36607 -115671 -176549 -235257 -269926
34524 -269926 -260025 -233369 -217418 -190129 -127471 -58843 -30014 -42640 -65897 -77857 -68552 -36703
34512 -36703 -8133 -20602 -68440 -102992 -107766 -123620 -173405 -214347 -197573 -122367 942 174842
34500 174842 347246 388845 229299 -13105 -131361 -64760 41766 35711 -52430 -72525 21119
34489 21119 87432 -19702 -233893 -326929 -190105 27613 124149 99471 93792 133141 99279
34478 99279 -46008 -174003 -179996 -117108 -64432 3583 114711 187013 150194 90377 133810
34467 133810 246492 289565 234633 184501 197403 222965 213706 181168 130072 41569 -62722
34456 -62722 -129406 -152492 -160348 -135561 -53739 5225 -80426 -269390 -345940 -181877 90419
34445 90419 244520 222480 150122 147505 210017 253513 209677 81724 -55086 -115064 -82901
34434 -82901 -15459 40086 85620 115693 83465 -30193 -156761 -209604 -197895 -216088 -312118
34423 -312118 -405716 -366946 -171565 47332 127949 53580 -42548 -55469 -30241 -60542 -128781
34412 -128781 -136499 -62742 13440 49893 95983 182980 254848 256608 216641 188134 169130 131664
34400 131664 76798 12653 -69340 -147453 -155797 -78480 -7739 -36884 -130752 -175066 -129453 -59050
34388 -59050 -31174 -56235 -125587 -227095 -304601 -273485 -119831 55774 133077 89283 -7079
34377 -7079 -94620 -166225 -218510 -204983 -83053 103317 237258 250033 199684 196214 267920
34366 267920 342381 349315 293606 221081 158612 107738 63930 19966 -29581 -74925 -99481 -104379
34354 -104379 -104737 -107584 -119001 -156496 -212932 -228196 -160365 -76719 -94901 -221413 -328790 -318641
34342 -318641 -227148 -134353 -56445 16047 56662 55900 66102 107231 89272 -66340 -266266
34331 -266266 -319931 -169299 49778 174277 153412 23384 -154776 -304458 -366321 -362918
34321 -362918 -370140 -399478 -379020 -284212 -208484 -241864 -336050 -361021 -261829 -94072 69138
34310 69138 193519 259221 257546 227202 231803 275103 288040 228411 143096 89400 43111 -49716
34298 -49716 -161422 -208085 -183096 -176081 -235537 -299276 -304561 -281060 -268708 -229520 -138410 -86683
34286 -86683 -162481 -273507 -244462 -83698 10679 -61565 -172950 -187585 -151775 -166045 -203908
34275 -203908 -187345 -141723 -141868 -178860 -204889 -240267 -310176 -346352 -290726 -231669 -282522 -378835
34263 -378835 -367401 -258111 -198229 -210645 -161471 -10203 108153 103593 50402 22584 -9737
34252 -9737 -43637 9072 132333 147852 -14471 -155161 -80731 104487 170948 104742 59668
34241 59668 59787 -4899 -117242 -110740 62570 245070 303649 274155 224677 142571 32503
34230 32503 -19639 27243 90806 91501 57009 32898 -1487 -48999 -37175 55508 113232 39920
34218 39920 -70883 -47634 124502 298319 362850 333642 261656 164484 59366 -21779 -68596
34207 -68596 -89734 -82254 -58588 -76210 -163952 -243264 -215409 -114418 -71485 -126948 -187767 -188214
34195 -188214 -173786 -182706 -162447 -78474 -4759 -8893 -25083 46034 162850 189752 97803 -819
34183 -819 -25298 -21918 -57223 -115076 -153986 -187415 -235974 -255801 -198272 -114786 -116485 -225316
34171 -225316 -341431 -386343 -411628 -508882 -654037 -719482 -637446 -474047 -315228 -155257
34161 -155257 36754 194614 200177 49754 -112733 -155473 -87153 -4223 19591 -39459 -158735
34150 -158735 -246556 -190210 1271 164920 173689 95944 70017 86740 33920 -80873 -119550
34139 -119550 -39587 30491 -6584 -82565 -102294 -79933 -41784 78683 318603 553344 628620
34128 628620 560491 467486 367768 208929 61690 87417 283122 431712 374019 191663
34118 191663 42797 -50868 -143168 -197505 -129607 25782 126625 106749 45296 32344 47038
34107 47038 9410 -97131 -199437 -213619 -125325 1213 80264 74035 15174 -32053 -28087
34096 -28087 16053 51410 29510 -51828 -136580 -163344 -133332 -103240 -108158 -123837 -117622 -100722
34084 -100722 -100854 -106405 -73724 12468 107735 140574 73215 -60327 -171473 -184070 -92326 48569
34072 48569 175374 243797 227593 138243 42225 6945 18151 -2858 -89043 -187237 -242480
34061 -242480 -258073 -241947 -167837 -49087 13698 -56194 -190058 -251587 -215561 -175874 -179948
34050 -179948 -160655 -68403 19079 -10751 -147820 -262791 -257492 -164361 -91728 -99914 -145485
34039 -145485 -142543 -68373 10583 28892 10695 28045 85172 104422 41141 -48053 -90703 -103546
34027 -103546 -152988 -238523 -290056 -288411 -318061 -455993 -647872 -751897 -699049 -559951 -441122
34016 -441122 -360081 -256449 -97673 73155 189279 218274 165709 65343 -18059 -18348 66896
34005 66896 165794 214137 223383 239604 266384 271136 244363 202143 144765 69095 15958 42191
33993 42191 134274 206011 199677 138136 61717 -20381 -82235 -58300 61045 158985 106128 -65945
33981 -65945 -184708 -139781 1800 102842 115741 99259 124204 209901 329953 439451 505405
33970 505405 534670 558372 572993 528258 406035 278826 235858 265266 269076 195761 95736
33959 95736 30644 -4748 -29704 -5797 112926 283484 397298 401213 340777 276758 213795
33948 213795 134831 59239 24014 25592 18211 -27364 -83428 -91267 -24594 74624 129535 104412
33936 104412 40644 8245 34987 99912 176773 248266 286225 262271 186441 99944 22632
33925 22632 -54245 -114928 -108420 -19767 85452 124054 80548 1682 -72685 -144569 -237543 -359781
33913 -359781 -471535 -484115 -330483 -60188 173597 254564 203925 120382 65158 41421 34931
33902 34931 16921 -51330 -147088 -153227 16563 269076 395691 301327 100772 -31140 -40395
33891 -40395 574 8223 -32386 -71141 -47956 37720 110749 105142 56635 58966 131406 197859
33879 197859 208475 203324 222028 227831 178804 114174 103327 152793 227666 320389 417465 429101
33867 429101 253935 -71912 -367657 -479237 -409409 -264190 -131941 -48111 -23157 -44923
33857 -44923 -69769 -57034 -12309 27591 43598 43151 31424 7488 -12547 -4608 21571 23471
33845 23471 -11257 -31302 18815 123283 210339 231342 194223 133038 84869 85715 136194 171906
33833 171906 128771 46696 34987 107270 134119 19160 -151668 -220245 -159821 -71568 -18675
33822 -18675 22703 62636 67477 44792 51877 95490 122936 139590 224513 379599 473044 412527
33810 412527 288371 252915 319109 367406 304491 131786 -96854 -292516 -340941 -198871
33800 -198871 21247 144987 120328 47496 32851 82887 145202 183999 191544 168562 114278
33789 114278 20203 -116103 -252135 -308902 -259926 -181248 -163205 -201758 -231004 -229794 -229613 -244521
33777 -244521 -263924 -288076 -296418 -216540 -23602 153604 145011 -38367 -209361 -247121 -216051
33766 -216051 -214626 -235749 -240365 -253605 -298936 -323240 -276258 -194973 -128238 -50119 62257 137562
33754 137562 106814 33176 20964 34020 -53806 -231079 -315788 -190583 43071 202705 226235
33743 226235 171999 96053 15990 -42647 -48032 -7966 40065 87732 165304 285007 402611
33732 402611 449009 394041 278411 183968 164106 199149 226018 207127 156197 106002 79188
33721 79188 87230 120253 132630 83316 6133 -11082 51929 102893 67229 10510 46212 152088
33709 152088 188034 103723 11713 7561 28558 -21860 -100026 -93079 -7902 48882 55718 89051
33697 89051 139968 83478 -102895 -241924 -193071 -69547 -77011 -217916 -318964 -307126 -278514
33686 -278514 -289211 -257115 -129975 -1597 30604 13368 41556 94925 77937 -25283 -134260
33675 -134260 -186271 -187051 -163942 -135788 -116416 -94323 -30574 73022 141198 126734 101573 151114
33663 151114 205142 101682 -158788 -349958 -286982 -70397 37192 -66615 -232653 -287165
33653 -287165 -242408 -228221 -283239 -301888 -184315 31650 218789 297513 281929 213866 108905
33642 108905 -20153 -128138 -158658 -96046 11409 76727 35862 -90982 -206453 -233747
33632 -233747 -198858 -176528 -166943 -94378 54546 163795 112156 -75483 -251682 -299881 -229419
33621 -229419 -140801 -126445 -183804 -209463 -113632 50244 131086 76690 -484 -4460 -2951 -94325
33609 -94325 -209973 -191331 -30784 109169 120125 57282 1887 -56903 -151180 -249838 -307681
33598 -307681 -323607 -302558 -233620 -149222 -128070 -190079 -261238 -286083 -290405 -282181 -193139 -3256
33586 -3256 167673 201272 147674 138974 188515 200405 147063 104632 111368 112030 65958 9727
33574 9727 -17612 -27433 -32364 -22917 -20887 -78267 -187887 -266893 -268160 -239584 -227746 -191183 -73558
33561 -73558 84904 178407 156654 63909 -24968 -65671 -61465 -60847 -122647 -244178 -336302 -307834
33549 -307834 -169466 -24983 32941 -6865 -92311 -159476 -166889 -111021 -21178 67582 132403
33538 132403 150626 96066 -22900 -133790 -148041 -51838 71857 127536 103049 65787 68326
33527 68326 84836 61402 7558 -11122 24088 52218 38136 43819 119082 174960 81938 -118947
33515 -118947 -233354 -167979 -40284 18190 35464 84369 119015 64188 -20799 -29145 -3185
33504 -3185 -68548 -194207 -210515 -91305 -24910 -127280 -257037 -237552 -126971 -113449 -226817
33493 -226817 -317139 -287002 -197640 -139487 -118084 -95754 -56967 840 79126 153503 180225
33482 180225 143593 67082 -19892 -93356 -127061 -116295 -97697 -104728 -123227 -136888 -185399 -307465
33470 -307465 -444325 -483100 -403649 -311062 -303951 -364150 -390142 -298101 -94678 103849 146922
33459 146922 13285 -122224 -75474 105693 196402 96473 -49564 -72411 8222 61836 33400
33448 33400 -39023 -113983 -163227 -157177 -111761 -94584 -120541 -115366 -56286 -55415 -193608 -354101
33436 -354101 -359559 -217828 -83426 -15225 61857 166756 212255 173938 143504 157859 128560
33425 128560 22105 -30479 82757 267525 344845 288854 221681 219218 243968 251958 256112
33414 256112 277401 315646 374065 443809 466466 386190 245058 151743 136954 112150 6015
33403 6015 -123536 -171031 -136320 -124926 -198803 -289971 -293587 -209018 -137642 -144868 -178655 -154657
33391 -154657 -80028 -34421 -43567 -44733 3519 48095 29895 -6621 27028 108094 96350 -80890
33379 -80890 -301556 -374468 -269806 -149443 -151887 -218779 -193769 -46716 92438 119969 79283
33368 79283 59556 68050 77238 121535 238718 355926 353042 233087 119589 77589 47949
33357 47949 -19406 -82174 -99412 -100494 -100200 -45879 72928 150744 95189 -35885 -115296 -105441
33345 -105441 -47817 42963 165478 255888 243158 162036 109735 106955 99317 72988 54667 10951
33333 10951 -118662 -272948 -288032 -115365 92242 176850 161959 167273 217263 230641 161045
33322 161045 60986 10199 33798 92013 122876 99574 53899 26196 974 -63247 -144651
33311 -144651 -168058 -123934 -105579 -185873 -315652 -390383 -363263 -243354 -42969 197093 368144
33300 368144 367177 212853 33117 -65320 -78044 -65299 -77781 -118157 -142722 -102337 26
33289 26 109574 193456 275921 365938 398172 313039 169244 98506 148338 238445 280882 273313
33277 273313 249468 204395 118088 14697 -50428 -47295 13714 101591 170920 175447 117922 70706
33265 70706 99377 172062 198839 167459 172948 274498 385254 377994 264356 172986 152921
33254 152921 110667 -14446 -120072 -79052 62436 138713 83793 -16867 -80958 -115110 -132857
33243 -132857 -107821 -51645 -32504 -58702 -40031 66560 164710 158186 101390 105241 155662 148609
33231 148609 74254 40908 112614 228591 302363 315088 289761 247974 218584 230208 271133
33220 271133 297126 283795 234139 154177 75668 68124 141898 169978 27513 -193876 -253910
33209 -253910 -82660 112455 133673 50472 53566 162949 237798 217640 185830 198209 201951
33198 201951 162627 149499 229358 354751 421602 391936 315899 270334 306415 417866 531436
33187 531436 564934 515920 452286 403430 327286 216659 156124 201265 267133 237199 143177
33176 143177 113899 148471 78310 -188179 -494610 -605360 -478515 -271687 -122843 -42694
33166 -42694 -12881 -59345 -177152 -274451 -266064 -176683 -91148 -39107 9567 60448 74190 30572
33154 30572 -40710 -104334 -157092 -210788 -266610 -318196 -361160 -392378 -412795 -432307 -460602 -494077
33142 -494077 -516681 -505419 -436992 -315143 -194510 -133620 -105482 -11299 172356 315998 280148
33131 280148 100568 -51563 -72265 2298 108160 221162 292278 238346 66176 -81484
33121 -81484 -84542 8312 64611 45431 16528 23131 44626 59604 73921 81039 60564 24832
33109 24832 15197 46056 94557 141392 174841 161497 71846 -57376 -140734 -141467 -108847 -103095
33097 -103095 -123479 -130417 -105066 -64966 -42778 -64690 -133312 -224723 -313619 -391920 -444053 -429818
33085 -429818 -336150 -226978 -180449 -180877 -142113 -48406 3023 -68097 -217845 -342318 -392171
33074 -392171 -377951 -320310 -257175 -251347 -313701 -348735 -258154 -86510 18139 -5534 -58971
33063 -58971 -26498 70817 103764 -15925 -241772 -425592 -436147 -276871 -92500 -25343 -66292
33052 -66292 -93084 -45850 15194 41288 81422 172869 233996 170163 35189 -29050 5349
33041 5349 27824 -28939 -100686 -114496 -86118 -40782 55522 202756 293458 238530 107959
33030 107959 36560 30588 -14132 -124420 -209812 -217641 -200686 -194963 -148560 -33359 72379
33019 72379 89988 49873 15295 -30912 -129257 -231460 -255808 -223305 -225552 -263198 -226009 -54105
33007 -54105 170956 323700 347743 250195 71315 -95342 -134719 -36520 58040 8513 -151298
32996 -151298 -255610 -206104 -67231 34497 47270 14877 5603 47825 115881 158060 144780
32985 144780 98820 73142 93713 128579 117742 32270 -98062 -213679 -273926 -270803 -207269
32974 -207269 -93613 25412 78768 41405 -25134 -48291 -41428 -67671 -117044 -97000 33295
32963 33295 190080 267519 257479 222041 199440 193676 212264 246578 246582 188211 146991 227757
32951 227757 420758 593309 631108 534297 376332 231183 146474 123543 108148 54081 157
32940 157 20725 98874 133006 84177 16472 -46557 -189361 -444720 -666310 -682638 -519869
32929 -519869 -345988 -232764 -114595 26005 90681 30338 -52855 -47151 19594 56344 58174
32918 58174 80840 112491 71973 -74289 -267808 -423827 -482440 -413891 -250112 -108260 -99892
32907 -99892 -192719 -230847 -128408 14453 38971 -68430 -162024 -118570 22110 117858 91060
32896 91060 -1631 -61019 -64833 -63090 -76591 -61192 7249 70536 65085 25411 39838 114059
32884 114059 155850 108387 24009 -28938 -64692 -128309 -194734 -194037 -120540 -47646 -28263 -36870
32872 -36870 -29248 -14054 -31355 -84421 -131532 -146798 -160185 -216536 -303418 -346295 -286951 -146132
32860 -146132 11304 150552 269411 344933 337537 258540 175718 123915 61083 -49219 -159541
32849 -159541 -194891 -152170 -85721 -19052 65600 162559 234579 275288 322359 391215 438967
32838 438967 415164 321452 206659 118617 63336 3655 -84578 -145408 -77694 123784 313626
32827 313626 351745 274185 220927 226739 201474 113147 52336 73785 102812 73415 49090 106896
32815 106896 185979 167833 58400 -20254 5731 100383 197722 250933 219173 100752 -22671
32804 -22671 -59637 -25004 -1268 7758 83550 239015 361202 351678 246687 152357 125848
32793 125848 165120 253503 356827 417855 406113 350139 290446 231331 161774 82768 -10452
32782 -10452 -124390 -215413 -199992 -65687 77990 120099 84318 84448 172687 294521 371889
32771 371889 362107 243658 18995 -246953 -440563 -481887 -381650 -222120 -104986 -100272
32761 -100272 -198952 -310385 -341275 -284464 -209104 -173832 -180938 -201448 -200802 -147388 -46750 31835
32749 31835 16723 -68981 -124835 -100523 -45443 -5298 61827 206612 372081 434757 356973
32738 356973 237178 197733 264051 362505 396512 308287 104594 -141233 -322276 -363934 -274527
32727 -274527 -137861 -58251 -95496 -220982 -327628 -311982 -175394 -35023 -8788 -90725
32717 -90725 -164023 -139635 -54157 -16280 -80158 -196094 -273289 -264953 -196037 -130078 -107253 -98704
32705 -98704 -34797 94552 188423 139158 -12177 -95890 -21822 98803 100283 -19217 -110395
32694 -110395 -82017 -1807 27589 9088 21702 104818 222018 309970 322842 250646 130269
32683 130269 25271 -31414 -63145 -104783 -156823 -199557 -217706 -185042 -65611 124427 286944
32672 286944 330574 277008 227377 230872 240676 199586 111402 12878 -74281 -139633 -172705 -181838
32660 -181838 -193118 -207976 -192453 -132796 -71481 -57374 -83137 -104115 -103378 -107156 -144876 -218303
32648 -218303 -301728 -353453 -340910 -276563 -215263 -194139 -192195 -173614 -145970 -136135 -129570 -87531
32636 -87531 -17387 34018 61698 109535 172327 161840 23921 -164248 -282088 -313349 -327450
32625 -327450 -339468 -291879 -187517 -133708 -198291 -304430 -345191 -338839 -373189 -435631 -416443
32614 -416443 -283397 -140124 -76762 -61430 -34273 -19632 -64943 -135598 -165407 -169368 -208023
32603 -208023 -263846 -254757 -164744 -60271 30099 146040 279262 337107 280361 204867 209558
32592 209558 256410 247188 181743 144297 168734 213775 253626 301646 350232 373275 389133 436884
32580 436884 482960 438719 292365 141307 60964 17803 -43583 -94971 -63866 63956 226864
32569 226864 337239 318297 142205 -120986 -331037 -402528 -379741 -363280 -405844 -505891
32559 -505891 -635751 -719982 -651988 -417245 -160718 -46096 -73494 -117075 -111142 -95089 -87277
32548 -87277 -36557 71863 166354 193358 190747 207051 222525 208954 199010 222991 230517 159827
32536 159827 51868 5137 25078 7220 -107755 -233159 -236288 -103762 38116 62967 -22628
32525 -22628 -93896 -49530 71099 126924 36401 -121677 -193358 -124457 -13505 20826 -9121
32514 -9121 20705 180342 380139 457567 349811 144202 -35719 -145927 -210659 -251145 -271823
32503 -271823 -282777 -280167 -223611 -88887 70983 176302 218302 235981 207937 65018 -169910
32492 -169910 -354639 -388125 -315702 -224299 -125647 -20019 15178 -81381 -222537 -255101 -158456
32481 -158456 -54541 -26367 -30164 3787 77794 152174 183893 128445 -14205 -143049 -134245
32470 -134245 27 113349 107785 26785 -57927 -144797 -235340 -271808 -222927 -157064 -150144
32459 -150144 -182541 -202148 -225637 -291404 -367029 -395943 -393412 -404418 -403471 -333174 -217672 -144712
32447 -144712 -151494 -209280 -291559 -366634 -360240 -241960 -125573 -151806 -275652 -310687 -198009
32436 -198009 -79004 -60982 -70055 -14785 54227 62218 60886 119592 160959 67380 -99431 -148828
32424 -148828 -23901 127077 156638 76201 -17275 -68747 -80897 -81417 -109643 -178278 -233545
32413 -233545 -213123 -144329 -107708 -100361 -33270 110136 216020 195035 107582 64559 73993
32402 73993 67318 27498 3656 21193 52606 71468 78722 78352 68862 53345 29806 -9571 -43927
32389 -43927 -24732 47318 82402 -6474 -193856 -371852 -461927 -446944 -333666 -163484 -38089
32378 -38089 -41407 -128308 -167823 -105834 -7581 72402 170079 321376 471955 538527 509681
32367 509681 433416 348131 275467 239727 239918 234532 203117 188194 222404 251563 202015 104768
32355 104768 74909 164028 299580 384429 399366 386705 381849 389899 396365 375983 315213 242183
32343 242183 207713 219867 224701 174406 93544 52102 82155 140552 152409 83835 -24399
32332 -24399 -93578 -82841 -24469 22532 36578 30470 6605 -41291 -88641 -93295 -57020 -26089
32320 -26089 -17656 2644 48927 80124 74824 83188 147300 217967 221977 175623 147453 131227
32308 131227 56483 -69981 -138595 -90994 -10248 -842 -51145 -81906 -69905 -43457 -1644
32297 -1644 69445 124826 102436 35364 28499 105432 166374 133952 60967 38119 58396 45021
32285 45021 -20717 -70185 -37602 68915 179664 211640 122703 -39824 -158748 -159241 -90629
32274 -90629 -53058 -59921 -34980 55175 138170 134765 66637 23165 53464 131683 207434 247846
32262 247846 235429 163598 50739 -54845 -99708 -64720 13927 68263 55541 -7740 -74671
32251 -74671 -119418 -143962 -149350 -134071 -118530 -133284 -171142 -181788 -132617 -55068 -13652 -38692
32239 -38692 -95648 -113235 -49959 50289 85442 9496 -98225 -125710 -78788 -76457 -190565
32228 -190565 -354606 -448852 -415009 -270765 -85120 30512 -11928 -167823 -285156 -290297
32218 -290297 -270516 -309639 -340025 -265243 -146271 -118166 -163382 -128702 31386 181725 208413
32207 208413 155946 112831 88144 71714 101625 179017 206304 113700 -16340 -51639 10545
32196 10545 65658 66588 61647 83488 103326 105055 116005 139904 133213 83139 52011 101181 205647
32183 205647 282855 286551 241035 193785 161972 126637 61980 -36930 -148452 -237581 -274184
32172 -274184 -247766 -174513 -88732 -21744 8731 -7068 -62636 -111376 -87329 17103 124575
32161 124575 166621 169442 184172 169577 45361 -145117 -245376 -191590 -94717 -60521 -37799
32150 -37799 68189 227752 343894 404129 447576 430141 267624 5636 -188736 -228034
32140 -228034 -188323 -167062 -161841 -129790 -73435 -14525 43990 81309 53654 -21841 -44305 45425
32128 45425 168130 203816 148310 101209 121552 170930 198471 211465 237494 266818 270500 250398
32116 250398 230491 202583 121000 -27124 -173388 -229937 -195286 -157258 -182656 -246831 -289104
32105 -289104 -289161 -257347 -197895 -126896 -84901 -83209 -81654 -72620 -128108 -282580 -426299 -428868
32093 -428868 -333438 -293750 -329068 -297795 -146049 -21577 -55281 -160111 -163765 -50728 53684
32082 53684 83684 88842 108099 101661 24868 -103604 -223673 -280168 -251195 -172126 -121122 -140725
32070 -140725 -187372 -194568 -162322 -140183 -146149 -155370 -155045 -158565 -168780 -167591 -139242 -76500 22473
32057 22473 136565 220384 246318 224599 163492 54349 -71141 -124423 -59435 51526 103239
32046 103239 86862 73113 99410 142793 179870 202204 189455 135866 89562 101050 149094
32035 149094 181303 204435 260541 336058 378086 385102 395218 400711 371550 349604 399930 460105
32023 460105 370076 98212 -177032 -275773 -213136 -120637 -62437 -17833 21226 36393 38689
32012 38689 58559 92223 112205 113998 106343 76137 7841 -78204 -142649 -166253 -148912 -99249
32000 -99249 -52002 -59239 -125639 -178557 -137906 1818 177756 315451 360570 296713 166723
31989 166723 50761 1493 22248 99465 197147 224410 106356 -80136 -142400 -4972 183908
31978 183908 249790 200165 142161 93872 16545 -37218 22924 146312 183355 117808 97870
31967 97870 196495 293167 267753 180835 159503 202139 214270 177227 159332 179805 170918 91692
31955 91692 574 -19863 32121 82245 76479 47554 73350 172479 267029 273528 207734 151677
31943 151677 128862 80649 -18876 -96797 -75010 20188 92187 83049 4868 -98597 -164235
31932 -164235 -113520 80906 327947 476111 460956 361942 299329 305472 317870 276440 195842
31921 195842 136316 123026 121120 98146 81037 113856 173124 180845 114701 50744 62796 123089
31909 123089 147316 105313 36293 -21847 -60617 -68776 -32267 25646 53473 36712 16245 26477
31897 26477 50158 54240 40744 37611 60303 107651 180341 273220 350463 357956 280312 175312
31885 175312 125467 145667 160850 97407 -23418 -121557 -173453 -231433 -318732 -374364 -340784
31874 -340784 -247079 -155064 -82059 -43870 -110058 -308978 -512067 -541324 -400011 -276011 -286511
31863 -286511 -339113 -301700 -194638 -124073 -112886 -106731 -92859 -104138 -133558 -142371 -138762 -162470
31851 -162470 -200150 -193665 -126799 -36912 45382 102366 102758 48670 16837 55384 73033 -41084
31839 -41084 -205962 -219301 -63721 32146 -84491 -267405 -289530 -155361 -47914 -55228 -111360
31828 -111360 -157871 -201418 -223380 -177272 -88439 -38929 -41909 -38275 -23830 -62191 -149622 -186427
31816 -186427 -130511 -79183 -136946 -274395 -372822 -354384 -231006 -79255 4583 -19295 -83575
31805 -83575 -100601 -101818 -196247 -373106 -466032 -371630 -194793 -98744 -107133 -145312 -188272 -255515
31793 -255515 -322480 -349475 -355561 -367638 -348517 -279514 -256326 -371997 -540252 -575518 -438743
31782 -438743 -271120 -184532 -153749 -129894 -123108 -136357 -138853 -143441 -193762 -241991 -175630 -18383
31770 -18383 45229 -65046 -177984 -113301 50373 104468 15451 -78766 -126872 -222508 -395931
31759 -395931 -527887 -531770 -485278 -502580 -573212 -606241 -563952 -479864 -396099 -345133 -351303 -395400
31747 -395400 -413934 -380044 -346391 -362621 -395468 -386890 -349199 -333744 -336306 -311155 -263875 -250518
31735 -250518 -282947 -308859 -295460 -261327 -209402 -106212 36966 133906 127000 66526 33019
31724 33019 32240 30029 42189 105911 189611 221885 205147 213942 269966 300565 246741 143043
31712 143043 61048 34419 64594 132977 175682 120898 1031 -42022 72171 244428 318800
31701 318800 271229 196322 153368 124170 99674 102071 114253 80765 4100 -33506 24404 134415
31689 134415 208277 198221 113052 -6149 -111305 -183604 -247434 -313642 -326620 -228337 -65012
31678 -65012 45994 63248 60374 103495 168118 205854 217532 218277 194789 144181 103666 99799
31666 99799 112705 120452 127098 121796 77169 22538 40689 137886 193061 109045 -48561 -143211
31654 -143211 -143205 -116744 -96023 -50216 22988 79732 113188 173407 282060 384216 406517 330006
31642 330006 200934 96249 67583 91013 93093 54704 48500 126329 216395 205238 89956
31631 89956 -34097 -118590 -205041 -323335 -436693 -506269 -534674 -520617 -438211 -294324 -152924
31620 -152924 -69413 -40538 -41757 -71395 -129034 -181176 -175455 -76974 109148 324065 466677
31609 466677 457475 304931 93719 -83436 -164127 -122388 7646 126467 143446 60177 -51879
31598 -51879 -134847 -162842 -116811 -17259 41451 -20435 -148019 -205416 -150440 -67110 -21190
31587 -21190 10570 41453 15404 -93688 -205491 -220879 -129660 15310 169161 291890 338740
31576 338740 314835 293327 325576 371358 360111 281223 178894 102622 91424 150465 211761
31565 211761 183702 77608 13040 52945 117848 128823 148743 282453 492297 617112 554465
31554 554465 351498 141510 49092 112826 232711 240099 90682 -65584 -82516 -12814 2173
31543 2173 -35265 -11181 70041 66874 -61581 -161863 -103940 28634 58884 -51502 -180677
31532 -180677 -214688 -160815 -106401 -113297 -155390 -149147 -53265 76086 157266 183385 197229 194608
31520 194608 137063 53455 28730 68668 70788 -25964 -144691 -179898 -136395 -96807 -102261 -128744
31508 -128744 -145847 -141266 -110702 -67820 -41581 -31030 6041 87972 172141 219557 250942 288420
31496 288420 285381 185546 32245 -53773 -13073 86799 135417 91712 1698 -65487 -82865
31485 -82865 -78605 -90908 -112137 -94680 -22412 47274 38712 -56648 -174995 -253154 -281849 -285786
31473 -285786 -273874 -224711 -119209 24313 159854 253356 286787 220454 5771 -315725
31463 -315725 -567599 -578038 -369786 -142057 -50110 -68448 -86845 -59395 -13331 21904 33606
31452 33606 16895 -5010 6883 36022 7678 -93162 -168144 -141652 -85363 -107385 -167379
31441 -167379 -131711 -2238 49338 -83059 -281396 -347580 -229061 -32183 127144 203921
31431 203921 192663 110125 21034 13846 111693 229299 246111 122555 -64709 -202182 -245892
31420 -245892 -241351 -245407 -256115 -237104 -184492 -129232 -81451 -19471 56136 102311 92936 64398
31408 64398 67095 92517 86848 30242 -32789 -46440 576 80825 165165 237184 287948 320572
31396 320572 355605 407708 451155 431349 328489 194175 98015 42814 -34916 -169466 -300168
31385 -300168 -327296 -221243 -50801 92000 167672 185362 155821 83024 1122 -18012 71009
31374 71009 221572 329602 345320 318421 311598 307883 249797 143905 59725 23414 -19860
31363 -19860 -111748 -203823 -214377 -126991 1827 102054 124040 47645 -94368 -216917 -248317
31352 -248317 -194193 -115955 -61687 -40389 -41118 -43876 -24820 19536 61015 70141 43357 -8382
31340 -8382 -66154 -86520 -29221 68269 100611 29074 -48573 -31839 25183 -20797 -203681 -407497
31328 -407497 -518432 -526763 -470900 -372744 -259433 -176255 -140236 -129872 -138806 -183316 -241044
31317 -241044 -248185 -186017 -114055 -91711 -120770 -183830 -274660 -364974 -409918 -419530 -456114 -525480
31305 -525480 -547266 -479713 -394201 -366028 -370806 -361681 -365727 -405231 -396866 -255609 -55557 46646
31293 46646 30570 19913 72805 109252 81843 76145 161744 252302 215642 55535 -113993
31282 -113993 -230613 -322236 -404717 -437154 -393948 -315264 -260909 -250805 -264906 -274816 -267877 -260291
31270 -260291 -284580 -342250 -376163 -319525 -172274 -3983 117309 174855 188359 182335 171439
31259 171439 147840 81811 -33283 -136916 -145790 -54371 53448 111548 137140 154875 121216
31248 121216 3816 -103871 -60980 112170 211253 96615 -111635 -175329 -34214 138714
31238 138714 175966 114395 115253 249689 424173 496668 416458 248154 94974 20157 32255
31227 32255 115583 242145 351959 366195 263669 128811 74815 115635 156641 120333 35614
31216 35614 -17576 -7209 43745 116071 209278 302484 343407 297188 193941 109270 86672
31205 86672 83725 19367 -113180 -215843 -207734 -145434 -149055 -216603 -206905 -41642 165946 256130
31193 256130 231022 223097 287832 332811 264666 119444 6268 -25587 -19905 -41880 -111589
31182 -111589 -202284 -278390 -321991 -321955 -255727 -116868 33947 93120 23852 -94553 -168038
31171 -168038 -198582 -235634 -257546 -194298 -61193 30891 24416 -17098 -34459 -74679 -187031
31160 -187031 -285777 -232660 -45500 83297 10837 -187729 -322266 -305940 -208769 -122874 -52508
31149 -52508 43750 157736 223119 183885 42164 -144775 -284315 -287395 -142726 41647 119689
31138 119689 51909 -63086 -112606 -83387 -35123 -14433 -32707 -83420 -131973 -122401 -44518
31127 -44518 34205 51924 35840 50987 104116 163276 232684 322560 373955 315922 188236
31116 188236 102024 76797 29925 -59013 -104858 -81592 -94488 -202072 -281616 -188763 28752
31105 28752 200771 264310 295556 339557 339107 248011 114292 19660 -1518 29728 57072 19041
31093 19041 -87023 -181659 -199064 -179765 -194110 -207520 -132126 -2298 34095 -69456 -178730
31082 -178730 -174373 -111671 -100147 -125116 -102992 -42640 -20688 -30718 11212 112223 176113
31071 176113 155654 123789 149992 200475 223419 253928 348738 462715 481808 370790 217456
31060 217456 124291 108625 114949 78443 -31081 -183113 -292357 -291388 -210214 -145288 -140955 -150126
31048 -150126 -127116 -96236 -89020 -75251 -24270 6499 -71415 -242873 -390371 -436997 -417827
31037 -417827 -393806 -366603 -314105 -250594 -201902 -159104 -106520 -73705 -114098 -235235 -374990
31026 -374990 -444989 -393724 -248362 -101670 -30204 -16502 17132 93758 146890 114950 17260
31015 17260 -93738 -205619 -329920 -452013 -538467 -565551 -513851 -376344 -200017 -66950
31005 -66950 1010 59333 125105 123643 11948 -130132 -218298 -286409 -376375 -392612 -231234
30994 -231234 -7047 40272 -125932 -287823 -287032 -210616 -192274 -202364 -156159 -95831 -119860
30983 -119860 -216033 -296467 -334706 -345722 -289208 -128255 48044 93397 -7646 -128771 -178037
30972 -178037 -184088 -201577 -228934 -243510 -242594 -226324 -195080 -169832 -160955 -125186 -20224 106568
30960 106568 162070 138297 114142 120077 98748 30893 3937 92357 235656 303430 243984
30949 243984 114358 -6340 -83093 -125710 -168452 -241199 -333742 -397510 -396325 -338246 -250919
30938 -250919 -157071 -86653 -72981 -108363 -132825 -96466 -13672 64343 106181 108969 78714 30720
30926 30720 -9308 -30547 -49951 -80719 -102881 -84573 -23552 43393 66253 24083 -37150 -23617
30914 -23617 105839 264580 322145 268993 225719 263885 300403 227340 74971 -37011 -61742
30903 -61742 -45162 -13661 52550 131831 148396 80131 2229 -16707 536 1189 -10359 -4988
30891 -4988 -6689 -69158 -187568 -291609 -327029 -298113 -228158 -130022 -34535 1076 -43089 -102133
30879 -102133 -92576 -22238 16815 -20284 -59952 -13639 87236 130096 85017 46885 86329
30868 86329 136801 95653 -14740 -74920 -40284 5907 -14634 -73024 -103276 -104943 -114535 -121367
30856 -121367 -85126 -17128 27729 38676 60158 101311 102200 27728 -58919 -70630 -11255 40210
30844 40210 39325 9426 -23858 -60300 -76848 -23832 95487 199333 225446 204907 188352 152107
30832 152107 53084 -60600 -89653 -27655 30159 36902 57941 144591 229064 211215 91592
30821 91592 -51666 -175608 -286799 -367942 -370323 -286515 -175170 -100085 -77858 -87094 -96139
30810 -96139 -78860 -29599 34482 97921 158344 197671 172920 71437 -48074 -110590 -105186
30799 -105186 -75944 -56894 -58020 -87320 -130381 -129918 -50668 48821 79467 51155 63453 161397
30787 161397 277809 336004 332541 290054 206210 96645 23452 22412 45654 27153 -34042
30776 -34042 -102517 -174790 -259635 -321448 -308724 -229109 -143417 -90111 -61465 -50296 -69719 -112282
30764 -112282 -128291 -76923 8174 31696 -62513 -207630 -267922 -199877 -118948 -153431 -264955
30753 -264955 -295547 -183656 -37063 26676 13601 -12019 -28376 -28189 23537 124333 195099
30742 195099 183991 142802 119500 53413 -114388 -296655 -361871 -336070 -353670 -424309 -406423
30731 -406423 -232203 -14193 113958 137383 95030 -1410 -119268 -183991 -180386 -184863 -229874
30720 -229874 -231322 -131619 -23395 -28520 -123214 -191809 -204359 -228385 -290503 -333960 -312958 -246303
30708 -246303 -176499 -142602 -184992 -305470 -423161 -436514 -337146 -212740 -139965 -123288 -130138
30697 -130138 -129938 -101419 -54491 -42490 -103110 -193515 -235132 -212738 -172603 -135107 -78871 -8432
30685 -8432 38535 61498 99816 147340 140015 58749 -27363 -60211 -66174 -80422 -66380 14013
30673 14013 97050 76121 -45242 -138124 -98908 43462 186749 266827 278489 227585 113178
30662 113178 -47702 -211361 -332809 -389013 -381821 -337601 -305256 -329424 -406563 -477130 -477625
30651 -477625 -397598 -279511 -177651 -128189 -132001 -137251 -68203 77324 181182 129886 -16203
30640 -16203 -70665 35332 156699 142774 45677 17949 72428 79554 -16129 -110550 -92281
30629 -92281 27481 170371 284613 343703 334725 300400 329796 456416 611566 712350 741287
30618 741287 706112 588524 388951 172533 14082 -68338 -87729 -50120 5017 -16614 -163822
30607 -163822 -343083 -398325 -285745 -113824 -10978 -1451 -15146 19898 106758 183568 194773
30596 194773 155561 123386 111430 80649 28430 19076 89085 180643 216103 187147 127124 58790
30584 58790 23643 86191 227366 306377 235538 133756 178008 342355 431392 359703 238661
30573 238661 165891 94330 -24962 -119686 -119795 -91594 -129004 -188418 -156238 -36431 48712
30562 48712 29037 -46567 -113492 -167115 -216360 -240590 -230360 -221868 -253865 -316277 -367188 -383825
30550 -383825 -375830 -356021 -317312 -247843 -163273 -103561 -83056 -64743 -16654 22355 -16382 -126786
30538 -126786 -223013 -248842 -227638 -185267 -105087 -6272 19347 -64990 -140184 -71259 80641
30527 80641 110357 -55877 -253744 -294496 -186457 -71968 -21255 9008 45420 39607 -34175
30516 -34175 -105538 -90111 -6073 51333 39726 14570 30930 54543 12754 -96868 -200698
30505 -200698 -242049 -230410 -198118 -160926 -134890 -140235 -161121 -145154 -74428 2398 41667 63967
30493 63967 97386 106314 41998 -62366 -117396 -87951 -12041 81913 198229 304660 325074
30482 325074 244491 157368 152858 192166 162081 32193 -99413 -118481 -8794 151624 268359
30471 268359 287915 211647 90681 5976 25107 155075 329727 446229 425722 260078
30461 260078 20488 -178482 -245248 -165411 1628 174011 284191 279699 143784 -49489
30451 -49489 -150590 -80325 53746 67594 -67228 -191537 -186324 -131260 -165405 -275737 -331377
30440 -331377 -280047 -192269 -123365 -48146 48276 118079 133549 143379 189823 223611 162333 9515
30428 9515 -132266 -163809 -83390 16571 39556 -22098 -89744 -100121 -75737 -68620 -76518 -70562
30416 -70562 -70080 -110351 -154453 -128537 -44590 7011 480 11339 81807 149138 154164 129209
30404 129209 122710 123887 124227 163547 235441 230926 75317 -140610 -264083 -262733 -209155 -142069
30392 -142069 -59801 -10485 -55927 -152195 -183924 -123518 -52455 -20515 7266 47290 48498 -18915
30380 -18915 -113265 -191315 -251767 -288330 -281374 -254642 -249718 -224445 -84181 148454 311594
30369 311594 316516 272483 312707 395506 391997 295687 210075 164796 81478 -70468 -198374
30358 -198374 -203020 -98709 15006 55655 16365 -39191 -34295 36022 86477 45987 -38078
30347 -38078 -54579 24748 116887 145192 120071 91109 81747 94540 127285 154412 135639 71690
30335 71690 13110 -14932 -59631 -175597 -336649 -447518 -434501 -305968 -137824 -14988
30325 -14988 30199 37699 63085 94121 54628 -88364 -254148 -322973 -266726 -170499 -130899
30314 -130899 -165441 -221971 -245674 -224762 -187572 -166099 -159283 -137468 -91149 -58573 -78119 -122269
30302 -122269 -117866 -39377 58094 118618 154328 191278 183874 60819 -140116 -263493 -206041
30291 -206041 -40294 83828 112048 90322 40543 -58590 -166119 -174723 -64977 32319 5537
30280 5537 -82086 -101639 -61507 -75545 -154439 -172240 -66294 60894 101234 89874 104023
30269 104023 105112 8397 -134676 -161366 -14567 179229 284701 314513 353377 402554 386791
30258 386791 284382 167191 107350 104864 122577 141432 148526 103278 -36539 -249428 -438968
30247 -438968 -509910 -455345 -357537 -298594 -281275 -250021 -178640 -106177 -77630 -84108 -93298 -113996
30235 -113996 -179311 -269640 -314022 -294595 -294249 -384292 -496998 -484712 -310442 -110930 -37191
30224 -37191 -82807 -120029 -75935 -8875 -4436 -50088 -53177 32184 138197 164569 107218 63264
30212 63264 92086 116652 19897 -180149 -331895 -343753 -290419 -272667 -255071 -146306 7623
30201 7623 46385 -76657 -212948 -214183 -105822 3713 92949 203033 306085 323256 260746
30190 260746 214891 227295 230180 162478 53442 -50322 -163841 -311016 -446708 -492717 -421714
30179 -421714 -264787 -73365 87233 156375 147032 152377 219896 264571 189016 47157 -23275
30168 -23275 -12345 -46516 -163493 -221929 -113597 51337 86529 -16073 -97696 -59178 47856
30157 47856 142632 202270 207018 112010 -71954 -243417 -308133 -264491 -163452 -43314 61856
30146 61856 113496 118474 137788 198611 247924 243428 232685 269815 299974 219786 38189 -112619
30134 -112619 -136836 -71762 -5598 34042 70556 102196 86767 537 -110450 -152251 -72928
30123 -72928 63746 124757 55104 -49157 -53277 56454 174429 214848 184819 124176 42274
30112 42274 -65964 -190299 -310391 -397763 -413987 -352334 -277107 -262615 -289247 -265999 -168961
30101 -168961 -85589 -93081 -159211 -200815 -181248 -111368 -13883 65789 66816 -16437 -112940 -166218
30089 -166218 -198798 -245622 -286771 -303112 -331662 -389041 -402747 -316533 -215395 -228723 -333643
30078 -333643 -381285 -321423 -270711 -320711 -398013 -386169 -295919 -224722 -203801 -180789 -133584
30067 -133584 -113255 -158113 -224410 -234339 -166346 -70759 -6409 10192 -16301 -104672 -278547
30056 -278547 -496613 -645198 -637252 -501652 -347287 -257853 -247007 -284370 -319362 -301062 -228300
30045 -228300 -172556 -205557 -312149 -415305 -467660 -467490 -410021 -296331 -180727 -129950 -129914 -106327
$$ [...]
##END NTUPLES=NMR SPECTRUM
##END=
