##TITLE=31Pdec_112-2025 Bay
CDCl3, 24 sc
 9.9.2025
##JCAMPDX= 6.0         $$ Bruker NMR JCAMP-DX V2.0
##DATA TYPE= NMR SPECTRUM
##DATA CLASS= NTUPLES
##ORIGIN= UXNMR, Bruker Analytische Messtechnik GmbH
##OWNER= root
$$ XWIN-NMR		Version 3.5
$$ Tue Sep  9 13:47:44 2025 Russian Standard Time (UT+4h)  she@DPX200
##.OBSERVE FREQUENCY= 81.013821
##.OBSERVE NUCLEUS= ^31P
##.ACQUISITION MODE= SIMULTANEOUS
##.ACQUISITION SCHEME= undefined
##.AVERAGES= 24
##.DIGITISER RES= 17
##SPECTROMETER/DATA SYSTEM= spect
##.PULSE SEQUENCE= zgpg30
##.SOLVENT NAME= CDCl3
##.SHIFT REFERENCE= (INTERNAL, CDCl3, 0, 198.062)
##AUDIT TRAIL= $$ (NUMBER, WHEN, WHO, WHERE, WHAT)
$$ ##TITLE= Audit trail, XWIN-NMR		Version 3.5
$$ ##JCAMPDX= 5.01
$$ ##ORIGIN= Bruker BioSpin GmbH
$$ ##OWNER= she
$$ F:/spectra/data/she/nmr/P31/2/pdata/1/auditp.txt
$$ ##AUDIT TRAIL=  $$ (NUMBER, WHEN, WHO, WHERE, WHAT)
(   1,<2025-09-09 13:46:27.59 +0400>,<she>,<DPX200>,
      <created by zg, POWCHK disabled, PULCHK disabled
       configuration hash MD5:
       00 E9 B6 7A A2 85 ED C7 34 08 36 98 17 FE 4E 26
       data hash MD5: 32K
       0C 30 72 A1 98 77 54 CA E4 28 A4 26 97 29 97 C4>)
(   2,<2025-09-09 13:46:40.03 +0400>,<she>,<DPX200>,
      <Start of raw data processing
       efp BC_mod = 2 LB = 1.5 FT_mod = 6 PKNL = 1 PHC0 = 1357.71 PHC1 = 144.0999 SI = 64K 
       data hash MD5: 64K
       0A B5 1B 51 A4 26 13 A8 95 26 57 E5 F0 37 E1 4B>)
(   3,<2025-09-09 13:47:03.70 +0400>,<she>,<DPX200>,
      <pk PHC0 = 25.51786 PHC1 = -32.20001 
       data hash MD5: 64K
       31 CA E1 12 1C E9 ED 8D 54 0A 7C 1D 9E 20 79 7A>)
$$ ##END=
$$ 
$$ hash MD5
$$ AA 0D 63 F8 55 E3 0E 10 08 A9 6A 38 85 80 F7 D1
##$RELAX= 
##$RELAX= 
##$RELAX= 
##$RELAX= 
##$RELAX= 
##$RELAX= 
##$RELAX= 
##$RELAX= 
$$ Bruker specific parameters
$$ --------------------------
##$DU= <F:/spectra>
##$EXPNO= 2
##$NAME= <P31>
##$PROCNO= 1
##$TYPE= <nmr>
##$USER= <she>
##$AMP= (0..31)
100 100 100 100 100 100 100 100 100 100 100 100 100 100 100 100 100 100 
100 100 100 100 100 100 100 100 100 100 100 100 100 100 
##$AQSEQ= 0
##$AQ_mod= 1
##$AUNM= <au_zg>
##$AUTOPOS= <>
##$BF1= 81.014009
##$BF2= 200.13
##$BF3= 200.13
##$BF4= 200.13
##$BF5= 200.13
##$BF6= 200.13
##$BF7= 200.13
##$BF8= 200.13
##$BYTORDA= 1
##$CFDGTYP= 0
##$CFRGTYP= 5
##$CHEMSTR= <none>
##$CNST= (0..31)
1 1 145 1 1 1 1 1 1 1 1 1 1 1 1 1 1 1 1 1 1 1 1 1 1 1 1 1 1 1 1 1 
##$CPDPRG= <waltz16>
##$CPDPRG1= <>
##$CPDPRG2= <waltz16>
##$CPDPRG3= <>
##$CPDPRG4= <mlev>
##$CPDPRG5= <mlev>
##$CPDPRG6= <mlev>
##$CPDPRG7= <mlev>
##$CPDPRG8= <mlev>
##$CPDPRGB= <>
##$CPDPRGT= <>
##$D= (0..31)
0 1 0 0 0 0 0 0 0 0.06 0 0.03 2e-05 3e-06 0 0 0.0002 0 0 0 0 0 0 0 0 0 
0 0 0 0 0 0 
##$DATE= 1757411187
##$DBL= (0..7)
120 120 120 11 120 120 24 19 
##$DBP= (0..7)
150 150 150 150 150 150 150 150 
##$DBP07= 0
##$DBPNAM0= <>
##$DBPNAM1= <>
##$DBPNAM2= <>
##$DBPNAM3= <>
##$DBPNAM4= <>
##$DBPNAM5= <>
##$DBPNAM6= <>
##$DBPNAM7= <>
##$DBPOAL= (0..7)
0.5 0.5 0.5 0.5 0.5 0.5 0.5 0.5 
##$DBPOFFS= (0..7)
$$ [...]
##$SUBNAM3= <"">
##$SUBNAM4= <"">
##$SUBNAM5= <"">
##$SUBNAM6= <"">
##$SUBNAM7= <"">
##$SUBNAM8= <"">
##$SUBNAM9= <"">
##$SW= 400.765351723535
##$SWIBOX= (0..15)
0 1 3 0 0 0 0 0 0 0 0 0 0 0 0 0 
##$SW_h= 32467.5324675325
##$TD= 32768
##$TD0= 1
##$TE= 0
##$TE2= 300
##$TE3= 300
##$TEG= 300
##$TL= (0..7)
0 120 53 12 22 120 120 120 
##$TP= (0..7)
150 150 150 150 150 150 150 150 
##$TP07= 0
##$TPNAME0= <>
##$TPNAME1= <>
##$TPNAME2= <>
##$TPNAME3= <>
##$TPNAME4= <>
##$TPNAME5= <>
##$TPNAME6= <>
##$TPNAME7= <>
##$TPOAL= (0..7)
0.5 0.5 0.5 0.5 0.5 0.5 0.5 0.5 
##$TPOFFS= (0..7)
0 0 0 0 0 0 0 0 
##$TUNHIN= 0
##$TUNHOUT= 0
##$TUNXOUT= 0
##$USERA1= <user>
##$USERA2= <user>
##$USERA3= <user>
##$USERA4= <user>
##$USERA5= <user>
##$V9= 5
##$VALIST= <valist>
##$VCLIST= <CCCCCCCCCCCCCCC>
##$VD= 0
##$VDLIST= <DDDDDDDDDDDDDDD>
##$VPLIST= <PPPPPPPPPPPPPPP>
##$VTLIST= <TTTTTTTTTTTTTTT>
##$WBST= 1024
##$WBSW= 4
##$XGAIN= (0..3)
0 0 0 0 
##$XL= 0
##$YL= 0
##$YMAX_a= 17910
##$YMIN_a= -19889
##$ZGOPTNS= <>
##$ZL1= 120
##$ZL2= 120
##$ZL3= 120
##$ZL4= 120
##$ABSF1= 0
##$ABSF2= 0
##$ABSG= 0
##$ABSL= 0
##$ALPHA= 0
##$AQORDER= 0
##$ASSFAC= 0
##$ASSFACI= 0
##$ASSFACX= 0
##$ASSWID= 0
##$AUNMP= <proc_1d>
##$AZFE= 0.1
##$AZFW= 0.5
##$BCFW= 0
##$BC_mod= 2
##$BYTORDP= 0
##$COROFFS= 0
##$CY= -3
##$DATMOD= 1
##$DC= 0
##$DFILT= <>
##$DTYPP= 0
##$F1P= 0
##$F2P= 0
##$FCOR= 1
##$FTSIZE= 65536
##$FT_mod= 6
##$GAMMA= 0
##$GB= 0
##$INTBC= 1
##$INTSCL= 9.790993e-09
##$ISEN= 30
##$LB= 1.5
##$LEV0= 0
##$LPBIN= 0
##$MAXI= 10000
##$MC2= 0
##$MEAN= 0
##$ME_mod= 0
##$MI= 50
##$NCOEF= 0
##$NC_proc= -6
##$NLEV= 6
##$NOISF1= 182.463
##$NOISF2= 159.3651
##$NSP= 0
##$NTH_PI= 0
##$NZP= 0
##$OFFSET= 198.0616
##$PC= 4
##$PHC0= 1383.228
##$PHC1= 111.8999
##$PH_mod= 1
##$PKNL= yes
##$PPARMOD= 0
##$PSCAL= 0
##$PSIGN= 0
##$REVERSE= no
##$SF= 81.0140089999434
##$SI= 65536
##$SIGF1= 159.3651
##$SIGF2= -187.1042
##$SINO= 113.3802
##$SIOLD= 16384
##$SREGLST= <1H.CDCl3>
##$SSB= 0
##$STSI= 65536
##$STSR= 0
##$SW_p= 32467.5324675325
##$SYMM= 0
##$S_DEV= 0
##$TDeff= 32768
##$TDoff= 0
##$TI= <>
##$TILT= no
##$TM1= 0
##$TM2= 0
##$TOPLEV= 0
##$USERP1= <user>
##$USERP2= <user>
##$USERP3= <user>
##$USERP4= <user>
##$USERP5= <user>
##$WDW= 1
##$XDIM= 65536
##$YMAX_p= 417052388
##$YMIN_p= -14848192
$$ End of Bruker specific parameters
$$ ---------------------------------
##NTUPLES= NMR SPECTRUM
##VAR_NAME=  FREQUENCY,     SPECTRUM/REAL,   SPECTRUM/IMAG
##SYMBOL=    X,             R,               I
##VAR_TYPE=  INDEPENDENT,   DEPENDENT,       DEPENDENT
##VAR_FORM=  AFFN,          ASDF,            ASDF
##VAR_DIM=   65536,         65536,           65536
##UNITS=     HZ,            ARBITRARY UNITS, ARBITRARY UNITS
##FACTOR=    0.49542278885378, 1,            1
##FIRST=     16045.7642231865, 0,            0
##LAST=      -16421.768244346, 0,            0
##MIN=       -16421.768244346, -14848192,    0
##MAX=       16045.7642231865, 417052388,    0
$$ Real data points
##PAGE= N=1
##DATA TABLE= (X++(R..R)), XYDATA
$$ [...]
$$ plain form
42780 548547 -146979 -1038061 -1401030 -1252228 -1212804 -1445246 -1516032 -1323215 -1334607 -1687937
42770 -1687937 -1816032 -1354903 -781000 -641182 -668715 -270501 458986 855368 642517 178683
42760 178683 -189463 -461185 -635253 -545760 -210750 29484 -84540 -426821 -696317 -716966
42750 -716966 -467045 -61278 208887 65725 -398529 -746728 -668736 -244718 299514 823072
42740 823072 1147554 1015684 414032 -266694 -643703 -777961 -977140 -1298774 -1508495 -1454435
42730 -1454435 -1218760 -915241 -582021 -304454 -220477 -318312 -390581 -281621 -55387 168544
42720 168544 406727 680474 780089 412295 -325782 -825516 -567177 205316 688369 475436
42710 475436 30532 14597 414139 688802 596184 387901 222042 -62473 -425013 -419023
$$ packed form
42780E48547o95526q91082l62969J48802L9424k32442p0786J92817j1392l53330
42770a687937j28095M61129N73903J39818k7533L98214P29487L96382k12851m63834
42760A78683l68146k71722j74068Q9493L35010K40234j14024l42281k69496k0649
42750g16966K49921M05767K70165j43162m64254l48199P7992M24018N44232N23558
42740H23072L24482j31870o01652o80726l77009j34258j99179l21634k09721N4060
42730a454435K35675L03519L33220K77567Q3977r7835p2269J08960K26234K23931
42720A68544K38183K73747R9615l67794p38077m99734K58339P72493M83053k12933
42710D75436m44904j5935L99542K74663r2618k08283j65859k84515l62540N990
$$ plain form
42700 -419023 134172 686803 638069 168612 -104294 -89960 -247502 -705053 -985123 -761290
42690 -761290 -366914 -286857 -531693 -792065 -887619 -766125 -347323 271071 644685 396863
42680 396863 -275815 -814230 -942694 -824042 -665932 -530155 -513506 -718234 -938629 -744185
42670 -744185 -76217 543600 668750 544782 724891 1225650 1490242 1202038 728769 602730
42660 602730 877717 1225995 1419605 1425427 1204704 779235 436548 499900 845332 986536
42650 986536 756850 571170 787569 1106049 961245 366181 -31992 242449 954189 1514603
42640 1514603 1619777 1391453 1090154 897036 894441 1069737 1310097 1471473 1473839 1327738
42630 1327738 1118311 978194 989292 1054247 949558 605188 276529 298768 647723 872503
$$ packed form
42700d19023N53195N52631m8734m69457k72906J4334j57542m57551k80070K23833
42690g61290L94376Q0057k44836k60372r5554J21494M18802O18394L73614k47822
42680C96863o72678n38415j28464J18652J58110J35777J6649k04728k20395J94444
42670g44185O67968O19817J25150j23968J80109N00759K64592k88204m73269j26039
42660F02730K74987L48278J93610N822k20723m25469l42687O3352L45432J41204
42650I86536k29686j85680K16399L18480j44804n95064l98173K74441P11740N60414
42640A514603J05174k28324l01299j93118k595J75296K40360J61376K366j46101
42630A327738k09427j40117J1098O4955j04689l44370l28659K2239L48955K24780
$$ plain form
42620 872503 571026 -116457 -615692 -544060 -108856 199861 193392 84524 66983 64756 -16386
42609 -16386 -46508 105583 272408 173644 -169696 -453476 -480213 -274867 154818 838192
42599 838192 1546180 1824563 1538767 1128112 1047372 1143107 905715 242719 -352567 -432864
42589 -432864 -95750 247006 347546 218105 -51769 -364969 -599767 -710256 -802872 -963294
42579 -963294 -1051227 -842126 -372292 34753 131451 -24886 -271654 -584497 -966284 -1228634
42569 -1228634 -1113360 -621888 -48820 333403 490083 529003 559644 688298 986484 1368539
42559 1368539 1602665 1513285 1099429 460649 -236159 -712218 -747547 -497197 -383372 -505744
42549 -505744 -429960 169291 912736 1173199 981064 963982 1345562 1529999 951153 -49200
$$ packed form
42620H72503l01477o87483m99235P1632M35204L08717o469j08868j7541k227q1142
42609a6386l0122J52091J66825r8764l43340k83780k6737K05346M29685O83374
42599H38192P07988K78383k85796m10655q0740R5735k37392o62996n95286q0297
42589d32864L37114L42756J00540j29441k69874l13200k34798j10489r2616j60422
42579i63294q7933K09101M69834M07045R6698j56337k46768l12843l81787k62350
42569a228634J15274M91472N73068L82223J56680L8920L0641J28654K98186L82055
42559A368539K34126q9380m13856o38780o96808m76059l5329K50350J13825j22372
42549e05744P5784N99251P43445K60463j92135j7082L81580J84437n78846j000353
$$ plain form
42539 -49200 -589352 -323914 224830 385611 62173 -351335 -527706 -473083 -328232 -132685
42529 -132685 130797 391002 548929 655661 862623 1160190 1331035 1237644 984995 695835
42519 695835 339884 -27479 -91438 328756 849017 876145 374836 -109760 -248612 -337527
42509 -337527 -727252 -1203447 -1258041 -808190 -336318 -321627 -710210 -989900 -742406 -107372
42499 -107372 345207 237469 -249693 -746339 -1213988 -1799339 -2341042 -2478087 -2228369 -1977856
42489 -1977856 -1819404 -1403100 -616651 84717 306315 235140 220896 253402 217530 262939
42479 262939 479894 550442 204104 -253648 -347152 -118834 66116 150309 295125 399452
42469 399452 295482 238910 578268 1077903 1227885 1098632 1137329 1194658 663279 -294224
$$ packed form
42539d9200n40152K65438N48744J60781l23438m13508j76371N4623J44851J95547
42529a32685K63482K60205J57927J06732K06962K97567J70845r3391k52649k89160
42519F95835l55951l67363o3959M20194N20261K7128n01309m84596j38852q8915
42509c37527l89725m76195n4594M49851M71872J4691l88583k79690K47494O35034
42499a07372M52579j07738m87162m96646m67649n85351n41703j37045K49718K50513
42489a977856J58452M16304P86449P01368K21598p1175j4244L2506l5872M5409
42479B62939K16955P0548l46338m57752r3504K28318J84950Q4193J44816J04327
42469C99452j03970n6572L39358M99635J49982j29253L8697N7329n31379r57503
$$ plain form
42459 -294224 -627067 103075 961387 939463 296453 -60059 76046 272864 444081 870592
42449 870592 1380097 1339428 576451 -300781 -664322 -498825 -162392 73636 99724 -87668
42439 -87668 -363223 -609526 -921887 -1433362 -1934825 -2001080 -1580826 -1139479 -1061013 -1185717
42429 -1185717 -1144376 -921375 -817127 -965158 -1153798 -1136223 -928555 -733939 -679740 -718599
42419 -718599 -752655 -761791 -772098 -767965 -734677 -767926 -1004017 -1387710 -1628041 -1484047 -1026747
42408 -1026747 -545377 -282115 -344582 -754220 -1392383 -1926964 -1989014 -1519095 -878102 -547344
42398 -547344 -702123 -1068680 -1203311 -937728 -530153 -333263 -379441 -427508 -373109 -386791
42388 -386791 -588900 -816739 -858420 -745104 -645065 -603438 -560819 -523481 -541831 -597291 -657957
$$ packed form
42459b94224l32843P30142Q58312k1924o43010l56512J36105J96818J71217M26511
42449H70592N09505m0669p62977q77232l63541J65497L36433K36028K6088j87392
42439h7668k75555k46303l12361n11475n01463o6255M20254M41347P8466j24704
42429a185717M1341K23001J04248j48031j88640J7575K07668J94616N4199l8859
42419g18599l4056r136j0307M133L3288l3249k36091l83693k40331J43994M57300
42408a026747M81370K63262o2467m09638o38163n34581o2050M69919O40993L30758
42398e47344j54779l66557j34631K65583M07575J96890m6178m8067N4399j3682
42388c86791k02109k27839m1681J13316J00039M1627M2619L7338j8350n5460o0666
$$ plain form
42377 -657957 -763610 -918240 -1000386 -935959 -861331 -945822 -1135616 -1233306 -1141295 -871163 -433497
42366 -433497 80896 415872 376934 88878 -162587 -270681 -307843 -306830 -271155 -285133 -348408
42355 -348408 -216203 285490 878985 1114696 963902 756864 590781 263150 -179333 -346774
42345 -346774 -134968 21066 -213376 -576803 -664032 -532583 -505876 -649690 -825458 -1050974
42335 -1050974 -1399718 -1667162 -1537821 -1048523 -547801 -209421 96633 433174 609526
42326 609526 467305 134249 -119726 -155064 -31687 98070 134199 121664 168790 234139
42316 234139 124565 -173239 -317367 4081 595445 911097 675379 133700 -300255 -437706
42306 -437706 -366465 -332069 -580950 -1112136 -1568238 -1577699 -1207759 -851779 -681973 -517368
$$ packed form
42377f57957j05653j54630q2146O4427P4628q4491j89794r7690R2011K70132M37666
42366d33497N14393L34976l8938k88056k51465j08094l7162J013L5675j3978o3275
42355c48408J32205N01693N93495K35711j50794k07038j66083l27631m42483j67441
42345c46774K11806J56034k34442l63427q7229J31449K6707j43814j75768k25516
42335a050974l48744k67444J29341M89298N00722L38380L06054L36541J76352
42326F09526j42221l33056k53975l5338J23377J29757L6129j2535M7126O5349
42316B34139j09574k97804j44128L21448N91364L15652k35718n41679m33955j37451
42306d37706P1241L4396k48881n31186m56102r461L69940L55980J69806J64605
$$ plain form
42296 -517368 -273105 -168069 -313878 -440777 -317457 -187692 -436025 -957798 -1230213 -998528
42286 -998528 -581623 -433573 -639300 -938927 -1069679 -953437 -648061 -259576 77143 204154
42276 204154 30995 -310505 -476665 -246443 155378 276708 22874 -244690 -308045 -440297
42266 -440297 -866212 -1210078 -969760 -366556 -151052 -565419 -1062085 -1156781 -983722 -780070
42256 -780070 -415540 145102 409012 -45385 -846258 -1278103 -1233333 -1118699 -974962 -403428
42246 -403428 574335 1262717 1153843 550839 77718 -7203 233877 700555 1144120 1150336
42236 1150336 657304 252397 546687 1392969 2059473 2055082 1487905 759126 237876 132128
42226 132128 339496 464891 250718 -89634 -217327 -193538 -310389 -517941 -458133 -68440
$$ packed form
42296e17368K44263J05036j45809j26899J23320J29765k48333n21773k72415K31685
42286i98528M16905J48050k05727k99627j30752J16242L05376L88485L36719J27011
42276B04154j73159l41500j66160K30222M01821J21330k53834k67564o3355j32252
42266d40297m25915l43866K40318O03204K15504m14367m96666r4696J73059K03652
42256g80070L64530N60642K63910m54397q00873m31845M4770J14634J43737N71534
42246d03428R77763O88382j08874o03004m73121q4921K41080M66678M43565O216
42236A150336m93032m04907K94290Q46282O66504m391n67177p28779n21250j05748
42226A32128K07368J25395k14173l40352j27693K3789j16851k07552N9808L89693
$$ plain form
42216 -68440 276551 314497 210332 191040 201808 107249 -29823 -67464 -1859 87337 170007
42205 170007 246262 323381 448943 607472 595415 240880 -236682 -381854 -95215 225689
42195 225689 250225 123757 162682 424845 766802 1069838 1216048 1086101 776756 573290
42185 573290 514612 279964 -246801 -627826 -447362 25899 182089 -94278 -375522 -379783
42175 -379783 -258939 -215635 -259754 -397668 -685270 -1003550 -1107878 -994091 -918919 -972172
42165 -972172 -934389 -669329 -350216 -140620 63973 376171 638283 630361 377313 34690
42155 34690 -369920 -845598 -1210384 -1214339 -846900 -301763 333826 1110357 1896830 2285537
42145 2285537 2012242 1369356 979193 1115345 1418494 1407932 1137683 1094615 1448390 1716815
$$ packed form
42216f8440L44991L7946j04165j9292J0768r4559j37072l7641O5605Q9196Q2670
42205A70007P6255P7119J25562J58529j2057l54535m77562j45172K86639L20904
42195B25689K4536j26468L8925K62163L41957L03036J46210j29947l09345k03466
42185E73290n8678k34648n26765l81025J80464M73261J56190k76367k81244m261
42175c79783J20844M3304m4119j37914k87602l18280j04328J13787P5172n3253
42165i72172L7783K65060L19113K09596K04593L12198K62112p922k53048l42623
42155C4690m04610m75678l64786l955L67439N45137O35589P76531P86473L88707
42145B285537k73295o42886l90163J36152L03149j0562k70249m3068L53775K68425
$$ plain form
42135 1716815 1381482 624833 141526 272006 623255 596384 46884 -666398 -1086542 -1001090
42125 -1001090 -549511 -134435 -129621 -546934 -1017573 -1146893 -852683 -379567 -89690 -219467
42115 -219467 -677761 -1054599 -991105 -589522 -305732 -404125 -708433 -936389 -1024827 -984936
42105 -984936 -692465 -80577 603113 1001712 1059506 1013639 1021659 1017133 931120 844248 857853
42094 857853 947998 989402 833124 380882 -273043 -771120 -739941 -185147 478749 858243
42084 858243 923905 854482 696871 365888 -85889 -435331 -600180 -802660 -1256843 -1781455
42074 -1781455 -1933207 -1549731 -981066 -696389 -804040 -1073728 -1290424 -1400435 -1393554 -1270592
42064 -1270592 -1136088 -1130008 -1217862 -1189314 -901861 -411254 129752 548991 656971 398866
$$ packed form
42135A716815l35333p56649m83307J30480L51249k6871n49500p13282m20144Q5452
42125a001090M51579M15076M814m17313m70639j29320K94210M73116K89877j29777
42115b19467m58294l76838O3494M01583K83790r8393l04308k27956q8438L9891
42105i84936K92471O11888O83690L98599N7794m5867Q020m526q6013q6872J3605
42094H57853R0145M1404j56278m52242o53925m98077L1179N54794O63896L79494
42084H58243O5662o9423j57611l30983m51777l49442j64849k02480m54183n24612
42074a781455j51752L83476N68665K84677j07651k69688k16696j10011O881J22962
42064a270592J34504O080q7854K8548K87453M90607N41006M19239J07980k58105
$$ plain form
42054 398866 44536 -4705 317319 682799 860087 1007053 1331228 1715796 1901046 1832024
42044 1832024 1600846 1247257 877040 772612 1043228 1304378 1088187 512319 154630
42035 154630 268672 526253 607587 631788 805316 981079 856442 430212 18477 -91161
42025 -91161 149067 561815 834242 725762 338445 67177 137916 312375 206941 -205774
42015 -205774 -592832 -682892 -520323 -349102 -400007 -750409 -1241115 -1553218 -1495220 -1191529
42005 -1191529 -895769 -706362 -606562 -663977 -937794 -1224762 -1186632 -798887 -423088 -316951
41995 -316951 -302675 -97186 228235 375071 299643 280815 491111 745707 773654 565182
41985 565182 325464 194208 131237 7124 -295383 -795028 -1309689 -1517721 -1288704 -918076
$$ packed form
42054C98866l54330m9241L22024L65480J77288J46966L24175L84568J85250o9022
42044A832024k31178l53589l70217j04428K70616K61150k16191n75868l57689
42035A54630J14042K57581Q1334K4201J73528J75763j24637m26230m11735j09638
42025i1161K40228M12748K72427j08480l87317k71268P0739J74459j05434m12715
42015b05774l87058r0060J62569J71221n0905l50402m90706l12103N7998L03691
42005a191529K95760J89407R9800n7415k73817k86968L8130L87745L75799J06137
41995c16951J4276K05489L25421J46836p5428j8828K10296K54596K7947k08472
41985E65182k39718j31256o2971j24113l02507m99645n14661k08032K29017L70628
$$ plain form
41975 -918076 -829957 -1014821 -977047 -360073 551954 1134404 1109179 732748 373710 146980
41965 146980 -15550 -164847 -316436 -489938 -661391 -765137 -803817 -853058 -906676 -848236
41955 -848236 -642941 -405403 -188632 99771 412367 412208 -89407 -659960 -585448 266266
41945 266266 1228405 1585855 1278952 737805 309191 86681 87456 274236 477246 564173
41935 564173 651428 905980 1178243 1119400 693048 278309 154549 139838 -89880 -529648
41925 -529648 -906489 -1070570 -1096932 -1072135 -1003527 -929036 -924487 -967332 -928752 -736662 -453167
41914 -453167 -182284 9987 91552 81884 76730 166565 333313 498872 628523 678089 508144
41903 508144 40626 -500769 -708511 -419000 121954 573889 828387 953948 981957 877777
$$ packed form
41975i18076Q8119j84864L7774O16974R12027N82450k5225l76431l59038k26730
41965A46980j62530j49297j51589j73502j71453j03746l8680m9241n3618N8440
41955h48236K05295K37538K16771K88403L12596j59n01615n70553P4512Q51714
41945B66266R62139L57450l06903n41147m28614k22510P75J86780K03010Q6927
41935E64173Q7255K54552K72263n8843m26352m14739j23760j4711k29718m39768
41925e29648l76841j64081k6362K4797O8608P4491M549m2845L8580J92090K83495
41914d53167K70883J92271Q1565r668n154Q9835J66748J65559J29651M9566j69945
41903E08144m67518n41395k07742K89511N40954M51935K54498J25561K8009j04180
$$ plain form
41893 877777 634526 306921 29510 25678 424604 971641 1108709 538077 -385467 -995802
41883 -995802 -989549 -624655 -334758 -327874 -528426 -726877 -746992 -569622 -319004 -95833
41873 -95833 113518 308423 380621 287739 224549 442782 934597 1436962 1708911 1675263
41863 1675263 1369704 908272 476900 187228 -6654 -112972 44270 540054 1031163
41854 1031163 1055289 626267 191424 -29085 -277976 -716037 -1034079 -879525 -397930 -31447
41844 -31447 69719 134455 341417 579719 666038 614599 614467 795547 1053784 1144487 999578
41833 999578 870644 995261 1193611 1072594 629512 296655 279388 245050 -91547 -455639
41823 -455639 -466885 -316172 -506753 -1059419 -1464323 -1407893 -1097625 -799080 -462614 34455
$$ packed form
41893H77777k43251l27605k77411l832L98926N47037J37068n70632r23544o10335
41883i95802O253L64894K89897O884k00552j98451k0115J77370K50618K23171
41873i5833K09351J94905P2198r2882o3190K18233M91815N02365K71949l3648
41863A675263l05559m61432m31372k89672j93882j06318J57242M95784M91109
41854A031163K4126m29022m34843k20509k48891m38061l18042J54554M81595L66483
41844c1447J01166O4736K06962K38302Q6319n1439j32J81080K58237R0703j44909
41833I99578j28934J24617J98350j21017m43082l32857j7267l4338l36597l64092
41823d55639j1246J50713j90581n52666m04904N6430L10268K98545L36466M97069
$$ plain form
41813 34455 592198 1014498 1206646 1109642 654388 -52458 -647412 -777127 -407433 152931
41803 152931 450858 171926 -571083 -1236859 -1355384 -1037997 -780434 -800929 -886577 -895275
41793 -895275 -989201 -1218423 -1279427 -967839 -553508 -378720 -340783 -144425 130312 146062
41783 146062 -87822 -170999 72710 308570 167638 -255555 -563175 -549850 -365454 -253858
41773 -253858 -264197 -235655 -30708 245105 316274 65956 -287358 -423877 -268095 -6927
41763 -6927 172511 249084 309211 414005 490000 317038 -246243 -942228 -1213736 -828521
41753 -828521 -260967 -185966 -662445 -1085313 -917188 -205978 609837 1124546 1156379 795868
41743 795868 366921 145466 61034 -137161 -429561 -523376 -335994 -149787 -161658 -192105
$$ packed form
41813C4455N57743M22300J92148r7004m55254p06846n94954j29715L69694N60364
41803A52931K97927k78932p43009o65776j18525L17387K57563k0495q5648q698
41793h95275r3926k29222o1004L11588M14331J74788L7937J96358K74737J5750
41783A46062k33884q3177K43709K35860j40932m23193l07620J3325J84396J11596
41773b53858j0339K8542K04947K75813P1169k50318l53314j36519J55782K61168
41763f927J79438P6573O0127J04794P5995j72962n63281o95985k71508L85215
41753h28521N67554P5001m76479m22868J68125P11210Q15815N14709L1833l60511
41743G95868m28947k21455q4432j98195k92400r3815J87382J86207j1871l0447
$$ plain form
41733 -192105 -16676 304639 635351 1016343 1455748 1717213 1621189 1371219 1285315 1359873
41723 1359873 1377903 1275850 1097386 768758 292635 14425 260922 783652 1000631 774659
41713 774659 514808 496540 552712 508313 428165 289252 -93140 -589665 -703817 -313168
41703 -313168 -5780 -275190 -787241 -922347 -684021 -496416 -386481 -62380 313108 178678
41693 178678 -490194 -967386 -746624 -187148 101910 39027 -126224 -352918 -676168 -826048
41683 -826048 -507533 48808 286622 71870 -154870 -24873 311469 496244 428034 241789
41673 241789 36958 -160995 -265898 -159349 128283 381923 412156 269023 173162 204430
41663 204430 144012 -251963 -866152 -1299467 -1362779 -1260209 -1188478 -1032347 -684060 -406622
$$ packed form
41733a92105J75429L21315L30712L80992M39405K61465r6024k49970q5904P4558
41723A359873J8030j02053j78464l28628m76123k78210K46497N22730K16979k25972
41713G74659k59851j8268N6172m4399q0148j38913l82392m96525j14152L90649
41703c13168L07388k69410n12051j35106K38326J87605J09935L24101L75488j34430
41693A78678o68872m77192K20762N59476K89058o2883j65251k26694l23250j49880
41683h26048L18515N56341K37814k14752k26740J29997L36342J84775o8210j86245
41673B41789k04831j97953j04903J06549K87632K53640L0233j43133r5861L1268
41663B04430o0418l95975o14189m33315o3312J02570P1731J56131L48287K77438
$$ plain form
41653 -406622 -502961 -749522 -589795 82897 719486 791653 344551 -246743 -738983 -1050136
41643 -1050136 -1131240 -1071921 -1121151 -1350528 -1471273 -1220241 -740975 -314017 103600 728903
41633 728903 1466997 1952057 2041307 1922217 1738004 1467815 1209269 1183988 1332003 1262012
41623 1262012 804678 306838 136517 166206 40096 -254460 -418612 -329846 -163749 -47446
41613 -47446 119944 442181 812938 999765 863752 514918 303874 538848 1090429 1427830
41603 1427830 1224141 754603 456843 307156 17253 -308928 -259935 118710 233360 -162331
41593 -162331 -518911 -318909 91741 13437 -567400 -1035882 -1097918 -1051089 -1093675 -983586
41583 -983586 -592363 -279794 -379576 -679431 -776779 -674930 -630946 -608249 -331230 170743
$$ packed form
41653d06622r6339k46561J59727O72692O36589P2167m47102n91294m92240l11153
41643a050136q1104N9319m9230k29377j20745K51032M79266M26958M17617O25303
41633G28903P38094M85060Q9250j19090j84213k70189k58546k5281J48015o9991
41623A262012m57334m97840j70321K9689j26110k94556j64152Q8766J66097J16303
41613d7446J67390L22237L70757J86827j36013l48834k11044K34974N51581L37401
41603A427830k03689m69538k97760j49687k89903l26181M8993L78645J14650l95691
41593a62331l56580K00002M10650p8304n80837m68482o2036M6829m2586J10089
41583i83586L91223L12569r9782k99855r7348J01849M3984K2697K77019N01973
$$ plain form
41573 170743 507647 489914 386054 474630 632963 583389 341599 165952 151075 97355
41563 97355 -222153 -813165 -1465768 -1882601 -1826625 -1295159 -576734 -22735 267225 452142
41553 452142 668703 893466 1090025 1286210 1407861 1233389 695858 92773 -223109 -276603
41543 -276603 -361085 -559339 -664681 -600903 -603222 -836136 -1081766 -1013101 -612219 -126519
41533 -126519 244167 412639 295845 -95110 -510211 -656620 -555102 -514028 -734568 -1097353
41523 -1097353 -1336310 -1268484 -864526 -262851 272877 550234 597425 507151 226839 -292261
41513 -292261 -825768 -1045190 -944684 -812622 -777397 -711414 -621994 -735626 -1038571 -1124973
41503 -1124973 -767958 -323120 -241552 -422287 -393868 23341 562346 895940 882382 543582
$$ packed form
41573A70743L36904j7733j03860Q8576J58333m9574k41790j75647j4877n3720
41563I7355l19508n91012o52603m16833N5976N31466P18425N53999K89960J84917
41553D52142K16561K24763J96559J96185J21651j74472n37531o03085l15882n3494
41543b76603q4482j98254j05342O3778k319k32914k45630O8665M00882M85700
41533a26519L70686J68472j16794l90955m15101j46409J01518M1074k20540l62785
41523a097353k38957O7826M03958O01675N35728K77357M7191r0274k80312n19100
41513b92261n33507k19422J00506J32062L5225O5983Q9420j13632l02945q6402
41503a124973L57015M44838Q1568j80735K8419M17209N39005L33594j3558l38800
$$ plain form
41493 543582 101786 -55183 259362 775226 1134843 1375819 1711536 1977148 1750921 1019399
41483 1019399 284467 -68409 -138286 -178006 -272696 -443701 -700774 -875146 -774458 -621032
41473 -621032 -900270 -1580599 -1960249 -1615772 -1062496 -1022298 -1389536 -1479216 -1088399 -706353
41463 -706353 -716213 -963701 -1207577 -1477209 -1760806 -1746322 -1193219 -348392 276211 436369
41453 436369 299776 172357 239142 488931 739816 768770 515808 144829 -134614 -247925
41443 -247925 -226917 -92640 160447 516850 929711 1312790 1520378 1420935 1050507 625123
41433 625123 331912 157980 -9515 -170898 -206115 -78063 55136 -977 -232407 -400611
41423 -400611 -299893 15034 313398 461792 512366 521109 425153 184895 -73374 -195448
$$ packed form
41493E43582m41796j56969L14545N15864L59617K40976L35717K65612k26227p31522
41483A019399p34932l52876o9877l9720r4690j71005k57073j74372J00688J53426
41473f21032k79238o80329l79650L44477N53276M0198l67238q9680L90817L82046
41463g06353r860k47488k43876k69632k83597J4484N53103Q44827O24603J60158
41453D36369j36593j27419O6785K49789K50885K8954k52962l70979k79443j13311
41443b47925K1008J34277K53087L56403M12861L83079K07588r9443l70428m25384
41433F25123k93211j73932j67495j61383l5217J28052J33199n6113k31430j68204
41423d00611J00718L14927K98364J48394N0574Q743r5956k40258k58269j22074
$$ plain form
41413 -195448 -208210 -239135 -270148 -150202 127549 320447 174088 -329244 -983467 -1499509
41403 -1499509 -1604526 -1172270 -387988 309928 604211 600965 657631 924820 1174498 1120128
41393 1120128 813617 623290 818490 1259964 1567283 1556827 1412898 1402622 1535279 1600976
41383 1600976 1468601 1197584 868394 464549 -14497 -446217 -695976 -772808 -773896 -705807
41373 -705807 -472098 -63460 325468 442594 223341 -167804 -537679 -832463 -1068646 -1183296
41363 -1183296 -1075155 -785408 -518084 -443946 -561265 -747930 -830365 -612359 -55413 483773
41353 483773 450573 -245919 -947213 -916419 -205785 452629 578244 406487 371282 509782
41343 509782 603343 630950 760367 980592 1015294 638349 -55174 -716745 -1032218 -968202
$$ packed form
41413a95448j2762l0925l1013J19946K77751J92898j46359n03332o54223n16042
41403a499509j05017M32256P84282O97916K94283l246N6666K67189K49678n4370
41393A120128l06511j90327J95200M41474L07319j0456j43929j0276J32657O5697
41383A600976j32375k71017l29190m03845m79046m31720k49759p6832j088O8089
41373g05807K33709M08638L88928J17126k19253l91145l69875k94784k36183j14650
41363a183296J08141K89747K67324P4138j17319j86665q2435K18006N56946N39186
41353D83773l3200o96492p01294L0794P10634O58414J25615j71757l5205J38500
41343E09782R3561K7607J29417K20225L4702l76945o93523o61571l15473O4016
$$ plain form
41333 -968202 -763979 -642338 -554418 -319615 26390 242808 272502 348010 579110 704714
41323 704714 480973 89489 -135311 -215299 -412621 -694808 -712068 -346354 75325 244360
41313 244360 264313 417808 757511 1102476 1278390 1206100 904469 570933 515010 808031
41303 808031 1095270 971773 496991 123834 130616 349280 499159 546058 569910 457527
41293 457527 5971 -666323 -1066836 -849552 -272445 57369 -118656 -449414 -462781 -139085
41283 -139085 135683 53754 -368319 -939667 -1438079 -1604902 -1289804 -734531 -472655 -723552
41273 -723552 -1043155 -844983 -189618 246044 11122 -593832 -944853 -800105 -390868 495
41263 495 287539 473415 553292 555064 505404 335424 -13147 -369040 -422294 -116552 236006
$$ packed form
41333i68202K04223J21641Q7920K34803L46005K16418K9694P5508K31100J25604
41323G04714k23741l91484k24800p9988j97322k82187j7260L65714M21679J69035
41313B44360J9953J53495L39703L44965J75914p2290l01631l33536n5923K93021
41303H08031K87239j23497m74782l73157O782K18664J49879M6899K3852j12383
41293D57527m51556o72294m00513K17284N77107L29814j76025l30758j3367L23696
41283a39085K74768q1929m22073n71348m98412j66823L15098N55273K61876k50897
41273g23552l19603J98172O55365M35662k34922o04954l51021J44748M09237L91363
41263D95K87044J85876P9877J772m9660j69980l48571l55893n3254L05742L52558
$$ plain form
41252 236006 354969 335088 423483 610936 683265 593955 518271 547284 596129 666275 922288
41241 922288 1359639 1621502 1373110 742091 173752 -80071 -111178 -35474 200811 590870
41231 590870 858337 706740 234488 -104979 -25876 257422 360583 285595 393491 786472
41221 786472 1023542 704547 137497 29337 525283 970890 781531 177171 -232703 -303368
41211 -303368 -387139 -646148 -776001 -471966 159874 764479 1063230 924507 360925 -384010
41201 -384010 -921457 -1048578 -887826 -616163 -236806 239905 581789 549293 246722 22027
41191 22027 23879 65836 -36572 -189343 -179646 22868 257388 405250 502288 606962 648796
41180 648796 471428 14113 -581255 -1049349 -1188260 -1001888 -701391 -548700 -616442 -667653
$$ packed form
41252B36006J18963j9881Q8395J87453P2329q9310p5684K9013M8845P0146K56013
41241I22288M37351K61863k48392o31019n68339k53823l1107P5704K36285L90059
41231E90870K67467j51597m72252l39467P9103K83298J03161p4988J07896L92981
41221G86472K37070l18995n67050j08160M95946M45607j89359o04360m09874p0665
41211c03368q3771k59009j29853L04035O31840O04605K98751j38723n63582p44935
41201c84010n37447j27121J60752K71663L79357M76711L41884l2496l02571k24695
41191B2027J852M1957j02408j52771R697K02514K34520J47862R7038J04674M1834
41180F48796j77368m57315n95368m68094j38911J86372L00497J52691o7742n1211
$$ plain form
41170 -667653 -359130 342860 1004293 1119900 683191 225987 216919 525192 597741 113356
41160 113356 -675463 -1251475 -1343113 -1066837 -694378 -437477 -416687 -628333 -852789 -771061
41150 -771061 -350649 -386 -105622 -469956 -526705 -139646 170712 -19297 -408723 -434966
41140 -434966 -104158 91755 -37303 -183296 -158523 -196677 -446858 -612466 -410685 -69238
41130 -69238 4395 -154575 -150154 174097 561138 731882 643163 346870 -116150 -592743
41120 -592743 -800950 -569618 -21563 519027 754981 612129 322229 247817 476603 650101
41110 650101 377085 -227543 -636053 -544435 -196399 -25887 -181973 -490884 -711620 -720203
41100 -720203 -567061 -440732 -473019 -539490 -402247 -107053 -45874 -487696 -1196614 -1682300
$$ packed form
41170f67653L08523P01990O61433J15607m36709m57204r068L08273P2549m84385
41160A13356p88819n76012r1638K76276L72459K56901K0790k11646k24456Q1728
41150g71061M20412L50263j05236l64334n6749L87059L10358j90009l89426k6243
41140d34966L30808J95913j29058j45993K4773l8154k50181j65608K01781L41447
41130f9238P3633j58970M421L24251L87041J70744q8719k96293m63020m76593
41120e92743k08207K31332N48055N40590K35954j42852k89900p4412K28786J73498
41110F50101k73016o04628m08510R1618L48036J70512j56086l08911k20736q583
41100g20203J53142J26329l2287o6471J37243K95194O1179m41822p08918m85686
$$ plain form
41090 -1682300 -1722732 -1463540 -1085918 -606543 -35535 446631 585950 301384 -193808 -513916
41080 -513916 -397950 39486 381635 326537 32179 -46278 316632 857593 1159272 1140395
41070 1140395 1055031 1033194 858317 346922 -235520 -428975 -206533 -4911 -31683 93479
41060 93479 734617 1573267 1961401 1785105 1503962 1361769 1077835 457406 -181901 -479790
41050 -479790 -550017 -681578 -817018 -720393 -464481 -339152 -371746 -307371 -16350 396649
41040 396649 821518 1154944 1170699 768505 310821 273082 529843 452753 -181478 -873324
41030 -873324 -1181531 -1299100 -1495112 -1463927 -796723 162152 553411 71692 -719831 -1205067
41020 -1205067 -1376193 -1513053 -1606761 -1418224 -926463 -436625 -257589 -404488 -621689 -662693
$$ packed form
41090a682300m0432K59192L77622M79375N71008M82166J39319k84566m95192l20108
41080e13916J15966M37436L42149n5098k94358p8457L62910N40961L01679j8877
41070A140395q5364k1837j74877n11395n82442j93455K22442K01622k6772J25162
41060I3479O41138Q38650L88134j76296k81143j42193k83934o20429o39307k97889
41050d79790p0227j31561j35440R6625K55912J25329l2594O4375K91021M12999
41040C96649M24869L33426J5755m02194m57684l7739K56761p7090o34231o91846
41030h73324l08207j17569j96012L1185O67204R58875L91259m81719p91523m85236
41020a205067j71126j36860r3708J88537M91761M89838J79036j46899k17201m1004
$$ plain form
41010 -662693 -561264 -581866 -833454 -1037837 -864620 -423564 -159314 -252427 -424159 -423755
41000 -423755 -398585 -584001 -884463 -1039292 -1037536 -1064942 -1122003 -1003388 -663046 -321596
40990 -321596 -128672 65921 475620 1039019 1434862 1378817 859691 164551 -281062 -196856
40980 -196856 326918 915045 1272384 1431134 1598317 1828376 1950833 1812534 1478689 1129800
40970 1129800 824655 465323 -7796 -484264 -780943 -787560 -482626 56750 548676 570456
40960 570456 -12223 -720164 -857301 -302571 351497 549882 375662 215305 125296 -124616
40950 -124616 -542140 -827077 -769235 -431956 42185 518218 773437 635081 263378 7883
40940 7883 -78870 -294204 -780451 -1284267 -1544700 -1608360 -1588182 -1420640 -1104712 -915555
$$ packed form
41010f62693J01429k0602k51588k04383J73217M41056K64250r3113j71732M04
41000d23755K5170j85416l00462j54829J756k7406n7061J18615L40342L41450
40990c21596J92924J94593M09699N63399L95843n6045n19126o95140m45613Q4206
40980a96856N23774N88127L57339J58750J67183K30059J22457j38299l33845l48889
40970A129800l05145l59332m73119m76468k96679o617L04934N39376M91926K1780
40960E70456n82679p07941j37137N54730O54068J98385j74220j60357r0009k49912
40950a24616m17524k84937N7842L37279M74141M76033K55219j38356l71703k55495
40940G883q6753k15334m86247n03816k60433o3660K0178J67542L15928J89157
$$ plain form
40930 -915555 -1084152 -1439666 -1633339 -1566186 -1358367 -1068231 -707191 -372696 -91748 295875
40920 295875 788159 944454 369812 -634966 -1360092 -1596083 -1793972 -2276035 -2769115
40911 -2769115 -2877061 -2581904 -2055760 -1369384 -674019 -334496 -522610 -892002 -982101 -785196
40901 -785196 -632471 -694911 -904092 -1195581 -1468367 -1432290 -919044 -308074 -198747 -586419
40891 -586419 -783919 -324208 441302 886742 907782 821690 729111 445985 6231 -247431
40881 -247431 -200183 -205172 -553226 -996391 -1109954 -918121 -761211 -631000 -122044 832340
40871 832340 1619857 1658557 1152406 756976 679367 563978 225633 2939 229195 735873
40861 735873 1118445 1217746 1091687 754019 251841 -149087 -185048 40754 173780 70424
$$ packed form
40930i15555j68597l55514j93673O7153K07819K90136L61040L34495K80948L87623
40920B95875M92284J56295n74642j004778p25126k35991j97889m82063m93080
40911b769115j07946K95157N26144O86376O95365L39523j88114l69392r0099J96905
40901g85196J52725o2440k09181k91489k72786L6077N13246O10970J09327l87672
40891e86419j97500M59711P65510M45440K1040q6092r2579k83126m39754k53662
40881b47431M7248m989l48054m43165j13563J91833J56910J30211N08956R54384
40871H32340P87517L8700n06151l95430p7609j15389l38345k22694K26256N06678
40861G35873L82572R9301j26059l37668n02178m00928l5961K25802J33026j03356
$$ plain form
40851 70424 -74422 -34557 234354 666044 1125797 1372497 1234904 891544 746727 937380
40841 937380 1170810 1151600 946493 770832 622667 363696 40338 -125733 -30517 229806
40831 229806 540846 831399 961595 785213 400593 143379 202946 389089 417300 295795
40821 295795 238765 275021 193407 -76956 -252228 -17269 535664 953138 898444 475374
40811 475374 58559 -113422 -119416 -163031 -281661 -330754 -265940 -311000 -691401 -1246155 -1517299
40800 -1517299 -1277734 -762612 -277364 176024 669955 987293 854014 444447 255854
40791 255854 442913 642761 563626 387100 392450 496672 443459 232329 76261 75467 184406
40780 184406 377190 600361 676121 508105 295126 296929 479733 644847 792903 1043234
$$ packed form
40851G0424j44846L9865K68911M31690M59753K46700j37593l43360j44817J90653
40841I37380K33430j9210k05107j75661j48165k58971l23358j66071R5216K60323
40831B29806L11040K90553J30196j76382l84620k57214N9567J86143K8211j21505
40821B95795n7030L6256q1614k70363j75272K34959N52933M17474n4694m23070
40811D75374m16815j71981n994m3615j18630m9093O4814m5060l80401n54754k71144
40800a517299K39565N15122M85248M53388M93931L17338j33279m09567j88593
40791B55854J87059J99848p9135j76526N350J04222n3213k11130j56068p94J08939
40780A84406J92784K23171P5760j68016k12979J803J82804J65114J48056K50331
$$ plain form
40770 1043234 1277887 1252758 1062776 1085806 1365925 1450306 1037050 445152 175671 277575
40760 277575 455389 581767 714578 718750 328999 -314212 -572279 -15099 976721 1601308
40750 1601308 1548678 1225226 1043936 852946 334804 -274859 -330380 328901 1043048 1097002
40740 1097002 523966 -95351 -361680 -269224 76287 530358 805876 721427 539957 675193
40730 675193 1062022 1230075 1040652 886645 1014183 1101500 776792 184433 -276768 -486462
40720 -486462 -546329 -426179 -18201 588357 1175458 1635040 1916959 1887766 1490514 924234
40710 924234 444742 121454 -19931 160754 643698 1018033 886120 383706 -30227 -174902
40700 -174902 -185610 -93006 181094 452692 385082 42831 -96605 189158 583923 777034
$$ packed form
40770A043234K34653k5129j89982K3030K80119Q4381m13256n91898k69481J01904
40760B77575J77814J26378J32811M172l89751o43211k58067N57180R91820O24587
40750A601308n2630l23452j81290j90990n18142o09663n5521O59281P14147N3954
40740A097002n73036o19317k66329R2456L45511M54071K75518q4449j81470J35236
40730F75193L86829J68053j89423j54007J27538Q7317l24708n92359m61201k09694
40720d86462n9867J20150M07978O06558N87101M59582K81919k9193l97252n66280
40710I24234m79492l23288j41385J80685M82944L74335j31913n02414m13933j44675
40700a74902j0708R2604K74100K71598o7610l42251j39436K85763L94765J93111
$$ plain form
40690 777034 898060 1156792 1374969 1209574 664389 82205 -279171 -420321 -405020 -214063
40680 -214063 176760 696230 1197125 1543349 1672610 1567104 1173548 469246 -300739 -614330
40670 -614330 -153808 746716 1394284 1489197 1344773 1354564 1539149 1697593 1712879 1569777
40660 1569777 1324527 1200197 1449653 1935588 2096363 1582318 749389 263424 340052 624820
40650 624820 726395 593339 383550 224533 197228 405116 915141 1617410 2216170 2474795
40640 2474795 2508225 2674434 3032109 3106567 2512067 1659221 1347248 1622473 1617562 783749
40630 783749 -243699 -462070 186662 859155 967455 740622 659573 819714 978399 924597
40620 924597 671143 431678 426771 610846 687347 518541 327681 293731 195153 -220115
$$ packed form
40690G77034J21026K58732K18177j65395n45185n82184l61376j41150J5301J90957
40680b14063L90823N19470N00895L46224J29261j05506l93556p04302p69985l13591
40670f14330M60522R00524O47568R4913j44424R791J84585J58444J5286j43102
40660A569777k45250j24330K49456M85935J60775n14045q32929m85965P6628K84768
40650F24820J01575j33056k09789j59017k7305K07888N10025P02269N98760K58625
40640B474795L3430J66209L57675P4458n94500q52846l11973K75225m911q33813
40630G83749j027448k18371O48732O72493J08300k26833q1049J60141J58685n3802
40620I24597k53454k39465m907J84075P6501j68806j90860l3950r8578m15268
$$ plain form
40610 -220115 -729871 -909984 -757317 -601334 -501601 -204781 345372 925864 1444307 1958828
40600 1958828 2302787 2207771 1827329 1589529 1476952 1076694 466885 326520 852494 1277064
40590 1277064 953631 317521 167758 490851 684047 579024 505585 562677 564814 608147
40580 608147 968561 1436745 1448523 979223 664758 846750 1082459 861392 288606 -261150
40570 -261150 -711226 -1116407 -1283422 -998136 -441275 -4016 200464 341398 480217 461782
40560 461782 174007 -287795 -712074 -918460 -883270 -807718 -937310 -1206435 -1232246 -831095
40550 -831095 -374578 -392285 -918458 -1478986 -1673920 -1524108 -1249940 -968269 -690313 -419250
40540 -419250 -119264 293562 795300 1141745 1045582 511007 -66943 -225517 103047 503776
$$ packed form
40610b20115n09756j80113J52667J55983R9733K96820N50153N80492N18443N14521
40600A958828L43959r5016l80442k37800j12577m00258o09809j40365N25974M24570
40590A277064l23433o36110j49763L23093J93196j05023p3439N7092K137M3333
40580F08147L60414M68184J1778m69300l14465J81992K35709k21067n72786n49756
40570b61150m50076m05181j67015K85286N56861M37259K04480J40934J38819j8435
40560D61782k87775m61802m24279k06386L5190P5552j29592k69125k5811M01151
40550h31095M56517j7707n26173n60528j94934J49812K74168K81671K77956K71063
40540d19250K99986M12826N01738L46445r6163n34575n77950j58574L28564M00729
$$ plain form
40530 503776 521775 139837 -299128 -582176 -810444 -1055799 -1112080 -787192 -255093 136061
40520 136061 302060 417581 548506 579577 507789 513648 662036 786160 781905 783639 896662
40509 896662 975132 879219 781967 953401 1320931 1507818 1297317 833216 360473 4788
40499 4788 -158929 -86125 75543 43426 -216129 -377823 -239468 -87935 -262519 -523796
40489 -523796 -310682 383380 888165 778099 451637 467518 699869 638942 287746 177028
40479 177028 524961 929950 991842 748363 341053 -259793 -933171 -1264594 -1098194 -868452
40469 -868452 -963559 -1078126 -698800 14604 421075 347598 224786 281372 255572 51262
40459 51262 39702 396801 692088 567472 387535 696545 1317499 1537890 1066298 333045
$$ packed form
40530E03776J7999l81938m38965k83048k28268k45355n6281L24888N32099L91154
40520A36061J65999J15521J30925L1071p1788N859J48388J24124m255J734J13023
40509H96662P8470r5913r7252J71434L67530J86887k10501m64101m72743l55685
40499D788j63717P2804J61668l2117k59555j61694J38355J51533j74584k61277
40489e23796K13114O94062N04785j10066l26462J5881K32351o0927l51196j10718
40479A77028L47933M04989O1892k43479m07310o00846o73378l31423J66400K29742
40469h68452r5107j14567L79326P13404M06471p3477j22812N6586k5800k04310
40459E1262j1560L57099K95287j24616j79937L09010O20954K20391m71592p33253
$$ plain form
40449 333045 -96251 8414 592700 1397169 1964871 1967258 1588454 1266029 1057578 663205
40439 663205 97370 -169542 68257 360190 254261 -28128 18843 383398 600397 519578
40429 519578 535783 965055 1548022 1775757 1532792 1218767 1256712 1600226 1797137 1528426
40419 1528426 965801 481018 128424 -295052 -691626 -580239 213556 1133642 1506069
40410 1506069 1340991 1142705 1111601 1007533 736331 560518 635055 763132 764221 718093
40400 718093 675497 482072 117464 -98185 91961 505381 812421 1003979 1292919 1709413
40390 1709413 2076953 2284855 2326962 2153395 1735503 1239114 926956 907963 1104483 1363126
40380 1363126 1461472 1179987 594279 147394 166176 426712 481679 296682 222193 412998
$$ packed form
40449C33045m29296J04665N84286Q04469N67702K387l78804l22425k08451l94373
40439F63205n65835k66912K37799K91933j05929k82389M6971L64555K16999q0819
40429E19578J6205M29272N82967K27735k42965l14025L7945L43514J96911k68711
40419A528426n62625m84783l52594m23476l96574J11387P93795R20086L72427
40410A506069j65078j98286l1104j04068k71202j75813P4537J28077J089m6128
40400G18093m2596j93425l64608k15649J90146M13420L07040J91558K88940M16494
40390A709413L67540K07902M2107j73567m17892m96389l12158j8993J96520K58643
40380A363126R8346k81485n85708m46885J8782K60536N4967j84997p4489J90805
$$ plain form
40370 412998 658258 783393 844521 881611 846373 853192 1135426 1631098 1961462 1965106 1900514
40359 1900514 1944931 1875308 1510410 1110651 986838 1003162 873352 720713 872348 1217380
40349 1217380 1274939 928727 637795 772497 1103564 1162977 853690 455365 175831 -40637
40339 -40637 -261931 -327091 -5077 609316 1009245 772192 120561 -272930 -135415 55281
40329 55281 -190725 -598202 -532687 -9032 280606 -1731 -337231 -112339 575410 1205528
40319 1205528 1555828 1713516 1628480 1165604 543101 265470 537749 1052986 1414411 1473343
40309 1473343 1189795 511592 -394975 -1045039 -1059623 -614461 -247370 -244975 -398418 -364052
40299 -364052 -82777 238032 435801 546270 653013 695467 512975 66808 -463136 -849371
$$ packed form
40370D12998K45260J25135O1128L7090l5238O819K82234M95672L30364L644o4592
40359A900514M4417o9623l64898l99759j23813J6324j29810j52639J51635L45032
40349A217380N7559l46212k90932J34702L31067N9413l09287l98325k79534k16468
40339d0637k21294o5160L22014O14393L99929k37053o51631l93491J37515J90696
40329E5281k46006m07477O5515N23655K89638k82337l35500K24892O87749O30118
40319A205528L50300J57688q5036m62876o22503k77631K72279N15237L61425N8932
40309A473343k83548o78203r06567o50064j4584M45162L67091K395j53443L4366
40299c64052K81275L20809J97769J10469J06743M2454j82492m46167n29944l86235
$$ plain form
40289 -849371 -1037519 -1136298 -1225953 -1269320 -1212736 -1077516 -917306 -768157 -686595 -750142 -942941
40278 -942941 -1111544 -1133745 -1079004 -1075800 -1040702 -693377 104550 1132981 1998469 2449986
40268 2449986 2459327 2117347 1593824 1137860 939686 943678 889377 579249 61988 -441601
40258 -441601 -726452 -727630 -543248 -343353 -195977 -9076 277314 508623 481982 258213
40248 258213 102232 107653 127573 133495 340694 810644 1221457 1301287 1243830 1348068 1447580
40237 1447580 1153319 580767 309828 523396 677369 278167 -403129 -736553 -582735
40228 -582735 -346204 -315494 -345786 -222069 -29114 -17748 -226811 -349043 3122 861440
40218 861440 1757511 2159905 2085376 2070351 2443137 2883975 2910305 2542553 2165746 1920003
$$ packed form
40289h49371j88148r8779q9655m3367N6584J35220J60210J49149Q1562o3547j92799
40278i42941j68603k2201N4741L204L5098L47325P97927J028431Q65488M51517
40268B449986R341l41980n23523m55964j98174L992n4301l10128n17261n03589
40258d41601k84851j178J84382J99895J47376J86901K86390K31309k6641k23769
40248B58213j55981N421J9920N922K07199M69950M10813P9830n7457J04238R9512
40237A447580k94261n72552k70939K13568J53973l99202o81296l33424J53818
40228e82735K36531L0710l0292J23717J92955J1366k09063j22232L52165Q58318
40218H61440Q96071M02394p4529j5025L72786M40838K6330l67752l76807k45743
$$ plain form
40208 1920003 1643656 1343193 1253975 1363255 1304393 911479 524795 492595 649119 595473
40198 595473 319282 208360 511525 1057080 1497255 1613438 1373967 898163 428932 204794
40188 204794 281690 522622 745685 811663 627603 220856 -181184 -297273 -84089 213013
40178 213013 352205 349586 389802 584684 918053 1354817 1855799 2272508 2364126 2022709
40168 2022709 1442664 975308 808174 852727 947763 1060358 1207284 1272167 1064541 576626
40158 576626 52061 -256327 -305385 -192877 12069 265412 459631 483999 367253 257057
40148 257057 252052 332888 454372 618072 837288 1090822 1312505 1382473 1184598 777618
40138 777618 449813 422712 512241 329917 -95589 -177249 512009 1577921 2198025 2101305
$$ packed form
40208A920003k76347l00463q9218J09280n8862l92914l86684l2200J56524n3646
40198E95473k76191j10922L03165N45555M40175J16183k39471m75804m69231k24138
40188B04794P6896K40932K23063O5978j84060m06747m02040j16089K13184K97102
40178B13013J39192k619M0216J94882L33369M36764N00982M16709R1618l41417
40168B022709n80045m67356j67134M4553R5036J12595J46926O4883k07626m87915
40158E76626n24565l08388m9058J12508K04946K53343J94219K4368j16746j10196
40148B57057n005Q0836J21484J63700K19216K53534K21683O9968j97875m06980
40138G77618l27805k7101Q9529j82324m25506q1660O89258J065912O20104r6720
$$ plain form
40128 2101305 1791071 1768996 1945784 2005376 1970076 2030450 2040115 1649118 928673 438669
40118 438669 530376 892155 992158 760204 599828 835063 1354191 1775319 1834674 1623559
40108 1623559 1491531 1644899 1818146 1513975 674997 -78829 -97518 535623 1128596 1195599
40098 1195599 881585 591879 501926 545243 654365 815785 964492 967344 727780 301626
40088 301626 -58278 -31608 462637 1097489 1421234 1329107 1120434 1084156 1206560 1334750
40078 1334750 1429049 1525298 1581352 1508918 1311009 1110144 1074035 1311055 1735530 2035355
40068 2035355 1919675 1431690 884989 501061 305048 362144 802733 1506052 2067088 2265749
40058 2265749 2305759 2394532 2389187 2137178 1864917 1835748 1852451 1562742 1113799 987054
$$ packed form
40128B101305l10234k2075J76788N9592l5300O0374R665l90997p20445m90004
40118D38669R1707L61779J00003k31954j60376K35235N19128M21128N9355k11115
40108A623559j32028J53368J73247l04171q38978p53826j8689O33141N92973O7003
40098A195599l14014k89706q9953M3317J09122J61420J48707K852k39564m26154
40088C01626l59904K6670M94245O34852L23745r2127k08673l6278J22404J28190
40078A334750R4299R6249N6054p2434j97909k00865l6109K37020M24475K99825
40068B035355j15680m87985n46701l83928j96013N7096M40589P03319N61036J98661
40058B265749M0010Q8773n345k52009k72261k9169J6703k89709m48943j26745
$$ plain form
40048 987054 1221584 1342806 1149054 1049254 1411165 2018745 2459113 2680347 2822865 2778028
40038 2778028 2322387 1581624 1016653 938688 1234315 1556653 1657523 1574132 1574186 1833459
40028 1833459 2121650 1986955 1353615 719295 583301 875890 1166216 1241328 1202985 1142458
40018 1142458 1055196 1028034 1195800 1488890 1679656 1723433 1843027 2222445 2777302 3261290
40008 3261290 3479961 3425673 3339332 3576334 4227209 4926098 5240976 5194389 5148811 5219264
39998 5219264 5112593 4599922 3860432 3244081 2912422 2814988 2826784 2813720 2724686 2675311
39988 2675311 2779589 2905505 2833266 2644143 2622710 2724130 2545736 2012297 1699879 2169133
39978 2169133 3255061 4329521 5020224 5333793 5314510 5038449 4849341 5148799 5905900
$$ packed form
40048I87054K34530J21222j93752r9800L61911O07580M40368K21234J42518m4837
40038B778028m55641p40763n64971p7965K95627L22338J00870q3391N4K59273
40028A833459K88191j34695o33340o34320j35994K92589K90326P5112l8343o0527
40018A142458q7262k7162J67766K93090J90766M3777J19594L79418N54857M83988
40008C261290K18671n4288q6341K37002O50875O98889L14878m6587m5578P0453
39998E219264j06671n12671p39490o16351l31659r7434J1796j3064q9034m9375
39988B675311J04278J25916p2239j89123k1433J01420j78394n33439l12418M69254
39978B169133J085928J074460O90703L13569j9283k76061j89108K99458P57101
$$ plain form
39969 5905900 6707988 7350795 8086930 9206263 10595251 11799820 12399258 12352772 12165944
39960 12165944 12642475 14146031 16015732 16962860 16216476 14191626 11986753 10366194
39952 10366194 9307651 8405375 7533737 7024410 7186998 7783575 8190378 8091314 7758933
39943 7758933 7573130 7581825 7712731 8038659 8483486 8593962 8085663 7408232 7257415 7667474
39933 7667474 8129110 8503869 9184052 10301046 11411618 12163877 12736351 13365603 13896328
39924 13896328 14099744 14110606 14288837 14863166 15834519 17009613 18111184 19130516 20525419
39915 20525419 22743678 25659458 28849825 32202979 35764382 39310019 42744729 46562669
39907 46562669 51135804 56113094 61630859 69414708 81196045 97108147 118072664 148193544
$$ packed form
39969E905900Q02088O42807P36135J119333J388988J204569N99438m6486j86828
39960A2165944M76531J503556J869701R47128p46384k024850k204873j620559
39952A0366194j058543r02276q71638n09327J62588N96577M06803r9064l32381
39943G758933j85803Q695J30906L25928M44827J10476n08299o77431j50817M10059
39933G667474M61636L74759O80183J116994J110572P52259N72474O29252N30725
39924A3896328K03416J0862J78231N74329R71353J175094J101571J019332J394903
39915B0525419K218259K915780L190367L353154L561403L545637L434710L817940
39907D6562669M573135M977290N517765P783849J1781337J5912102K0964517L0120880
$$ plain form
39899 148193544 189303864 231492737 254778907 245803743 211254792 170729400 138026286
39892 138026286 113787928 94212212 79265954 70146188 64707380 59839689 55443607
39885 55443607 52629370 50296310 46721771 42754869 40369125 39387959 38426117 37845639
39877 37845639 39011404 41644908 44602364 48315318 53748768 59865521 64971968 69764272
39869 69764272 76150878 84038844 92647552 104147683 122276128 148415153 183742126
39862 183742126 233614667 301021463 372237549 417052388 411958148 361995616 294786294
39855 294786294 234922728 189205947 153914538 126766654 107965689 95607594 86089310
39848 86089310 77806663 71063863 65222571 58669471 51203194 44254262 38733118 34214653
$$ packed form
39899A48193544M1110320M2188873K3286170q975164l4548951m0525392l2703114
39892A38026286k4238358j9575716j4946258r119766n438808m867691m396082
39885E5443607k814237k333060l574539l966902k385744r81166r61842n80478
39877C7845639J165765K633504K957456L712954N433450O116753N106447M792304
39869F9764272O386606P887966Q608708J1500131J8128445K6139025L5326973
39862A83742126M9872541O7406796P1216086M4814839n094240m9962532o7209322
39855B94786294n9863566m5716781l5291409k7147884j8800965j2358095r518284
39848H6089310q282647o742800n841292o553100p466277o948932n521144m518465
$$ plain form
39840 34214653 30217499 26920238 24439167 22425640 20609583 19026534 17569485 15925305
39832 15925305 14125051 12702163 12111696 12246256 12640768 13011444 13510215 14422064 15560317
39823 15560317 16115000 15412480 13783018 12277536 11485373 11069972 10550162 9987417 9640441
39814 9640441 9459217 9338008 9489980 10102012 10843206 11135279 10777231 9979014 8940675
39805 8940675 7755660 6630116 5836237 5426252 5224426 5108781 5123000 5307821 5563322
39796 5563322 5713375 5680935 5632822 5909018 6649548 7481960 7782094 7315162 6441878 5638742
39786 5638742 5035224 4517616 4047980 3687486 3427288 3148455 2711443 2078138 1455243
39777 1455243 1260485 1717128 2482125 2928878 2823979 2470325 2187235 1994348 1870449
$$ packed form
39840C4214653l997154l297261k481071k013527j816057j583049j457049j644180
39832A5925305j800254j422888n90467J34560L94512L70676M98771R11849J138253
39823A5560317N54683p02520j629462j505482p92163m15401n19810n62745l46976
39814I640441j81224j21209J51972O12032P41194K92073l58048p98217j038339
39805H940675j185015j125544p93879m09985k01826j15645J4219J84821K55501
39796E563322J50053l2440m8113K76196P40530Q32412L00134m66932q73284q03136
39786E638742o03518n17608m69636l60494k60198k78833m37012o33305o22895
39777A455243j94758M56643P64997M46753j04899l53654k83090j92887j23899
$$ plain form
39768 1870449 1938808 2225272 2538727 2745138 2875402 2866786 2575190 2187703 2182030 2639166
39758 2639166 3060024 3210395 3678091 5062683 6937591 8229916 8492571 8221007 7939818
39749 7939818 7560282 6807118 5827650 5066329 4722469 4576634 4332210 4000752 3862701
39740 3862701 4016041 4095196 3677255 2941291 2572666 2886930 3397640 3470253 3078797 2653521
39730 2653521 2519890 2825323 3674819 4876001 5797297 5976669 5710062 5576392 5575899 5291164
39720 5291164 4751482 4470701 4605375 4713344 4483156 4127468 3859386 3519739 2995222
39711 2995222 2539336 2365288 2304805 2177389 2150613 2416573 2821428 3143630 3458472 3876365
39701 3876365 4164989 4026935 3606844 3358322 3486622 3826274 4197929 4598634 5077004
$$ packed form
39768A870449O8359K86464L13455K06411J30264q616k91596l87487n673M57136
39758B639166M20858J50371M67696J384592J874908J292325K62655k71564k81189
39749G939818l79536p53164r79468p61321l43860j45835k44424l31458j38051
39740C862701J53340P9155m17941p35964l68625L14264N10710P2613l91456m25276
39730B653521j33631L05433Q49496J201182R21296J79372k66607j33670m93k84735
39720E291164n39682k80781J34674J07969k30188l55688k68082l39647n24517
39711B995222m55886j74048o0483j27416k6776K65960M04855L22202L14842M17893
39701C876365K88624j38054m20091k48522J28300L39652L71655M00705M78370
$$ plain form
39692 5077004 5654330 6313153 6852176 6856073 6088926 4877646 3842029 3256852 2918836
39683 2918836 2611728 2399100 2387310 2460271 2390386 2060419 1482280 744171 46325 -330533
39673 -330533 -225435 257906 846413 1294830 1496547 1503979 1467416 1460111 1350266 968821
39663 968821 425633 86975 146551 379244 462726 396211 391517 453036 355326 61008 -113178
39652 -113178 122530 666291 1170514 1393789 1273168 826559 205883 -258031 -307004 -30047
39642 -30047 287740 527643 747960 914691 899788 730614 557472 371476 73072 -153492
39632 -153492 68038 697880 1153347 1027764 595813 320987 193578 -68693 -434978 -621065
39622 -621065 -567522 -425863 -193889 184384 439554 196523 -403073 -767623 -639475 -393597
$$ packed form
39692E077004N77326O58823N39023L897p67147j211280j035617n85177l38016
39683B918836l07108k12628j1790P2961o9885l29967n78139p38109o97846l76858
39673c30533J05098M83341N88507M48417K01717P432l6563p305j09845l81445
39663I68821n43188l38658N9576K32693Q3482o6515m694O1519r7710k94318j74186
39652a13178K35708N43761N04223K23275j20621m46609o20676m63914m8973K76957
39642c0047L17787K39903K20317J66731j4903j69174j73142j85996k98404k26564
39632a53492K21530O29842M55467j25583m31951k74826j27409k62271l66285j86087
39622f21065N3543J41659K31974L78273K55170k43031n99596l64550J28148K45878
$$ plain form
39612 -393597 -439004 -737160 -1077953 -1417528 -1684475 -1605604 -1062592 -394640 -22061 86519
39602 86519 274608 614526 758144 404327 -267042 -708199 -515268 180376 843900 1091179
39592 1091179 1044889 1048222 1151413 1111035 828119 478372 181634 -146084 -521316 -769378
39582 -769378 -807535 -791176 -830843 -814427 -675914 -592060 -701562 -830806 -720739 -381259
39572 -381259 -35554 156408 168532 48052 -75885 -67317 25771 32358 -5215 190438 676825
39561 676825 1095532 1138910 955177 855990 881754 938444 1115590 1514997 1936740 2093079
39551 2093079 2016975 1925569 1796190 1454348 1032319 948036 1351311 1872527 2033198 1757401
39541 1757401 1427748 1508561 2062213 2576474 2424037 1606438 835238 708742 1059537 1353192
$$ packed form
39612c93597m5407k98156l40793l39575k66947P8871N43012O67952L72579J08580
39602H6519J88089L39918J43618l53817o71369m41157J92931O95644O63524K47279
39592A091179m6290L333J03191m0378k82916l49747k96738l27718l75232k48062
39582g69378l8157J6359l9667J6416J38513Q3854j09502j29244J10067L39480
39572c81259L45705J91962J2124j20480j23937Q568R3088O587l7573J95653M86387
39561F76825M18707M3378j83733r9187K5764N6690J77146L99407M21743J56339
39551B093079p6104r1406j29379l41842m22029q4283M03275N21216J60671k75797
39541A757401l29653Q0813N53652N14261j52437q17599p71200j26496L50795K93655
$$ plain form
39531 1353192 1433790 1496138 1562090 1475662 1315759 1325793 1434014 1284115 796827 320410
39521 320410 159547 296635 629120 1132679 1708377 2185123 2558562 2952663 3310955 3435490
39511 3435490 3367398 3389701 3588220 3752130 3796267 3938651 4346266 4929960 5597759 6362067
39501 6362067 7051798 7276983 6900782 6274305 5807517 5548262 5338995 5113275 4849340
39492 4849340 4479914 4032443 3635074 3252450 2705036 2113270 1979744 2552205 3369976
39483 3369976 3745328 3505688 3000207 2576772 2355661 2368815 2592381 2865565 2993779 2926841
39473 2926841 2746131 2578730 2595403 2906512 3339035 3513521 3282426 2897403 2618114 2401517
39463 2401517 2145182 1972645 2043500 2285859 2523420 2664469 2596456 2161426 1442921 793190
$$ packed form
39531A353192Q0598O2348O5952q6428j59903J0034J08221j49899m87288m76417
39521C20410j60863J37088L32485N03559N75698M76746L73439L94101L58292J24535
39511C435490o8092K2303J98519J63910M4137J42384M07615N83694O67799P64308
39501F362067O89731K25185l76201o26477m66788k59255k09267k25720k63935
39492D849340l69426m47471l97369l82624n47414n91766j33526N72461Q17771
39483C369976L75352k39640n05481m23435k21111J3154K23566K73184J28214o6938
39473B926841j80710j67401J6673L11109M32523J74486k31095l85023k79289k16597
39463B401517k56335j72537P0855K42359K37561J41049o8013m35030p18505o49731
$$ plain form
39453 793190 364532 -39466 -399465 -236853 618934 1452360 1479705 960163 781574 1089736
39443 1089736 1128349 517849 -82698 88675 881344 1567505 1805911 1842705 1956185 2079636
39433 2079636 1953845 1464911 834131 501737 719860 1254911 1634149 1666710 1542084 1470469
39423 1470469 1499824 1681848 2092313 2597660 2885418 2844918 2676682 2523932 2258146 1773357
39413 1773357 1250753 941247 851245 806039 694323 527165 388897 444963 869554 1640181
39403 1640181 2482704 3100941 3413517 3573874 3855096 4460840 5275161 5834922 5757395 5175630
39393 5175630 4541219 4061812 3632611 3275981 3225898 3463562 3554377 3164878 2479733 1922822
39383 1922822 1689591 1694101 1735213 1583856 1164856 773599 815397 1202102 1367371 1066051
$$ packed form
39453G93190m28658m03998l59999J62612Q55787Q33426K7345n19542j78589L08162
39443A089736L8613o10500o00547J71373P92669O86161K38406L6794J13480J23451
39433B079636j25791m88934o30780l32394K18123N35051L79238L2561j24626p1615
39423A470469K9355J82024M10465N05347K87758m0500j68236j52750k65786m84789
39413A773357n22604l09506r0002m5206j11716j67158j38268N6066M24591P70627
39403A640181Q42523O18237L12576J60357K81222O05744Q14321N59761p7527n81765
39393E175630o34411m79407m29201l56630n0083K37664R0815l89499o85145n56911
39383A922822k33231M510M1112j51357m19000l91257M1798L86705J65269l01320
$$ plain form
39373 1066051 748701 849369 1106220 1008917 601263 345166 392457 502466 573485 736122
39363 736122 903206 701363 4135 -768648 -1031333 -567205 322501 1048267 1174210 828794
39353 828794 605662 865167 1261489 1206447 645938 45154 -271772 -365059 -319289 -86228
39343 -86228 247674 426359 381866 324774 380807 428040 393172 423162 638565 954172 1239540
39332 1239540 1435088 1460036 1267709 1041973 1046097 1213307 1199596 905422 576706 289881
39322 289881 -217761 -979454 -1493888 -1345802 -814066 -474455 -428199 -316132 61136 523608
39312 523608 834515 922466 831091 696762 701160 838461 869244 722797 717260 1048133 1291376
39301 1291376 902442 107877 -245392 210323 913132 1176741 994355 785227 716954 642325
$$ packed form
39373A066051l17350J00668K56851r7303m07654k56097M7291J10009P1019J62637
39363G36122J67084k01843o97228p72783k62685M64128Q89706P25766J25943l45416
39353H28794k23132K59505L96322n5042n60509o00784l16926r3287M5770K33061
39343h6228L33902J78685m4493n7092N6033M7233l4868K9990K15403L15607K85368
39332A239540J95548K4948j92327k25736M124J67210j3711k94174l28716k86825
39322B89881n07642p61693n14434J48086N31736L39611M6256J12067L77268M62472
39312E23608L10907Q7951r1375j34329M398J37301L0783j46447n537L30873K43243
39301A291376l88934p94565l53269M55715P02809K63609j82386k09128o8273p4629
$$ plain form
39291 642325 505942 458113 601256 848729 1039088 1080766 1021312 1034719 1250284 1529732
39281 1529732 1534742 1113741 521848 159157 173738 405550 632063 768634 875966 1039789
39271 1039789 1221869 1236740 945523 439735 -77290 -526739 -889213 -980745 -606533 29587
39261 29587 419675 398933 372565 687968 1100018 1164563 897053 655864 542565 336613
39251 336613 -35407 -354969 -443843 -312724 27048 563514 1052047 1115704 689993 125287
39241 125287 -216669 -229285 77417 635168 1149666 1235014 891364 549391 476613 470309
39231 470309 342420 319681 609631 896909 744968 309348 138674 319264 328722 -163611
39221 -163611 -786283 -960293 -604729 -130082 73819 -59271 -355856 -608556 -730675 -786695
$$ packed form
39291F42325j36383m7829J43143K47473J90359M1678n9454J3407K15565K79448
39281A529732N010m21001n91893l62691J4581K31812K26513J36571J07332J63823
39271A039789J82080J4871k91217n05788n17025m49449l62474r1532L74212O36120
39261B9587L90088k0742k6368L15403M12050O4545k67510k41189j13299k05952
39251C36613l72020l19562q8874J31119L39772N36466M88533O3657m25711n64706
39241A25287l41956j2616L06702N57751N14498Q5348l43650l41973p2778o304
39231D70309j27889k2739K89950K87278j51941m35620j70674J80590R458m92333
39221a63611o22672j74010L55564M74647K03901j33090k96585k52700j22119n6020
$$ plain form
39211 -786695 -850928 -865325 -743195 -568931 -507421 -516882 -386499 -132388 -117246 -606905 -1361485
39200 -1361485 -1852368 -1810074 -1408856 -959121 -567223 -133414 376304 731962 624458 117224
39190 117224 -240218 6165 576344 728298 239171 -239858 -29813 668339 1051622 743794
39180 743794 175808 -49612 145599 352599 216253 -177026 -392018 -107122 492015 875762
39170 875762 801675 612011 720223 990981 965377 610897 412620 632218 896010 770749
39160 770749 427559 363123 618674 685786 228543 -421670 -654620 -293218 250803 461403
39150 461403 218435 -164512 -270571 84339 722385 1200317 1103414 412187 -391168 -724781
39140 -724781 -485600 -94574 112475 334731 935695 1790079 2346536 2324103 1990279 1662568
$$ packed form
39211g86695o4233j4397J22130J74264O1510r461J30383K54111J5142m89659p54580
39200a361485m90883M2294M01218M49735L91898M33809N09718L55658j07504n07234
39190A17224l57442K46383N70179J51954m89127m79029K10045O98152L83283l07828
39180G43794n67986k25420J95211K07000j36346l93279k14992K84896N99137L83747
39170H75762p4087j89664J08212K70758k5604l54480j98277K19598K63792j25261
39160G70749l43190o4436K55551O7112m57243o50213k32950L61402N44021K10600
39150D61403k42968l82947j06059L54910O38046M77932r6903o91227q03355l33613
39140g24781K39181L91026K07049K22256O00964Q54384N56457k2433l33824l27711
$$ plain form
39130 1662568 1298282 788004 326764 147904 98440 -107545 -294295 68155 1075731
39121 1075731 2097225 2477880 2262564 1976968 1905197 1893916 1766653 1594488 1519600 1578537
39111 1578537 1801628 2280174 2984516 3638848 3923924 3755419 3295022 2792983 2514486
39102 2514486 2673326 3223648 3751177 3769706 3167901 2262922 1458487 1016208 1106959 1793980
39092 1793980 2858514 3867025 4564229 5048101 5456716 5702189 5686200 5551948 5460940
39083 5460940 5293850 4884484 4431781 4327357 4621048 5017477 5400111 5958279 6698332
39074 6698332 7224630 7226180 6899436 6670420 6726035 7007683 7409394 7738311 7716633 7321766
39064 7321766 6947731 6921586 7002426 6686573 5910444 5114722 4664511 4534305 4540436 4547611
$$ packed form
39130A662568l64286n10278m61240j78860m9464k05985j86750L62450J007576
39121A075731J021494L80655k15316k85596p1771j1281j27263j72165p4888N8937
39111A578537K23091M78546P04342O54332K85076j68505m60397n02039k78497
39102B514486J58840N50322N27529J8529o01805r04979q04435m42279R0751O87021
39092A793980J064534J008511O97204M83872M08615K45473j5989j34252r1008
39083E460940j67090m09366m52703j04424K93691L96429L82634N58168P40053
39074F698332N26298J550l26744k29016N5615K81648M01711L28917k1678l94867
39064G321766l74035k6145Q0840l15853p76129p95722m50211j30206O131P175
$$ plain form
39054 4547611 4430061 4159297 3977823 4165772 4579044 4768289 4655441 4701898 5195178 5732781
39044 5732781 5745622 5287114 4934388 5036056 5400840 5674028 5704874 5529810 5256179 5020244
39034 5020244 4884964 4758157 4553549 4387851 4420514 4543924 4507781 4388960 4644167 5541285
39024 5541285 6750993 7691732 8132182 8257911 8265967 8156832 7926948 7727623 7716010 7867582
39014 7867582 8049753 8222121 8460887 8810228 9217207 9634404 10086766 10574448 11008149
39005 11008149 11378259 11940378 13028337 14612858 16221276 17434697 18340407 19342377
38997 19342377 20669443 22312548 24342921 26937791 30046546 33386870 36943879 41167605
38989 41167605 46409690 52405621 58676665 65338060 73153661 82829286 94634988 108802582
$$ packed form
39054D547611j17550k70764j81474J87949M13272J89245j12848M6457M93280N37603
39044E732781J2841m58508l52726J01668L64784K73188L0846j75064k73631k35935
39034E020244j35280j26807k04608j65698L2663J23410l6143j18821K55207Q97118
39024E541285J209708R40739M40450J25729Q056j09135k29884j99325j1613J51572
39014G867582J82171J72368K38766L49341M06979M17197M52362M87682M33701
39005A1008149L70110N62119J087959J584521J608418J213421R05710J001970
38997A9342377J327066J643105K030373K594870L108755L340324L557009M223726
38989D1167605N242085N995931O271044O661395P815601R675625J1805702J4167594
$$ plain form
38981 108802582 125938995 146811501 171773828 200165283 229561416 255266965 271306728
38974 271306728 273257087 260925092 238342269 211104874 183675708 158624634 137189564
38967 137189564 119640243 105322852 93175240 82553628 73371798 65475328 58350099
38960 58350099 51663974 45703210 40876815 36983267 33385942 29849110 26753507 24384343
38952 24384343 22421857 20414724 18470389 17078952 16336284 15723744 14734942 13430535
38944 13430535 12223609 11332482 10646356 9993655 9308459 8576788 7848753 7341184 7319018
38935 7319018 7740203 8133770 7993470 7277761 6407835 5775392 5377642 4985775 4547585
38926 4547585 4273250 4332134 4599157 4769601 4656679 4311034 3907722 3610730 3519118 3624189
$$ packed form
38981A08802582J7136413K0872506K4962327K8391455K9396133K5705549J6039763
38974B71306728J950359j2331995k2582823k7237395k7429166k5051074k1435070
38967A37189564j7549321j4317391j2147612j0621612r181830p896470p125229
38960E8350099o686125n960764m826395l893548l597325l536832l095603k369164
38952B4384343j962486k007133j944335j391437p42668o12540r88802j304407
38944A3430535j206926q91127o86126o52701o85196p31671p28035n07569k2166
38935G319018M21185L93567j40300p15709q69926o32443l97750l91867m38190
38926D547585k74335N8884K67023J70444j12922l45645m03312k96992r1612J05071
$$ plain form
38916 3624189 3776953 3771272 3514861 3099595 2706080 2492222 2560987 2922749 3432386 3850196
38906 3850196 4043319 4072459 4025271 3856699 3503691 3087969 2846673 2849023 2897912 2747486
38896 2747486 2347443 1864139 1535655 1505934 1710151 1908037 1919098 1844304 1959962 2359418
38886 2359418 2799125 2959760 2785201 2505425 2395493 2581222 3022088 3589814 4159003
38877 4159003 4660076 5051617 5261948 5211503 4887853 4334376 3587542 2740690 2060155 1846879
38867 1846879 2084984 2383451 2408302 2244814 2155619 2096932 1745911 1024240 346337 214679
38857 214679 689197 1367195 1814817 1925787 1901029 1971266 2164400 2323859 2325701 2220505
38847 2220505 2128874 2071994 1997242 1909320 1832796 1668001 1265971 698351 293203 304252
$$ packed form
38916C624189J52764n681k56411m15266l93515k13858O8765L61762N09637M17810
38906C850196J93123K9140m7188j68572l53008m15722k41296K350M8889j50426
38896B747486m00043m83304l28484k9721K04217J97886J1061p4794J15658L99456
38886B359418M39707J60635j74559k79776j09932J85729M40866N67726N69189
38877D159003N01073L91541K10331n0445l23650n53477p46834q46852o80535k13276
38867A846879K38105K98467K4851j63488q9195n8687l51021p21671o77903j31658
38857B14679M74518O77998M47622J10970k4758P0237J93134J59459J842j05196
38847B220505r1631n6880p4752q7922p6524j64795m02030n67620m05148J1049
$$ plain form
38837 304252 654480 1091282 1471391 1773921 1949982 1940490 1806350 1685086 1626176 1601293
38827 1601293 1662985 1930718 2379750 2785243 2952659 2907802 2790673 2652451 2446504 2160307
38817 2160307 1868363 1681534 1692169 1912662 2206262 2347871 2247539 2061991 1980811 1957252
38807 1957252 1799617 1511385 1356208 1521174 1861726 2077018 2029331 1793805 1507047 1309103
38797 1309103 1352559 1677389 2063257 2159379 1838040 1363912 1173114 1491459 2129209 2599638
38787 2599638 2496090 1853562 1132822 795230 938160 1377637 1915170 2338978 2317631 1641594
38777 1641594 610744 -112898 -161076 233828 655166 956427 1157435 1169063 895172 462634
38767 462634 100696 -129631 -302138 -424016 -453463 -419025 -342558 -148898 178335 487432
$$ packed form
38837C04252L50228M36802L80109L02530J76061r492j34140j21264n8910k4883
38827A601293O1692K67733M49032M05493J67416m4857j17129j38222k05947k86197
38817B160307k91944j86829J0635K20493K93600J41609j00332j85548q1180k3559
38807A957252j57635k88232j55177J64966L40552K15292m7687k35526k86758j97944
38797A309103M3456L24830L85868R6122l21339m74128j90798L18345O37750M70429
38787B599638j03548o42528p20740l37592J42930M39477N37533M23808k1347o76037
38777A641594j030850p23642m8178L94904M21338L01261K01008J1628k73891m32538
38767D62634l61938k30327j72507j21878k9447L4438P6467J93660L27233L09097
$$ plain form
38757 487432 682074 861842 1007430 778648 9216 -791252 -924354 -421190 38980 119968
38747 119968 158839 390293 469898 104667 -354583 -406643 -134840 12860 -71305 -124893
38737 -124893 -21355 125726 257459 382891 397552 262278 247669 577401 916924 714541
38727 714541 63618 -295602 28448 558948 658826 349274 115142 215663 544396 957136
38717 957136 1369269 1633973 1655540 1595295 1698159 1915347 1921564 1526906 902432 395090
38707 395090 265411 567872 1085468 1376054 1110312 457805 -20898 35256 430185 727757
38697 727757 773070 737652 753326 739294 628441 568166 744783 1070069 1194576 893429
38687 893429 382189 158759 485524 1065120 1314870 981542 386948 -274 -110665 -224808
$$ packed form
38757D87432J94642J79768J45588k28782p69432q00468j33102N03164M60170Q0988
38747A19968L8871K31454P9605l65231m59250n2060K71803J47700q4165n3588
38737a24893J03538J47081J31733J25432J4661j35274j4609L29732L39523k02383
38727G14541o50923l59220L24050N30500R9878l09552k34132J00521L28733M12740
38717I57136M12133K64704K1567o0245J02864K17188O217l94658o24474n07342
38707C95090j29679L02461N17596K90586k65742o52507m78703N6154L94929K97572
38697G27757M5313l5418J5674j4032j10853o0275J76617L25286J24507l01147
38687H93429n11240k23430L26765N79596K49750l33328n94594l87222j10391j14143
$$ plain form
38677 -224808 -468425 -641940 -608712 -555041 -670956 -810929 -746909 -583128 -579516 -665838 -526920
38666 -526920 -163812 52059 -17714 -36745 243469 553756 528414 250489 36897 -76555
38656 -76555 -246211 -382719 -228727 172366 470608 497966 442325 492629 604440 693108
38646 693108 810256 1029444 1328736 1640941 1878892 1918214 1723450 1466164 1334001 1268924
38636 1268924 1106876 913972 918402 1144556 1402080 1623871 1913358 2255117 2496852 2636922
38626 2636922 2796030 2874691 2611403 2064388 1673117 1726821 2092861 2527272 2864875 2853272
38616 2853272 2308922 1595558 1401971 1786440 1995443 1575116 1077110 1166487 1588200 1694854
38606 1694854 1565371 1777926 2289735 2397136 1826441 1117770 781850 698537 545535 293037
$$ packed form
38677b24808k43617j73515L3228N3671j15915j39973O4020J63781L612q6322J38918
38666e26920L63108K15871o9773j9031K80214L10287k5342k77925k13592j13452
38656g6555j69656j36508J53992M01093K98242K7358n5641N0304J11811Q8668
38646F93108J17148K19188K99292L12205K37951L9322j94764k57286j32163o5077
38636A268924j62048j92904M430K26154K57524K21791K89487L41759K41735J40070
38626B636922J59108P8661k63288n47015l91271N3704L66040M34411L37603j1603
38616B853272n44350p13364j93587L84469K09003m20327m98006Q9377M21713J06654
38606A694854j29483K12555N11809J07401n70695p08671l35920q3313j53002k52498
$$ plain form
38596 293037 43869 -186834 -310231 -127524 365389 919579 1368464 1715535 1857559 1616434
38586 1616434 1131912 823218 848228 977581 1068059 1195864 1226520 830857 177877 32041
38576 32041 745938 1625081 1781853 1259117 792562 747667 863023 890612 915911 1033889
38566 1033889 1164488 1266199 1413341 1621382 1846995 2134604 2494993 2679503 2379675
38557 2379675 1670985 1005675 750622 948036 1490027 2232616 2893752 3114431 2762423
38548 2762423 2063325 1391103 1013966 984194 1109344 1066839 720138 298203 115457 185817
38538 185817 298487 387251 573830 878887 1141276 1226086 1094353 694138 41362 -595081
38528 -595081 -872890 -782136 -602331 -416353 4842 706679 1276561 1329173 1050103 948771
$$ packed form
38596B93037k49168k30703j23397J82707M92913N54190M48885L47071J42024k41125
38586A616434m84522l08694K5010J29353R0478J27805L0656l95663o52980j45836
38576C2041P13897Q79143J56772n22736m66555m4895J15356K7589K5299J17978
38566A033889J30599J01711J47142K08041K25613K87609L60389J84510k99828
38557B379675p08690o65310k55053J97414N41991P42589O61136K20679l52008
38548B762423o99098o72222l77137k9772J25150m2505l46701m21935j82746P0360
38538A85817J12670Q8764J86579L05057K62389Q4810j31733m00215o52776o36443
38528e95081k77809R0754J79805J85978M21195P01837N69882N2612k79070j01332
$$ plain form
38518 948771 1164028 1322294 1123662 813817 890530 1430609 1934225 1941068 1645211 1650944
38508 1650944 2138854 2598519 2542570 2181810 2093476 2443761 2925272 3325637 3696880 3980311
38498 3980311 3956771 3699736 3645146 3995214 4408828 4528815 4491316 4601535 4758740 4570746
38488 4570746 3920723 3106610 2469859 2129524 2035450 2056763 2023780 1849390 1610545 1424451
38478 1424451 1313441 1266740 1296450 1313745 1120571 706777 401986 509665 911068 1264340
38468 1264340 1475196 1685642 1878823 1841320 1551690 1294686 1270597 1319180 1171669 821063
38458 821063 513877 478951 762443 1241344 1699152 1933573 1873186 1610323 1335376 1242580
38448 1242580 1411530 1689268 1759039 1461753 1020845 818767 976223 1290566 1554298 1739242
$$ packed form
38518I48771K15257J58266j98632l09845P6713N40079N03616O843k95857N733
38508A650944M87910M59665n5949l60760q8334L50285M81511M00365L71243K83431
38498C980311k3540k57035n4590L50068M13614J19987l7499J10219J57205j87994
38488D570746o50023q14113o36751l40335r4074K1313l2983j74390k38845j86094
38478A424451j11010m6701K9710J7295j93174m13794l04791J07679M01403L53272
38468A264340K10856K10446J93181l7503k89630k57004k4089M8583j47511l50606
38458H21063l07186l4926K83492M78901M57808K34421o0387k62863k74947r2796
38448A242580J68950K77738O9771k97286m40908k02078J57456L14343K63732J84944
$$ plain form
38438 1739242 1843268 1772166 1503049 1237792 1245333 1578828 2026224 2319987 2352501 2213641
38428 2213641 2061516 1963085 1864756 1715970 1574378 1558741 1746809 2142647 2651314 3035427
38418 3035427 3040035 2694926 2370444 2350113 2446649 2266567 1778462 1331123 1121863 986138
38408 986138 815372 853349 1342777 2092924 2674917 2952944 3179631 3585377 4069193 4338147
38398 4338147 4253486 4014431 4026057 4524554 5272714 5704561 5467512 4772270 4131225 3823905
38388 3823905 3721020 3562027 3254788 2898326 2623600 2458150 2326347 2194753 2202721 2529348
38378 2529348 3057892 3311931 2916608 2091301 1489354 1494920 1825968 1929127 1656753 1391229
38368 1391229 1502004 1851124 1983973 1750276 1512846 1639886 1994328 2173407 2136803 2232374
$$ packed form
38438A739242J04026p1102k69117k65257P541L33495M47396K93763L2514j38860
38428B213641j52125r8431r8329j48786j41592j5637J88068L95838N08667L84113
38418C035427M608l45109l24482k0331R6536j80082m88105m47339k09260j35725
38408I86138j70766L7977M89428P50147N81993K78027K26687M05746M83816K68954
38398D338147q4661k39055J1626M98497P48160M31847k37049o95242o41045l07320
38388C823905j02885j58993l07239l56462k74726j65450j31803j31594P968L26627
38378B529348N28544K54039l95323q25307o01947N566L31048J03159k72374k65524
38368A391229J10775L49120J32849k33697k37430J27040L54442J79079l6604R5571
$$ plain form
38358 2232374 2559196 2713283 2400591 1964684 1923156 2182414 2173640 1728560 1354405 1519039
38348 1519039 2054058 2489389 2686507 2855284 3115389 3331954 3345802 3169042 2953201 2857843
38338 2857843 2902300 2901371 2679800 2413009 2535357 3149667 3767719 3911837 3772794 3894052
38328 3894052 4327353 4575546 4400196 4194386 4366638 4781243 5100940 5337784 5701002
38319 5701002 6163405 6598090 7171745 8142623 9333833 10272104 10881780 11586252 12596926
38310 12596926 13555310 14157874 14791008 16170763 18519675 21433070 24472882 27581200
38302 27581200 30919239 34603803 38744373 43604795 49576542 56941277 65627659 75176268
38294 75176268 84915743 94044966 101417798 105471724 104925474 99860117 91876515 82897427
$$ packed form
38358B232374L26822J54087l12692m35907m1528K59258q774m45080l74155J64634
38348A519039N35019M35331J97118J68777K60105K16565J3848j76760k15841r5358
38338B857843M4457r29k21571k66791J22348O14310O18052J44118j39043J21258
38328C894052M33301K48193j75350k05810J72252M14605L19697K36844L63218
38319E701002M62403M34685N73655R70878J191210R38271O09676P04472J010674
38310A2596926R58384O02564O33134J379755K348912K913395L039812L108318
38302B7581200L338039L684564M140570M860422N971747P364735Q686382R548609
38294G5176268R739475R129223P372832M053926n46250n065357p983602q979088
$$ plain form
38286 82897427 73931803 65145518 56749363 49274882 43037867 37839841 33354478 29502023
38278 29502023 26322058 23737239 21573690 19633605 17696749 15672911 13806677 12479897
38270 12479897 11717568 11116216 10341801 9447456 8606730 7833849 7145638 6716743 6606606
38261 6606606 6514555 6071140 5273632 4438879 3836849 3547596 3541335 3677196 3712162 3523174
38251 3523174 3274262 3209195 3344977 3495636 3489241 3232411 2724810 2196085 2044286 2365844
38241 2365844 2685623 2481336 1901751 1598252 1829510 2117968 1942410 1447211 1191337
38232 1191337 1363524 1559260 1358784 894224 679332 950349 1387105 1579692 1581023 1738308
38222 1738308 2058566 2114559 1680810 1103413 810800 766528 715141 696211 895972 1153781
$$ packed form
38286H2897427q965624q786285q396155p474481o237015n198026m485363l852455
38278B9502023l179965k584819k163549j940085j936856k023838j866234j326780
38270A2479897p62329o01352p74415q94345q40726p72881o88211m28895j10137
38261F606606r2051m43415p97508q34753o02030k89253o261J35861L4966j88988
38251C523174k48912o5067J35782J50659o395k56830n07601n28725j51799L21558
38241B365844L19779k04287n79585l03499K31258K88458j75558m95199k55874
38232A191337J72187J95736k00476m64560k14892K71017M36756J92587J331J57285
38222A738308L20258N5993m33749n77397k92613m4272n1387j8930J99761K57809
$$ plain form
38212 1153781 1083310 655452 244164 71506 -6110 -111893 -138558 -33616 46607 604
38202 604 -86848 -167400 -269574 -229952 230795 980091 1397169 1103722 475400 124497 127708
38191 127708 106643 -122344 -361139 -404943 -260643 -4048 305854 563122 689689 779603
38181 779603 976730 1216427 1282001 1126977 959671 975825 1157414 1368492 1513010 1549441
38171 1549441 1459809 1269760 1044498 829783 633782 479700 436490 567071 839878 1101355
38161 1101355 1182515 1071266 930783 894020 925506 989369 1233698 1800805 2525228 3074791
38151 3074791 3359917 3511673 3470239 2989736 2163853 1545999 1511470 1819004 2048278 2140753
38141 2140753 2195683 2062501 1579957 1013925 788577 874986 871060 635282 431102 456782
$$ packed form
38212A153781p0471m27858m11288j72658p7616j05783k6665J04942Q0223m6003
38202F04q7452q0552j02174L9622M60747P49296M17078k93447o28322l50903L211
38191A27708k1065k28987k38795m3804J44300K56595L09902K57268J26567Q9914
38181G79603J97127K39697O5574j55024j67306J6154J81589K11078J44518L6431
38171A549441q9632j90049k25262k14715j96001j54082m3210J30581K72807K61477
38161A101355Q1160j11249j40483l6763L1486O3863K44329N67107P24423N49563
38151C074791K85126J51756m1434m80503q25883o17854l4529L07534K29274R2475
38141B140753N4930j33182m82544n66032k25348Q6409l926k35778k04180K5680
$$ plain form
38131 456782 627552 846853 1123853 1382770 1506888 1609410 1900612 2244935 2251584 1898581
38121 1898581 1644991 1754070 1911856 1757187 1414965 1191540 1054317 784935 436555
38112 436555 269074 359730 599997 956146 1401038 1693800 1613339 1397391 1566139 2222198
38102 2222198 2849928 2954760 2641936 2386728 2439809 2664409 2809121 2707575 2278235 1554726
38092 1554726 736140 59048 -394770 -654252 -670929 -371251 93431 394552 438491 504871
38082 504871 782628 981547 713076 129335 -207870 -95649 80524 504 -113785 74584
38072 74584 449256 641999 573345 432062 285265 97345 26695 278086 670431 753344
38062 753344 409971 -11526 -230163 -325695 -392579 -287149 75093 502241 864652 1368663
$$ packed form
38131D56782J70770K19301K77000K58917J24118J02522K91202L44323O649l53003
38121A898581k53590J09079J57786j54669l42222k23425j37223k69382l48380
38112D36555j67481R0656K40267L56149M44892K92762q0461k15948J68748O56059
38102B222198O27730J04832l12824k55208N3081K24600J44712j01546m29340p23509
38092A554726q18586o77092m53818k59482j6677K99678M64682L01121M3939O6380
38082E04871K77757J98919k68471n83741l37205J12221J76173q0020j14289J88369
38072G4584L74672J92743o8654j41283j46797j87920p0650K51391L92345Q2913
38062G53344l43373m21497k18637r5532o6884J05430L62242M27148L62411N04011
$$ plain form
38052 1368663 2173090 2931959 3085670 2549978 1811290 1332628 1119843 922643 631088
38043 631088 327502 65390 -218737 -536065 -700602 -487590 58950 623359 1005139 1354294
38033 1354294 1853606 2315639 2394042 2170965 2209028 2911757 4077948 5223037 6120414
38024 6120414 6822973 7276405 7149941 6135209 4403090 2712503 1890310 2051036 2459385
38015 2459385 2361853 1800286 1334078 1180189 1115425 1116433 1445041 1983154 2131959 1664354
38005 1664354 1104985 890841 713907 202575 -254767 -47755 619241 961717 749758
37996 749758 513710 628435 843148 830728 638211 402185 77353 -325479 -578067 -523307
37986 -523307 -284482 -56619 100426 204594 312396 543918 894870 1065994 804313 366399
$$ packed form
38052A368663Q04427P58869J53711n35692p38688m78662k12785j97200k91555
38043F31088l03586k62112k84127l17328j64537K13012N46540N64409L81780L49155
38033A354294M99312M62033P8403k23077L8063P02729J166191J145089Q97377
38024F120414P02559M53432j26464j014732j732119j690587q22193J60726M08349
38015B459385r7532n61567m66208j53889o4764J008L28608N38113J48805m67605
38005A664354n59369k14144j76934n11332m57342K07012O66996L42476k11959
37996G49758k36048J14725K14713j2420j92517k36026l24832m02832k52588N4760
37986e23307K38825K27863J57045J04168J07802K31522L50952J71124k61681m37914
$$ plain form
37976 366399 229955 347715 181136 -423876 -919246 -843682 -456630 -262133 -297215 -278719
37966 -278719 -153768 -85650 -78596 6532 182232 391291 709026 1182684 1580661 1624237
37956 1624237 1410431 1301942 1420118 1531218 1448748 1283617 1226536 1284195 1321817 1239237
37946 1239237 1033629 770553 548930 464736 587358 940361 1428635 1797781 1822112 1597557
37936 1597557 1491505 1695142 1972250 1983381 1714201 1415690 1245698 1166193 1104564 1010787
37926 1010787 817372 555753 478615 837111 1501674 1993095 1968208 1562146 1198245 1150357
37916 1150357 1336959 1479215 1416155 1271893 1292419 1516668 1706726 1664014 1485728 1365793
37906 1365793 1254107 951809 541157 464986 1044192 2065328 3008394 3611989 4052311
$$ packed form
37976C66399j36444J17760j66579o05012m95370P5564L87052J94497l5082J8496
37966b78719J24951O8118P054Q5128J75700K09059L17735M73658L97977M3576
37956A624237k13806j08489J18176J11100q2470j65131n7081N7659L7622q2580
37946A239237k05608k63076k21623q4194J22622L53003M88274L69146K4331k24555
37936A597557j06052K03637K77108J1131k69180k98511j69992p9505o1629r3777
37926A010787j93415k61619p7138L58496O64563M91421k4887m06062l63901m7888
37916A150357J86602J42256o3060j44262K0526K24249J90058m2712j78286j19935
37906A365793j11686l02298m10652p6171N79206J021136R43066O03595M40322
$$ plain form
37897 4052311 4585352 5198709 5695525 5967681 6018313 5801432 5277084 4640765 4232921 4091135
37887 4091135 3830314 3171981 2370855 1825632 1462967 921123 250461 -70468 113922
37878 113922 357678 284121 105766 193457 498140 753552 953458 1217479 1390524 1213663
37868 1213663 798399 532479 543454 598938 521199 364105 161179 -168937 -571265 -768787
37858 -768787 -565519 -105462 239411 177324 -258210 -673207 -627020 -117672 382197 521818
37848 521818 471597 471943 286608 -408538 -1267662 -1530285 -1077725 -634144 -727193 -1009622
37838 -1009622 -936628 -626086 -577898 -858206 -1067919 -971714 -706873 -424300 -125440 125584
37828 125584 173341 33356 -76547 -45783 5506 -11643 16070 188362 375229 385834 256018
$$ packed form
37897D052311N33041O13357M96816K72156N0632k16881n24348o36319m07844j41786
37887D091135k60821o58333q01126n45223l62665n41844o70662l20929J84390
37878A13922K43756p3557j78355Q7691L04683K55412J99906K64021J73045j76861
37868A213663m15264k65920J0975N5484p7739j57094k02926l30116m02328j97522
37858g68787K03268M60057L44873o2087m35534m14997M6187N09348M99869J39621
37848E21818n0221L46j85335o95146q59124k62623M52560M43581r3049k82429
37838a009622P2994L10542M8188k80308k09713R6205K64841K82573K98860K51024
37828A25584M7757j39985j09903L0764N1289j7149K7713J72292J86867J0605j29816
$$ plain form
37817 256018 180595 175516 -2733 -507196 -1095120 -1338811 -1114102 -699660 -355135 -17373
37807 -17373 432617 800505 771099 413963 185906 358696 685425 739233 383674 -199512
37797 -199512 -743030 -999488 -802618 -248924 269129 416578 279249 224818 428764 692776
37787 692776 745475 580618 419239 401319 411738 249560 -73834 -309349 -291841 -180536
37777 -180536 -246415 -486994 -637953 -560725 -410783 -354416 -302951 -59991 363803 693534
37767 693534 622517 96375 -566347 -885128 -701553 -422504 -576059 -1131037 -1516752 -1363290
37757 -1363290 -921603 -628394 -571139 -601330 -685681 -822994 -811552 -475644 -53004 -9224
37747 -9224 -445467 -971879 -1224544 -1260839 -1329589 -1434494 -1308652 -797911 -142097 227374
$$ packed form
37817B56018p5423n079j78249n04463n87924k43691K24709M14442L44525L37762
37807a7373M49990L67888k9406l57136k28057J72790L26729N3808l55559n83186
37797a99512n43518k56458J96870N53694N18053J47449j37329n4431K03946K64012
37787F92776N2699j64857j61379j7920J0419j62178l23394k35515J7508J11305
37777a80536o5879k40579j50959P7228J49942N6367N1465K42960M23794L29731
37767F93534p1017n26142o62722l18781J83575K79049j53555n54978l85715J53462
37757a363290M41687K93209N7255l0191q4351j37313J1442L35908M22640M3780
37747i224m36243n26412k52665l6295o8750j04905J25842N10741O55814L69471
$$ plain form
37737 227374 185315 78329 239647 447608 181496 -557563 -1073763 -838694 -193124 134694
37727 134694 -47158 -347777 -492531 -599821 -784193 -918686 -891163 -786086 -722502 -756456
37717 -756456 -967606 -1351710 -1590150 -1269851 -465498 194958 226391 -179610 -481620 -430910
37707 -430910 -197120 -43444 -112159 -429920 -905028 -1334442 -1550357 -1562789 -1505416 -1488187
37697 -1488187 -1538723 -1607669 -1587070 -1409628 -1173645 -1079346 -1193997 -1359244 -1366938 -1160880
37687 -1160880 -864390 -688190 -781094 -1060479 -1229932 -1091684 -772491 -484263 -194235 192206
37677 192206 445722 236742 -249038 -404109 -63224 197421 -96910 -609165 -726756 -476510
37667 -476510 -419262 -825034 -1435477 -1940343 -2207324 -2067696 -1374529 -387454 308416 441420
$$ packed form
37737B27374m2059j06986J61318K07961k66112p39059n16200K35069O45570L27818
37727A34694j81852l00619j44754j07290j84372j34493K7523J05077O3584l3954
37717g56456k11150l84104k38440L20299Q04353O60456L1433m06001l02010N0710
37707d30910K33790J53676o8715l17761m75108m29414k15915j2432N7373J7229
37697a488187n0536o8946K0599J77442K35983R4299j14651j65247p694K06058
37687a160880K96490J76200r2904k79385j69453J38248L19193K88228K90028L86441
37677A92206K53516k08980m85780j55071L40885K60645k94331n12255j17591K50246
37667d76510N7248m05772o10443n04866k66981J39628O93167R87075O95870J33004
$$ plain form
37657 441420 313618 290303 341274 279637 176076 262488 578382 961357 1309273 1644419
37647 1644419 1952915 2135607 2135074 2009793 1870402 1792349 1767058 1688274 1416277 912318
37637 912318 303784 -212027 -528691 -705296 -902142 -1215122 -1537244 -1632141 -1406982 -1048565
37627 -1048565 -794740 -655983 -524146 -479146 -718306 -1133884 -1233580 -661250 354573 1233472
37617 1233472 1607114 1502929 1102373 551035 -15443 -461845 -726932 -816276 -733267 -517098
37607 -517098 -308006 -227882 -212636 -135463 -110040 -452956 -1220273 -1942610 -2017717 -1333251
37597 -1333251 -368588 295213 445289 248570 -30748 -246836 -403287 -572462 -780300
37588 -780300 -946609 -966705 -858916 -768256 -782731 -797927 -627007 -227145 233104 528656
$$ packed form
37657D41420j27802k3315N0971o1637j03561Q6412L15894L82975L47916L35146
37647A644419L08496J82692n33j25281j39391p8053k5291p8784k71997n03959
37637I12318o08534n15811l16664j76605j96846l12980l22122r4897K25159L58417
37627a048565K53825J38757J31837M5000k39160m15578r9696N72330J015823Q78899
37617A233472L73642j04185m00556n51338n66478m46402k65087q9344Q3009K16169
37607e17098K09092Q0124J5246P7173K5423l42916p67317p22337p5107O84466
37597a333251R64663O63801J50076j96719k79318k16088j56451j69175k07838
37588g80300j66309k0096J07789R0660j4475j5196J70920L99862M60249K95552
$$ plain form
37578 528656 571692 460679 359796 328182 274694 103790 -124618 -255737 -248858 -216493 -236189
37567 -236189 -255328 -230468 -198539 -114186 193389 726782 1164764 1253605 1209242 1405036 1750807
37556 1750807 1780995 1364102 893431 674433 568373 435070 458624 691053 692338 112822
37546 112822 -648575 -904575 -623524 -353919 -304276 -129310 304771 574424 364375 -34091
37536 -34091 -213979 -230662 -328410 -425382 -282775 29548 224086 209803 81314 -161961
37526 -161961 -533920 -807219 -708375 -326598 -7589 106792 101552 -66229 -496964 -894451
37516 -894451 -688754 162372 900711 817551 94810 -529122 -683967 -550287 -287309 193181
37506 193181 815232 1181897 1094467 909214 1041883 1314580 1189296 591630 76655 65742
$$ packed form
37578E28656M3036j11013j00883l1614n3488j70904k28408j31119O879L2365j9696
37567b36189j9139K4860L1929Q4353L07575N33393M37982Q8841m4363J95794L45771
37556A750807L0188m16893m70671k18998j06060j33303K3554K32429J285n79516
37546A12822p61397k56000K81051K69605M9643J74966M34081K69653k10049l98466
37536c4091j79888j6683r7748r6972J42607L12323J94538j4283j28489k43275
37526a61961l71959k73299R8844L81777L19009J14381n240j67781m30735l97487
37516h94451K05697Q51126P38339q3160p22741o23932j54845J33680K62978M80490
37506A93181O22051L66665q7430j85253J32669K72697j25284n97666n14975j0913
$$ plain form
37496 65742 306633 353489 275305 479235 974984 1291408 1180099 976062 1068703 1350978
37486 1350978 1458917 1312094 1113215 964574 784574 533575 282330 110319 104104 319997
37476 319997 556579 392225 -226537 -658687 -304492 458821 650430 4493 -710122 -847966
37466 -847966 -709798 -844340 -1117774 -1044437 -645725 -345538 -237634 -89255 39488 -169166
37456 -169166 -605654 -702508 -258135 241480 373498 381264 678111 1110708 1159124 708004
37446 708004 217113 135159 430030 752147 878864 904545 1038788 1274542 1339862 1062526
37436 1062526 683372 587994 752584 749087 379704 2927 49053 462966 848171 947832
37426 947832 733107 212092 -533299 -1231129 -1645706 -1863379 -2084814 -2202643 -1897611 -1145440
$$ packed form
37496F5742K40891M6856p8184K03930M95749L16424j11309k04037R2641K82275
37486A350978J07939j46823j98879j48641j80000k50999k51245j72011o215K15893
37476C19997K36582j64354o18762m32150L54195P63313J91609o45937p14615j37844
37466h47966J38168j34542k73434P3337L98712L00187J07904J48379J28743k08654
37456a69166m36488r6854M44373M99615J32018P766K96847M32597M8416m51120
37446G08004m90891q1954K94871L22117J26717K5681J34243K35754O5320k77336
37436A062526l79154r5378J64590l497l69383l76777M6126M13913L85205R9661
37426I47832k14725n21015p45391o97830m14577k17673k21435j17829L05032P52171
$$ plain form
37416 -1145440 -322331 233970 494796 534488 361205 67234 -132725 -191805 -342734 -722507
37406 -722507 -1062294 -989723 -550298 -202373 -305464 -775858 -1244852 -1412724 -1234297 -901749
37396 -901749 -710920 -833754 -1109132 -1109892 -562969 266776 761267 636118 310512 363675
37386 363675 693130 574126 -324042 -1345064 -1581219 -972267 -294074 -177809 -550121
37377 -550121 -1009999 -1306626 -1328362 -1018629 -544215 -302176 -536240 -1077767 -1566900 -1751878
37367 -1751878 -1510960 -852091 -35256 551756 801130 946905 1103808 1056239 695739 314359
37357 314359 156184 528 -404133 -755052 -549409 100271 521518 361167 -46232 -256335
37347 -256335 -237439 -173078 -106492 -737 78024 36821 -101646 -229179 -231645 -45774 217921
$$ packed form
37416a145440Q23109N56301K60826L9692j73283k93971j99959n9080j50929l79773
37406g22507l39787P2571M39425L47925j03091m70394m68994j67872J78427L32548
37396i01749J90829j22834k75378p60N46923Q29745M94491j25149l25606N3163
37386C63675L29455j19004q98168j021022k36155O08952O78193J16265l72312
37377e50121m59878k96627k1736L09733M74414K42039k34064n41527m89133j84978
37367a751878K40918O58869Q16835N87012K49374J45775J56903m7569l60500l81380
37357C14359j58175j55656m04661l50919K05643O49680M21247j60351m07399k10103
37347b56335J8896O4361O6586J05755P8761m1203j38467j27533k466J85871K63695
$$ plain form
37336 217921 265772 -47767 -437389 -508780 -312764 -241814 -399525 -495082 -427739 -500925 -853617
37325 -853617 -1122682 -987127 -688963 -636214 -763062 -701995 -414294 -221239 -278781 -407205
37315 -407205 -443192 -428300 -401937 -288685 -76681 104792 183376 273526 513811 845178
37305 845178 1013343 794849 243388 -305010 -561811 -602622 -698411 -857845 -826433 -612765
37295 -612765 -637918 -1105305 -1547885 -1384449 -716945 -168863 -77297 -278730 -600180 -1058758
37285 -1058758 -1524421 -1652432 -1319101 -779723 -241888 391262 1163138 1741230 1719235 1112298
37275 1112298 378822 23648 226412 713900 953731 633706 -23514 -574982 -917269
37266 -917269 -1256076 -1582146 -1607987 -1308916 -1068097 -1062080 -921192 -328984 381512 630379
$$ packed form
37336B17921M7851l13539l89622p1391J96016P0950j57711r5557O7343p3186l52692
37325h53617k69065J35555K98164N2749j26848O1067K87701J93055n7542j28424
37315d07205l5987J4892K6363J13252K12004J81473P8584R0150K40285L31367
37305H45178J68165k18494n51461n48398k56801m0811r5789j59434L1412K13668
37295f12765k5153m67387m42580J63436O67504N48082R1566k01433l21450m58578
37285a058758m65663j28011L33331N39378N37835O33150P71876N78092k1995o06937
37275A112298p33476l55174K02764M87488K39831l20025o57220n51468l42287
37266i17269l38807l26070k5841K99071K40819O017J40888N92208P10496K48867
$$ plain form
37256 630379 364782 32624 -78539 -102695 -261980 -588517 -954361 -1155198 -1035607 -720064
37246 -720064 -577871 -745398 -882223 -680459 -380423 -384463 -562867 -468814 -163676 -232762
37236 -232762 -872397 -1505066 -1551079 -1157189 -853626 -817269 -830524 -772102 -787248 -996655
37226 -996655 -1266448 -1312766 -980718 -443523 -91568 -104013 -187928 53921 556955 894467
37216 894467 918318 903516 980095 877082 451447 42437 -35636 6384 -161451 -390949
37206 -390949 -348780 -190854 -384825 -913188 -1192313 -873940 -284575 76791 110735 16772
37196 16772 -63794 -90400 -28037 92482 160525 158323 198150 287787 247327 11244 -147497
37185 -147497 101351 697244 1180748 1142824 618760 45076 -152502 48548 293626 286679
$$ packed form
37256F30379k65597l32158j11163k4156j59285l26537l65844k00837J19591L15543
37246g20064J42193j67527j36825K01764L00036m040j78404R4053L05138o9086
37236b32762o39635o32669m6013L93890L03563L6357j3255N8422j5146k09407
37226i96655k69793m6318L32048N37195L51955j2445q3915K41849N03034L37512
37216H94467K3851j4802P6579j03013m25635m09010p8073M2020j67835k29498
37206c90949M2169J57926j93971n28363k79125L18373N89365L61366L3944r3963
37196A6772q0566k6606O2363J20519O8043k202L9827Q9637m0460k36083j58741
37185a47497K48848N95893M83504l7924n24064n73684j97578K01050K45078o947
$$ plain form
37175 286679 111639 28829 73121 51283 -129412 -366627 -575150 -747732 -805934 -661154
37165 -661154 -447502 -388686 -370884 -1088 754245 1336590 1252624 686616 177277 -71432
37155 -71432 -229454 -383338 -417584 -276878 -22288 339031 806853 1214922 1371611 1335211
37145 1335211 1294323 1230883 989092 636150 430573 427103 437545 413629 522622 765659
37135 765659 885443 809863 843785 1182743 1518389 1423086 940423 498090 346748 359980
37125 359980 331210 216751 86488 25357 92744 243901 320444 256828 244282 507812 932961
37114 932961 1105751 768312 89666 -552811 -905626 -893949 -535101 17298 424986 388507
37104 388507 -13276 -348945 -307596 -54632 18436 -173102 -336604 -283409 -225944 -430614
$$ packed form
37175B86679j75040q2810M4292k1838j80695k37215k08523j72582n8202J44780
37165f61154K13652N8816J7802L69796P55333N82345q3966n66008n09339k48709
37155g1432j58022j53884l4246J40706K54590L61319M67822M08069J56689l6400
37145A335211m0888o3440k41791l52942k05577l470J0442k3916J08993K43037
37135G65659J19784p5580L3922L38958L35646r5303m82663m42333j51342J3232
37125C59980k8770j14459j30263o1131O7387J51157P6543o3616j2546K63530M25149
37114I32961J72790l37439o78646o42477l52815J1677L58848N52399M07688l6479
37104C88507m01783l35669M1349K52964P3068j91538j63502N3195N7465k04670
$$ plain form
37094 -430614 -771205 -891087 -720706 -544165 -543954 -555437 -364913 -35500 187829 151277
37084 151277 -121627 -480270 -712725 -712562 -651333 -819004 -1215322 -1491775 -1406839 -1131651
37074 -1131651 -956504 -911127 -885500 -922899 -1090154 -1162093 -770616 90757 947173 1313043
37064 1313043 1157057 855666 778410 954123 1102845 981878 664273 394694 234423 61733
37054 61733 -89779 -21404 198332 173621 -198730 -423839 -110728 332374 206404 -482099
37044 -482099 -1096143 -1326222 -1445228 -1590297 -1461198 -947752 -472066 -371332 -406075 -262379
37034 -262379 -158508 -509927 -1238431 -1838806 -2002416 -1839648 -1592548 -1418232 -1367552 -1335247
37024 -1335247 -1122750 -737848 -475327 -490116 -485119 -98473 562671 1071525 1224874 1132078
$$ packed form
37094d30614l40591j19882J70381J76541K11j1483J90524L29413K23329l6552
37084A51277k72904l58643k32455J63O1229j67671l96318k76453Q4936K75188
37074a131651J75147M5377K5627l7399j67255p1939L91477Q61373Q56416L65870
37064A313043j55986l01391p7256J75713J48722j20967l17605k69579j60271j72690
37054F1733j51512O8375K19736k4711l72351k25109L13111M43102j25970o88503
37044d82099o14044k30079j19006j45069J29099N13446M75686J00734l4743J43696
37034b62379J03871l51419p28504o00375j63610J62768K47100J74316N0680L2305
37024a335247K12497L84902K62521j4789M997L86646O61144N08854J53349r2796
$$ plain form
37014 1132078 899144 582912 384799 510108 813678 903165 646754 323929 232717 368505
37004 368505 516492 472022 183908 -135615 -111948 349042 799491 712571 146638 -358919
36994 -358919 -494899 -437722 -426244 -493069 -661521 -991812 -1319760 -1351178 -1168535 -1241613
36984 -1241613 -1718475 -2084824 -1812986 -1040128 -305003 117670 307526 363198 320963 255213
36974 255213 170566 -64008 -429387 -600855 -363671 15637 158457 118490 175339 259847
36964 259847 62902 -341356 -475694 -133222 348746 602424 649013 666674 678876 655787
$$ packed form
37014A132078k32934l16232j98113J25309L03570Q9487k56411l22825r1212J35788
37004C68505J47987m4470k88114l19523K3667M60990M50449q6920n65933n05557
36994c58919j35980N7177J1478o6825j68452l30291l27948l1418J82643p3078
36984a241613m76862l66349K71838P72858P35125M22673J89856N5672m2235o5750
36974B55213q4647k34574l65379j71468K37184L79308J42820l9967N6849Q4508
36964B59847j96945m04258j34338L42472M81968K53678M6589J7661J2202k3089
$$ [...]
##END NTUPLES=NMR SPECTRUM
##END=
