##TITLE=31Pdec_111-2025
CDCl3, 64 sc
 11.9.2025
##JCAMPDX= 6.0         $$ Bruker NMR JCAMP-DX V2.0
##DATA TYPE= NMR SPECTRUM
##DATA CLASS= NTUPLES
##ORIGIN= UXNMR, Bruker Analytische Messtechnik GmbH
##OWNER= root
$$ XWIN-NMR		Version 3.5
$$ Thu Sep 11 13:46:25 2025 Russian Standard Time (UT+4h)  she@DPX200
##.OBSERVE FREQUENCY= 81.013821
##.OBSERVE NUCLEUS= ^31P
##.ACQUISITION MODE= SIMULTANEOUS
##.ACQUISITION SCHEME= undefined
##.AVERAGES= 64
##.DIGITISER RES= 17
##SPECTROMETER/DATA SYSTEM= spect
##.PULSE SEQUENCE= zgpg30
##.SOLVENT NAME= CDCl3
##.SHIFT REFERENCE= (INTERNAL, CDCl3, 0, 198.062)
##AUDIT TRAIL= $$ (NUMBER, WHEN, WHO, WHERE, WHAT)
$$ ##TITLE= Audit trail, XWIN-NMR		Version 3.5
$$ ##JCAMPDX= 5.01
$$ ##ORIGIN= Bruker BioSpin GmbH
$$ ##OWNER= she
$$ F:/spectra/data/she/nmr/P31/2/pdata/1/auditp.txt
$$ ##AUDIT TRAIL=  $$ (NUMBER, WHEN, WHO, WHERE, WHAT)
(   1,<2025-09-11 13:45:19.51 +0400>,<she>,<DPX200>,
      <continue with go, POWCHK disabled, PULCHK disabled
       configuration hash MD5:
       00 E9 B6 7A A2 85 ED C7 34 08 36 98 17 FE 4E 26
       data hash MD5: 32K
       D2 D4 76 BF 23 1C A8 EA F1 AE D7 BC 3E 3E 4F EE>)
(   2,<2025-09-11 13:45:22.31 +0400>,<she>,<DPX200>,
      <Start of raw data processing
       efp BC_mod = 2 LB = 1.5 FT_mod = 6 PKNL = 1 PHC0 = 1242.917 PHC1 = 459.2999 SI = 64K 
       data hash MD5: 64K
       3B C1 5D A1 E4 15 D5 90 97 F7 C5 AD 8F EC 3A 25>)
(   3,<2025-09-11 13:45:55.35 +0400>,<she>,<DPX200>,
      <pk PHC0 = 378.0675 PHC1 = -220 
       data hash MD5: 64K
       16 72 B4 5E 82 3D 19 81 76 44 31 6E A1 5F 98 57>)
(   4,<2025-09-11 13:45:59.37 +0400>,<she>,<DPX200>,
      <abs ABSG = 5 
       data hash MD5: 64K
       A6 2E 9D 16 33 76 A1 07 CF EE DD B7 91 2C 17 15>)
$$ ##END=
$$ 
$$ hash MD5
$$ 12 50 11 FB BF EF DB 81 82 C6 D4 DE 1C 0D AA 54
##$RELAX= 
##$RELAX= 
##$RELAX= 
##$RELAX= 
##$RELAX= 
##$RELAX= 
##$RELAX= 
##$RELAX= 
$$ Bruker specific parameters
$$ --------------------------
##$DU= <F:/spectra>
##$EXPNO= 2
##$NAME= <P31>
##$PROCNO= 1
##$TYPE= <nmr>
##$USER= <she>
##$AMP= (0..31)
100 100 100 100 100 100 100 100 100 100 100 100 100 100 100 100 100 100 
100 100 100 100 100 100 100 100 100 100 100 100 100 100 
##$AQSEQ= 0
##$AQ_mod= 1
##$AUNM= <au_zg>
##$AUTOPOS= <>
##$BF1= 81.014009
##$BF2= 200.13
##$BF3= 200.13
##$BF4= 200.13
##$BF5= 200.13
##$BF6= 200.13
##$BF7= 200.13
##$BF8= 200.13
##$BYTORDA= 1
##$CFDGTYP= 0
##$CFRGTYP= 5
##$CHEMSTR= <none>
##$CNST= (0..31)
1 1 145 1 1 1 1 1 1 1 1 1 1 1 1 1 1 1 1 1 1 1 1 1 1 1 1 1 1 1 1 1 
##$CPDPRG= <waltz16>
##$CPDPRG1= <>
##$CPDPRG2= <waltz16>
##$CPDPRG3= <>
##$CPDPRG4= <mlev>
##$CPDPRG5= <mlev>
##$CPDPRG6= <mlev>
##$CPDPRG7= <mlev>
##$CPDPRG8= <mlev>
##$CPDPRGB= <>
##$CPDPRGT= <>
##$D= (0..31)
0 1 0 0 0 0 0 0 0 0.06 0 0.03 2e-05 3e-06 0 0 0.0002 0 0 0 0 0 0 0 0 0 
0 0 0 0 0 0 
##$DATE= 1757583811
##$DBL= (0..7)
120 120 120 11 120 120 24 19 
##$DBP= (0..7)
150 150 150 150 150 150 150 150 
##$DBP07= 0
##$DBPNAM0= <>
##$DBPNAM1= <>
$$ [...]
##$SUBNAM3= <"">
##$SUBNAM4= <"">
##$SUBNAM5= <"">
##$SUBNAM6= <"">
##$SUBNAM7= <"">
##$SUBNAM8= <"">
##$SUBNAM9= <"">
##$SW= 400.765351723535
##$SWIBOX= (0..15)
0 1 3 0 0 0 0 0 0 0 0 0 0 0 0 0 
##$SW_h= 32467.5324675325
##$TD= 32768
##$TD0= 1
##$TE= 0
##$TE2= 300
##$TE3= 300
##$TEG= 300
##$TL= (0..7)
0 120 53 12 22 120 120 120 
##$TP= (0..7)
150 150 150 150 150 150 150 150 
##$TP07= 0
##$TPNAME0= <>
##$TPNAME1= <>
##$TPNAME2= <>
##$TPNAME3= <>
##$TPNAME4= <>
##$TPNAME5= <>
##$TPNAME6= <>
##$TPNAME7= <>
##$TPOAL= (0..7)
0.5 0.5 0.5 0.5 0.5 0.5 0.5 0.5 
##$TPOFFS= (0..7)
0 0 0 0 0 0 0 0 
##$TUNHIN= 0
##$TUNHOUT= 0
##$TUNXOUT= 0
##$USERA1= <user>
##$USERA2= <user>
##$USERA3= <user>
##$USERA4= <user>
##$USERA5= <user>
##$V9= 5
##$VALIST= <valist>
##$VCLIST= <CCCCCCCCCCCCCCC>
##$VD= 0
##$VDLIST= <DDDDDDDDDDDDDDD>
##$VPLIST= <PPPPPPPPPPPPPPP>
##$VTLIST= <TTTTTTTTTTTTTTT>
##$WBST= 1024
##$WBSW= 4
##$XGAIN= (0..3)
0 0 0 0 
##$XL= 0
##$YL= 0
##$YMAX_a= 12340
##$YMIN_a= -10247
##$ZGOPTNS= <>
##$ZL1= 120
##$ZL2= 120
##$ZL3= 120
##$ZL4= 120
##$ABSF1= 198.0616
##$ABSF2= -202.7028
##$ABSG= 5
##$ABSL= 3
##$ALPHA= 0
##$AQORDER= 0
##$ASSFAC= 0
##$ASSFACI= 0
##$ASSFACX= 0
##$ASSWID= 0
##$AUNMP= <proc_1d>
##$AZFE= 0.1
##$AZFW= 0.5
##$BCFW= 0
##$BC_mod= 2
##$BYTORDP= 0
##$COROFFS= 0
##$CY= -3
##$DATMOD= 1
##$DC= 0
##$DFILT= <>
##$DTYPP= 0
##$F1P= 0
##$F2P= 0
##$FCOR= 1
##$FTSIZE= 65536
##$FT_mod= 6
##$GAMMA= 0
##$GB= 0
##$INTBC= 1
##$INTSCL= 9.790993e-09
##$ISEN= 30
##$LB= 1.5
##$LEV0= 0
##$LPBIN= 0
##$MAXI= 10000
##$MC2= 0
##$MEAN= 0
##$ME_mod= 0
##$MI= 50
##$NCOEF= 0
##$NC_proc= -8
##$NLEV= 6
##$NOISF1= 182.463
##$NOISF2= 159.3651
##$NSP= 0
##$NTH_PI= 0
##$NZP= 0
##$OFFSET= 198.0616
##$PC= 4
##$PHC0= 1620.984
##$PHC1= 239.2999
##$PH_mod= 1
##$PKNL= yes
##$PPARMOD= 0
##$PSCAL= 0
##$PSIGN= 0
##$REVERSE= no
##$SF= 81.0140089999434
##$SI= 65536
##$SIGF1= 159.3651
##$SIGF2= -187.1042
##$SINO= 113.3802
##$SIOLD= 16384
##$SREGLST= <1H.CDCl3>
##$SSB= 0
##$STSI= 65536
##$STSR= 0
##$SW_p= 32467.5324675325
##$SYMM= 0
##$S_DEV= 0
##$TDeff= 32768
##$TDoff= 0
##$TI= <>
##$TILT= no
##$TM1= 0
##$TM2= 0
##$TOPLEV= 0
##$USERP1= <user>
##$USERP2= <user>
##$USERP3= <user>
##$USERP4= <user>
##$USERP5= <user>
##$WDW= 1
##$XDIM= 65536
##$YMAX_p= 352762974
##$YMIN_p= -53242651
$$ End of Bruker specific parameters
$$ ---------------------------------
##NTUPLES= NMR SPECTRUM
##VAR_NAME=  FREQUENCY,     SPECTRUM/REAL,   SPECTRUM/IMAG
##SYMBOL=    X,             R,               I
##VAR_TYPE=  INDEPENDENT,   DEPENDENT,       DEPENDENT
##VAR_FORM=  AFFN,          ASDF,            ASDF
##VAR_DIM=   65536,         65536,           65536
##UNITS=     HZ,            ARBITRARY UNITS, ARBITRARY UNITS
##FACTOR=    0.49542278885378, 1,            1
##FIRST=     16045.7642231865, 0,            0
##LAST=      -16421.768244346, 0,            0
##MIN=       -16421.768244346, -53242651,    0
##MAX=       16045.7642231865, 352762974,    0
$$ Real data points
##PAGE= N=1
##DATA TABLE= (X++(R..R)), XYDATA
$$ [...]
##PAGE= N=2
##DATA TABLE= (X++(I..I)), XYDATA
$$ plain form
7480 -5563897 -2879802 1316312 4104515 5357129 6192937 5623072 2112206 -2741346 -5400621
7471 -5400621 -4926751 -3433534 -2054127 525222 4661371 7515430 6020547 815604
7463 815604 -4285352 -6227273 -5273891 -4152041 -5281429 -8475467 -11093669 -10963676 -9154993
7454 -9154993 -8869098 -11314028 -13950126 -13663017 -10555451 -7246577 -5114965 -3057030 -198818
7445 -198818 1860994 787445 -3089160 -6307259 -5441204 -285759 6066905 9817653 9238694
7436 9238694 5700896 2305442 983031 685615 -1010674 -4450809 -7172049 -7180427 -5549097
7427 -5549097 -4409317 -3603862 -1475300 1642431 3293736 2418996 466592 -1594193 -4623881
7418 -4623881 -8354971 -9815763 -7035659 -2387765 315109 584809 455459 276684 -1357756
$$ packed form
7480e563897K684095M196114K788203J252614Q35808n69865l510866m853552k659275
7471e400621M73870J493217J379407K579349M136149K854059j494883n204943
7463H15604n100956j941921R53382J121850j129388l194038k618202J29993J808683
7454i154993K85895k444930k636098K87109L107566L308874K131612K057935K858212
7445a98818K059812j073549l876605l218099Q66055N155445O352664L750748n78959
7436I238694l537798l395454j322411k97416j696289l440135k721240q378J631330
7427e549097J139780Q05455K128562L117731J651305q74740j952404k060785l029688
7418d623881l731090j460792K780104M647894K702874K69700j29350j78775j634440
$$ plain form
7409 -1357756 -4008374 -5237899 -4469069 -3865416 -4533748 -4781363 -3406768 -1952400 -1887091
7400 -1887091 -1964133 -672526 567987 -682990 -3938666 -6384601 -6760635 -5993303 -4219633
7391 -4219633 -167219 5699582 10073181 10664815 9523837 10314268 12975249 13418487 8996095
7382 8996095 2393153 -1335588 -749822 639994 -809368 -4154111 -5024506 -956477 5620678
7373 5620678 9969208 9857713 7207703 5212477 4632141 3574501 671226 -2779943 -4722679
7364 -4722679 -5426218 -6848369 -9067667 -9669668 -7614659 -5412324 -5452038 -5974502 -3529711
7355 -3529711 1490311 4984863 4744260 2645728 625882 -2061113 -5778541 -7821689
7347 -7821689 -5789423 -1777004 21633 -983366 -1602785 -199563 953223 -545070
$$ packed form
7409a357756k650618j229525P68830O03653o68332k47615J374595J454368O5309
7400a887091p7042J291607J240513j250977l255676k445935l76034P67332J773670
7391d219633M052414N866801M373599N91634j140978P90431K660981M43238m422392
7382H996095o602942l728741N85766J389816j449362l344743q70395M068029O577155
7373E620678M348530j11495k650010j995226n80336j057640k903275l451169j942736
7364d722679p03539j422151k219298o02001K055009K202335l9714n22464K444791
7355c529711N020022L494552k40603k098532k019846k686995l717428k043148
7347g821689K032266M012419J798637j004999o19419J403222J152786j498293
$$ plain form
7339 -545070 -3655387 -5585266 -5330689 -3981795 -2652530 -1725728 -1557276 -2345872 -3270435
7330 -3270435 -2940602 -1046543 1167267 2373786 2526620 2396777 2264455 1699577 501868
7321 501868 -796566 -1618464 -2111817 -2806456 -3641617 -3767193 -2453738 -34056 2177851
7312 2177851 2942683 2163786 873604 -45816 -1009507 -3054585 -5964806 -7942779 -7707776
7303 -7707776 -6128348 -4941022 -4633058 -4793315 -5827027 -8463639 -11588338 -12477534 -9799808
7294 -9799808 -4915425 292109 5145851 8934217 9965922 7641092 4162536 2236050
7286 2236050 1854588 1173140 -247572 -1345540 -2320642 -4806929 -8688552 -11156130 -10309151
7277 -10309151 -7970362 -7281530 -8677785 -9978907 -9717363 -8508773 -7350581 -6406438 -5760365
$$ packed form
7339e45070l110317j929879K54577J348894J329265R26802J68452p88596r24563
7330c270435L29833J894059K213810J206519J52834j29843j32322n64878j197709
7321E01868j298434q21898m93353o94639q35161j25576J313455K419682K211907
7312B177851P64832p78897j290182r19420r63691k045078k910221j977973K35003
7303g707776J579428J187326L07964j60257j033712k636612l124699q89196K677726
7294i799808M884383N207534M853742L788366J031705k324830l478556j926486
7286B236050l81462o81448j420712j097968r75102k486287l881623k467578Q46979
7277a0309151K338789O88832j396255j301122K61544J208590J158192R44143O46073
$$ plain form
7268 -5760365 -5677266 -5390242 -3177968 1063382 4452423 4065289 814652 -1378542 -321588
7259 -321588 2320836 4015675 4478843 4705548 4804029 4697619 5517184 7745763 8771592
7250 8771592 5313432 -1557357 -6822251 -7833241 -7320004 -8511808 -10153154 -9131643
7242 -9131643 -5964837 -4062851 -4280502 -3829200 -997308 2278764 3790480 4366174 5913052
7233 5913052 7929441 8174478 6086798 3666450 2995717 4071452 5114635 4302648 1472975
7224 1472975 -1145085 -338922 4871317 11541250 15333743 14751327 11903671 9213449 6952435
7215 6952435 4700398 3574487 5124403 8503778 10698492 10008295 7821738 6231920
7207 6231920 5295565 3876981 2097691 1170549 1182125 844313 -382129 -1565212 -2175033
$$ packed form
7268e760365Q3099K87024K212274M241350L389041l87134l250637k193194J056954
7259c21588K642424J694839M63168K26705R8481j06410Q19565K228579J025829
7250H771592l458160o870789n264894j010990N13237j191804j641346J021511
7242i131643L166806J901986k17651M51302K831892L276072J511716N75694J546878
7233E913052K016389K45037k087680k420348o70733J075735J043183q11987k829673
7224A472975k618060Q06163N210239O669933L792493n82416k847656k690222k261014
7215F952435k252037j125911J549916L379375K194714o90197k186557j589818
7207F231920r36355j418584j779290r27142J1576l37812j226442j183083o09821
$$ plain form
7198 -2175033 -3043627 -4485777 -4884834 -2694303 888983 2879398 2050852 204838 -383567
7189 -383567 215452 -142194 -3108314 -8044084 -12609583 -14770978 -14117628 -11470232 -7841013
7180 -7841013 -4243902 -1963080 -1860314 -3294132 -4776719 -6023924 -8199667 -11481815
7172 -11481815 -13646850 -12438640 -8725055 -5781753 -5348435 -5599877 -3652038 440840
7164 440840 2976329 381394 -6336323 -11784597 -11717014 -7715642 -4851486 -5086278 -5371653
7155 -5371653 -2866402 668052 1585963 -486408 -2636210 -2633200 -528163 2827620 6228832
7146 6228832 7455834 4928768 447534 -1952118 -570484 2188364 3044334 1195369
7138 1195369 -1960205 -4762780 -6283104 -6683583 -7101059 -8153291 -8644520 -7200863 -4950758
$$ packed form
7198b175033q68594j442150l99057K190531L583286J990415q28546j846014n88405
7189c83567N99019l57646k966120m935770m565499k161395O53350K647396L629219
7180g841013L597111K280822J02766j433818j482587j247205k175743l282148
7172a1481815k165035J208210L713585K943302M33318k51442J947839M092878
7164D40840K535489k594935o717717n448274O7583M001372K864156k34792k85375
7155e371653K505251L534454R17911k072371k149802L010K105037L355783L401212
7146F228832J227002k527066m481234k399652J381634K758848Q55970j848965
7138A195369l155574k802575j520324m00479m17476j052232m91229J443657K250105
$$ plain form
7129 -4950758 -4529730 -6286091 -7762179 -7464930 -6756476 -7054385 -7513959 -6878558 -5546796
7120 -5546796 -4227573 -2441994 -73379 1392545 1097466 664338 1780975 3467480 4025859
7111 4025859 4219909 5693080 7245878 5964846 1939633 -1309306 -1769755 -1578362 -3510067
7102 -3510067 -6930042 -8806947 -7535059 -4441923 -2185214 -2486334 -4861089 -7009187
7094 -7009187 -6927126 -4851000 -2551268 -912445 625467 2224570 2852219 2010971 949938
7085 949938 1136990 2359959 3224089 2855915 1372216 -614253 -2156026 -2349805 -1449164
7076 -1449164 -988253 -1907004 -3213120 -3534386 -3252138 -3636748 -4385457 -3916193 -2159221
7067 -2159221 -980610 -1072769 -398227 2756484 6630945 7838376 5537277 1763607 -1820354
$$ packed form
7129d950758M21028j756361j476088K97249P08454k97909m59574O35401J331762
7120e546796J319223J785579K368615J465924k95079m33128J116637J686505N58379
7111D025859J94050J473171J552798j281032m025213l248939m60449J91393j931705
7102c510067l419975j876905J271888L093136K256709l01120k374755k148098
7094g009187Q2061K076126K299732J638823J537912J599103O27649q41248j061033
7085I49938J87052J222969Q64130l68174j483699j986469j541773j93779R00641
7076a449164M60911r18751j306116l21266K82248l84610p48709M69264J756972
7067b159221J178611r2159O74542L154711L874461J207431k301099l773670l583961
$$ plain form
7058 -1820354 -5082295 -7302537 -6731419 -3523876 -867435 -1262079 -3139069 -3161502 -785775
7049 -785775 1622557 2488086 2470485 2368713 1923344 1196994 1235134 2503188 3883043 3829658
7039 3829658 1758936 -1607543 -4231471 -3678335 165957 3773792 3722761 1556356 1984713
7030 1984713 5974916 9184101 8503383 6379065 6203666 6914764 5777684 3877799 4400352
7021 4400352 6819049 7368524 5074117 3073014 3380017 4149196 3293214 1563485 522637
7012 522637 115298 -213778 -268992 -406922 -1891279 -4399715 -5260357 -2941916 509346
7003 509346 2335963 2651146 3109779 3563837 2596539 610862 -107717 1571862 4272487
6994 4272487 5791027 4825003 1371787 -3079597 -5922101 -5473990 -2740784 -92742 1519377
$$ packed form
7058a820354l261941k220242N71118L207543K656441l94644j876990k2433K375727
7049g85775K408332Q65529j7601j01772m45369p26350L8140J268054J379855n3385
7039C829658k070722l366479k623928N53136L844292L607835n1031k166405M28357
7030A984713L990203L209185o80718k124318j75399P11098j137080j899885N22553
7021D400352K418697N49475k294407k001103L07003P69179q55982j729729j040848
7012E22637m07339l29076n5214j37930j484357k508436q60642K318441L451262
7003E09346J826617L15183M58633M54058r67298j985677p18579J679579K700625
6994D272487J518540r66024l453216m451384k842504M48111K733206K648042J612119
$$ plain form
6985 1519377 2772895 3817262 3696765 2145720 366669 -539340 -679329 -380459 660480
6976 660480 2413711 3654753 3105047 1060177 -833422 -1208767 37436 2017796 3540827
6967 3540827 3666136 2120967 -540294 -3127317 -4262108 -3113661 -223822 2495876
6959 2495876 3107749 1078265 -2781797 -7283095 -11004525 -11966337 -8732185 -2481991 3009780
6950 3009780 4399302 1531643 -3041875 -6544958 -7548795 -6126200 -3618679 -1878990
6942 -1878990 -1708892 -2093574 -1595419 -136575 1338883 2383343 3048191 2850457 1413663
6933 1413663 176803 1546036 5536493 8863260 8624733 5735237 3359168 2919152 3268678
6924 3268678 3183858 2826890 2738744 2926730 3194509 3166384 1873588 -1382414 -5492166 -8108480
$$ packed form
6985A519377J253518J044367j20497j551045j779051r06009j39989K98870J040939
6976F60480J753231J241042n49706k044870j893599l75345J246203J980360J523031
6967C540827J25309j545169k661261k587023j134791J148447K889839K719698
6959B495876O11873k029484l860062m501298l721430r61812L234152O250194N491771
6950C009780J389522k867659m573518l503083j003837J422595K507521J739689
6942a878990J70098l84682M98155J458844J475458J044460O64848j97734j436794
6933A413663j236860J369233L990457L326767k38527k889496k376069m40016L49526
6924C268678q4820l56968q8146J87986K67779k8125j292796l256002m109752k616314
$$ plain form
6914 -8108480 -8132548 -6554209 -4630209 -2597302 -587735 730324 1249510 1813702 2566326
6905 2566326 2176681 -171669 -3162897 -4944561 -5330324 -5169698 -4575390 -3242355 -1611375
6896 -1611375 -151826 1644041 3887671 4934759 3578373 1808084 2653009 5439996
6888 5439996 6180299 3251008 -312747 -1614034 -2278418 -5678853 -11468492 -15587388 -15291924
6879 -15291924 -12054274 -9307492 -8799052 -9570622 -9679314 -8506729 -7450866 -8101423 -9825808
6870 -9825808 -10129489 -7760446 -4279053 -1818245 -549992 466469 1130376 707357 -304952
6861 -304952 -577918 -60067 -33649 -986981 -1920264 -2030282 -1800211 -2075505 -3075617 -4442383
6851 -4442383 -5212256 -3853894 169650 4719317 6547943 5077819 2991827 2432280 2525312
$$ packed form
6914h108480k4068J578339J924000K032907K009567J318059N19186N64192P52624
6905B566326l89645k348350k991228j781664l85763J60626N94308J333035J630980
6896a611375J459549J795867K243630J047088j356386j770289Q44925K786987
6888E439996P40303k929291l563755j301287o64384l400435n789639m118896K95464
6879a5291924L237650K746782N08440p71570j08692J172585J055863o50557j724385
6870i825808l03681K369043L481393K460808J268253J016461O63907m23019j012309
6861c04952k72966N17851K6418r53332r33283j10018K30071k75294j000112j366766
6851d442383p69873J358362M023544M549667J828626j470124k085992n59547R3032
$$ plain form
6842 2525312 1838707 1288006 2586450 5218441 7283338 8422525 9380346 9240639 6146457
6833 6146457 1150458 -1638728 -133669 2734474 2715608 -790505 -5113610 -8086415 -9469357
6824 -9469357 -9751695 -9624242 -9999117 -10728815 -9956079 -6582415 -2650545 -1094167 -1681690
6815 -1681690 -1717150 -528642 -369691 -2474492 -5153503 -6787683 -7920676 -8925971 -8255611
6806 -8255611 -5081746 -1584703 -342346 -977228 -1394402 -812712 343671 1726692 2033975
6797 2033975 -1082649 -7007821 -10188762 -6384291 333892 1671914 -3927846 -9507361
6789 -9507361 -9659337 -6995449 -6113937 -6165447 -3764856 84957 1146611 -1345162 -3784806
6780 -3784806 -3760436 -2456187 -1089881 1273127 4983150 7813824 7608538 5110575 2532897
$$ packed form
6842B525312o86605n50701J298444K631991K064897J139187R57821j39707l094182
6833F146457m995999k789186J505059K868143j8866l506113m323105k972805j382942
6824i469357k82338J27453l74875p29698P72736L373664L931870J556378n87523
6815a681690l5460J188508J58951k104801k679011j634180j132993j005295O70360
6806h255611L173865L497043J242357o34882m17174N81690J156383J383021L07283
6797B033975l116624n925172l180941L804471O718183J338022n599760n579515
6789i507361j51976K663888Q81512n1510K400591L849813J061654k491773k439644
6780c784806K4370J304249J366306K363008L710023K830674k05286k497963k577678
$$ plain form
6771 2532897 691482 -904641 -2198201 -2445171 -1400376 621335 3379403 6176373
6763 6176373 7215674 5182946 1636521 182632 2377044 5539626 5784022 2544391
6755 2544391 -1179501 -2687081 -2130176 -1076354 -240491 360343 217327 -1223105 -3313481
6746 -3313481 -4590603 -4323324 -2888488 -917254 960452 1687919 198984 -3392225 -7520140
6737 -7520140 -10271597 -10738247 -9718903 -9184775 -10119665 -10551591 -7180125 57388 6605311
6728 6605311 8073014 5048332 1300787 -1248583 -3145677 -4362313 -4168635 -3620677 -4535335
6719 -4535335 -5827452 -4544702 -1028838 992706 544577 1202743 4626648 6744475 3929844
6710 3929844 -640757 -1315702 1680190 3012952 277020 -3320653 -4296977 -2935177 -1334345
$$ packed form
6771B532897j841415j596123j293560k46970J044795K021711K758068K796970
6763F176373J039301k032728l546425j453889K194412L162582K44396l239631
6755B544391l723892j507580N56905J053822Q35863O00834j43016j440432k090376
6746c313481j277122K67279J434836J971234J877706P27467j488935l591209m127915
6737g520140k751457m66650J019344N34128r34890m31926L371466P237513O547923
6728F605311J467703l024682l747545k549370j897094j216636J93678N47958r14658
6719d535335j292117J282750L515864K021544m48129O58166L423905K117827k814631
6710C929844m570601o74945K995892J332762k735932l597673r76324J361800J600832
$$ plain form
6701 -1334345 -652080 -1278712 -3261067 -5475257 -6098825 -4669779 -2522888 -1096485 -999641
6692 -999641 -2410741 -4895405 -7109268 -8029672 -7938464 -7004717 -4294366 -155518 2096903
6683 2096903 -25258 -3763986 -4108953 -849783 1209384 -638793 -3686721 -4649911 -3847189
6674 -3847189 -2602337 -100941 4188875 7508090 6592865 2294039 -1320655 -1822594 -217961
6665 -217961 1466019 2236315 1987810 1153649 652386 920096 1002103 -296110 -2448455
6656 -2448455 -3560490 -2802999 -1373747 -520858 497077 3367788 7676052 10101913 7729260
6647 7729260 1719253 -3662077 -5702665 -5374678 -4559094 -3404371 -1779967 -1148491 -2631755
6638 -2631755 -4657622 -5019907 -4101412 -3446560 -2425344 392236 3458519 3718961 1660039
$$ packed form
6701a334345O82265o26632j982355k214190o23568J429046K146891J426403R6844
6692i99641j411100k484664k213863r20404R1208R33747K710351M138848K252421
6683B096903k122161l738728l44967L259170K059167j848177l047928r63190Q02722
6674c847189J244852K501396M289816L319215r15225m298826l614694n01939J604633
6665b17961J683980P70296k48505q34161n01263K67710Q2007j298213k152345
6656b448455j112035P57491J429252Q52889J017935K870711M308264K425861k372653
6647G729260o010007n381330k040588L27987Q15584J154723J624404O31476j483264
6638b631755k025867l62285R18495O54852J021216K817580L066283K60442k058922
$$ plain form
6629 1660039 876573 2291716 3003356 1724107 892022 1697186 1528398 -927763 -2161872
6620 -2161872 911651 5328008 5785930 1927923 -1979770 -3203339 -2670460 -1857526 -1034955
6611 -1034955 -336247 171996 1177239 2686649 2744845 -54386 -3739781 -5185108 -4180784
6602 -4180784 -2606364 -704387 2455904 5458076 5258449 1737439 -1752334 -2968911
6594 -2968911 -2938455 -2913472 -2276891 -702334 281300 -506239 -2070466 -2972071 -3217210 -3285226
6584 -3285226 -2901475 -1950176 -1173856 -867823 -171060 1378270 2857211 3441282 3626256
6575 3626256 4133039 4914079 6067034 8180835 10656830 11318416 9301974 6965521 6908392
6566 6908392 8029327 6917397 2940995 -516622 -572959 1501433 2517821 1696387 726769
$$ packed form
6629A660039p83466J415143P11640j279249q32085Q05164j68788k456161j234109
6620b161872L073523M416357M57922l858007l907693j223569N32879Q12934Q22571
6611a034955O98708N08243J005243J509410N8196k799231l685395j445327J004324
6602d180784J574420J901977L160291L002172j99627l521010l489773j216577
6594b968911L0456K4983O36581J574557R83634p87539j564227r01605k45139o8016
6584c285226L83751R51299P76320L06033O96763J549330J478941N84071J84974
6575C626256N06783P81040J152955K113801K475995O61586k016442k336453n7129
6566F908392J120935j111930l976402l457617n6337K074392J016388q21434r69618
$$ plain form
6557 726769 187681 -1618909 -5588137 -9585671 -10864493 -9510307 -7691940 -6261980 -4274270
6548 -4274270 -1744545 -580493 -2145232 -5730570 -10019979 -14102272 -16346688 -14713072
6540 -14713072 -9773973 -5455965 -4921939 -7253420 -9774668 -11682263 -13324850 -14034851
6532 -14034851 -13583643 -14183792 -17738515 -22067800 -23166043 -20617404 -17561479 -15829315
6524 -15829315 -14605633 -13634156 -13869329 -14551384 -13443536 -10847575 -9749434 -10851379 -11148190
6515 -11148190 -9008097 -6968700 -7233009 -7724701 -5440342 -1090229 2468960 4251298
6507 4251298 4847431 4218144 2759487 2757376 5583636 8801172 9204624 7540787 6859801
6498 6859801 7155903 5546781 1728489 -675216 690972 3443437 3733957 816509 -3107522
$$ packed form
6557G26769n39088j806590l969228l997534j278822J354186J818367J429960J987710
6548d274270K529725J164052j564739l585338m289409m082293k244416J633616
6540a4713072M939099M318008N34026k331481k521248j907595j642587p10001
6532a4034851M51208o00149l554723m329285j098243K548639L055925J732164
6524a5829315J223682R71477k35173o82055J107848K595961J098141j101945k96811
6515a1148190K140093K039397k64309m91692K284359M350113L559189J782338
6507D251298N96133o29287j458657k111K826260L217536M03452j663837o80986
6498F859801K96102j609122l818292k403705J366188K752465K90520k917448l924031
$$ plain form
6489 -3107522 -5884910 -6773326 -6006897 -4407239 -2926189 -1809268 -589947 899400 2181439
6480 2181439 2777413 2272602 -69513 -4295177 -8234770 -8840413 -5974336 -3350745 -4318381
6471 -4318381 -7669337 -9120339 -6404049 -1341101 3006409 5538207 6787756 6743840 4635902
6462 4635902 928042 -1839184 -1298014 1898774 4453645 3966654 1449224 -164667 572201
6453 572201 2489102 3756062 3882559 3453362 2808313 1872059 961861 750811 1149092
6444 1149092 988890 -546117 -2612784 -3562244 -2845509 -1253873 454450 1867011 1783217
6435 1783217 -1398091 -7027578 -11393627 -11319649 -7822186 -4479586 -2823229 -1471375 383403
6426 383403 1180537 -462381 -3344515 -5049904 -4506715 -2278876 500700 2555690 2934708
$$ packed form
6489c107522k777388q88416P66429J599658J481050J116921J219321J489347J282039
6480B181439N95974n04811k342115m225664l939593o05643K866077K623591r67636
6471d318381l350956j451002K716290N062948M347510K531798J249549m3916k107938
6462D635902l707860k767226N41170L196788K554871m86991k517430j613891P36868
6453E72201J916901J266960J26497m29197o45049r36254r10198k11050L98281
6444A149092j60202j535007k066667r49460P16735J591636J708323J412561q3794
6435A783217l181308n629487m366049P3978L497463L342600J656357J351854J854778
6426C83403P97134j642918k882134j705389N43189K227839K779576K054990L79018
$$ plain form
6417 2934708 2052565 1365749 1222066 139975 -2797480 -5997527 -7165904 -6264999 -5262967
6408 -5262967 -5417931 -6155918 -6448794 -6114448 -5651172 -5560987 -5928627 -6275284 -5996574 -5175676
6398 -5175676 -4498824 -4168682 -3729468 -3373910 -4284315 -6704760 -8638076 -7905131 -5147625
6389 -5147625 -3368629 -4295210 -6263119 -6260263 -3555337 -672319 -640353 -3608897 -6748149
6380 -6748149 -7592320 -6610571 -5805532 -5775958 -5630865 -5222490 -5518969 -6650706 -7413344 -7198253
6370 -7198253 -6878117 -7245889 -7887748 -7933877 -6688755 -3681186 188939 1961936 -369800
6361 -369800 -4223694 -4921661 -2200207 -546912 -2004796 -2927523 -229890 3275249 3291691
6352 3291691 380956 -2204164 -4202123 -7139677 -9407598 -7659672 -2437599 2145189
$$ packed form
6417B934708q82143o86816j43683j082091k937455l200047j168377R00905J002032
6408e262967j54964p37987k92876L34346M63276R0185l67640l46657K78710Q20898
6398e175676O76852L30142M39214L55558r10405k420445j933316P32945K757506
6389e147625J778996r26581j967909K856K704926K883018L1966k968544l139252
6380f748149q44171R81749Q05039K9574J45093M08375k96479j131737p62638K15091
6370g198253L20136l67772o41859m6129J245122L007569L870125J772997k331736
6361c69800l853894o97967K721454J653295j457884r22727K697633L505139J6442
6352C291691k910735k585120j997959k937554k267921J747926N222073M582788
$$ plain form
6344 2145189 4048450 4503902 3967223 1426304 -1873246 -2417280 610694 3726792 3541917
6335 3541917 -79957 -5606987 -11258894 -14338691 -12767062 -8398914 -5674251 -5966788
6327 -5966788 -6304873 -4489726 -2063073 -999347 -770877 -136656 1148880 3569341 7560743
6318 7560743 10866997 9821597 4800648 692444 203606 704238 -117001 39389 3348196
6309 3348196 6831228 6332661 2658155 -372615 -1564916 -1971192 -1184520 1513308 3938894
6300 3938894 3379612 1117790 561196 1926761 2810684 2962544 4100128 5673894 5419096
6291 5419096 3971360 4370650 6667177 7454189 5408172 2933670 1368116 -944911 -4231961
6282 -4231961 -5373393 -2854347 133862 424418 -434579 563530 2424299 1552838 -2721831
$$ packed form
6344B145189J903261M55452n36679k540919l299550n44034L027974L116098j84875
6335C541917l621874n527030n651907l079797J571629M368148K724663k92537
6327e966788l38085J815147K426653J063726K28470O34221J285536K420461L991402
6318G560743L306254j045400n020949m108204m88838N00632q21239J56390L308807
6309C348196L483032m98567l674506l030770j192301m06276P86672K697828K425586
6300C938894n59282k261822n56594J365565Q83923J51860J137584J573766k54798
6291E419096j447736L99290K296527P87012k046017k474502j565554k313027l287050
6282d231961j141432K519046K988209K90556q58997R98109J860769q71461m274669
$$ plain form
6273 -2721831 -7267332 -9255635 -8588940 -6546708 -4267408 -2666532 -2178548 -2295576 -2285822
6264 -2285822 -2222557 -2532226 -2929417 -2667864 -1596177 -351049 257810 -132255 -804405
6255 -804405 75010 3680398 8378793 10767216 9567303 7110551 6043277 6025701 5028048
6246 5028048 2585438 -164 -1884872 -3280224 -4195779 -4279383 -3855385 -3649417 -3454098
6237 -3454098 -2532229 -1513603 -2206944 -4701773 -6115448 -3807805 753083 3138642 1308565
6228 1308565 -1797620 -2152936 108695 1310407 -315259 -2331940 -2078493 -540373 -366049
6219 -366049 -1809780 -3140593 -3952376 -5215899 -6531370 -6358014 -5109253 -5029891 -6468378
6210 -6468378 -7337665 -7180684 -8362426 -11438390 -12735737 -9483223 -4704031 -3351824 -5229464
$$ packed form
6273b721831m545501j988303O66695K042232K279300J600876M87984j17028R754
6264b285822O3265l09669l97191K61553J071687J245128O08859l90065o72150
6255h04405Q79415L605388M698395K388423j199913k456752j067274j7576r97653
6246E028048k442610k585602j884708j395352r15555q3604M23998K05968J95319
6237c454098R21869J018626o93341k494829j413675K307643M560888K385559j830077
6228A308565l106185l55316K261631J201712j625666k016681K53447J538120J74324
6219c66049j443731j330813q11783j263523j315471J73356J248761P9362j438487
6210f468378q69287J56981j181742l075964j297347L252514M779192J352207j877640
$$ plain form
6201 -5229464 -5676120 -2625962 935336 1878282 813479 9894 206293 922324 1912560
6192 1912560 2873808 3098110 2494665 1797275 1092781 -433994 -2571753 -3528178 -2410890
6183 -2410890 -841234 -767641 -1786034 -1984322 -527865 1960754 4778585 7359089 8617833
6174 8617833 7697890 5407506 3726971 3739494 4833573 5811686 5918932 4932331 3197966
6165 3197966 1608037 773770 305588 -365743 -794746 -211463 838411 906424 -218223
6156 -218223 -1219345 -1482123 -2113916 -3961795 -5989357 -6775115 -6522108 -6234716 -5815548
6147 -5815548 -4596403 -3134420 -2589890 -2482622 -1095508 1502531 2853702 1571163 -283400
6138 -283400 134620 2519087 4034980 3472666 2856798 4487283 7807308 10076970 9388340
$$ packed form
6201e229464m46656L050158L561298R42946j064803q03585J96399P16031R90236
6192A912560R61248K24302o03445o97390p04494j526775k137759r56425J117288
6183b410890J569656P3593j018393j98288J456457K488619K817831K580504J258744
6174H617833r19943k290384j680535J2523J094079R78113J07246r86601j734365
6165C197966j589929q34267m68182o71331m29003N83283J049874O8013j124647
6156b18223j001122k62778o31793j847879k027562p85758K53007K87392M19168
6147e815548J219145J461983N44530J07268J387114K598039J351171j282539j854563
6138b83400M18020K384467J515893n62314o15868J630485L320025K269662o88630
$$ plain form
6129 9388340 6173996 2107112 -1635251 -4839325 -7486561 -9049696 -8776496 -6536223
6121 -6536223 -3094653 436207 3099451 4137247 3246222 1125238 -856881 -2043105
6113 -2043105 -2968402 -3927395 -3908426 -2055690 433112 1441633 886834 828316 2161486
6104 2161486 2927652 1128127 -2050038 -3522766 -2280884 -317648 467964 561269 1256842
6095 1256842 2208214 2086254 1196395 1708936 4676215 7975990 8391955 5383681 1658736
6086 1658736 -118083 -157610 -600602 -2578104 -5065842 -6299346 -5546878 -3617684 -2245452
6077 -2245452 -2813150 -4986846 -6639243 -5814763 -2880828 -190749 408131 -880271 -2746932
6068 -2746932 -4414571 -5912376 -7349563 -8574379 -9411818 -9826933 -9828534 -9362068 -8310616
$$ packed form
6129I388340l214344m066884l742363l204074k647236j563135K73200K240273
6121f536223L441570L530860K663244J037796q91025k120984j982119j186224
6113b043105r25297r58993J8969J852736K488802J008521n54799n8518J333170
6104B161486P66166j799525l178165j472728J241882J963236P85612R3305O95573
6095A256842R51372j21960q89859N12541K967279L299775M15965l008274l724945
6086A658736j776819l9527m42992j977502k487738j233504P52468J929194J372232
6077b245452n67698k173696j652397Q24480K933935K690079N98880j288402j866661
6068b746932j667639j497805j437187j224816q37439m15115j601M66466J051452
$$ plain form
6059 -8310616 -6614049 -4402884 -1867248 1039622 4422169 7797531 10100125 10691734
6051 10691734 9932893 8435764 6466357 4646336 4271751 5746998 7327679 6794392 4086389
6042 4086389 1092414 -663571 -719783 1170066 4391893 6279178 4232055 -474312 -3533086
6033 -3533086 -3115280 -1990298 -2969061 -5069722 -6248949 -7223193 -9448860 -11103266 -8747209
6024 -8747209 -2508033 3571587 6442097 6666299 6015165 5052614 3635360 1603727 -1607942
6015 -1607942 -6155850 -10245281 -11416309 -9714246 -7475775 -5697835 -3200372 -6722
6007 -6722 1554593 758817 651812 3835404 8192155 9621400 7607754 5169002 4196703
5998 4196703 3922350 3737246 4367294 5528036 5045282 1778267 -2129562 -3305749 -774340
$$ packed form
6059h310616J696567K211165K535636K906870L382547L375362K302594N91609
6051A0691734p58841j497129j969407j820021l74585J475247J580681n33287k708003
6042D086389k993975j755985n6212J889849L221827J887285k047123m706367l058774
6033c533086M17806J124982r78763k100661j179227r74244k225667j654406K356057
6024h747209O239176O079620K870510K24202o51134r62551j417254k031633l211669
6015a607942m547908m089431j171028J702063K238471J777940K497463L193650
6007f722J561315p95776j07005L183592M356751J429245k013646k438752r72299
5998D196703k74353j85104O30048J160742m82754l267015l907829j176187K531409
$$ plain form
5989 -774340 3151662 4968809 2713380 -2483085 -7169522 -8636412 -7345673 -5559569
5981 -5559569 -3969698 -1437773 1755684 2780556 -89154 -4304695 -5600978 -3044116
5973 -3044116 372657 1864179 1615549 1159023 881207 196151 -929498 -1831567 -2104158
5964 -2104158 -1841669 -1162025 -173397 715532 1056439 954233 980016 1471957 2251431 3008870
5954 3008870 3579119 3725946 3012719 1227795 -1084528 -2781010 -3074419 -2413858 -2196729
5945 -2196729 -3340246 -5286696 -6816686 -7668951 -8557750 -9415828 -8736244 -5662670 -2065813
5936 -2065813 -1080986 -3453062 -6527818 -7293648 -5429037 -2766874 -699605 916081 2773404
5927 2773404 4993904 6909608 7431689 5866570 2841033 99495 -1108793 -1114523 -971906
$$ packed form
5989g74340L926002J817147k255429n196465m686437j466890J290739J786104
5981e559569J589871K531925L193457J024872k869710m215541j296283K556862
5973c044116L416773J491522k48630m56526k77816o85056j125649r02069k72591
5964b104158K62489O79644R88628Q88929L40907j02206K5783M91941P79474P57439
5954C008870N70249J46827p13227j784924k312323j696482k93409O60561K17129
5945b196729j143517j946450j529990q52265q88799q58078O79584L073574L596857
5936b065813R84827k372076l074756p65830J864611K662163K067269J615686J857323
5927B773404K220500J915704N22081j565119l025537k741538j208288n730J42617
$$ plain form
5918 -971906 -1221325 -2068153 -3745000 -5465673 -4953125 -982873 3804537 4804522 773521
5909 773521 -4538695 -6953004 -6356202 -5340041 -4902790 -3606836 -575927 2589631 3409414
5900 3409414 1220009 -1978066 -3129175 -959791 2479827 3847129 2479990 1101831
5892 1101831 1746029 2767569 1866612 513884 2181862 6561450 9155472 7597007 5059411
5883 5059411 5355481 7328855 6983675 3508627 -47723 -1512470 -1905873 -2702735 -3397579
5874 -3397579 -2834793 -1209836 353071 1140958 1030896 225301 -689578 -1259404 -1988401
5865 -1988401 -3625870 -5428188 -5438816 -2968341 454976 3059858 4306284 3855702 1064678
5856 1064678 -3035932 -4937534 -2000654 4105965 9127899 10817212 10110823 8495734
$$ packed form
5918i71906k49419q46828j676847j720673N12548L970252M787410R99985m031001
5909G73521n312216k414309N96802J016161M37251J295954L030909L165558Q19783
5900C409414k189405l198075j151109K169384L439618J367302j367139j378159
5892A101831O44198J021540r00957j352728J667978M379588K594022j558465k537596
5883E059411K96070J973374l45180l475048l556350j464747l93403p96862o94844
5874c397579N62786J624957J562907P87887j10062q05595r14879n69826p28997
5865a988401j637469j802318j0628K470475L423317K604882J246426m50582k791024
5856A064678m100610j901602K936880O106619N021934J689313p06389j615089
$$ plain form
5848 8495734 6515805 4770030 3967486 3382029 1237044 -2546287 -5666802 -6392125 -5631657
5839 -5631657 -5036178 -4476616 -2727571 376856 3714880 6044631 6497486 4925436 2799440
5830 2799440 2626005 5085997 7663656 7553182 5077050 2726112 1806569 1957340 3053523
5821 3053523 4980267 5816083 3240464 -1557891 -4126989 -2321209 627255 471210 -2386550
5812 -2386550 -3909776 -2133957 566625 868209 -1765360 -5173199 -7069300 -7020750 -6479932
5803 -6479932 -6964205 -7901378 -6943215 -3323613 -114344 -1389498 -7102835 -12473361 -13094094
5794 -13094094 -9374604 -5155347 -3108612 -2765619 -2509721 -2066536 -2553532 -4620881 -7133105
5785 -7133105 -8008666 -6405997 -3648417 -1584245 -575819 -3419 -252125 -2518513 -6298257
$$ packed form
5848H495734j979929j745775q02544n85457k144985l783331l120515p25323P60468
5839e631657N95479N59562J749045L104427L338024K329751M52855j572050k125996
5830B799440j73435K459992K577659j10474k476132k350938r19543J50771J096183
5821C053523J926744Q35816k575619m798355k569098J805780K948464j56045k857760
5812b386550j523226J775819K700582L01584k633569l407839j896101M8550N40818
5803f479932m84273r37173R58163L619602L209269j275154n713337n370526o20733
5794a3094094L719490M219257K046735L42993K55898M43185m86996k067349k512224
5785g133105q75561J602669K757580K064172J008426N72400k48706k266388l779744
$$ plain form
5776 -6298257 -8775363 -7828577 -4469590 -1090945 1591411 4268634 6627687 7349024 6435781
5767 6435781 5574379 5749818 6078403 5409680 3447365 -244265 -6376613 -13809726 -18931664
5758 -18931664 -18961283 -14987375 -10250755 -6435004 -3429748 -1672471 -2010870 -3264216 -2631397
5749 -2631397 544564 3512559 3813555 2486692 2086289 2925094 3166161 1898287 280195
5740 280195 -215082 719332 2425564 3774417 3601111 1894172 510396 1406566 4023103
5731 4023103 5751907 5363870 4623120 5746939 8370246 10085106 9367566 6995084 4900180
5722 4900180 4429491 5523447 6924612 7295750 6586566 6044570 6492799 7176411 7050282
5713 7050282 6553810 6776855 7073647 5240726 758266 -3584104 -4623965 -2608148 -594462
$$ packed form
5776f298257k477106R46786L358987L378645K682356K677223K359053P21337r13243
5767F435781q61402J75439L28585o68723j962315l691630o132348p433113n121938
5758a8931664k9619L973908M736620L815751L005256J757277l38399j253346O32819
5749b631397L175961K967995L00996j326863m00403Q38805K41067j267874j618092
5740B80195m95277R34414J706232J348853j73306j706939j383776Q96170K616537
5731D023103J728804l88037p40750J123819K623307J714860p17540k372482k094904
5722D900180m70689J093956J401165L71138p09184n41996M48229O83612j26129
5713G050282m96472K23045K96792j832921m482460m342370j039861K015817K013686
$$ plain form
5704 -594462 -440548 -1025974 -701084 148603 21601 -1256375 -2321510 -2117097 -838090
5695 -838090 790777 2129087 2551490 1878338 1109326 1658932 3350608 4092801 2287089
5686 2287089 -1104278 -3663935 -4170566 -3340839 -2379774 -1814679 -1679287 -1875926 -2068910
5677 -2068910 -1814562 -1068897 -265924 87619 -458859 -2306604 -5171201 -7461849 -7304548
5668 -7304548 -4742609 -2260641 -2338284 -4692690 -6633213 -6191970 -4271690 -3293059 -4105613
5659 -4105613 -5031595 -4245584 -2383310 -1837096 -3586174 -5866604 -6433654 -5092661 -3122668
5650 -3122668 -1133451 1097518 3111218 3754097 2891982 1780213 1367570 1510311 2261878
5641 2261878 4322827 7174559 8274079 5891541 1966751 134406 952022 996745 -2663871
$$ packed form
5704e94462J53914n85426L24890Q49687j27002j277976j065135K04413J279007
5695h38090J628867J338310M22403o73152p69012N49606J691676P42193j805712
5686B287089l391367k559657n06631Q29727R61065N65095J35392j96639j92984
5677b068910K54348P45665Q02973L53543n46478j847745k864597k290648J57301
5668g304548K561939K481968p7643k354406j940523M41243J920280R78631q12554
5659d105613r25982P86011J862274N46214j749078k280430n67050J340993J969993
5650c122668J989217K230969K013700O42879q62115j111769m12643J42741P51567
5641B261878K060949K851732J099520k382538l924790j832345Q17616M4723l660616
$$ plain form
5632 -2663871 -8566639 -12381573 -11391828 -6484681 -463917 4319856 6835272 7130990 5802563
5623 5802563 3355278 356 -3620405 -5864328 -5290192 -2744840 -1239331 -2837743
5615 -2837743 -6167558 -7992793 -7007632 -4945609 -3825550 -3350917 -1809450 1219102 4029741
5606 4029741 4474362 1924657 -2113932 -4807279 -3969139 -262807 2734917 1799753 -2341774
5597 -2341774 -5584496 -4970314 -1711407 925224 1767638 2454131 4321512 6224928 6256194
5588 6256194 4601030 3343536 3636843 4414507 4270618 3312783 2214585 609395 -1902559
5579 -1902559 -3786053 -2829697 352692 2280691 1056801 -1104372 -1224233 455324 1897052
5570 1897052 3010421 5060114 7199045 6986248 4597204 3237503 4268887 4900833 2602912
$$ packed form
5632b663871n902768l814934R89745M907147O020764M783773K515416K95718j328427
5623E802563k447285l354922l620761k243923N74136K545352J505509j598412
5615b837743l329815j825235R85161K062023J120059M74633J541467L028552K810639
5606D029741M44621k549705m038589k693347Q38140L706332K997724r35164m141527
5597b341774l242722O14182L258907K636631Q42414O86493J867381J903416L1266
5588F256194j655164j257494K93307P77664j43889r57835j098198j605190k511954
5579a902559j883494R56356L182389J927999j223890k161173j19861J679557J441728
5570A897052J113369K049693K138931k12797k389044j359701J031384O31946k297921
$$ plain form
5561 2602912 -608132 -780114 2573213 6186821 7340510 6135383 3926964 1742456
5553 1742456 311705 -304127 -1481176 -4745580 -9165834 -11512629 -9867874 -5997320
5545 -5997320 -3165775 -2276965 -1246576 1882267 6048747 7928358 5554951 784856
5537 784856 -2381714 -1967906 120185 685380 -1056338 -3094605 -3464090 -2474692 -1995759
5528 -1995759 -3113079 -4815398 -5062816 -3264185 -1318507 -1363498 -2653240 -2134174 1380894
5519 1380894 5259294 6443698 5322129 4524574 5101997 6080658 6948119 7895257 7758251
5510 7758251 4651430 -592097 -4211638 -4111233 -2590306 -2915104 -4957333 -6153149 -5409367
5501 -5409367 -3846442 -2449803 -1212512 -353665 -299710 -308527 977725 3150374 3990138
$$ packed form
5561B602912l211044j71982L353327L613608J153689j205127k208419k184508
5553A742456j430751o15832j177049l264404m420254k346795J644755L870554
5545e997320K831545Q88810J030389L128843M166480J879611k373407m770095
5537G84856l166570M13808K088091N65195j741718k038267l69485R89398M78933
5528a995759j117320j702319k47418J798631J945678m4991j289742N19066L515068
5519A380894L878400J184404j121569p97555N77423R78661Q67461R47138j37006
5510G758251l106821n243527l619541J00405J520927l24798k042229j195816P43782
5501e409367J562925J396639J237291Q58847N3955q817J286252K172649Q39764
$$ plain form
5492 3990138 2660995 1387527 2616609 5586467 7348127 6674362 5107281 3933595
5484 3933595 2066984 -1753238 -5919854 -7175968 -4826370 -1835794 -1058390 -2050930 -2823012
5475 -2823012 -3102448 -3734271 -3892664 -1835005 1444022 2378526 -102724 -2401701 -1243867
5466 -1243867 1419941 1426502 -1202991 -2470638 -602218 1727002 2053231 1417193 1372307
5457 1372307 979973 -628871 -1358233 769848 3345315 2273219 -1895466 -4334144 -2955287
5448 -2955287 -1072777 -1734749 -3185886 -2485769 -590103 -344281 -1241417 -50161 3787136
5439 3787136 6960681 7104078 5907682 6133532 7519698 7254976 3691308 -1410621 -4023311
5430 -4023311 -1206409 5846458 12149713 13369516 10001913 6260071 5229895 6493807
$$ packed form
5492C990138j329143j273468J229082K969858J761660o73765j567081j173686
5484C933595j866611l820222m166616j256114K349598K990576P77404r92540p72082
5475b823012k79436o31823j58393K057659L279027R34504k481250k298977J157834
5466a243867K663808O561k629493j267647J868420K329220L26229o36038m4886
5457A372307l92334j608844p29362K128081K575467j072096m168685k438678J378857
5448b955287J882510o61972j451137P00117J895666K45822q97136J191256L837297
5439C787136L173545J43397j196396K25850J386166k64722l563668n101929k612690
5430d023311K816902P052867O303255J219803l367603l741842j030176J263912
$$ plain form
5422 6493807 8021924 8303391 6537883 2972381 -365270 -1291136 -446988 -591695 -2308659
5413 -2308659 -2947702 -992469 1231803 1146226 -156337 -16750 1603829 2690222 2552134
5404 2552134 1960013 923976 -987020 -2763908 -2897233 -1736662 -680895 356776 2334266
5395 2334266 4617972 5734762 6062781 6971001 7565293 5322404 191732 -4751284 -7156227
5386 -7156227 -7300227 -5872067 -2768050 1178920 3995173 5036296 5353376 5128265 3524076
5377 3524076 1623873 2085587 4549181 4861931 1001743 -3244785 -3036404 1568662 6860822
5368 6860822 10212981 10787516 7885862 2121283 -3140617 -4863497 -4115516 -4038332 -5079098
5359 -5079098 -5214344 -4003706 -3051571 -2741838 -1838398 -516330 -604662 -2160791 -2740677
$$ packed form
5422F493807J528117K81467j765508l565502l337651r25866Q44148j44707j716964
5413b308659o39043J955233K224272q5577j302563J39587J620579J086393j38088
5404B552134n92121j036037j910996j776888j33325J160571J055767J037671J977490
5395B334266K283706J116790L28019R08220N94292k242889n130672m943016k404943
5386g156227j44000J428160L104017L946970K816253J041123L17080k25111j604189
5377C524076j900203M61714K463594L12750l860188m246528K08381M605066N292160
5368F860822L352159N74535k901654n764579n261900j722880P47981P7184j040766
5359e079098j35246J210638R52135L09733R03440J322068q8332j556129n79886
$$ plain form
5350 -2740677 -1191349 341567 -356598 -2276694 -2731061 -936211 1384222 2270399 1339193
5341 1339193 -281656 -1135512 -664800 561282 1832029 2968587 3663778 3146932 1465894
5332 1465894 102730 -11386 -75711 -1334999 -2480377 -1389283 1325769 3230824 4175174
5323 4175174 6360182 9979560 12039570 10672875 7741559 5592933 3860828 1439906
5315 1439906 -716882 -1161370 -503279 39991 1116186 3638098 5957013 5601389 3235124
5306 3235124 1952096 2771984 3718365 3602070 3732467 4978672 5927064 5466827 4818901
5297 4818901 5087189 4857168 2634691 84710 -83653 1360673 978886 -1899023 -3752152
5288 -3752152 -2001480 1197279 2147714 474922 -1459363 -2378286 -2626867 -1851478 789217
$$ packed form
5350b740677J549328J532916o98165j920096m54367J794850K320433Q86177r31206
5341A339193j620849q53856M70712J226082J270747J136558O95191n16846j681038
5332A465894j363164j14116o4325j259288j145378J091094K715052J905055R44350
5323D175174K185008L619378K060010j366695k931316k148626j732105k420922
5315A439906k156788m44488O58091N43270J076195K521912K318915l55624k366265
5306C235124j283028Q19888R46381j16295J30397J246205R48392m60237o47926
5297D818901K68288k30021k222477k549981j68363J444326l81787k877909j853129
5288c752152J750672L198759R50435j672792j934285r18923k48581P75389K640695
$$ plain form
5279 789217 4070226 5241667 3895327 2855778 4084030 5835467 5369390 2666330 -295634
5270 -295634 -2462717 -3895553 -4143625 -2666659 -430803 896286 1149814 1279022 974575
5261 974575 -1171710 -4687751 -6413505 -3961937 1015875 4205647 2973843 -1287798
5253 -1287798 -4907008 -5503280 -3791583 -2099440 -1556571 -1354824 -660045 -33991 -243330
5244 -243330 -744302 -625272 -384801 -1270416 -3045356 -3835815 -2378610 612397 3372169
5235 3372169 4381958 2799299 -1119271 -5558543 -8012716 -7308660 -4633197 -2480605
5227 -2480605 -2640627 -4775590 -6642112 -6290673 -4410374 -3605801 -4872941 -6222197 -5878186
5218 -5878186 -5163698 -6229343 -8254589 -8536958 -6726050 -5203432 -5328572 -5991749 -6130042
$$ packed form
5279G89217L281009J171441j346340j039549J228252J751437m66077k703060k961964
5270b95634k167083j432836k48072J476966K235856J327089K53528J29208l04447
5261I74575k146285l516041j725754K451568M977812L189772j231804m261641
5253a287798l619210n96272J711697J692143N42869K01747O94779O26054k09339
5244b43330n00972J19030K40471q85615j774940p90459J457205K991007K759772
5235C372169J009789j582659l918570m439272k454173P04056K675463K152592
5227b480605j60022k134963j866522L51439J880299Q04573j267140j349256L44011
5218e878186P14488j065645k025246k82369J810908J522618j25140o63177j38293
$$ plain form
5209 -6130042 -6007336 -5470956 -3613295 -1017977 251790 -15245 553995 2973829 4889316
5200 4889316 4365978 3158469 3745430 5190022 4819764 2521839 317719 -1320940 -3434599
5191 -3434599 -5167859 -3792228 1095317 6061005 7717784 6213080 3783295 1638587
5183 1638587 -274080 -1774645 -2528227 -3155716 -4779915 -7375064 -9526731 -10059488 -9331423
5174 -9331423 -8734354 -9271641 -10690629 -11655194 -10733942 -7724822 -4280249 -2730045 -3731530
5165 -3731530 -5431098 -5706332 -4961648 -5502300 -7981093 -9998897 -9205036 -6526897 -4810106
5156 -4810106 -5038115 -5650303 -5256494 -4119696 -2733968 -682528 2403539 5985842 9342315
5147 9342315 12162659 13983308 14096065 12602300 10675816 9212560 7896056 5968931
$$ packed form
5209f130042J22706N36380J857661K595318J269767k67035N69240K419834J915487
5200D889316n23338j207509N86961J444592l70258k297925k204120j638659k113659
5191c434599j733260J375631M887545M965688J656779j504704k429785k144708
5183A638587j912667j500565p53582o27489j624199k595149k151667n32757P28065
5174i331423N97069n37287j418988r64565R21252L009120L444573J550204j001485
5165c731530j699568k75234P44684n40652k478793k017804P93861K678139J716791
5156d810106k28009o12188L93809J136798J385728K051440L086067L582303L356473
5147I342315K820344J820649J12757j493765j926484j463256j316504j927125
$$ plain form
5139 5968931 3303562 555877 -1086541 -472993 2187505 4749437 5173999 4106662 3970760
5130 3970760 5470349 6719420 6199591 4822872 4351995 5222144 6557549 7032249 5387421
5121 5387421 1723476 -1393385 -1099552 1903289 3804768 2800724 1321758 1896895 3386376
5112 3386376 3358112 1994611 1091589 753405 -242167 -1762235 -2468700 -2028421 -1036421
5103 -1036421 634487 3241643 5389961 5061034 2432998 -118376 -912464 -428325 36734
5094 36734 -191378 -1060857 -2047502 -2536249 -2573616 -2772120 -3050795 -2614616 -1851296 -2521406
5084 -2521406 -4699118 -5342078 -1990761 3510432 7277615 8162847 7753804 6753922 4571982
5075 4571982 2206109 2161113 4670104 6548987 4951854 553354 -3793002 -6014457 -5722570
$$ packed form
5139E968931k665369k747685j642418O13548K660498K561932M24562j067337j35902
5130C970760J499589J249071n19829j376719m70877Q70149J335405M74700j644828
5121E387421l663945l116861K93833L002841J901479j004044j478966N75137J489481
5112C386376k8264j363501r03022l38184r95572j520068p06465M40279R92000
5103a036421J670908K607156K148318l28927k628036k551374p94088M84139M65059
5094C6734k28112q69479r86645m88747l7367j98504k78675M36179P63320o70110
5084b521406k177712o42960L351317N501193L767183Q85232m09043r99882k181940
5075D571982k365873m4996K508991J878883j597133m398500m346356k221455K91887
$$ plain form
5066 -5722570 -3636514 -1144679 285099 -13576 -1645627 -3472984 -3941366 -2106916 767205
5057 767205 1819615 194863 -1152478 844259 4863404 6720151 4798137 1428162
5049 1428162 -972464 -2410300 -3427997 -3191279 -837676 2578874 4616248 3469231
5041 3469231 -711255 -5927614 -9879882 -11903408 -12874531 -12940170 -10898728 -6857364 -3548369
5032 -3548369 -3075189 -4063680 -4299255 -4325614 -5486903 -6244272 -4441320 -2222232 -4121419
5023 -4121419 -10018438 -14205449 -12439141 -6442920 -586706 2392189 1450442 -3109737
5015 -3109737 -8272667 -9824253 -7229158 -4476855 -4633020 -6325734 -7037353 -6613991 -5442714
5006 -5442714 -2361604 2758587 6828369 6980010 4521405 2889626 3272231 4667045 6464103
$$ packed form
5066e722570K086056K491835J429778k98675j632051j827357m68382J834450K874121
5057G67205J052410j624752j347341J996737M019145J856747j922014l369975
5049A428162k400626j437836j017697K36718K353603L416550K037374j147017
5041C469231m180486n216359l952268k023526r71123o5639K041442M041364L308995
5032c548369M73180r88491k35575k6359j161289p57369J802952K219088j899187
5023d121419n897019m187011J766308N996221N856214K978895r41747m560179
5015c109737n162930j551586K595095K752303j56165j692714p11619M23362J171277
5006e442714L081110N120191M069782J51641k458605j631779L82605J394814J797058
$$ plain form
4997 6464103 8078642 7523288 3706407 -491348 -697187 3214522 6566690 5683415 2099193
4988 2099193 83460 1632015 5150596 8139526 9662215 9986420 8976579 6180314
4980 6180314 2542418 496295 1220775 2856402 2960845 1936768 2198440 4518726 7317637
4971 7317637 9293358 10516359 10985346 10478228 10021835 11095499 12968367 13184670 11212590
4962 11212590 9298131 9106060 9757290 9760135 8675356 6448499 3420699 1257205 1250273
4953 1250273 1549827 -797207 -4708433 -5569908 -1735224 3185414 5733407 6455521 6814942
4944 6814942 6376829 5360053 6047858 8754639 9896066 7255658 3959433 3752614 5288787
4935 5288787 5002880 3159444 2708579 3764696 3632830 1746809 712948 2262285 5111663
$$ packed form
4997F464103J614539n55354l816881m197755k05839L911709L352168q83275l584222
4988B099193k015733J548555L518581K988930J522689L24205j009841k796265
4980F180314l637896k046123P24480J635627J04443j024077K61672K320286K798911
4971G317637J975721J223001M68987n07118m56393J073664J872868K16303j972080
4962A1212590j914459j92071O51230K845j084779k226857l027800k163494o932
4953A250273K99554k347034l911226q61475L834684M920638K547993P22114L59421
4944F814942m38113j016776O87805K706781J141427k640408l296225k06819J536173
4935E288787k85907j843436m50865J056117j31866j886021j033861J549337K849378
$$ plain form
4926 5111663 7211254 7925889 7643849 6831954 5899114 5245973 5320371 6550729 8683563
4917 8683563 10711965 12575164 15881272 20982018 24678228 23808010 19916452 16788791
4909 16788791 14783021 12243064 11081868 14757992 21051931 23649538 21482292 19655573
4901 19655573 20436459 20928149 20736101 23282717 27474183 27348022 23058749 22611806 28868663
4892 28868663 34805247 36014113 37130356 40750758 41834524 39390005 40878628 47480078
4884 47480078 49085940 42988302 41727367 51160703 58804759 58485357 65668063 88270203
4876 88270203 106019511 108025348 125511888 181251568 221728218 160704914 -296
4869 -296 -149262487 -191746846 -149190858 -105704944 -95063748 -89039268 -69059295 -52445889
$$ packed form
4926E111663K099591P14635k82040q11895r32840o53141P4398J230358K132834
4917H683563K028402J863199L306108N100746L696210q70218l891558l127661
4909A6788791k005770k539957j161196L676124O293939K597607k167246j826719
4901A9655573P80886M91690j92048K546616M191466j26161m289273m46943O256857
4892B8868663N936584J208866J116243L620402J083766k444519J488623O601450
4884D7480078J605862o097638j260935R433336P644056l19402P182706K2602140
4876H8270203J7749308K005837J7486540N5739680M0476650o1023304j60705210
4869b96j49262191m2484359M2555988M3485914J0641196O024480J9979973J6613406
$$ plain form
4861 -52445889 -51178028 -51646703 -44031461 -38184838 -40499042 -41315171 -34931848 -30428451
4853 -30428451 -33587252 -36667055 -34442805 -33580766 -37867753 -39522623 -33764458 -28319934
4845 -28319934 -29766184 -32511461 -29856628 -25137090 -23420002 -21889313 -17035091 -13002826
4837 -13002826 -14433865 -17972642 -18491224 -17627144 -19191569 -21609748 -21327040 -18885277 -16168742
4828 -16168742 -12478412 -8210962 -7262790 -10864285 -14012881 -12686908 -9589971 -8370713
4820 -8370713 -7693868 -5874614 -5639653 -8557614 -9901151 -5272066 1923063 5662138 6062258
4811 6062258 6784055 7167535 3606186 -3343288 -9213851 -11709948 -11781981 -10279226 -8037888
4802 -8037888 -7561359 -10110040 -12559118 -11255114 -7517430 -5436170 -5831117 -6322961 -5868585
$$ packed form
4861e2445889J267861m68675P615242N846623k314204q16129O383323M503397
4853c0428451l158801l079803K224250Q62039m286987j654870N758165N444524
4845b8319934j446250k745277K654833M719538J717088J530689M854222M032265
4837a3002826j431039l538777n18582Q64080j564425k418179K82708K441763K716535
4828a6168742L690330M267450R48172l601495l148596J325973L096937J219258
4820h370713O76845J819254K34961k917961j343537M629085P195129L739075M00120
4811F062258P21797L83480l561349o949474n870563k496097p2033J502755K241338
4802h037888M76529k548681k449078J304004L737684K081260l94947m91844M54376
$$ plain form
4793 -5868585 -5296071 -4667207 -3884674 -4674525 -8274230 -12245622 -13115419 -11192017 -9445438
4784 -9445438 -8695679 -7362825 -5200129 -3912226 -4354568 -5751705 -7238973 -8062592 -7194628
4775 -7194628 -4798891 -2856690 -2421382 -1941851 -339228 480851 -1200144 -3509466 -3864580
4766 -3864580 -3194030 -3870740 -5304986 -5344950 -4556138 -5115796 -6426404 -5782571 -2915630
4757 -2915630 -248275 991939 1384070 359272 -3600122 -9413801 -13390068 -13645317 -12078848
4748 -12078848 -11313245 -11770273 -12280321 -11821564 -10252254 -8518078 -7941850 -8296691 -7508710
4739 -7508710 -4639801 -1931722 -2135194 -5011260 -8262768 -10512620 -11433023 -10658869 -8935693
4730 -8935693 -8603623 -10317834 -11136013 -8852798 -6240528 -7275824 -10835321 -12444738 -11209564
$$ packed form
4793e868585N72514O28864P82533p89851l599705l971392q69797J923402J746579
4784i445438P49759J332854K162696J287903m42342j397137j487268q23619Q67964
4775g194628K395737J942201M35308M79531J602623Q20079j680995k309322l55114
4766c864580O70550o76710j434246l9964P88812n59658j310608O43833K866941
4757b915630K667355J240214L92131j024798l959394n813679l976267k55249J566469
4748a2078848P65603m57028n10048M58757J569310J734176N76228l54841P87981
4739g508710K868909K708079k03472k876066l251508k249852r20403P74154J723176
4730h935693L32070j714211q18179K283215K612270j035296l559497j609417J235174
$$ plain form
4721 -11209564 -10372139 -11346942 -11886579 -10541780 -8584307 -6751587 -4159806 -1405326 -772958
4712 -772958 -2090681 -2175412 23969 1328770 -738865 -4203543 -5921129 -5656874 -4643831
4703 -4643831 -2891869 -634392 -140643 -3010524 -7082863 -8876229 -8208862 -7770260 -8624459
4694 -8624459 -8781216 -6523652 -3005251 -591710 83474 231899 543229 -87455 -2922872
4685 -2922872 -7105022 -10110349 -10634329 -10019716 -10373269 -12220821 -14480220 -15486132 -13361879
4676 -13361879 -7090915 1337723 7343952 8165444 5768855 3677690 2316815 -226738
4668 -226738 -4061099 -6990741 -7774292 -7348901 -6882127 -6665947 -6707352 -6604178 -5457089
4659 -5457089 -3702725 -3791272 -6653150 -8993376 -7343364 -3581560 -2502598 -4582608 -5617700
$$ packed form
4721a1209564Q37425r74803n39637J344799J957473J832720K591781K754480O32368
4712g72958j317723q4731K199381J304801k067635l464678j717586K64255J013043
4703d643831J751962K257477M93749k869881m072339j793366O67367M38602q54199
4694h624459j56757K257564L518401K413541O75184J48425L11330o30684k835417
4685b922872m182150l005327n23980O14613l53553j847552k259399j005912K124253
4676a3361879O270964Q428638O006229Q21492k396589k091165j360875k543553
4668b26738l834361k929642p83551M25391M66774K16180m1405J03174J147089
4659e457089J754364q8547k861878k340226J650012L761804J078962k080010j035092
$$ plain form
4650 -5617700 -3707651 -1951522 -3010516 -5200420 -5891552 -5399250 -5487693 -6678306 -8634722
4641 -8634722 -10762117 -11331755 -8826136 -5210381 -4670770 -7766513 -10238591 -9320545 -7633106
4632 -7633106 -8482096 -10765851 -11599810 -11100396 -11077546 -11025978 -8874954 -4551456 -33529
4623 -33529 3161776 4426681 3374729 828336 -934202 -972704 -1187801 -3035870 -4652018
4614 -4652018 -3761795 -1722971 -1724251 -4099330 -6261960 -6554078 -5637887 -4689749 -4481259
4605 -4481259 -5648740 -7826814 -9185237 -8665131 -7770842 -8331359 -9649655 -9861944 -8840730
4596 -8840730 -7557785 -5936184 -3855166 -3030588 -5067362 -8509759 -10508738 -10531676 -9723621
4587 -9723621 -7756516 -3684273 782603 2536947 1525314 424407 -223141 -2735384
$$ packed form
4650e617700J910049J756129j058994k189904o91132M92302q8443j190613j956416
4641h634722k127395n69638K505619L615755N39611l095743k472078R18046J687439
4632g633106q48990k283755q33959M99414K2850N1568K151024M323498M517927
4623c3529L195305J264905j051952k546393j762538l8502k15097j848069j616148
4614d652018Q90223K038824j280k375079k162630k92118R16191R48138K08490
4605d481259j167481k178074j358423N20106Q94289n60517j318296k12289J021214
4596h840730J282945J621601K081018Q24578k036774l442397j998979k2938Q08055
4587i723621J967105M072243M466876J754344j011633j100907o47548k512243
$$ plain form
4579 -2735384 -7354717 -10339634 -8723389 -4090086 199985 3049222 4900225 5141438
4571 5141438 2745443 -1484832 -5285508 -7184982 -7275239 -6312147 -4990688 -3632157 -1949051
4562 -1949051 387466 2661124 3415261 2212381 253630 -1075518 -1385778 -790727 572314
4553 572314 1952908 2014179 338959 -1747442 -2653887 -2408917 -2375681 -3277244 -4154296 -3578396
4543 -3578396 -1747007 -855771 -2784853 -6553278 -9020443 -8427806 -6296934 -5305160 -6283961
4534 -6283961 -8041480 -9161171 -9068884 -8151484 -7611779 -8332422 -9346139 -8783387 -6934141
4525 -6934141 -6355059 -7765612 -8300820 -6005258 -3739198 -5472620 -10222554 -13146792 -11897186
4516 -11897186 -8550419 -5673887 -3847980 -3039755 -3126203 -2707129 -367836 2536252 3172763
$$ packed form
4579b735384m619333k984917J616245M633303M290071K849237J851003K41213
4571E141438k395995m230275l800676j899474r0257R63092J321459J358531J683106
4562a949051K336517K273658P54137j202880j958751j329148l10260N95051J363041
4553E72314J380594O1271j675220k086401r06445K44970L3236r01563q77052N75900
4543c578396J831389Q91236j929082l768425k467165N92637K130872R91774r78801
4534f283961j757519j119691R2287R17400N39705p20643j013717N62752J849246
4525f934141N79082j410553n35208K295562K266060j733422m749934k924238J249606
4516a1897186L346767K876532J825907Q08225q6448M19074K339293K904088O36511
$$ plain form
4507 3172763 1459425 8053 -201827 -621160 -1308343 -329045 1946250 2035987 -1244808
4498 -1244808 -4231354 -3607212 -905264 739454 1282038 2271065 3332744 3420351 3484382
4489 3484382 4656605 5554185 4631223 3505005 4303249 5056970 1992394 -3867140 -6680470
4480 -6680470 -3423333 1817279 2859953 -1567507 -7535551 -10959691 -11059135 -9500342 -7855013
4471 -7855013 -6425580 -4978109 -3821439 -3585379 -4110617 -4386736 -3779110 -2556982 -1123815
4462 -1123815 244933 824904 48447 -991386 -346098 1858107 3137150 2148494 453401
4453 453401 -328606 -804962 -1579642 -1164164 1411180 3860351 3369411 602685 -1881375
4444 -1881375 -3794879 -6350086 -8355457 -6990540 -2497337 1510288 2999500 3522045
$$ packed form
4507C172763j713338j451372k09880m19333o87183R79298K275295Q9737l280795
4498a244808k986546O24142K701948J644718N42584R89027J061679Q7607O4031
4489C484382J172223Q97580r22962j126218P98244P53721l064576n859534k813330
4480f680470L257137N240612J042674m427460n968044l424140r9444J558793J645329
4471g855013J429433J447471J156670K36060n25238k76119O07626J222128J433167
4462a123815J368748N79971p76457j039833O45288K204205J279043r88656j695093
4453D53401p82007m76356p74680M15478K575344K449171m90940k766726k484060
4444a881375j913504k555207k005371J364917M493203M007625J489212N22545
$$ plain form
4436 3522045 4394910 4042992 764675 -4164348 -7790763 -8377376 -6096693 -2595330 -707984
4427 -707984 -2607669 -7001637 -9816204 -8821588 -6011351 -4374167 -4210523 -4184759 -4230960
4418 -4230960 -5171134 -6361344 -5953768 -3471196 -561263 1002096 1048208 609918 519758
4409 519758 559161 -294425 -2645055 -5542377 -7003571 -6056911 -3996945 -3291740 -5291726
4400 -5291726 -8891815 -11198240 -9912428 -5701287 -1872497 -941838 -2016235 -2654310 -2639366
4391 -2639366 -3965805 -7031013 -9056919 -7404462 -2987511 915281 2388508 2268112
4383 2268112 2280170 2758342 2264143 -694516 -5407477 -8821579 -8504128 -5494312 -3091113
4374 -3091113 -2999627 -4056669 -4640041 -4500930 -3834867 -2439544 -720079 -36399 -1047260
$$ packed form
4436C522045Q72865l51918l278317m929023l626415n86613K280683L501363J887346
4427g07984j899685m393968k814567R94616K810237J637184J63644K5764m6201
4418d230960r40174j190210M07576K482572K909933J563359M6112m38290r0160
4409E19758L9403q53586k350630k897322j461194R46660K059966P05205j999986
4400e291726l600089k306425J285812M211141L828790R30659j074397o38075J4944
4391b639366j326439l065208k025906J652457M416951L902792J473227j20396
4383B268112J2058M78172m94199k958659m712961l414102L17451L009816K403199
4374c091113R1486j057042n83372J39111O66063J395323J719465O83680j010861
$$ plain form
4365 -1047260 -2858330 -4554500 -6341014 -8455948 -10265198 -11189696 -11257480 -10195556 -7620057
4356 -7620057 -4797575 -4173911 -5964140 -7240929 -5985406 -4089626 -4367288 -6365534 -7577604
4347 -7577604 -7535785 -8090868 -10257429 -13021603 -14814515 -14310439 -10591885 -4687051 -204731
4338 -204731 -25658 -2722463 -4428051 -3657669 -1814460 380390 3639722 7134754 8239978
4329 8239978 6455535 4719720 5157704 5834414 3679063 -1061822 -5318145 -7067713 -6854780
4320 -6854780 -6022644 -5092981 -3926476 -2430521 -799743 658733 1840636 2763719 2957114
4311 2957114 1578340 -1109055 -3145025 -3011533 -1671221 -917097 -498991 893185 2369829
4302 2369829 1515144 -1492810 -3599893 -3624459 -4111758 -6812737 -9331229 -8727686 -6058735
$$ packed form
4365a047260j811070j696170j786514k114934j809250r24498o7784J061924K575499
4356g620057K822482O23664j790229j276789J255523J895780k77662j998246j212070
4347g577604M1819n55083k166561k764174j792912N04076L718554N904834M482320
4338b04731J79073k696805j705588P70382J843209K194850L259332L495032J105224
4329H239978j784443j735815M37984O76710k155351m740885m256323j749568K12933
4320f854780Q32136R29663J166505J495955J630778J458476J181903R23083J93395
4311B957114j378774k687395k035970J33492J340312P54124M18106J392176J476644
4302B369829q54685l007954k107083k4566m87299k700979k518492O03543K668951
$$ plain form
4293 -6058735 -4430584 -4244374 -3455762 -1545066 -195897 -364364 -1310695 -2532366 -4398521
4284 -4398521 -6720165 -8579394 -9665068 -10147455 -9440493 -6953971 -3962201 -2681625 -3230768
4275 -3230768 -3360484 -1630033 784189 1883048 940639 -1601817 -4829352 -7365821 -8011978
4266 -8011978 -7057959 -6067017 -6016119 -6478418 -6604621 -5823424 -3749590 -785009 1351650
4257 1351650 1306337 123019 -323416 -695380 -3326851 -7637529 -9627037 -7435424 -4433998
4248 -4433998 -4470869 -6597626 -7505556 -7123452 -7984775 -10075102 -10515528 -8608482 -7225940
4239 -7225940 -7943417 -8356837 -6377864 -4259133 -5374435 -8884740 -10876594 -9854693 -7780271
4230 -7780271 -5871509 -2955481 1001197 3005592 956151 -2692885 -3861724 -2270804
$$ packed form
4293f058735J628151J86210P88612J910696J349169j68467r46331j221671j866155
4284d398521k321644j859229j085674m82387P06962K486522K991770J280576n49143
4275c230768j29716J730451K414222J098859r42409k542456l227535k536469o46157
4266h011978R54019R90942N0898m62299j26203P81197K073834K964581K136659
4257A351650m5313j183318m46435l71964k631471m310678j989508K191613L001426
4248d433998l6871k126757r07930L82104q61323k090327m40426J907046J382542
4239g225940p17477m13420J978973K118731j115302l510305j991854J021901K074422
4230g780271J908762K916028L956678K004395k049441l649036j168839J590920
$$ plain form
4222 -2270804 -1240260 -2565588 -4341807 -4176196 -2107289 438058 2427964 2913658 967005
4213 967005 -2580504 -4995854 -4920557 -4385900 -5742585 -7940121 -8204425 -6538490 -5835881
4204 -5835881 -7573524 -9948422 -10867294 -10642842 -10780518 -11719916 -12813997 -13407865 -13094272
4195 -13094272 -11790859 -10180874 -9281167 -9164428 -8907765 -8022707 -7017160 -6427989 -6387827
4186 -6387827 -7260396 -9428009 -12182194 -14081416 -14680937 -14625841 -13858183 -11342585 -7093264
4177 -7093264 -2961670 -705143 -470145 -1583666 -3459800 -5365751 -6829887 -8628534
4169 -8628534 -11685017 -14748038 -15261408 -13006458 -10558946 -9485184 -8688656 -7425735 -6977803
4160 -6977803 -7867655 -8459462 -8221131 -9234503 -12024677 -13078559 -9747456 -4916951 -3236221
$$ packed form
4222b270804J030544j325328j776219J65611K068907K545347J989906M85694j946653
4213I67005l547509k415350P5297N34657j356685k197536k64304J665935P02609
4204e835881j737643k374898r18872K24452j37676r39398j094081n93868L13593
4195a3094272J303413J609985Q99707J16739K56663Q85058J005547N89171M0162
4186f387827q72569k167613k754185j899222n99521N5096P67658K515598M249321
4177g093264M131594K256527K34998j113521j876134j905951j464136j798647
4169h628534l056483l063021n13370K254950K447512J073762P96528J262921M47932
4160f977803q89852n91807K38331j013372k790174j053882L331103M830505J680730
$$ plain form
4151 -3236221 -5047810 -7773145 -10943088 -15430814 -19507591 -20472065 -19231787 -18935993 -20097622
4142 -20097622 -21111342 -21528338 -19605985 -9371472 11803853 33483890 39635194 28220295
4134 28220295 14574015 11327340 13630255 10457302 2499441 -625600 3693190 8195019
4126 8195019 7692156 4897101 3482480 2928918 2387731 3471015 6303650 7509869 5191286
4117 5191286 2420149 2902666 5789281 7418495 6271392 3876415 2207430 2162594 3647113
4108 3647113 5563869 6288389 5125683 2784466 80949 -2815888 -5474518 -6733566
4100 -6733566 -5838896 -3384079 -875610 122754 -1088718 -3177533 -3214505 34576 3791315
4091 3791315 4327540 1965736 435112 1214275 1627811 -461790 -3124642 -3419044 -1561710
$$ packed form
4151c236221j811589k725335l169943m487726m076777r64474J240278K95794j161629
4142b0097622j013720m16996J922353J0234513K1175325K1680037O151304j1414899
4134B8220295j3646280l246675K302915l172953p957861l125041M318790M501829
4126H195019n02863k795055j414621n53562n41187J083284K832635J206219k318583
4117E191286k771137M82517K886615J629214j147103k394977j668985m4836J484519
4108C647113J916756P24520j162706k341217k703517k896837k658630j259048
4100f733566Q94670K454817K508469R98364j211472k088815l6972L249081L756739
4091C791315N36225k361804j530624P79163M13536k089601k662852k94402J857334
$$ plain form
4082 -1561710 285003 1597740 3231117 4617524 3946526 1061643 -1972205 -3562996
4074 -3562996 -4307726 -5528353 -7184842 -7833570 -6199651 -2596384 923131 1982627 -39168
4065 -39168 -3306524 -5147340 -4311415 -1623032 1102331 2475900 2328399 1570557 1124521
4056 1124521 856159 -116301 -2024342 -3953613 -4972397 -5147522 -5067984 -4924273 -4600586
4047 -4600586 -4316457 -4551984 -5305802 -5777122 -5054541 -3287808 -2038797 -2844532 -5096559
4038 -5096559 -6075934 -3920953 -63713 2314550 1951111 473366 -164898 84377 -53664
4029 -53664 -1459602 -3860872 -5919311 -5805993 -2597145 2469930 6746708 8441113 7746722
4020 7746722 5976811 4390392 3663111 3560365 3293193 3062307 4623050 8817405 13061419
$$ packed form
4082a561710J846713J312737J633377J386407o70998k884883l033848j590791
4074c562996p44730j220627j656489o48728J633919L603267L519515J059496k021795
4065c9168l267356j840816Q35925K688383K725363J373569j47501p57842m46036
4056A124521k68362r72460j908041j929271j018784j75125P9538J43711L23687
4047d600586K84129k35527p53818m71320P22581J766733J249011q05735k252027
4038e096559r79375K154981L857240K378263l63439j477745o38264K49275j38041
4029e3664j405938k401270k058439J13318L208848N067075M276778J694405o94391
4020G746722j769911j586419p27281j02746k67172k30886J560743M194355M244014
$$ plain form
4011 13061419 13438731 9526101 5120590 3611844 4493707 5144305 4134156 1701138 -1362945
4002 -1362945 -3941984 -4855456 -3975079 -2230521 -53329 2831338 5657588 6562636 5195242
3993 5195242 3556535 3147594 3103249 2342696 1514106 1177921 82203 -2642049 -5229134
3984 -5229134 -5519787 -4139254 -3157136 -2794309 -1972463 -1230451 -2376344 -5479291 -8501636
3975 -8501636 -9918190 -9958432 -9542711 -9586932 -10753753 -12179920 -11303104 -7013775 -2163756
3966 -2163756 -569831 -2094923 -3159981 -1695567 1000777 3016947 3608211 2170618
3958 2170618 -1720082 -6671674 -10205802 -11581572 -11886982 -11481022 -9963058 -8594880 -9475830
3949 -9475830 -11676897 -11483764 -7681630 -3562126 -2217883 -2776085 -3096484 -3380396 -4732865
$$ packed form
4011A3061419L77312l912630m405511j508746Q81863O50598j010149k433018l064083
4002a362945k579039r13472Q80377J744558K177192K884667K826250R05048j367394
3993E195242j638707m08941m4345p60553q28590l36185j095718k724252k587085
3984e229134k90653J380533R82118L62827Q21846P42012j145893l102947l022345
3975h501636j416554m0242M15721m4221j166821j426167Q76816M289329M850019
3966b163756J593925j525092j065058J464414K696344K016170N91264j437593
3958B170618l890700m951592l534128j375770l05410M05960J517964J368178q80950
3949i475830k201067J93133L802134M119504J344243n58202l20399k83912j352469
$$ plain form
3940 -4732865 -6328835 -6489688 -5143906 -3371007 -2011575 -2206865 -5251166 -10018023 -12654651
3931 -12654651 -11136778 -8245291 -7605784 -8680791 -8512745 -6714582 -5390578 -5197420 -4928239
3922 -4928239 -4472588 -4803766 -5058403 -2852322 1986824 6672564 8986279 9232031 8332303
3913 8332303 6474667 4351103 3440809 4029380 4647564 4223386 3277781 2551124 2054965
3904 2054965 1785391 1638517 440929 -2884771 -6883060 -8577525 -7480277 -6233868 -6560064
3895 -6560064 -7210667 -7036830 -7176635 -8289863 -8286305 -5422566 -1677358 -195049 -736018
3886 -736018 -476292 1668514 4317282 6463909 8097463 8332099 6037582 2731373 1989118
3877 1989118 4922526 8377126 8708651 5657566 1556382 -1642397 -3389446 -3903855 -3777519
$$ packed form
3940d732865j595970j60853J345782J772899J359432j95290l044301m766857k636628
3931a2654651J517873K891487O39507j075007J68046J798163J324004J93158K69181
3922d928239M55651l31178k54637K206081M839146M685740K313715K45752q99728
3913H332303j857636k123564r10294N88571O18184m24178r45605p26657m96159
3904B054965k69574j46874j197588l325700l998289j694465J097248J246409l26196
3895f560064o50603J73837j39805j113228L558K863739L745208J482309n40969
3886g36018K59726K144806K648768K146627J633554K34636k294517l306209p42255
3877A989118K933408L454600L31525l051085m101184l198779j747049n14409J26336
$$ plain form
3868 -3777519 -3606304 -3459608 -3386726 -4360418 -7243924 -10669680 -11908545 -10561947 -9372475
3859 -9372475 -10253202 -11634383 -11462509 -10766376 -11650875 -13104626 -11929223 -7606859 -3363383
3850 -3363383 -1851765 -2155207 -2046222 -1327695 -1549778 -3409100 -5557280 -5689149 -2570534
3841 -2570534 2430643 5917912 5541362 2487388 -118895 -1013779 -1457999 -2249352 -2237260
3832 -2237260 -524033 1763153 2992198 2814698 1505889 -790670 -2989235 -3054885 -766420
3823 -766420 1020634 -223780 -3286417 -5148828 -5082941 -4480382 -3648162 -1611036 1245745
3814 1245745 3147717 3697888 4104005 4355630 2865511 -347890 -2767015 -2897183 -2346248
3805 -2346248 -2876810 -3545326 -2755362 -1427221 -1716625 -3491231 -4402446 -3257988 -1440726
$$ packed form
3868c777519J71215J46696P2882r73692k883506l425756j238865J346598J189472
3859i372475q80727j381181J71874O96133q84499j453751J175403M322364M243476
3850c363383J511618l03442J08985P18527k22083j859322k148180j31869L118615
3841b570534N001177L487269l76550l053974k606283q94884m44220p91353J2092
3832b237260J713227K287186J229045j77500j308809k296559k198565o5650K288465
3823g66420J787054j244414l062637j862411O5887O02559Q32220K037126K856781
3814A245745J901972N50171M06117K51625j490119l213401k419125j30168N50935
3805b346248n30562o68516P89964J328141k89404j774606r11215J144458J817262
$$ plain form
3796 -1440726 -785301 -1384929 -1801870 -665219 1985202 4424602 4631787 2559733 572323
3787 572323 927533 3319581 5643379 6550311 6235188 5212881 3593533 1544696 -505852
3778 -505852 -2224192 -3328792 -3436872 -2694314 -2257609 -3181122 -4889127 -5686572 -4883926
3769 -4883926 -3560814 -2979927 -3007627 -2624406 -1656727 -1465808 -3646503 -7933257 -11628544
3760 -11628544 -11754497 -8095240 -3650487 -1659389 -2494655 -3814237 -3362001 -1185178 628930
3751 628930 68731 -2761866 -5702406 -7047161 -7705213 -9767416 -12941980 -14054684 -10876778
3742 -10876778 -5052859 -159234 1889514 1302563 -1256524 -4865187 -7717249 -8420704
3734 -8420704 -7756701 -7504388 -7805329 -7415311 -6268894 -5703781 -5969684 -5619809 -4029181
$$ packed form
3796a440726O55425n99628m16941J136651K650421K439400K07185k072054j987410
3787E72323L55210K392048K323798R06932l15123j022307j619348k048837k050548
3778e05852j718340j104600j08080P42558M36705r23513j708005p97445Q02646
3769d883926J323112N80887k7700L83221R67679J90919k180695m286754l695287
3760a1628544j25953L659257M444753J991098q35266j319582M52236K176823J814108
3751F28930n60199k830597k940540j344755o58052k062203l174564j112704L177906
3742a0876778N823919M893625K048748n86951k559087l608663k852062p03455
3734h420704O64003K52313l00941L90018J146417N65113k65903L49875J590628
$$ plain form
3725 -4029181 -2644657 -2722630 -3320038 -2728159 -861973 902014 1553509 1167324 322324
3716 322324 -429462 -875175 -1383321 -2425240 -3701941 -4511240 -5140928 -6700188 -8965558
3707 -8965558 -9719582 -7529237 -4365834 -3855097 -6984440 -10850713 -11916853 -9431497 -5167501
3698 -5167501 -832900 3125481 6450764 8106955 7088828 3740461 -391603 -3872865
3690 -3872865 -6065860 -6839294 -6525666 -6237827 -7212440 -9310401 -10836388 -10350501 -8160328
3681 -8160328 -5739660 -4339661 -4400381 -5417871 -6055273 -5430683 -4595522 -5304286 -6896174
3672 -6896174 -6495856 -3490451 -1418292 -3126913 -6035821 -5365503 -976255 2473522 1963328
3663 1963328 -657666 -2312448 -2485859 -2401285 -2985596 -4804227 -7912408 -10731988 -10968868
$$ packed form
3725d029181J384524p7973n97408N91879J866186J763987O51495l86185q45000
3716C22324p51786m45713n08146j041919j276701q09299o29688j559260k265370
3707h965558p54024K190345L163403N10737l129343l866273j066140K485356M263996
3698e167501M334601L958381L325283J656191j018127l348367m132064l481262
3690c872865k192995p73434L13628K87839r74613k097961j525987M85887K190173
3681h160328K420668J399999o0720j017490o37402O24590Q35161p08764j591888
3672f896174M00318L005405K072159j708621k908908O70318M389248L449777n10194
3663A963328k620994j654782j73411Q4574n84311j818631l108181k819580k36880
$$ plain form
3654 -10968868 -8545340 -5864239 -4582102 -4101134 -3633079 -3180879 -1794841 2061009 6985110
3645 6985110 8624661 5427359 1716156 2323025 6355599 9253047 9193619 8069806 7208704
3636 7208704 5697462 2949922 65087 -1816068 -2537729 -2208814 -1170709 -562756 -1256407
3627 -1256407 -2425036 -2739991 -2564140 -3189465 -4316516 -4347221 -3143730 -2511411 -3610284
3618 -3610284 -5457392 -6315341 -5312276 -2608156 750444 2971385 2592349 -358928 -4705174
3609 -4705174 -9028271 -11691996 -11348840 -8894663 -7705664 -9987885 -13741712 -15309714
3601 -15309714 -14032551 -12106248 -10673401 -8877555 -6545867 -4933097 -4497178 -4453985 -4854190
3592 -4854190 -6567506 -8768408 -9112211 -7275658 -5866595 -6728301 -8552979 -9320107 -8983934
$$ packed form
3654a0968868K423528K681101J282137M80968M68055M52200J386038L855850M924101
3645F985110J639551l197302l711203O06869M032574K897448n9428j123813q61102
3636G208704j511242k747540k884835j881155p21661L28915J038105O07953o93651
3627a256407j168629l14955J75851o25325j127051l0705J203491O32319j098873
3618c610284j847108q57949J003065K704120L358600K220941l79036k951277m346246
3609d705174m323097k663725L43156K454177J188999k282221l753827j568002
3601a5309714J277163J926303J432847J795846K331688J612770M35919M3193m00205
3592d854190j713316k200902l43803J836553J409063q61706j824678p67128L36173
$$ plain form
3583 -8983934 -8395940 -7489160 -6075255 -4884501 -4295798 -3279338 -976263 1669998 2961992
3574 2961992 2224180 -193485 -3500962 -6320021 -7297184 -6779236 -6661517 -7732893 -8433190
3565 -8433190 -7118051 -4348020 -2107082 -1864726 -3897423 -7039570 -8627637 -6649323
3557 -6649323 -2829776 -1482912 -4026172 -6783244 -5963077 -2738116 -993072 -1569166 -1584476
3548 -1584476 1025819 4780000 6723551 5715813 3421726 2691265 4462310 5812855
3540 5812855 2450458 -5786520 -13472173 -15318061 -12015889 -8391718 -7047667 -6539280
3532 -6539280 -5273314 -4094893 -4257442 -5149828 -5364419 -4718722 -4032769 -3584450 -2785090
3523 -2785090 -1287659 227389 812270 806949 1918730 4886326 7594421 7108318 3631826
$$ packed form
3583h983934N87994R06780J413905J190754N88703J016460K303075K646261J291994
3574B961992p37812k417665l307477k819059r77163N17948J17719j071376p00297
3565h433190J315139K770031K240938K42356k032697l142147j588067J978314
3557f649323L819547J346864k543260k757072Q20167L224961J745044n76094j5310
3548a584476K610295L754181J943551j007738k294087p30461J771045J350545
3540E812855l362397q236978p685653j845888L302172L624171J344051N08387
3532f539280J265966J178421j62549q92386k14591O45697O85953M48319P99360
3523b785090J497431J515048N84881n321J111781K967596K708095m86103l476492
$$ plain form
3514 3631826 571336 156238 1043377 1203815 887011 1002179 633181 -1410389 -3911050
3505 -3911050 -4628726 -3630247 -2984412 -3608962 -4438380 -4407230 -3508321 -2168664 -997725
3496 -997725 -654760 -773321 42914 1921337 2862638 1790664 684166 1463571 2592103
3487 2592103 1640216 -377363 -654810 552058 435909 -1628863 -3553939 -4277786 -4192380
3478 -4192380 -2244351 2904901 8544463 9523700 5429932 1723593 2067424 3879115 3657300
3469 3657300 2317461 2089579 1875755 -466851 -3892826 -5954346 -6833786 -8164182 -9544762
3460 -9544762 -9608759 -9128751 -9655103 -10097169 -8007569 -3737424 -324156 507557 -230767
3451 -230767 -909017 -518630 1500881 4207983 4669815 1252778 -3172333 -4281577 -2284209
$$ packed form
3514C631826l060490m15098Q87139J60438l16804J15168l68998k043570k500661
3505c911050p17676R98479O45835o24550q29418L1150Q98909J339657J170939
3496i97725L42965j18561Q16235J878423R41301j071974j106498P79405J128532
3487B592103r51887k017579k77447J206868j16149k064772j925076p23847Q5406
3478d192380J948029N149252N639562R79237m093768l706339L43831J811691k21815
3469C657300j339839k27882k13824k342606l425975k061520q79440j330396j380580
3460i544762o3997M80008n26352m42066K089600M270145L413268Q31713p38324
3451b30767o78250L90387K019511K707102M61832l417037m425111j109244J997368
$$ plain form
3442 -2284209 -1655678 -4585560 -7896061 -7542270 -3464314 1489836 5259682 7448288 8125242
3433 8125242 7728935 7507174 8481422 9955015 9883665 6902580 1818853 -2848677 -4927430
3424 -4927430 -4443638 -3254773 -2713305 -2298148 -937960 1174936 2913273 3690250 3749216
3415 3749216 3556350 3633406 4279031 4796005 3995562 2171329 1128344 1200635 87866
3406 87866 -3537447 -7034721 -6916708 -3730840 -1117414 -912226 -2034760 -3461168 -4992017
3397 -4992017 -5345599 -3092795 21520 84609 -3679241 -7591152 -8476108 -6904345 -4387546
3388 -4387546 -820941 3261491 5136428 3585686 1897589 4001108 8917420 11891104
3380 11891104 10156401 5074350 -648357 -5257240 -7847330 -8441306 -8361476 -8798131 -9095087
$$ packed form
3442b284209O28531k929882l310501L53791M077956M954150L769846K188606O76954
3433H125242l96307k21761R74248J473593p1350k981085n083727m667530k078753
3424d927430M83792J188865N41468M15157J360188K112896J738337P76977N8966
3415C749216j92866P7056O45625N16974q00443j824233j042985P2291j112769
3406H7866l625313l497274J18013L185868K613426K05188j122534j426408j530849
3397d992017l53582K252804L114315O3089l763850l911911q84956J571763K516799
3388d387546L566605M082432J874937j550742j688097K103519M916312K973684
3380A1891104j734703n082051n722707m608883k590090n93976P9830m36655k96956
$$ plain form
3371 -9095087 -7972233 -5945633 -4586794 -3707782 -1570879 1881700 4281168 4175603 3329795
3362 3329795 4487329 7953905 11441540 12512198 10323002 5699391 536539 -3124424
3354 -3124424 -4316213 -3725326 -2933880 -3112370 -4312298 -5563600 -5575240 -3924349 -1928228
3345 -1928228 -1861656 -4651619 -8414439 -9895014 -7673522 -3670405 -1176562 -1635301 -3786547
3336 -3786547 -5658710 -6408698 -5986066 -4246776 -1500044 835949 1560820 1420670 2122001
3327 2122001 3711141 4480417 3647447 2398033 1672882 686731 -1224576 -2795596 -2384530
3318 -2384530 -310788 1813301 3167807 3593619 2340157 -906421 -4047064 -3936755 -331717
3309 -331717 3217901 3207169 -328438 -4754551 -7876295 -9041784 -8439840 -6817455 -5427388
$$ packed form
3371i095087J122854K026600J358839Q79012K136903L452579K399468j05565q45808
3362C329795J157534L466576L487635J070658k189196m623611n162852l660963
3354c124424j191789N90887P91446j78490j199928j251302j1640J650891J996121
3345a928228O6572k789963l762820j480575K221492M003117K493843m58739k151246
3336c786547j872163p49988M22632J739290K746732K335993P24871j40150P01331
3327B122001J589140P69276q32970j249414p25151r86151j911307j571020M11066
3318b384530K073742K124089J354506M25812j253462l246578l140643J10309L605038
3309c31717L549618j0732l535607m426113l121744j165489O01944J622385J390067
$$ plain form
3300 -5427388 -4925009 -4455649 -2967401 -1270527 -1324226 -3126392 -3941894 -1889518 818449
3291 818449 124108 -4573548 -9295551 -10238912 -7972762 -5777431 -5224314 -5170513 -4486358
3282 -4486358 -3843094 -4471521 -6318697 -7874881 -7429192 -4741845 -1858122 -1405319 -3303748
3273 -3303748 -4444549 -3012973 -1512362 -3010668 -5704419 -4875626 -112220 3476431
3265 3476431 2370958 -801765 -1808496 -534508 564524 942038 1524410 1669757 62767
3256 62767 -2341143 -3358794 -2873145 -2298897 -1573380 212026 1674199 97115 -4103305
3247 -4103305 -6994207 -6129958 -3418745 -2002310 -2552853 -3906260 -5414181 -7008171 -7988759
3238 -7988759 -7195495 -4198690 142276 4102156 6286617 6950717 7606628 8585114 7957549
$$ packed form
3300e427388N02379M69360J488248J696874n3699j802166q15502K052376K707967
3291H18449o94341m697656m722003r43361K266150K195331N53117N3801O84155
3282d486358O43264o28427j847176j556184M45689K687347K883723M52803j898429
3273c303748j140801J431576J500611j498306k693751Q28793M763406L588651
3265C476431j105473l172723j006731J273988J099032L77514N82372J45347j606990
3256F2767k403910j017651M85649N74248P25517J785406J462173j577084m200420
3247d103305k890902Q64249K711213J416435n50543j353407j507921j593990r80588
3238g988759P93264K996805M340966L959880K184461O64100O55911R78486o27565
$$ plain form
3229 7957549 4190096 -1133044 -4976090 -6360490 -6287347 -5212942 -3158484 -1566628 -1985671
3220 -1985671 -3060271 -1913190 1294367 3282362 2542053 1094634 621749 142898 -1240698
3211 -1240698 -2481748 -3073416 -4456731 -7084254 -8732882 -7712956 -5363041 -3476277
3203 -3476277 -1717136 353112 1182810 -383177 -2676061 -3525882 -3220540 -3158832 -3635806
3194 -3635806 -4927555 -8040577 -12015361 -13251225 -10408194 -7146905 -6557441 -5876870 -1307869
3185 -1307869 4393220 4802988 -725173 -6138704 -7267916 -6129082 -6030889 -7389531 -9746094
3176 -9746094 -13369356 -16897557 -17217606 -13817999 -10158017 -8931393 -8943628 -8269161 -7280402
3167 -7280402 -6611904 -5286652 -3229404 -2814553 -5264852 -7861489 -7438932 -4716193 -2549077
$$ packed form
3229G957549l767453n323140l843046j384400P3143J074405K054458J591856m19043
3220a985671j074600J147081L207557J987995p40309j447419m72885m78851j383596
3211a240698j241050n91668j383315k627523j648628J019926K349915J886764
3203c476277J759141K070248Q29698j565987k292884q49821L05342O1708m76974
3194c635806j291749l113022l974784j235864K843031L261289N89464O80571M569001
3185a307869N701089M09768n528161n413531j129212J138834R8193j358642k356563
3176i746094l623262l528201l20049L399607L659982J226624j2235O74467R88759
3167g280402O68498J325252K057248M14851k450299k596637M22557K722739K167116
$$ plain form
3158 -2549077 -1639276 -724698 340350 551556 159901 742225 3016314 6009614 7962433
3149 7962433 7281651 3857394 351107 402232 4183732 7524903 6921526 3405792 -203662
3140 -203662 -3351312 -6504895 -8280335 -7280576 -5311338 -5211136 -6401388 -6072052 -4126584
3131 -4126584 -3239729 -4075108 -4148970 -2083507 255509 819887 -173650 -1773053 -3690514
3122 -3690514 -5191066 -5031992 -3612499 -2915267 -3228434 -2292215 924638 3928672 4005522
3113 4005522 1897668 147479 -695118 -1960676 -3947416 -5439760 -5897389 -6186108 -6857398
3104 -6857398 -7100781 -5989121 -4044826 -2963956 -3794179 -5648619 -6688080 -6557712 -7003432
3095 -7003432 -9184855 -11258589 -10330157 -6487195 -2923395 -1879312 -2446166 -2864685 -2883982
$$ packed form
3158b549077R09801R14578J065048K11206l91655N82324K274089K993300J952819
3149G962433o80782l424257l506287N1125L781500L341171o03377l515734l609454
3140b03662l147650l153583j775440R99759J969238J00202j190252L29336J945468
3131d126584Q86855q35379p3862K065463K339016N64378r93537j599403j917461
3122c690514j500552J59074J419493O97232l13167R36219L216853L004034P6850
3113D005522k107854j750189q42597j265558j986740j492344m57629k88719o71290
3104f857398k43383J111660J944295J080870q30223j854440j039461J30368m45720
3095g003432k181423k073734R28432L842962L563800J044083n66854m18519j9297
$$ plain form
3086 -2883982 -2855533 -2408609 -1416126 -873916 -1541265 -2812239 -3807529 -4256117 -3609920 -1140398
3076 -1140398 2096041 3560588 2914808 3033382 5404080 7087441 5088056 1402357 -65285
3067 -65285 66950 -2119834 -6765606 -9298693 -7387694 -4251802 -3212611 -3019942 -1340119
3058 -1340119 453387 -431360 -3198923 -4479278 -3448102 -2535116 -3085526 -3295692 -1174920
3049 -1174920 2641171 6038124 7919322 8591887 8605300 8104675 6944182 4897509 1913037
3040 1913037 -1575857 -4584274 -5833834 -4377561 -650626 3052254 4179374 2610155
3032 2610155 893236 1090419 2314571 2364538 771647 -1247298 -3058659 -4895152 -6141967
3023 -6141967 -5485880 -3243276 -1674597 -2052854 -2842636 -1846966 965923 3865248 5595506
$$ packed form
3086b883982K8449M46924R92483N42210o67349j270974r95290m48588O46197K469522
3076a140398L236439J464547o45780J18574K370698J683361j999385l685699j467642
3067f5285J32235k186784m645772k533087J910999L135892J039191J92669J679823
3058a340119J793506q84747k767563j280355J031176R12986n50410k10166K120772
3049a174920L816091L396953J881198O72565J3413n00625j160493k046673k984472
3040A913037l488894l008417j249560J456273L726935L702880J127120j569219
3032B610155j716919J97183J224152M9967j592891k018945j811361j836493j246815
3023f141967O56087K242604J568679l78257p89782R95670K812889K899325J730258
$$ plain form
3014 5595506 5984716 5096082 3158739 936732 -1092301 -3578076 -6974665 -9693185 -9383340
3005 -9383340 -6399993 -4184146 -5158387 -7650833 -8289374 -6360566 -4019194 -2872711 -2596997
2996 -2596997 -2950275 -4616818 -6975672 -7331720 -4464654 -1444306 -2255085 -6155686 -8165588
2987 -8165588 -5476430 -776253 1758242 1359821 -30509 -1248744 -2337902 -2776043 -1923645
2978 -1923645 -948161 -2049544 -5607974 -9851629 -13367100 -16071863 -17550745 -16555126 -12946790
2969 -12946790 -8437306 -4516179 -1139140 1703893 2832028 1636364 -344404 -1162544
2961 -1162544 -887600 -955616 -1999162 -3738616 -6080041 -8513165 -9063292 -6019618 -843886
2952 -843886 2515302 1807862 -1295105 -3579582 -3645373 -2391912 -1423044 -1887025 -4129927
$$ packed form
3014E595506L89210q88634j937343k222007k029033k485775l396589k718520L09845
3005i383340K983347K215847r74241k492446o38541J928808K341372J146483K75714
2996b596997l53278j666543k358854l56048K867066L020348q10779l900601k009902
2987h165588K689158M700177K534495l98421j390330j218235j089158m38141Q52398
2978a923645R75484j101383l558430m243655l515471k704763j478882R95619L608336
2969a2946790M509484L921127L377039K843033J128135j195664j980768q18140
2961a162544K74944o8016j043546j739454k341425k433124n50127L043674N175732
2952h43886L359188p07440l102967k284477o5791J253461R68868m63981k242902
$$ plain form
2943 -4129927 -7543267 -10940046 -13497946 -15091243 -15591427 -14464772 -11496177 -7531202
2935 -7531202 -4078841 -2264751 -2198652 -3058276 -3728679 -3649874 -3110801 -2651765 -2511242 -2887346
2925 -2887346 -4111837 -5959257 -7444670 -8181957 -9236537 -11409483 -13375972 -13257713 -11652380
2916 -11652380 -10992655 -11836897 -12135072 -10741721 -9164050 -8612830 -7762635 -5379659 -3120769
2907 -3120769 -3224860 -4858895 -5474009 -4865665 -5022460 -6377058 -7196407 -6847728 -6706801
2898 -6706801 -7066445 -5940812 -2353918 1478914 3014674 2669999 2385022 2322191 1145258
2889 1145258 -1165216 -2869531 -2768241 -1384234 236887 1685167 2951641 3875578 3983012
2880 3983012 2531688 -843229 -5002731 -7588809 -7396869 -5810557 -4771919 -4094361 -2407311
$$ packed form
2943d129927l413340l396779k557900j593297n00184J126655K968595L964975
2935g531202L452361J814090O6099q59624o70403P8805N39073M59036J40523l76104
2925b887346j224491j847420j485413p37287j054580k172946j966489J18259J605333
2916a1652380O59725q44242k98175J393351J577671N51220Q50195K382976K258890
2907c120769j04091j634035o15114O08344j56795j354598q19349L48679J40927
2898f706801l59644J125633L586894L832832J535760l44675k84977o2831j176933
2889A145258k310474j704315J01290J384007J621121J448280J266474R23937J07434
2880C983012j451324l374917m159502k586078J91940J586312J038638O77558J687050
$$ plain form
2871 -2407311 -280140 -258912 -3353478 -7268279 -9015291 -8061612 -6106666 -4890106 -5129843
2862 -5129843 -6624395 -8306502 -8824746 -8017215 -7308567 -7874735 -9019791 -9206489 -8048103
2853 -8048103 -6288025 -4410267 -2477062 -940865 -278451 79448 1191267 2933253 4083142
2844 4083142 4184703 4075181 4270908 4090967 2882277 945540 -1346395 -4152302 -7074379
2835 -7074379 -8605140 -7754383 -5419135 -3181441 -1665742 -1127351 -2392372 -5355435 -7352610
2826 -7352610 -5378580 -4705 4909035 6630294 5684230 3377074 -34784 -3362362
2818 -3362362 -3421722 1223546 6863989 8108915 4541571 1180726 1994560 5613433 8451757
2809 8451757 9497563 9963263 9931469 8104706 4611870 1752987 1376983 2993975 5041543
$$ packed form
2871b407311K127171K1228l094566l914801j747012R53679J954946J216560k39737
2862e129843j494552j682107n18244Q07531P08648n66168j145056j86698J158386
2853h048103J760078J877758J933205J536197O62414L57899J111819J741986J149889
2844D083142J01561j09522J95727j79941j208690j936737k291935k805907k922077
2835g074379j530761Q50757K335248K237694J515699N38391j265021k963063j997175
2826g352610J974030N373875M913740J721259r46064k307156l411858l327578
2818c362362n9360M645268N640443J244926l567344l360845Q13834L618873K838324
2809H451757J045806M65700l1794j826763l492836k858883l76004J616992K047568
$$ plain form
2800 5041543 6754142 8103441 9081103 10026491 11656601 13429454 12636939 7094656 -1056886
2791 -1056886 -6167211 -4915917 -241817 1932168 -768597 -5402845 -8061676 -8007027 -6950745
2782 -6950745 -6024298 -4943673 -3353689 -1512020 227260 1570418 2003833 1260252 32645
2773 32645 -600342 -424814 35831 748085 2172329 3969301 4973951 4893972 4782098 5107931
2763 5107931 4682644 2726538 831678 974005 2113345 1057894 -2906892 -6452462 -6504519
2754 -6504519 -4352361 -3546229 -4769878 -5258853 -3272982 -632448 267123 -11985 742034
2745 742034 2622126 3280076 1291710 -1928678 -3971861 -3841410 -2101346 -1116 801980
2736 801980 -1046919 -4908645 -7904352 -7603925 -4606826 -1489321 282516 1147435 1551011
$$ packed form
2800E041543J712599J349299R77662R45388J630110J772853p92515n542283q151542
2791a056886n110325J251294M674100K173985k700765m634248k658831N4649J056282
2782f950745R26447J080625J589984J841669J739280J343158M33415p43581j227607
2773C2645o32987J75528M60645P12254J424244J796972J004650p9979j11874L25833
2763E107931m25287j956106j894860J42327J139340j055451l964786l545570n2057
2754f504519K152158Q06132j223649m88975J985871K640534Q99571k79108P54019
2745G42034J880092O57950j988366l220388k043183J30451J740064K100230Q03096
2736H01980j848899l861726k995707L00427K997099L117505J771837Q64919M03576
$$ plain form
2727 1551011 919027 -1040265 -3193485 -3836324 -2158960 1339170 5207311 7680488 7794421
2718 7794421 6139688 3835632 830688 -3588788 -8450460 -10931643 -9554255 -6301943
2710 -6301943 -4292666 -4274247 -4755241 -4707737 -4353661 -3664421 -2049944 111233 1180879
2701 1180879 168203 -2055580 -3936684 -4857831 -5312717 -6232821 -8208339 -10455713 -10678984
2692 -10678984 -7387222 -2522160 -27616 -1133201 -2861024 -2294689 -385271 288987
2684 288987 -245902 -115124 376482 -1225018 -5108140 -7787029 -6420868 -2395758 904446
2675 904446 2157288 2188784 1399424 -667695 -3578678 -5727975 -6104249 -5279604 -4513418
2666 -4513418 -4593943 -5459128 -6301564 -6225000 -5282398 -4410203 -3867769 -2629178 -197567 1983942
$$ packed form
2727A551011o31984j959292k153220o42839J677364L498130L868141K473177J13933
2718G794421j654733k304056l004944m419476m861672k481183J377388L252312
2710f301943K009277J8419m80994M7504L54076O89240J614477K161177J069646
2701A180879j012676k223783j881104r21147m54886r20104j975518k247374k23271
2692a0678984L291762M865062K494544j105585j727823N66335J909418O74258
2684B88987n34889J30778M91606j601500l883122k678889J366161M025110L300204
2675I04446J252842L1496p89360k067119k910983k149297l76274Q24645P66186
2666d513418q0525q65185q42436P6564R42602Q72195N42434J238591K431611K181509
$$ plain form
2656 1983942 2275947 1158667 195226 -561155 -2070683 -3653233 -3317099 -1017365 823808
2647 823808 792574 189255 180895 -407620 -2639835 -4687213 -3895260 -677780 1933702 2337012
2637 2337012 2005022 2894885 4631827 4795811 1589298 -3686404 -6822769 -4492552 1586232
2628 1586232 5724207 4628064 1196461 334081 2497348 3862286 2102898 -771664
2620 -771664 -1502503 689966 3832795 5019322 2494980 -2389842 -5484001 -3969954 49510
2611 49510 2218585 1778098 1888338 4045192 5705019 4775510 3280135 4357357 7876678
2602 7876678 11223924 12656057 11877972 9068557 5537377 3759117 4340842 4231153 466205
2593 466205 -5258700 -8322487 -6874149 -3329489 -588710 702799 1095629 918510 432532
$$ packed form
2656A983942K92005j117280r63441p56381j509528j582550L36134K299734J841173
2647H23808l1234o03319q360n88515k232215k047378P91953L217480K611482M03310
2637B337012l31990Q89863J736942J63984l206513n275702l136365K330217O078784
2628A586232M137975j096143l431603q62380K163267J364938j759388k874562
2620g71664p30839K192469L142829J186527k524342m884822l094159J514047M019464
2611D9510K169075m40487J10240K156854J659827r29509j495375J077222L519321
2602G876678L347246J432133p78085k809415l531180j778260N81725j09689l764948
2593D66205n724905l063787J448338L544660K740779J291509L92830j77119m85978
$$ plain form
2584 432532 -262162 -1676290 -3814716 -4845478 -2827045 1169246 3665584 2887149 464200
2575 464200 -1381128 -2470894 -3724218 -5181528 -6009674 -5515077 -3545211 -760390 1237393
2566 1237393 1157993 -321176 -1266595 -990862 -581325 -920491 -1841894 -3487385 -6499781
2557 -6499781 -10044439 -11512437 -9527228 -5986597 -3973136 -4728277 -7571015 -11350727
2549 -11350727 -14654417 -15855243 -14608676 -12554625 -11186428 -9861013 -7373292 -4610028
2541 -4610028 -3695067 -4791798 -5679862 -4776094 -2979104 -1899046 -1446761 -74980 3071582
2532 3071582 6897490 9229963 8844511 6661598 4755033 4117768 3918174 3216934 2577126
2523 2577126 3105467 4469089 5102469 4408624 3662697 4262083 5718201 5972530 3635643
$$ packed form
2584D32532o94694j414128k138426j030762K018433L996291K496338p78435k422949
2575D64200j845328j089766j253324j457310q28146M94597J969866K784821J997783
2566A237393p9400j479169r45419K75733M09537l39166r21403j645491l012396
2557f499781l544658j467998J985209L540631K013461p55141k842738l779712
2549a1350727l303690j200826J246567K054051J368197J325415K487721K763264
2541d610028R14961j096731q88064R03768J796990J080058M52285J371781L146562
2532C071582L825908K332473l85452k182913j906565o37265j99594p01240o39808
2523B577126N28341J363622O33380o93845p45927N99386J456118K54329k336887
$$ plain form
2514 3635643 -301889 -3100028 -2846912 -521645 886089 -374457 -2833235 -3565213 -1647480
2505 -1647480 809085 1069681 -1358310 -4444453 -5828222 -5004295 -3456525 -2958424 -4038233
2496 -4038233 -6036834 -7959874 -8638779 -6690320 -1802618 3653206 5789860 3135226
2488 3135226 -1383637 -3587225 -2713230 -1666608 -2828734 -5218603 -6408475 -5907824 -5265588
2479 -5265588 -5303546 -4907602 -3183448 -1595076 -2554889 -6233313 -10316341 -13158536 -15419962
2470 -15419962 -17601173 -17841622 -14392482 -9217380 -6230660 -5890414 -4474795 312591
2462 312591 5799591 8185867 7516259 6219846 4415115 57167 -6581768 -11815279 -12751662
2453 -12751662 -10289548 -6970149 -3955078 -1559679 -974716 -3192574 -6781910 -8790439
$$ packed form
2514C635643l937532k798139K53116K325267J407734j260546k458778p31978J917733
2505a647480K456565K60596k427991l086143j383769Q23927J547770M98101j079809
2496d038233j998601j923040o78905J948459M887702N455824K136654k654634
2488C135226m518863k203588Q73995J046622j162126k389869j189872N00651O42236
2479e265588l7958L95944J724154J588372r59813l678424m083028k842195k261426
2470a5419962k181211k40449L449140N175102K986720L40246J415619M787386
2462C12591N487000K386276o69608j296413j804731m357948o638935n233511r36383
2453a2751662K462114L319399L015071K395399N84963k217858l589336k008529
$$ plain form
2445 -8790439 -8153656 -6712636 -6301968 -6206084 -4676533 -2063983 -666845 -1380605 -2185899
2436 -2185899 -807969 2410833 5428586 7119662 7415190 5891722 2515842 -590189
2428 -590189 -786000 1249881 1894756 -222258 -1923613 -23008 4048291 6322535 5299083
2419 5299083 2451520 -947122 -4713971 -8004340 -9342688 -8637833 -7298738 -6259536
2411 -6259536 -5411154 -4703858 -4133424 -3012302 -1120179 -171931 -1943433 -5087178 -6194966
2402 -6194966 -4254168 -1723775 -759124 -730414 -196568 1001484 2632964 4782365 6269458
2393 6269458 4461661 -1393384 -7983881 -10922794 -9183582 -5327851 -2315986 -1432129
2385 -1432129 -2394920 -3852600 -4109786 -2639938 -760590 -87034 -759816 -1856591 -2877225
$$ packed form
2445h790439O36783J441020M10668R5884J529551K612550J397138p13760q05294
2436b185899J377930L218802L017753J691076K95528j523468l375880l106031
2428e90189j95811K035881O44875k117014j701355J900605M071299K274244j023452
2419E299083k847563l398642l766849l290369j338348P04855J339095J039202
2411f259536Q48382P07296N70434J121122J892123R48248j771502l143745j107788
2402f194966J940798K530393R64651K8710N33846J198052J631480K149401J487093
2393F269458j807797n855045o590497k938913J739212L855731L011865Q83857
2385a432129r62791j457680k57186J469848J879348O73556o72782j096775j020634
$$ plain form
2376 -2877225 -3964463 -5212135 -6601902 -8205835 -9789792 -10695596 -10705770 -10502224 -10727822
2367 -10727822 -11122270 -11010186 -10044430 -8201133 -5890238 -4357972 -4869064 -6948400 -8478676
2358 -8478676 -8079599 -6319276 -4181666 -1831249 385637 1377431 930106 491620 1100471
2349 1100471 1873743 1798212 1487639 1583530 954057 -1485345 -4334121 -5187705 -3612107
2340 -3612107 -693651 3101043 7101651 8680966 5719932 608493 -1658014 30204
2332 30204 1472641 -699519 -4503147 -6075290 -5170920 -4674572 -6045953 -7774429 -7955734
2323 -7955734 -6447773 -4349301 -2621695 -1525625 -847618 -587758 -1387691 -3634864 -6059518
2314 -6059518 -6390355 -4067003 -1244367 -158498 -391517 91954 1877908 3454184 3396790
$$ packed form
2376b877225j087238j247672j389767j603933j583957r05804j0174K03546k25598
2367a0727822l94448J12084R65756J843297K310895J532266n11092k079336j530276
2358h478676L99077J760323K137610K350417K216886R91794m47325m38486O08851
2349A100471P73272p5531l10573R5891o29473k439402k848776q53584J575598
2340c612107K918456L794694M000608J579315k961034n111439k266507J688218
2332C0204J442437k172160l803628j572143R04370M96348j371381j728476j81305
2323g955734J507961K098472J727606J096070O78007K59860p99933k247173k424654
2314f059518l30837K323352K822636J085869k33019M83471J785954J576276n7394
$$ plain form
2305 3396790 1916374 62765 -1609548 -3174564 -4697361 -5835526 -5960541 -4771616
2297 -4771616 -2998970 -2134779 -2908698 -4261089 -4547012 -3719012 -3468031 -4863837 -6602783
2288 -6602783 -6355759 -3564895 -37989 2387930 3902552 5692754 7383807 6881679 3304808
2279 3304808 -994885 -2627056 -1138237 541777 -24981 -1768411 -2063865 -836254 -871741
2270 -871741 -3700917 -6875310 -6782714 -3333113 38634 1067071 1308128 3068695 5450580
$$ packed form
2305C396790j480416j853609j672313j565016j522797j138165j25015J188925
2297d771616J772646Q64191p73919j352391k85923Q28000K50981j395806j738946
2288f602783K47024K790864L526906K425919J514622J790202J691053n02128l576871
2279C304808m299693j632171J488819J680014n66758j743430k95454J227611l5487
2270h71741k829176l174393R2596L449601L371747J028437K41057J760567K381885
$$ [...]
##END NTUPLES=NMR SPECTRUM
##END=
