##TITLE=31Pdec_11-2025
 DMSO-d6, 24 sc
 20.1.2025
##JCAMPDX= 6.0         $$ Bruker NMR JCAMP-DX V2.0
##DATA TYPE= NMR SPECTRUM
##DATA CLASS= NTUPLES
##ORIGIN= UXNMR, Bruker Analytische Messtechnik GmbH
##OWNER= root
$$ XWIN-NMR		Version 3.5
$$ Mon Jan 20 13:59:54 2025 Russian Standard Time (UT+4h)  she@DPX200
##.OBSERVE FREQUENCY= 81.013821
##.OBSERVE NUCLEUS= ^31P
##.ACQUISITION MODE= SIMULTANEOUS
##.ACQUISITION SCHEME= undefined
##.AVERAGES= 24
##.DIGITISER RES= 17
##SPECTROMETER/DATA SYSTEM= spect
##.PULSE SEQUENCE= zgpg30
##.SOLVENT NAME= DMSO
##.SHIFT REFERENCE= (INTERNAL, DMSO, 0, 198.062)
##AUDIT TRAIL= $$ (NUMBER, WHEN, WHO, WHERE, WHAT)
$$ ##TITLE= Audit trail, XWIN-NMR		Version 3.5
$$ ##JCAMPDX= 5.01
$$ ##ORIGIN= Bruker BioSpin GmbH
$$ ##OWNER= she
$$ F:/spectra/data/she/nmr/P31/2/pdata/1/auditp.txt
$$ ##AUDIT TRAIL=  $$ (NUMBER, WHEN, WHO, WHERE, WHAT)
(   1,<2025-01-20 13:58:30.46 +0400>,<she>,<DPX200>,
      <created by zg, POWCHK disabled, PULCHK disabled
       configuration hash MD5:
       00 E9 B6 7A A2 85 ED C7 34 08 36 98 17 FE 4E 26
       data hash MD5: 32K
       42 42 59 81 94 1A 96 CB B3 BC 27 EC 0F 29 9E A4>)
(   2,<2025-01-20 13:58:45.31 +0400>,<she>,<DPX200>,
      <Start of raw data processing
       efp BC_mod = 2 LB = 1.5 FT_mod = 6 PKNL = 1 PHC0 = 1757.543 PHC1 = 87.4864 SI = 64K 
       data hash MD5: 64K
       FA 66 B5 7C 95 C1 7C 4B 71 9D F4 87 D2 66 41 B9>)
(   3,<2025-01-20 13:59:04.85 +0400>,<she>,<DPX200>,
      <pk PHC0 = -8.053797 PHC1 = 0 
       data hash MD5: 64K
       A4 E7 A6 9C AB BA 9C D9 8C D4 B8 62 4F 53 E6 FB>)
(   4,<2025-01-20 13:59:27.20 +0400>,<she>,<DPX200>,
      <abs ABSG = 5 
       data hash MD5: 64K
       B2 14 4E 89 C5 66 35 38 15 FC 5B 0B 03 B9 AC 15>)
$$ ##END=
$$ 
$$ hash MD5
$$ 8C 0E 8B 57 DE 77 51 41 1A 48 43 F5 82 F4 63 0F
##$RELAX= 
##$RELAX= 
##$RELAX= 
##$RELAX= 
##$RELAX= 
##$RELAX= 
##$RELAX= 
##$RELAX= 
$$ Bruker specific parameters
$$ --------------------------
##$DU= <F:/spectra>
##$EXPNO= 2
##$NAME= <P31>
##$PROCNO= 1
##$TYPE= <nmr>
##$USER= <she>
##$AMP= (0..31)
100 100 100 100 100 100 100 100 100 100 100 100 100 100 100 100 100 100 
100 100 100 100 100 100 100 100 100 100 100 100 100 100 
##$AQSEQ= 0
##$AQ_mod= 1
##$AUNM= <au_zg>
##$AUTOPOS= <>
##$BF1= 81.014009
##$BF2= 200.13
##$BF3= 200.13
##$BF4= 200.13
##$BF5= 200.13
##$BF6= 200.13
##$BF7= 200.13
##$BF8= 200.13
##$BYTORDA= 1
##$CFDGTYP= 0
##$CFRGTYP= 5
##$CHEMSTR= <none>
##$CNST= (0..31)
1 1 145 1 1 1 1 1 1 1 1 1 1 1 1 1 1 1 1 1 1 1 1 1 1 1 1 1 1 1 1 1 
##$CPDPRG= <waltz16>
##$CPDPRG1= <>
##$CPDPRG2= <waltz16>
##$CPDPRG3= <>
##$CPDPRG4= <mlev>
##$CPDPRG5= <mlev>
##$CPDPRG6= <mlev>
##$CPDPRG7= <mlev>
##$CPDPRG8= <mlev>
##$CPDPRGB= <>
##$CPDPRGT= <>
##$D= (0..31)
0 1 0 0 0 0 0 0 0 0.06 0 0.03 2e-05 3e-06 0 0 0.0002 0 0 0 0 0 0 0 0 0 
0 0 0 0 0 0 
##$DATE= 1737367109
##$DBL= (0..7)
120 120 120 11 120 120 24 19 
##$DBP= (0..7)
150 150 150 150 150 150 150 150 
##$DBP07= 0
##$DBPNAM0= <>
##$DBPNAM1= <>
##$DBPNAM2= <>
$$ [...]
##$SUBNAM3= <"">
##$SUBNAM4= <"">
##$SUBNAM5= <"">
##$SUBNAM6= <"">
##$SUBNAM7= <"">
##$SUBNAM8= <"">
##$SUBNAM9= <"">
##$SW= 400.765351723535
##$SWIBOX= (0..15)
0 1 3 0 0 0 0 0 0 0 0 0 0 0 0 0 
##$SW_h= 32467.5324675325
##$TD= 32768
##$TD0= 1
##$TE= 0
##$TE2= 300
##$TE3= 300
##$TEG= 300
##$TL= (0..7)
0 120 53 12 22 120 120 120 
##$TP= (0..7)
150 150 150 150 150 150 150 150 
##$TP07= 0
##$TPNAME0= <>
##$TPNAME1= <>
##$TPNAME2= <>
##$TPNAME3= <>
##$TPNAME4= <>
##$TPNAME5= <>
##$TPNAME6= <>
##$TPNAME7= <>
##$TPOAL= (0..7)
0.5 0.5 0.5 0.5 0.5 0.5 0.5 0.5 
##$TPOFFS= (0..7)
0 0 0 0 0 0 0 0 
##$TUNHIN= 0
##$TUNHOUT= 0
##$TUNXOUT= 0
##$USERA1= <user>
##$USERA2= <user>
##$USERA3= <user>
##$USERA4= <user>
##$USERA5= <user>
##$V9= 5
##$VALIST= <valist>
##$VCLIST= <CCCCCCCCCCCCCCC>
##$VD= 0
##$VDLIST= <DDDDDDDDDDDDDDD>
##$VPLIST= <PPPPPPPPPPPPPPP>
##$VTLIST= <TTTTTTTTTTTTTTT>
##$WBST= 1024
##$WBSW= 4
##$XGAIN= (0..3)
0 0 0 0 
##$XL= 0
##$YL= 0
##$YMAX_a= 3998
##$YMIN_a= -3970
##$ZGOPTNS= <>
##$ZL1= 120
##$ZL2= 120
##$ZL3= 120
##$ZL4= 120
##$ABSF1= 198.0616
##$ABSF2= -202.7028
##$ABSG= 5
##$ABSL= 3
##$ALPHA= 0
##$AQORDER= 0
##$ASSFAC= 0
##$ASSFACI= 0
##$ASSFACX= 0
##$ASSWID= 0
##$AUNMP= <proc_1d>
##$AZFE= 0.1
##$AZFW= 0.5
##$BCFW= 0
##$BC_mod= 2
##$BYTORDP= 0
##$COROFFS= 0
##$CY= -3
##$DATMOD= 1
##$DC= 0
##$DFILT= <>
##$DTYPP= 0
##$F1P= 0
##$F2P= 0
##$FCOR= 1
##$FTSIZE= 65536
##$FT_mod= 6
##$GAMMA= 0
##$GB= 0
##$INTBC= 1
##$INTSCL= 9.790993e-09
##$ISEN= 30
##$LB= 1.5
##$LEV0= 0
##$LPBIN= 0
##$MAXI= 10000
##$MC2= 0
##$MEAN= 0
##$ME_mod= 0
##$MI= 50
##$NCOEF= 0
##$NC_proc= -7
##$NLEV= 6
##$NOISF1= 182.463
##$NOISF2= 159.3651
##$NSP= 0
##$NTH_PI= 0
##$NZP= 0
##$OFFSET= 198.0616
##$PC= 4
##$PHC0= 1749.489
##$PHC1= 87.4864
##$PH_mod= 1
##$PKNL= yes
##$PPARMOD= 0
##$PSCAL= 0
##$PSIGN= 0
##$REVERSE= no
##$SF= 81.0140089999434
##$SI= 65536
##$SIGF1= 159.3651
##$SIGF2= -187.1042
##$SINO= 113.3802
##$SIOLD= 16384
##$SREGLST= <1H.CDCl3>
##$SSB= 0
##$STSI= 65536
##$STSR= 0
##$SW_p= 32467.5324675325
##$SYMM= 0
##$S_DEV= 0
##$TDeff= 32768
##$TDoff= 0
##$TI= <>
##$TILT= no
##$TM1= 0
##$TM2= 0
##$TOPLEV= 0
##$USERP1= <user>
##$USERP2= <user>
##$USERP3= <user>
##$USERP4= <user>
##$USERP5= <user>
##$WDW= 1
##$XDIM= 65536
##$YMAX_p= 387626908
##$YMIN_p= -12728720
$$ End of Bruker specific parameters
$$ ---------------------------------
##NTUPLES= NMR SPECTRUM
##VAR_NAME=  FREQUENCY,     SPECTRUM/REAL,   SPECTRUM/IMAG
##SYMBOL=    X,             R,               I
##VAR_TYPE=  INDEPENDENT,   DEPENDENT,       DEPENDENT
##VAR_FORM=  AFFN,          ASDF,            ASDF
##VAR_DIM=   65536,         65536,           65536
##UNITS=     HZ,            ARBITRARY UNITS, ARBITRARY UNITS
##FACTOR=    0.49542278885378, 1,            1
##FIRST=     16045.7642231865, 0,            0
##LAST=      -16421.768244346, 0,            0
##MIN=       -16421.768244346, -12728720,    0
##MAX=       16045.7642231865, 387626908,    0
$$ Real data points
##PAGE= N=1
##DATA TABLE= (X++(R..R)), XYDATA
$$ [...]
41249D62754p34558p52567o63796o78260m63565j44388l11753o64213p3189J428906
41239b594629K185341J251390j58199n33081j32855n2805l28863k85249N2803
41230e96147J95693K25871M25797M49618q470l29744N0860L86491l17487j459109
41220i76627j520376l28061Q19855J171079J200558J235046Q83388J57544j59025
41211B483381K51674P01300O29045L18887J01664k03068o30198p68426n48734
41202B335525m52629n25244j42906P22791J028705J85883q44787q79374j91553
41193A236411J32004o4689m4209L36397L52892k75419p90764m91808K46859N34714
41183A172388J69033k30891j96156k0849j72707m42530k26138L85629N13508j80130
$$ plain form
41249 462754 -271804 -1024371 -1688167 -2366427 -2829992 -2974380 -3286133 -3950346 -4023535 -2594629
41239 -2594629 -409288 842102 683903 150822 17967 -34838 -363701 -648950 -596147
41230 -596147 -400454 -174583 251214 700832 692362 362618 413478 799969 482482 -976627
41220 -976627 -2497003 -2825064 -2005209 -834130 366428 1601474 2484862 2642406 2483381
41211 2483381 2735055 3436355 4065400 4384287 4485951 4282883 3652685 2884259 2335525
41202 2335525 1882896 1357652 1214746 1937537 2966242 3152125 2307338 1427964 1236411
41193 1236411 1368415 1303726 1259517 1595914 1948806 1673387 882623 390815 637674 1172388
41183 1172388 1341421 1110530 914374 893525 720818 278288 52150 437779 951287 771157
41173G71157p82994m14925M09550O30185L35393L94195P15960L68485n44376p49753
41163A132877N1629N27470r0334p24148l77366J47293k05530p84382m40752L35762
41153d27481L10426k03319J04351J094052J281120L33288m57690m13206l54045
41144A267496q21223j124412q01032m71032m76861j06292R40279J614852J064476
41135A086251j6806n95629p85135j022557q18551L14886J491851J472703N41316
41126A668329m1732n6658l14151q48994p31817J43567N94749o279o83935l94769
41116f71690L72717M46759k11794n15735J39226J084210J290677N50856m59906
41107B025320j012550r53394n60488n9838M50751O98754L30188m77764r27404
$$ plain form
41173 771157 -11837 -426762 -17212 612973 948366 1342561 2058521 2427006 1882630 1132877
41163 1132877 1184506 1711976 1621642 897494 520128 667421 461891 -322491 -763243 -427481
41153 -427481 -117055 -320374 -216023 878029 2159149 2492437 2034747 1621541 1267496
41144 1267496 446273 -678139 -1479171 -1950203 -2427064 -2533356 -1593077 21775 1086251
41135 1086251 1069445 473816 -311319 -1333876 -2152427 -1837541 -345690 1127013 1668329
41126 1668329 1626597 1569939 1255788 406794 -325023 -181456 413293 407014 -276921 -671690
41116 -671690 -298973 147786 -64008 -579743 -440517 643693 1934370 2485226 2025320
41107 2025320 1012770 59376 -501112 -560950 -110199 588555 918743 440979 -486425
41098d86425n39189J50513L39420J02392R1545K80961o1366r67069j262179q1629
41088b433026J698272K312741J197734m46327j200058r40695n55399n74828o19697
41079a561283j98644M35488O04712J90099j95533r7189J89896J78975p1042j81438
41069g05959q6103O5421L79930R78316J416826J062293J06254m90334k80413P8031
41059B524262j55375p68908j055180q51086n60313m07804k40713K1265K30520
41050a263332L33188M71149O82105P51571M46877k26441r80590j347128r47918
41041b080519J02602J110683J360332Q07514Q0063k21649p8177J21354J50897
41032A353100J96041M91605Q02398N06095n95124j693342j635695l10289J007613
$$ plain form
41098 -486425 -1025614 -875101 -535681 -433289 -341744 -60783 -122149 -1089218 -2351397 -2433026
41088 -2433026 -734754 1577987 2775721 2329394 1129336 188641 -366758 -941586 -1561283
41079 -1561283 -1759927 -1324439 -719727 -529628 -725161 -822350 -632454 -453479 -524521 -705959
41069 -705959 -792062 -726641 -346711 631605 2048431 3110724 3216978 2726644 2446231 2524262
41059 2524262 2368887 1599979 544799 -306287 -866600 -1274404 -1515117 -1493852 -1263332
41050 -1263332 -930144 -458995 223110 974681 1421558 1195117 214527 -1132601 -2080519
41041 -2080519 -1977917 -867234 493098 1300612 1380675 1159026 1080849 1202203 1353100
41032 1353100 1549141 2040746 2843144 3349239 2754115 1060773 -574922 -885211 122402
41023A22402J031286m8165q67977n96027J69102L44623k28802p28363n23376P3170
41013a252127L67280K38286J63309L92214N26625J09871o32690r61582m88782
41004a537596L73059Q94960Q25956N90108O83662R60321P27894k85773j312760
40995A919831j359371n79728j73851o92313j178830n69042O91319J283495Q77941
40986B19451L58275L23140M22876L05172J86956J39844k52644r95604j233926
40977e26460l65821R56007J565489J113749J52478o76298j018255p82366k61884
40968A56639L7045N8234K54058O72656O71849N3262l16547J76120O82984O7639
40958B513939j244608j813325j281626o28173l81334N0346R52841J440894O87197
$$ plain form
41023 122402 1153688 1105523 237546 -358481 -189379 155244 -73558 -801921 -1325297 -1252127
41013 -1252127 -884847 -646561 -483252 -91038 435587 545458 -87232 -1048814 -1537596
41004 -1537596 -1164537 -269577 556379 1146487 1830149 2790470 3518364 3232591 1919831
40995 1919831 560460 -19268 -193119 -885432 -2064262 -2633304 -1941985 -658490 219451
40986 219451 577726 900866 1323742 1628914 1815870 1955714 1703070 707466 -526460
40977 -526460 -892281 63726 1629215 2742964 2895442 2219144 1200889 418523 156639
40968 156639 193684 251918 505976 1178632 1850481 1903743 1587196 1763316 2446300 2513939
40958 2513939 1269331 -543994 -1825620 -2453793 -2835127 -2784781 -1831940 -391046 296151
40949B96151p65907j585640j124987Q4559R89230R38482K50694r6749L58273R07259
40939B51365O99827P1737j6221M00216L83787k05888m18032J09351N15204L07463
40929B098809K69474R31458J337273M83176r26034j448932j033351q63631j398680
40920e50438j805153j321430j91036Q24177J115959M80078n95828j026822k50188
40911c320681Q82961J076340K75408m41895m99441l58466l96198k93257J67266
40902b907963N86194O70054P62168J175139J522032J192347J84288q61265j251310
40893A071684p69964R0133M36515q9158p57189o40043O6667L37905r4143l63834
40883g11427J02755P35715Q41553N92340L80040K807o81145r55978j28644J153845
$$ plain form
40949 296151 -469756 -2055396 -3180383 -3095824 -2106594 -1168112 -917418 -1014167 -655894 251365
40939 251365 951192 1022929 1006708 1406924 1790711 1584823 1166791 1276142 1791346 2098809
40929 2098809 2368283 3299741 4637014 5120190 4194156 2745224 1711873 848242 -550438
40920 -550438 -2355591 -3677021 -3868057 -3043880 -1927921 -1447843 -2043671 -3070493 -3320681
40911 -3320681 -2437720 -1361380 -1085972 -1527867 -2027308 -2385774 -2781972 -3075229 -2907963
40902 -2907963 -2321769 -1651715 -889547 285592 1807624 2999971 3184259 2322994 1071684
40893 1071684 301720 391853 828368 739210 -17979 -658022 -591355 -253450 -347593 -711427
40883 -711427 -608672 127043 968596 1560936 1940976 1943783 1262638 306660 178016 1331861
40873A331861J501444O08763m28301o72502l75772k47927m43502o59808p30969
40864a16713p12969o58335n82650m44431k7862Q30729J714602J716196M58221
40855B176788j166779j726572p69626O77240J232620N61933m97806j023371q94091
40846a429664n68075l30603r4139J94847L76042L89557M07976M66577K89503k31933
40836e29912o77193o04483k15083m0609q9406J14670N96370O90696P4438n15118
40826a195630j82629P74874J093374J72671j073993j283389k36394R49656J123342
40817A41882L07063m81528m79740m4125j05911q49660j333053o96401N79490J182609
40807a779374O61955l9562P7732Q28133J320699J140315N20203k14122p23434
$$ plain form
40873 1331861 2833305 3442068 3013767 2341265 1965493 1717566 1274064 614256 -116713
40864 -116713 -829682 -1488017 -2070667 -2515098 -2542960 -1712231 2371 1718567 2176788
40855 2176788 1010009 -716563 -1486189 -808949 423671 985604 487798 -535573 -1429664
40846 -1429664 -1997739 -2328342 -2422481 -2227634 -1851592 -1462035 -1054059 -587482 -297979 -529912
40836 -529912 -1207105 -1811588 -2026671 -2067280 -2156686 -2042016 -1445646 -754950 -680512 -1195630
40826 -1195630 -1378259 -603385 489989 662660 -411333 -1694722 -1931116 -981460 141882
40817 141882 448945 -32583 -512323 -556448 -662359 -1512019 -2845072 -3541473 -2961983 -1779374
40807 -1779374 -1117419 -1156981 -1079249 -251116 1069583 2209898 2730101 2515979 1792545
40798A792545n44034L07649Q41021J09741j300322j745567o43321Q15265J344528
40789I77505R76019L45408l78780j077151j115800k50032N69052M21264o1061
40780D06424L42310J301297J238920j87367j398696j136413r8157L56795N3970
40771H79083l06247m38380m62897k30934L04019M62555l19425j236756q70301
40762b219283O98568J677662R43309l64749m74580M84660P81464k28235j046233
40753B52583k42137J338857J698637M83469p12463q31604o60638j081218j397822
40744a152336n84802P49559J118085M07373j12978J23712L74362J62495k6585
40735A058885R143l17352j030372j071589J4896J036622Q05887j16990m17326
$$ plain form
40798 1792545 1248511 1556160 2397181 2506922 1206600 -538967 -1182288 -367023 977505
40789 977505 1953524 2298932 1920152 843001 -272799 -522831 46221 467485 406424
40780 406424 748734 2050031 3288951 3101584 1702888 566475 468318 825113 879083
40771 879083 572836 134456 -328441 -559375 -255356 207199 -112226 -1348982 -2219283
40762 -2219283 -1520715 156947 1100256 735507 260927 745587 1527051 1298816 252583
40753 252583 10446 1349303 3047940 3531409 2818946 1987342 1326704 245486 -1152336
40744 -1152336 -1737138 -987579 130506 537879 424901 548613 922975 1085470 1058885
40735 1058885 1068028 750676 -279696 -1351285 -1336389 -299767 506120 389130 -28196
40726b8196M4302M53518N41642O40208O81298L34005j48109l03044m08847r64924
40716H41853j486639j018505K49442J084756R77711O38301N84958M17166j48972
40707B140071n76460l64616J75679M72588L94634P3858l54872n83972l44251P155
40697A039814j92811q16859r68309l48272K66762K68633L3619J7496m0252l49882
40687a090061l66157L16057J036152R26502J87610l52463n10524o95081r30479
40678a478444q47979m48605m3653L81062R17057J052164K08666j054801j378715
40669b693248l63800Q52854J089775M42810k35123m60310k46777K84997Q36535
40660d92287Q83218K84297l34728l43712r777n5998m85899n46064O9454O60732
$$ plain form
40726 -28196 16106 469624 1011266 1651474 2332772 2666777 2518668 2215624 1806777 841853
40716 841853 -644786 -1663291 -1413849 -329093 648618 1286919 1871877 2289043 2140071
40707 2140071 1563611 1198995 1374674 1847262 2241896 2315754 1960882 1376910 1032659 1039814
40697 1039814 847003 30144 -938165 -1286437 -1019675 -751042 -717423 -699927 -740179 -1090061
40687 -1090061 -1456218 -1140161 -104009 822493 1010103 657640 147116 -547965 -1478444
40678 -1478444 -2326423 -2775028 -2818681 -2437619 -1520562 -468398 -259732 -1314533 -2693248
40669 -2693248 -3057048 -2204194 -1114419 -671609 -906732 -1367042 -1613819 -1328822 -492287
40660 -492287 390931 675228 340500 -3212 -12989 -68987 -554886 -1100950 -1031496 -370764
40650c70764N00714j37387m17721j05039K65130K81099J40559J07232j1948m87915
40640b36040j044291j024151j64544J026692J683658J310407K34823n71676l49069
40631H65809O02997J163963O81049k86390q12921q11430q40505r83532o99803
40622a120763J49613Q65519Q29107L45887J63389M41726O01461J27747p29302
40613A674384j165966p75050j71040k86301r48801q13779P63060K439790K417998
40604C134295Q28424n96470j006391j117458j281749o06378J161117K355501J384363
40595D255254q78661k103307j451296k26970J96387j36446m39894l40669k3654
40586a149256J90086J58030N8873J81405M17169K98624k21925n58922m15007k46157
$$ plain form
40650 -370764 129950 -7437 -425158 -530197 -265067 16032 156591 263823 251875 -236040
40640 -236040 -1280331 -2304482 -2469026 -1442334 241324 1551731 1786554 1214878 865809
40631 865809 1468806 2632769 3313818 3027428 2214507 1403077 562572 -420960 -1120763
40622 -1120763 -971150 -105631 723476 1069363 1232752 1674478 2275939 2403686 1674384
40613 1674384 508418 -266632 -437672 -723973 -1672774 -2486553 -1723493 716297 3134295
40604 3134295 3962719 3366249 2359858 1242400 -39349 -645727 515390 2870891 4255254
40595 4255254 3376593 1273286 -178010 -404980 -208593 -345039 -784933 -1125602 -1149256
40586 -1149256 -959170 -801140 -742267 -560862 -143693 154931 -66994 -625916 -1040923 -1287080
40576a287080l10338p7554O65426J018644L35682m46159j84202M61409K7294j193507
40566i90385j452223l40008O25035M90195Q7492J88506K41664j46467j08892Q89145
40556e15938J687641J045439l64478r55364m93866k0672m1105j27923l2830K9966
40546B10870R7646M07329O70116L07084n79239j230450j220704p83190k58224
40537b378762J44818J81211j60819l48198Q0148P10476P43684J67215k91088l28880
40527a480195m12168q29671j090289n63708O57303J737814J797943P17787n84732
40518d9916r60353l45712J86143K6386m7635P36556J598292J222663j30726r22399
40508A313299o12650k12986m11323o10601l10219o7920l09820l58908L66562J117071
$$ plain form
40576 -1287080 -1597418 -1674972 -1009546 9098 344780 -101379 -285581 175828 203122 -990385
40566 -990385 -2442608 -2782616 -2157581 -1667386 -1579894 -1391388 -1149724 -1296191 -1405083 -515938
40556 -515938 1171703 2217142 1852664 897300 403434 382762 341657 213734 180904 210870
40546 210870 308516 715845 1385961 1693045 1113806 -116644 -1337348 -2120538 -2378762
40537 -2378762 -2233944 -2052733 -2213552 -2561750 -2481602 -1771126 -1027442 -860227 -1151315 -1480195
40527 -1480195 -1892363 -2722034 -3812323 -4376031 -3718728 -1980914 -182971 534816 -49916
40518 -49916 -1010269 -1355981 -1169838 -1143452 -1191087 -454531 1143761 2366424 2235698 1313299
40508 1313299 700649 487663 76340 -534261 -844480 -912400 -1222220 -1581128 -1214566 -97495
40498i7495Q78393Q006l26947Q5342M07029J82786k01135m39682p04674r99072
40488a207449r64427n54443k06558j15823L4261L73421M94630J43809k78339l21851
40478b602769j56437j68473k44407n977M41818N73624K27047j86687l21610k75614
40468b719485j77543J46906P89503J371404J413112R00176J62476n92211j227910
40459F6428j370113p14209L45777R30782O58769m529m52718n02258j55290N50659
40449f46702J164293R64609j2532o75960k53857N11274L11339r04415j877220
40440a419171j660357n22288O88089J315628J054151R8211p45404p27212j0552
40431a928905O68389J038990J261430J071803L8417j278902j613492p78533o1985
$$ plain form
40498 -97495 780898 788904 461957 547299 954328 1137114 935979 496297 -208377 -1207449
40488 -1207449 -2171876 -2726319 -2932877 -3048700 -3014439 -2641018 -2146388 -2002579 -2280918 -2602769
40478 -2602769 -2759206 -2927679 -3172086 -3178063 -2736245 -2162621 -1935574 -2122261 -2443871 -2719485
40468 -2719485 -2897028 -2750122 -1960619 -589215 823897 1724073 1886549 1294338 66428
40459 66428 -1303685 -2017894 -1672117 -741335 -82566 -87095 -539813 -1042071 -1197361 -646702
40449 -646702 517591 1482200 1469668 793708 539851 1051125 1362464 458049 -1419171
40440 -1419171 -3079528 -3601816 -2913727 -1598099 -543948 -445737 -1191141 -1918353 -1928905
40431 -1928905 -1260516 -221526 1039904 2111707 2150124 871222 -742270 -1520803 -1582788
40422a582788l57651r80630r61160m51320m7178K93274P00322O61943n9175n51504
40412c335867n185Q19754P00463j1023L9760Q97336J185654L65680m77041m74419
40402b94888j92729m05090q18204p46984j77006M88622R98548J065537M17525
40393C35331m42412m03000O75478J411013P39936m78078o70786K58315J050837
40384B476634R78695M32098j92302r66106j631002j423123j95365J002247J012581
40375A494357j36891j394549j816834j242473j57661P14924Q30032K05043n18154
40366b022206n80696J71515J074583J258096N45397l36318n61982j14275L23617
40357b42269K52208k12386p09884r64097p15246J11294R97358J159482N48126
$$ plain form
40422 -1582788 -1940439 -2921069 -3882229 -4333549 -4380727 -4087453 -3387131 -2725188 -2784363 -3335867
40412 -3335867 -3341052 -2521298 -1820835 -1831858 -1792098 -894762 290892 656572 179531 -294888
40402 -294888 -487617 -892707 -1710911 -2457895 -2634901 -2146279 -1147731 -82194 335331
40393 335331 -107081 -510081 165397 1576410 2316346 1838268 1167482 1425797 2476634
40384 2476634 3455329 3887427 3695125 2729019 1098017 -325106 -520471 481776 1494357
40375 1494357 1357466 -37083 -1853917 -3096390 -3254051 -2539127 -1709095 -1504052 -2022206
40366 -2022206 -2602902 -2431387 -1356804 -98708 446689 110371 -451611 -565886 -242269
40357 -242269 9939 -202447 -912331 -1876428 -2591674 -2480380 -1483022 -323540 224586
40348B24586k5539k1503K28715L84106O94502J116213P63968p03749j891915j235653
40338d66269O17775J478947O13544m50921l68850K96518M23545N1072k11383m44204
40328A539774r64794j327953r35571k35210k10147q21419r37121Q9017J498675
40319b304749K003678J181015j25510o33362O2450R52569P41751m37052j102843
40310C37947m82563L96154L02833l86467m87904N5341K93586l7666k66929j25249
40300d00917m5558o2009K95204P68273L48510j015379j882449j210317J87652
40291c016990Q42769M72161j55753m59157l13090K94235J013153J042914J26731
40282a53027q01793p78421j73587k7495m34141n84397j57660L62953O58168Q57940
$$ plain form
40348 224586 199047 177544 406259 790365 1484867 2601080 3365048 2661299 769384 -466269
40338 -466269 151506 1630453 2243997 1793076 1424226 1720744 2144289 2195361 1983978 1539774
40328 1539774 574980 -752973 -1688544 -1923754 -2133901 -2955320 -3892441 -3803424 -2304749
40319 -2304749 -301071 879944 754434 121072 183522 1136091 1877842 1440790 337947
40310 337947 -144616 251538 554371 167904 -320000 -264659 28927 -8739 -275668 -400917
40300 -400917 -446475 -508484 -213280 554993 903503 -111876 -1994325 -3204642 -3016990
40291 -3016990 -2174221 -1702060 -1857813 -2316970 -2630060 -2335825 -1322672 -279758 -153027
40282 -153027 -954820 -1733241 -1906828 -1934323 -2368464 -2952861 -3110521 -2747568 -2089400 -1231460
40272a231460Q67807L77214l73398p36259o62367o51254o11359J35492J396361
40263a489223J805510O55162q88644j229119l37440N18213N25163m2278n84405
40254a067061p36347l75944J90908K28705n41211j243993q26394L87991J002769
40245b980577M61009k73857k25269L04387M90321L10029L62470P84555J112268
40236C45336J048797P05485J56377n98259j193184j081143l66548J14008j17623
40227i86754m90991k43739M15513O21467J66499j98037Q9895N67401M56188j72998
40217B24444m71376K1856P35671P62879k3407p83706o50618K92278J108739J060681
40207B277441L44171l33365o25294o52023m52765Q4046O97362P87187K60440j84665
$$ plain form
40272 -1231460 -363653 13561 -359837 -1096096 -1758463 -2409717 -3021076 -2885584 -1489223
40263 -1489223 316287 971449 82805 -1146314 -1483754 -965541 -440378 -482656 -1067061
40254 -1067061 -1803408 -2179352 -1988444 -1759739 -2300950 -3544943 -4371337 -3983346 -2980577
40245 -2980577 -2519568 -2793425 -3018694 -2714307 -2223986 -1913957 -1551487 -766932 345336
40236 345336 1394133 2099618 2255995 1657736 464552 -616591 -983139 -869131 -986754
40227 -986754 -1477745 -1721484 -1305971 -684504 -518005 -716042 -626147 -58746 397442 224444
40217 224444 -246932 -225076 510595 1273474 1250067 466361 -184257 108021 1216760 2277441
40207 2277441 2621612 2288247 1662953 1010930 558165 642211 1339573 2126760 2387200 2202535
40197B202535j5108L68036L07939r4336k67007j32105o0065p7736P9285K03414
40187B514852k36295j070159j370622o84718L75397J053486J268760J186321P07925
40178C744947r3245o47530n97164l60778m36436n98846l85730M1316J81158K78
40168H47970j97822m01770p12417q16115l70584K95859O00216N95839O50556M93376
40158I85108l76796j400609j295231K5858J022263N86026m67002p23467j37568
40149a781418K98192K33352J75106K78976O8702n11627p31423j47578O42776Q05852
40139f69090L73250L1543P7318J27398j42776m48014l20113J57800L79435r722
40129d42971o38113q71676n69170j21056J66936L85230O64476Q54251P57324M37233
$$ plain form
40197 2202535 2187427 2555463 2863402 2769066 2502059 2369954 2309889 2232153 2311438 2514852
40187 2514852 2278557 1208398 -162224 -846942 -471545 581941 1850701 3037022 3744947
40178 3744947 3651702 3004172 2407008 2046230 1609794 1010948 625218 666534 847692 847970
40168 847970 650148 248378 -464039 -1280154 -1650738 -1354879 -754663 -158824 491732 985108
40158 985108 608312 -792297 -2087528 -2061670 -1039407 -453381 -920383 -1643850 -1781418
40149 -1781418 -1483226 -1249874 -1074768 -795792 -727090 -1238717 -1970140 -2117718 -1474942 -669090
40139 -669090 -295840 -264297 -186979 -59581 -202357 -650371 -970484 -812684 -433249 -442971
40129 -442971 -1081084 -1952760 -2521930 -2642986 -2476050 -2090820 -1426344 -572093 185231 622464
40119F22464N1039m23945r90617j288307q46041K41753J200363J333797P40773
40110F41279Q4222k33758l90284o22620p35279m16119J30003L02638o0038l80287
40100a680243j31580M06540N76746K92195M9815P4729K1013l37149o22047l78004
40090a727985K37625O34590N02252O1802k96447l70047j47486L31811R82658J541674
40080A750447J567044Q24410k39524p21084k59525M35329M72223l3052k50980
40071C545288J4687P4867m16950q44500o81311m16064p36551j310889j203608
40062a975031k73040O30256Q39650N73165L45059K38258K1469l38858n47346k86241
40052g72659M03633J029965J071407N86015J77429J92637K46683j74884r27363
$$ plain form
40119 622464 673503 249558 -741059 -2029366 -2875407 -2633654 -1433291 -99494 641279
40110 641279 725501 491743 101459 -521161 -1256440 -1672559 -1542556 -1239918 -1299956 -1680243
40100 -1680243 -1811823 -1405283 -828537 -536342 -486527 -411798 -390785 -727934 -1349981 -1727985
40090 -1727985 -1490360 -855770 -353518 -291716 -588163 -958210 -1105696 -773885 208773 1750447
40080 1750447 3317491 4141901 3902377 3181293 2921768 3357097 3829320 3796268 3545288
40071 3545288 3559975 3634842 3217892 2373392 1692081 1276017 539466 -771423 -1975031
40062 -1975031 -2248071 -1617815 -778165 -205000 140059 378317 399786 60928 -486418 -772659
40052 -772659 -369026 660939 1732346 2318361 2495790 2688427 2935110 2760226 1832863
40043A832863j393588j240550o22146J37256O47669N02864k38124p91459m63661
40034a628876L40573N27226k32782j032229q67529J93767J161581J146060J65590
40025b26619q32363q45739J4177M86788k56617j345048j272000k656R71826P34096
40015b574155J9876j49552J26146K40927K49541N40471Q81696P09844J26714j91995
40005b0487M56K76574K89298K04986K96323N16985N91277K95420l49019r98655
39995A103158j221986r76715o52914m54884o0336P71251J563331J582560P84180
39986B437645j62640p09363q41807o99460k78348L20561O84109M12026l76570
39977G86153r87334p41354K56375J068422R40076K68843Q7879N95129Q81760L44229
$$ plain form
40043 1832863 439275 -801275 -1423421 -1286165 -638496 -135632 -373756 -1165215 -1628876
40034 -1628876 -1288303 -761077 -993859 -2026088 -2893617 -2699850 -1538269 -392209 -226619
40025 -226619 -1058982 -1904721 -1890544 -1403756 -1660373 -3005421 -4277421 -4280077 -3308251 -2574155
40015 -2574155 -2554279 -2703831 -2577685 -2336758 -2087217 -1546746 -665050 44794 171508 -20487
40005 -20487 -20031 256543 545841 750827 1047150 1564135 2155412 2450832 2101813 1103158
39995 1103158 -118828 -1095543 -1748457 -2203341 -2263677 -1492426 70905 1653465 2437645
39986 2437645 2275005 1565642 723835 24375 -253973 66588 750697 1162723 786153
39977 786153 -201181 -942535 -686160 382262 1322338 1591181 1679060 2274189 3155949 3500178
39967C500178m17579o16901m45736m59983m27861J95506J012043J018981J26844
39958C485492p11065r43435r42838q89609k73822R33249J583358P01407j005558
39949A937179j836141j081521L20446J011206N61242l92193r36237p03752q8339
39940a208110K80241K11673l8339k96928n77227o42283o8440R61508J473409Q15334
39930I10838l94079r67269n68283J14164M56941N27337N58899M19445n9765n85696
39920D12532o51427j90733L27113M68302K44817j21267n57229r94491j069504
39911b131887m54048M73618Q31401L88711m93L88615R79044O90549l68547r57658
39901a60695m76559K91847M95111L29685L08254K41701k42486p32131n10788K36947
$$ plain form
39967 3500178 3082599 2465698 2019962 1559979 1132118 1327624 2339667 3358648 3485492
39958 3485492 2774427 1830992 888154 -1455 -275277 657972 2241330 2942737 1937179
39949 1937179 101038 -980483 -660037 351169 912411 520218 -416019 -1119771 -1208110
39940 -1208110 -927869 -716196 -754535 -1051463 -1628690 -2270973 -2339413 -1377905 95504 910838
39930 910838 516759 -450510 -1018793 -904629 -447688 79649 638548 1057993 998228 412532
39920 412532 -238895 -429628 -102515 365787 610604 489337 -67892 -1062383 -2131887
39911 -2131887 -2585935 -2112317 -1280916 -892205 -892698 -504083 474961 1165510 796963 -160695
39901 -160695 -637254 -345407 149704 479389 787643 1029344 786858 54727 -456061 -219114
39891b19114N66784J08783m66917m36373J08268N68487N89235K80008m9243k05113
39881H44805k76075m78261p36434o05405J16245Q71976Q72681J18293n21645l62791
39871a56611K80560N29305J2784o92089p14742P9338Q51572P49501j3661m29712
39861D96245p2004L68052K20938r1130K28247R56582J031020P8749j023226j310959
39851H82514q17297j96759K10588N26469Q48559J013134P71820M9406q63063j358941
39841A066430j052520l65700k20858r03382j544508j113255K63912J423336J571020
39832h75525J069875O40141L01117l25317r41297o89278M30937J138117N48427
39823A297197m12785l18922M90563L72382q87686j462503k54060J275340J246569
$$ plain form
39891 -219114 347670 456453 -10464 -446837 -338569 229918 819153 1099161 1049918 844805
39881 844805 568730 90469 -645965 -1251370 -1135125 -263149 609532 727825 206180 -156611
39871 -156611 123949 653254 666038 -26051 -740793 -661455 190117 939618 925957 496245
39861 496245 424241 792293 1013231 922101 1150348 2106930 3137950 3216699 2193473 882514
39851 882514 65217 -131542 79046 605515 1454074 2467208 3239028 3288434 2425371 1066430
39841 1066430 13910 -351790 -572648 -1476030 -3020538 -4133793 -3869881 -2446545 -875525
39832 -875525 194350 834491 1135608 810291 -131006 -820284 -389347 748770 1297197
39823 1297197 884412 565490 1056053 1428435 540749 -921754 -1175814 99526 1346095
39814A346095J08913l40566J52919K49966m66441q44893k51858M11110L24319
39805F89564n7010j12752j03489l17789k94370J96122L54724m41222j385093j244905
39795b716220r8108Q99576J057727N72098j88635q67503q76108O8161J247913
39786i01099J591828R62256J32508l60521o03337o69057l97206J31317N36730
39777D23419O02030L01220m58089j469091j821677p72413R56527J676608P71317
39768B09851n79662j024772n87987j23618N1993K84651P40014J109223J044018
39759A123711M81461l27824q41175n50672L40397Q37556K36245q76326j241386
39750h18013n24236K95097K92042k26395l60852l284J35228k02386l31682K47406
$$ plain form
39814 1346095 1455008 1114442 1267361 1517327 1050886 205993 -45865 365245 689564
39805 689564 632554 519802 416313 98524 -195846 276 355000 -86222 -1471315 -2716220
39795 -2716220 -2814328 -1914752 -857025 -284927 -473562 -1341065 -2217173 -2149012 -901099
39786 -901099 690729 1652985 1785493 1424972 821635 152578 -244628 -113311 423419
39777 423419 1025449 1326669 868580 -600511 -2422188 -3194601 -2238074 -561466 209851
39768 209851 -369811 -1394583 -1982570 -2106188 -2054195 -1769544 -1029530 79693 1123711
39759 1123711 1605172 1277348 436173 -114499 225898 1063454 1299699 423373 -818013
39750 -818013 -1342249 -1047152 -755110 -981505 -1342357 -1345641 -1210413 -1412799 -1744481 -1497075
39740a497075R09833P49184l2496l77470J08542P08219P44541L77504J101l76698
39730A315185p27100o67765r7815L81111K55739j51727k73277j35315q853K45169
39720A35352P32780R06942K74023o17652q19211l76480j37257l23149l04729K00050
39710c29331O84623P37842N05140J47737l29722o22879l66321P4261l8323n62995
39700i9968o18480j31231m5463o06131p23205K32383J187073R34648J6564j52186
39690e996N74999J026473N20061l79588q77701q37823n50390k49052K04K71483
39680e07330O34474Q78014O49559N3847l41422l64985n14857r74445j060423k89066
39670a836634O51913P97127K52788j87783l05222l99152l72024Q0182N81593M38550
$$ plain form
39740 -1497075 -587242 161942 129446 -248024 -139482 568737 1313278 1690782 1691883 1315185
39730 1315185 588085 -79680 -177495 203616 459355 307628 34351 -100964 -109817 135352
39720 135352 868132 1775074 2049097 1431445 612234 235754 98497 -224652 -529381 -329331
39710 -329331 355292 1093134 1598274 1746011 1416289 793410 427089 501350 463027 -99968
39700 -99968 -718448 -849679 -895142 -1501273 -2224478 -1992095 -805022 129626 146190 -5996
39690 -5996 569003 1595476 2115537 1735949 858248 20425 -529965 -779017 -778813 -507330
39680 -507330 127144 1005158 1654717 1708564 1367142 1002157 487300 -487145 -1547568 -1836634
39670 -1836634 -1184721 -387594 -134806 -322589 -627811 -1026963 -1398987 -1318805 -737212 -298662
39660b98662j75935l87358K7935M02709L35925J42487K7838k45346o36206o44565
39650a451178j63494K38162J91231J3426O0937K40458L97762N53790N68733K45923
39640H95750q2745J52647P14153O86135q1125o26871l83610O04p4256j30744L14872
39629A384810O19059L3947q78722j052531n93784m03488n23362k35358L58048
39620a291381L31380l25692m26531M41631R82406Q4763j357527j589941l47265
39611c498157J000681J326469P70472M445n75764p70102m50667J73708O43114
39602a375801P85900P61421N11901k31353j192119j459937o11303N76431J047818
39593a187042O98783J46021k90895o37206o21945O6034R24391R85289J78327n37534
$$ plain form
39660 -298662 -474597 -861955 -834020 -431311 -95386 47101 74939 -170407 -806613 -1451178
39650 -1451178 -1614672 -1376510 -1185279 -1171853 -1110916 -870458 -472696 81094 649827 895750
39640 895750 813005 965652 1679805 2365940 2284815 1657944 1274334 1274938 1200682 1069938 1384810
39629 1384810 2003869 2037816 1159094 106563 -487221 -890709 -1414071 -1649429 -1291381
39620 -1291381 -960001 -1285693 -1712224 -1270593 -288187 -203424 -1560951 -3150892 -3498157
39611 -3498157 -2497476 -1171007 -400535 -396090 -971854 -1741956 -2192623 -2018915 -1375801
39602 -1375801 -589901 171520 683421 452068 -740051 -2199988 -2811291 -2234860 -1187042
39593 -1187042 -488259 -342238 -633133 -1270339 -1892284 -1826250 -901859 83430 261757 -275777
39583b75777o42406o98032j096058j186646m24931M79038N62528J26352J23837
39574c032095M86854L39435k93925l58487M57895J076140O41715k25559m25087
39565a333114J65732Q77338J252981J184766N52386n30628j389666j376739o87471
39556a284415j07904l6713j68223q2783K20455M28889L57357K11385L57554P43293
39546F38895P61280O0720p14398o42093Q2867L28638k09935m22275M76732J540619
39536A901050J357880R6464q08093o85314k17983m1524J08631N34201P97888L91006
39526C434206m05428r09188r30595p51176m68718K4980M38741J04777j027821
39517d90222j837912j120390P59975J959464J261282m41029j350650j009564m50937
$$ plain form
39583 -275777 -918183 -1616215 -2712273 -3898919 -4323850 -3844812 -3282284 -3155932 -3032095
39574 -3032095 -2545241 -2205806 -2499731 -2858218 -2400323 -1324183 -682468 -908027 -1333114
39565 -1333114 -1167382 -290044 962937 2147703 2700089 2169461 779795 -596944 -1284415
39556 -1284415 -1392319 -1429032 -1597255 -1680038 -1459583 -1030694 -673337 -461952 -104398 638895
39546 638895 1400175 1460895 746497 104404 187271 515909 305974 -116301 360431 1901050
39536 1901050 3258930 3355394 2547301 1861987 1644004 1602480 1711111 2245312 3043200 3434206
39526 3434206 3028778 2119590 1188995 437819 -30899 -5919 432822 537599 -490222
39517 -490222 -2328134 -3448524 -2688549 -729085 532197 91168 -1259482 -2269046 -2719983
39508b719983l46473k00552L46983O14629K1637p54122p03740J6923M79994M50849
39498b793855M58766O59834O63956M49385M76496P79072Q08866L80366n634k5729
39488A851523j4559k95144o65101q60399r44135r06254m54164L90447R98026R09194
39478I434N04043M12026N95867N60063K31089K3964P8316J4854l73948o55049
39468A400659l39472L07827N05959K6522m40175k65910J66303M7985n29719o21342
39458B58637Q5570O76898L61470l49488n34319l12447m37635q07492n12888O01372
39448i70322J471318J227325K81879l83257m09511j45052J567j03523l69265o08050
39438f891p28178p70256n95720J18507J117491J281313P739j417713j072093R15886
$$ plain form
39508 -2719983 -3066456 -3267008 -2920025 -2305396 -2283759 -3037881 -3741621 -3724698 -3244704 -2793855
39498 -2793855 -2335089 -1675255 -1011299 -561914 -85418 693654 1502520 1882886 1877252 1851523
39488 1851523 1836964 1541820 876719 16320 -927815 -1834069 -2288233 -1897786 -899760 9434
39478 9434 513477 925503 1521370 2081433 2312522 2336486 2414802 2429656 2055708 1400659
39468 1400659 1061187 1369014 1874973 1901495 1461320 1195410 1361713 1409698 879979 258637
39458 258637 344207 1021105 1382575 1033087 498768 186321 -251314 -1058806 -1571694 -970322
39448 -970322 500996 1728321 2010200 1626943 1217432 1072380 1073947 970424 601159 -6891
39438 -6891 -735069 -1505325 -2101045 -1982538 -865047 416266 424005 -993708 -2065801 -1149915
39428a149915K268544J568083J4056n94874l39952m14922q52115o08777M29042
39419C19170J065724N69920l71456p98408o18562k02369L35497Q91588J001986
39410B193090L63388n48861r23075n70059k7529K41243L26869M33186L38902l14371
39400A512783j283508j704057j025588K69651J149105J104322N09545M5798N3604
39391F31655L70385N30535J81282n04144r76767j025968r76456r06964k84068
39382b960510J000713J858330J267684j18728q26553p05291p75843j067835m26711
39373b754744J147650J883959Q89751l03107j37727N38473Q5790j092052j261810
39364a003817j97488O48913N11492M7665k09374m62818o29976k55912L48983L10153
$$ plain form
39428 -1149915 1118629 2686712 2700768 2105894 1765942 1351020 498905 -109872 319170
39419 319170 1384894 1954814 1583358 784950 166388 -35981 299516 1191104 2193090
39410 2193090 2556478 2007617 1084542 514483 486954 728197 1055066 1488252 1827154 1512783
39400 1512783 229275 -1474782 -2500370 -2230719 -1081614 22708 532253 578051 631655
39391 631655 1002040 1532575 1713857 1209713 232946 -793022 -1769478 -2676442 -2960510
39382 -2960510 -1959797 -101467 1166217 1047489 220936 -484355 -1260198 -2328033 -2754744
39373 -2754744 -1607094 276865 1166616 863509 725782 1264255 1350045 257993 -1003817
39364 -1003817 -1201305 -552392 -40900 6765 -202609 -665427 -1295403 -1551315 -1202332 -892179
39354h92179k32951j41463Q13068J430601R26174p507n28952q01852j146048j171853
39344a752962n88355K6136P9265j23244k7353K67798M12822M85621O26802N64261
39334b9209J05604l92632n57211n05796m21489k05547O9102M2894j85470K9937
39324b049817P57170J120225O27842k9238j87483k46842o30093p04343R7960R26795
39314c17824O56317k32694l81494K50500M89829P0387j5622N45518P27986k4905
39304A767998p43642m64831L09834N69559L00697P8806j28378o74086j176336
39295a60379q63211R5493N77530K3406p96253q60163j61691N53917R00367J089381
39285C98397J193448Q60252K4067o38514n16399n4918k39510j074315j334805
$$ plain form
39354 -892179 -1125130 -1266593 -453525 977076 1903250 1895743 1366791 564939 -581109 -1752962
39344 -1752962 -2341317 -2315181 -2235916 -2359160 -2386513 -2118715 -1705893 -1220272 -593470 -29209
39334 -29209 76395 -316237 -873448 -1379244 -1800733 -2006280 -1937178 -1894284 -2079754 -2049817
39324 -2049817 -1292647 -172422 455420 426182 238699 -8143 -638236 -1342579 -1244619 -317824
39314 -317824 338493 105799 -275695 -25195 464634 535021 519399 1064917 1792903 1767998
39304 1767998 1024356 559525 869359 1438918 1739615 1818421 1690043 1015957 -160379
39295 -160379 -1023590 -928097 -350567 -327161 -1123414 -1983577 -2145268 -1591351 -690984 398397
39285 398397 1591845 2452097 2476164 1837650 1321251 1266333 1026823 -47492 -1382297
39276a382297k04919J439962J976154R40345n67478j215238o72944L55993Q46171
39267A515749K50485r68230j628252j019466K69967J072944J018986O94714N58453
39258A765350L52394k68503j056850j386239q72985K86384J319875J308445Q9155
39249A537026j268663j441092l96822O06868P03747L70932L42411L53994k43135
39240E65266j095296j099048n8514Q34662N71564k91209m29715M38718J265436
39231G01864J136035L21520l53576n67795m80887j69463K52376K82233l79819
39222G42488j016234n98399N98044J096791K86574o75451o72262k84662n92495
39213a115606j174153p37255O41768J436854R00627m533k36963m033Q2915J07060
$$ plain form
39276 -1382297 -1587216 -147254 1828900 2769245 2201767 986529 313585 669578 1515749
39267 1515749 1766234 798004 -830248 -1849714 -1579747 -506803 512183 1206897 1765350
39258 1765350 2117744 1849241 792391 -593848 -1466833 -1180449 139426 1447871 1537026
39249 1537026 268363 -1172729 -1569551 -962683 -258936 111996 454407 808401 565266
39240 565266 -530030 -1629078 -1687592 -852930 -281366 -572575 -1002290 -563572 701864
39231 701864 1837899 2159419 1805843 1238048 757161 587698 840074 1122307 742488
39222 742488 -273746 -872145 -274101 822690 1109264 433813 -238449 -523111 -1115606
39213 -1115606 -2289759 -3027014 -2385246 -948392 -47765 -52298 -289261 -293294 -210379 -103319
39203a03319L49426M96739J64831l04178k99271J46261M83095L96946l8789o42566
39193F49175j112985j058569m69239J42544M29516O42326R81541J020997L68786
39184A594092n10578q36230o02552m21810m73198l81811r3800o9168m33561o26736
39174b855352k13938M59892P77461O41510M06445K78329J54127m8322k19527k43193
39164h62568j58619q1519o9856j18126j99910k37623j03674J97853L82555J66192
39154a085295k34402k10067L88634Q47709M75047l62823o63458j17261O36334
39145c25582J043201J177011J146360P82279K17804j1025J25045j02863r84589
39136C067641j680165j422876p08816m34157m67410r9753N53443P42753L89504
$$ plain form
39203 -103319 246107 742846 907677 603499 304228 450489 933584 1330530 1291741 649175
39193 649175 -463810 -1522379 -1991618 -1849074 -1419558 -777232 204309 1225306 1594092
39184 1594092 1083514 247284 -355268 -777078 -1250276 -1632087 -1725887 -1795055 -2228616 -2855352
39174 -2855352 -3069290 -2609398 -1831937 -1190427 -783982 -505653 -351526 -399848 -619375 -862568
39164 -862568 -1021187 -1102706 -1172562 -1290688 -1490598 -1728221 -1831895 -1634042 -1251487 -1085295
39154 -1085295 -1319697 -1529764 -1141130 -293421 181626 -181197 -844655 -961916 -325582
39145 -325582 717619 1894630 3040990 3823269 4041073 4030048 4155093 4052230 3067641
39136 3067641 1387476 -35400 -744216 -1178373 -1645783 -1745536 -1192093 -449340 -59836
39127e9836J6129m49297j459235k378829j728786N61693K457037K254189P36146
39118e0789j13020K30098O42724L84420j7679K3559K18836J29388J8664L39439
39108A805640Q28911P87591J10767n48837o91472n28661m41905l56868m6719K85776
39098A204223K61506k6764k06690l46121p49725j048704m62339P23146J014746
39089C63278k06984j430856r58458N97310J166162K48576m86185J91373J347103
39080H31319J404881K73337q68592j174903p35501m0066M89448O61654O12388
39071A453965N51284L32795k83725r40562r50458l85334o8428k36855j53792N35788
39061a45322J077909Q67867M50474M51746M46175j09238o49568m05804J15209
$$ plain form
39127 -59836 -43707 -493004 -1952239 -4331068 -6059854 -5498161 -3041124 -786935 -50789
39118 -50789 -163809 66289 709013 1093433 1075754 1099313 1318149 1447537 1466201 1805640
39108 1805640 2634551 3422142 3532909 2984072 2292600 1763939 1322034 965166 918447 1204223
39098 1204223 1465729 1438965 1232275 886154 136429 -912275 -1374614 -651468 363278
39089 363278 156294 -1274562 -2233020 -1635710 -469548 -220972 -707157 -515784 831319
39080 831319 2236200 2509537 1640945 466042 -269459 -309525 179923 841577 1453965
39071 1453965 2005249 2338044 2054319 1113757 163299 -222035 -290463 -527318 -681110 -145322
39061 -145322 932587 1800454 2250928 2702674 3148849 3039611 2390043 1984239 2099448
39052B099448j41394j009497j385088r97073n63955l40923J11334O90311O64007
39043h72830K9033l36329j83308k88784r13868j135642l64768O04503Q46081O22853
39033a993059N95526N87659J42767l53427j87916M28789O25763K02970j58559
39024a09487L4849N01112O76141L09569l92084q81690p07221j08843J55033j23123
39014f45744k27737L16981Q37901N12180k54309m06948J15617L58375j29355p62572
39004b85611r59861p51522k24826O43756J334439R80210k81432j060307m90115
38995a095269N14934N94733r6643k92189L49872P53078J17118q48694q95896J02482
38985g96474J033937R03320j38983j132987j355213q79682k47814J78188M30011
$$ plain form
39052 2099448 1958054 948557 -436531 -1433604 -1997559 -2338482 -2227148 -1536837 -872830
39043 -872830 -843797 -1180126 -1363434 -1652218 -2566086 -3701728 -4066496 -3461993 -2615912 -1993059
39033 -1993059 -1397533 -809874 -667107 -1020534 -1208450 -779661 -153898 49072 -109487
39024 -109487 -74638 426474 1102615 1412184 1020100 138410 -568811 -677654 -522621 -645744
39014 -645744 -873481 -556500 281401 793581 539272 132324 247941 606316 476961 -285611
39004 -285611 -1245472 -1996994 -2221820 -1578064 -243625 736585 455153 -605154 -1095269
38995 -1095269 -580335 14398 -82245 -374434 -24562 728516 845634 -3060 -898956 -796474
38985 -796474 237463 1140783 1001800 -131187 -1486400 -2366082 -2613896 -2435708 -2005697
38976b005697O32715P27848N81320K27017j29905l08263k76520j43058q9480k38433
38966a022456m85239n07144o7693O57727J143553R85715L22627k77267m04659
38957C45164k26583j96578m11097n11102k78487J0308O5199R2450L95366O78860
38947c6500L42338n16910r93465m93892N18070J192593J259081R20089K12353
38938B403757q82204j849459j879594q87752J84082M00221j01497l83268R5420
38929b900294Q87601J212258R30241O14609O80065P57557K19632p94762j331843
38920B75064p93342K14321O15080K57265K2901M75479R78965N87799n33367j205133
38910H95032p63737R0747K83158k34822n90272k87872K43294M83302N58669P70157
$$ plain form
38976 -2005697 -1372982 -645134 -63814 163203 33298 -274965 -551485 -694543 -784023 -1022456
38966 -1022456 -1507695 -2014839 -2082532 -1424805 -281252 704463 1027090 749823 345164
38957 345164 118581 -77997 -489094 -1000196 -1278683 -1268375 -1203176 -1110726 -715360 -36500
38947 -36500 305838 -211072 -1204537 -1698429 -1180359 12234 1271315 2191404 2403757
38938 2403757 1521553 -327906 -2207500 -3095252 -2911170 -2510949 -2612446 -2995714 -2900294
38929 -2900294 -2012693 -800435 129806 744415 1424480 2182037 2401669 1606907 275064
38920 275064 -518278 -303957 311123 568388 591289 1066768 2045733 2633532 2100165 895032
38910 895032 131295 222042 505200 270378 -319894 -607766 -364472 118830 677499 1447656
38900A447656Q72248M08665m47603r79867q45948m29511k12799k10311j38363
38891e35833J66411N87411P67658L68213m40106r23669o47640j60048k00423m66645
38881a484671q5044P63483Q85133M0661m18617L86469J340834R72164l02653q77248
38871A220511k84920N50389R85307J129093Q46407j77543j290608j290202l05621
38862A382813J42842n64103j173322n62920N72662R46731M91568p3893n47455
38853F14923r87412r14378J0384J015480J086643M38931M8351P3913r0819m35363
38843H60653k76509L70969N53800k02156j176854j487241j062121k93997N60484
38834b152972J263855J448503R73403J29977o45362r93580o92164L8716M52248
$$ plain form
38900 1447656 2319904 2728569 2280966 1301099 455151 25640 -187159 -397470 -535833
38891 -535833 -369422 217989 985647 1353860 913754 -9915 -657555 -817603 -1018026 -1484671
38881 -1484671 -1569715 -806232 78901 119562 -299055 87414 1428248 2400412 2097759 1220511
38871 1220511 935591 1485980 2471287 3600380 4446787 4269244 2978636 1688434 1382813
38862 1382813 1525655 961552 -211770 -774690 -202028 744703 1236271 1162378 614923
38853 614923 -372489 -1286867 -1276483 -261003 825640 1264571 1312922 1386835 1296016 860653
38843 860653 584144 955113 1508913 1306757 129903 -1357338 -2419459 -2713456 -2152972
38834 -2152972 -889117 559386 1532789 1662766 1017404 23824 -668340 -629624 -177376
38825a77376R7935m46856l86314k0071k57746r08139p12402O07497J579689R37533
38815C13750o47841j587572j328421m46847N08113J286853J514696R86244J95236
38806G94211k10866l18296n79518q05330l66117O73287J450893J446048J013800
38797C098112O07180J23477o39428j363376j500899j005178m21453k39195l48033
38788a688793k63623J53041M49135K53269o0328J37265O85713P64512J78714k66415
38778C42490l9644K59465o3531o14936o18468k77837m21601j047747j251856n91953
38768d325618L84714J059024J352077J281424P17120j35019o62965n76814k28670
38759a134727k2895R370p0839k75969m32157k78446N3739J92426K14417N40030
$$ plain form
38825 -177376 -79441 -526297 -912611 -932682 -1190428 -2098567 -2810969 -2203472 -623783 313750
38815 313750 -334091 -1921663 -3250084 -3696931 -3188818 -1901965 -387269 598975 794211
38806 794211 583345 265049 -314469 -1119799 -1485916 -812629 638264 2084312 3098112
38797 3098112 3705292 3828769 3189341 1825965 325066 -680112 -1101565 -1340760 -1688793
38788 -1688793 -1952416 -1799375 -1350240 -1096971 -1157299 -1020034 -334321 430191 608905 342490
38778 342490 302846 562311 498780 -116156 -734624 -1012461 -1434062 -2481809 -3733665 -4325618
38768 -4325618 -3940904 -2881880 -1529803 -248379 468741 333722 -329243 -906057 -1134727
38759 -1134727 -1157622 -1148252 -1219091 -1495060 -1927217 -2205663 -2151924 -1959498 -1745081 -1205051
38749a205051J052362J082761M82777q8477k50667m17545p76149o69176K61880
38740e27285J094229P62908k94682o60159Q7992Q70208O40038l32485r11504l63140
38730C66120R36782J763865J110335o56226j886873j370115K17551J121346O12720
38721B215505l85346p45923m31748q8814j6416l0087K0269Q3656J29519J86695
38711I37310J96737O8450j13666j05580K02530N75249O17054K31198j80628j46232
38701B282422K58826M62740J40318l77774o01500n01540l92661m56944o61157
38692A52730q96744r01411l41404O30923J214026Q82662K11343J09255M25060
38683A486440J79447p64004j248464m89831O49671Q18783P9794k67974L83659
$$ plain form
38749 -1205051 -152689 930072 1412849 1324372 1073705 656160 -119989 -789165 -527285
38740 -527285 566944 1329852 1035170 375011 463003 1333211 1973249 1640764 729260 366120
38730 366120 1302902 3066767 4177102 3520876 1634003 263888 481439 1602785 2215505
38721 2215505 1830159 1084236 652488 563674 547258 517171 537440 621096 750615 937310
38711 937310 1134047 1202497 1088831 983251 1185781 1761030 2378084 2609282 2428654 2282422
38701 2282422 2541248 3003988 3144306 2766532 2165032 1663492 1270831 813887 152730
38692 152730 -744014 -1645425 -1986829 -1355906 -141880 740782 952125 1061380 1486440
38683 1486440 1665887 901883 -346581 -836412 -186741 632042 711836 443862 827521
38674H27521J118147Q40951k29076r28010o65067n686K34763j8258k57081k44843
38664F73361l15980q20669j555403j883921j328165j8983J313989J828692J264343
38655h42736J90923n94785q47463p84169m20140L84985J209954J232457M51332
38646a9642q0165J77590L07532n36883j474215j110335R0212L29177o37699r56605
38636c911033M05256J892335J624866J10286p29810l48217J70823J55507O1205
38627e68782K13287K69724J52227L09290P33888P72772K65686j25843j15618k72627
38617A634004p71432p64908J55203Q62499K12023j063328j317451m54277M6093
38608a461574m56488q31848j09144R85739J231916O79323K59236K90157L51530
$$ plain form
38674 827521 1945668 2786619 2557543 1629533 964466 958780 1193543 1175285 918204 673361
38664 673361 357381 -463288 -2018691 -3902612 -5230777 -5249760 -3935771 -2107079 -842736
38655 -842736 -651813 -1246598 -2094061 -2878230 -3298370 -2913385 -1703431 -470974 -19642
38646 -19642 -99807 77783 385315 -151568 -1625783 -2736118 -2645906 -2316729 -2954428 -3911033
38636 -3911033 -3505777 -1613442 11424 121710 -608100 -956317 -785494 -629987 -568782
38627 -568782 -355495 -85771 66456 375746 1109634 1882406 2148092 2022249 1906631 1634004
38617 1634004 862572 97664 252867 1115366 1327389 264061 -1053390 -1507667 -1461574
38608 -1461574 -1918062 -2749910 -2859054 -1873315 -641399 37924 297160 587317 938847
38599I38847K40531J30269J4509j86596j90608J76114L48793j90371p50874k51405
38589B79209Q60402R34869l15244j097909j83163J135429R59183m08576j104184
38580A060016m96959K97903M44886L09961K60064K8070l61364l16702J91493L56376
38570A773744j01987l91635n0158K19070j21583l45070K87580J055705P74664
38561C100330l15280q94255m66811K51627O47717P30699M03451n53837j569842
38552A333799j514173l04658O81209L98290m56505n41615K39055Q00730N09731
38543A145863j28806m07189k70745J116L66330Q26953J023339N85559j78546m92119
38533B471755j53528J33977j80685n78569k23369O52101R37837K58030m63502
$$ plain form
38599 938847 1179378 1309647 1324156 1137560 946952 1123066 1471859 1281488 530614 279209
38589 279209 1139611 2074480 1759236 661327 478164 1613593 2572776 2164200 1060016
38580 1060016 563057 860960 1305846 1615807 1875871 1903941 1542577 1225875 1417368 1773744
38570 1773744 1671757 1280122 1229964 1449034 1327451 982381 1269961 2325666 3100330
38561 3100330 2785050 1890795 1423984 1675611 2323328 3054027 3457478 2903641 1333799
38552 1333799 -180374 -485032 196177 594467 137962 -403653 -164598 636132 1145863
38543 1145863 1017057 609868 339123 340239 706569 1533522 2556861 3142420 2963874 2471755
38533 2471755 2318227 2452204 2271519 1692950 1469581 2121682 3059519 3317549 2854047
38524B854047l67212J82172L34809L0470j57876l9380P1198L2830J4450M0647
38514B996155m8729k44893m11960n46320n82267j86181P24530J485735J338017
38505D524087M54104k78014l84557j20832J96555M70745N03066J34973k53270
38496E246857j07781L63983L74010j89000m79944J5352O47642N47234j19617l68419
38486E930317L80369J673377K515570K328876J495116R00844Q69657Q98615P36378
38477A7729119J113530K647457M511910N279742M906700M760141N702969P268393
38469E3919961Q777123J0126522J1422119J3053949J6149380K1542164K8334340
38462A63325558L5134209M2234355M9416989N1071616L8068126Q376055k6411227
$$ plain form
38524 2854047 2486835 2669007 3003816 3034286 2876410 2837030 2908228 2941058 2955508 2996155
38514 2996155 2947426 2702533 2290573 1744253 1161986 975805 1700335 3186070 4524087
38505 4524087 4978191 4700177 4315620 4194788 4391343 4862088 5365154 5500127 5246857
38496 5246857 5139076 5503059 5877069 5688069 5208125 5223477 5871119 6418353 6298736 5930317
38486 5930317 6310686 7984063 10499633 12828509 14323625 15224469 16094126 16992741 17729119
38477 17729119 18842649 21490106 26002016 31281758 36188458 40948599 46651568 53919961
38469 53919961 62697084 72823606 84245725 97299674 113449054 134991218 163325558
38462 163325558 198459767 240694122 290111111 341182727 379250853 387626908 361215681
38455C61215681m9590022n4308646m7179780l8032390l0562496k3791394j7745537
38448A00005416j3895088j2022542j0232840p862284o111459n745051n860313
38441C8275839n224166l711477k144669j381717j638554k265429k314714j650351
38433A7944762j132230j357024j792762j690698j224892r99484r83274p92672
38425G971726n87310p45144r69897p01181j87752j11321k53280L05135J507803
38416F228779K019299J075577l31850q13477m04317k13396o89050j121762q36338
38407D913465j58112P6248l82674q91829o92842J38774O94885L19988m79411n98482
38397B940010J96497Q81530N06475n73623j260496j141474p35305m94160k98059
$$ plain form
38455 361215681 311625659 257317013 210137233 172104843 141542347 117750953 100005416
38448 100005416 86110328 74087786 63854946 55992662 49881203 44136152 38275839
38441 38275839 33051673 29340196 27195527 25813810 24175256 21909827 19595113 17944762
38433 17944762 16812532 15455508 13662746 11972048 10747156 9747672 8764398 7971726
38425 7971726 7384416 6639272 5669375 4968194 4780442 4669121 4415841 4720976 6228779
38416 6228779 8248078 9323655 8991805 8178328 7774011 7560615 6871565 5749803 4913465
38407 4913465 4755353 4831601 4448927 3557098 2864256 3003030 3697915 4017903 3538492 2940010
38397 2940010 3136507 4018037 4524512 3950889 2690393 1548919 813614 319454 21395
38388B1395l4989K2633k37998l89878p7099L85309M94887L24763K78221L39976
38378A127220J85643j10849j55948m675j45720n97459p14736j59380N54115P92573
38368G70784N14265l9267o95227j020342m26404P75651J186092M9445j424437
38359c09440j485192j48535J020144J105617N92619O3699m68742p56926k24797
38350f11553Q12844J034232q8380j342463j369731l67353N70764J030243J296851
38341I65454J396150J054835L08132n54959j330253j681548j171960j34163K28381
38332i19931n20677j066759j57230J264748J249556j70258r13617P3373J373161
38323B12366J325426K15263o79872j015279j188403j081402k96015P51348J124766
$$ plain form
38388 21395 -13594 9039 -228959 -618837 -695936 -310627 184260 509023 787244 1127220
38378 1127220 1312863 1202014 1046066 1041391 895671 298212 -416524 -575904 -21789 770784
38368 770784 1285049 1245782 550555 -469787 -896191 -120540 1065552 1114997 -309440
38359 -309440 -1794632 -1943167 -923023 182594 775213 838912 370170 -386756 -611553
38350 -611553 201291 1235523 1147143 -195320 -1565051 -1932404 -1361640 -331397 965454
38341 965454 2361604 3416439 3724571 3169612 1839359 157811 -1014149 -1148312 -919931
38332 -919931 -1440608 -2507367 -2664597 -1399849 -150293 -320551 -1234168 -1160795 212366
38323 212366 1537792 1753055 1073183 57904 -1130499 -2211901 -2507916 -1756568 -631802
38314f31802O48214N627l11270l26122l482O92540J155961N80395o90999j227786
38304a08724m18784N57801L91940m66149n60310L70408J107050Q13500L2382m62019
38294A257095p39548j052448r97493k11183O85280P96462K89893R4237M38587
38285E60882O39814L23738q4370k15498k21901j95575J4281J77661j92603p74098
38275C2331n19011O71219J403732O99241n21689q35676l67127k68521p72969j062116
38265a540586p30394j34676N06308J157568J281397L80733q11278r93211k22988
38256a107127J71597k06705k25445O76958J318530O18757o41863j035700n03238
38247i34236K3115K38132M43853M68173o3508o58695m55330K79614L95678k76930
$$ plain form
38314 -631802 16412 22039 -289231 -615353 -618835 73705 1229666 1810061 1119062 -108724
38304 -108724 -527508 30293 422233 -43916 -604226 -233818 873232 1686732 1719114 1257095
38294 1257095 517547 -534901 -1532394 -1743577 -1058297 -261835 28058 122295 560882
38285 560882 1200696 1524434 1440064 1224566 1002665 807090 821371 999032 806429 32331
38275 32331 -486680 184539 1588271 2287512 1765823 930147 563020 294499 -478470 -1540586
38265 -1540586 -2270980 -2405656 -1899348 -741780 539617 920350 109072 -884139 -1107127
38256 -1107127 -935530 -1142235 -1367680 -690722 627808 1246565 604702 -430998 -934236
38247 -934236 -911121 -672989 -229136 239037 175529 -483166 -938496 -658882 -263204 -540134
38237e40134n47007K44537J082546P79843k08081m56370L45772J025861O79944
38228B406911j35968l96384r9494k6329l45645m04315r953N9048o25148j154670
38218g31947n57040N30471O73377j18550l63922N14169J239217P19730k73996
38209A631509m40325R1791L12081P3949m107J16955j7008j95077J85354P49311
38199B504433M01060q64075j678608j220423k52213K71101N06628Q78384R31381
38190A477668J03882r68835j071419j18000P55046Q08830N25224O03175Q90455
38181C006026P77649K20732j61572N8030N18433M49893m45682j588705k037284
38172G97520j398924j68944Q35659J241515J231349J053863O91826Q1793n40984
$$ plain form
38237 -540134 -1087141 -842604 239942 1019785 811704 355334 701106 1726967 2406911
38228 2406911 2270943 1874559 1775065 1748736 1403091 998776 988823 1047871 422723 -731947
38218 -731947 -1288987 -758516 -85139 -203689 -567611 -53442 1185775 1905505 1631509
38209 1631509 1191184 1282975 1595056 1669005 1664898 1781853 1764845 1569768 1755122 2504433
38199 2504433 2905493 2041418 362810 -857613 -1109826 -838725 -332097 546287 1477668
38190 1477668 1581550 612715 -458704 -576704 178342 987172 1512396 2115571 3006026
38181 3006026 3783675 4004407 3842835 3900865 4419298 4869191 4423509 2834804 797520
38172 797520 -601404 -770348 65311 1306826 2538175 3592038 4283864 4365657 3824673
38163C824673p44332l74313K05534M51153J71421l54183p39388q41879p57961
38154H40725o26870n17643m25775l27542k72690l68644n58956n24122n3080N43138
38144b291459P27779M63647K42059L01468L02618J8355j58957J69820O70448O63561
38134A109339L9531o57762q80501m43325M77191J269321J153235J20904o71595
38125A516338j77069J041906J392061L14614j062582j484331r74964l80625k08357
38116b3009l56170n07883m05817o2410J08894k30098o69729m47449L63244P96609
38106a433818L88753j85456k85179k32576m18107l46925M52268J218355Q39449
38097c236l62864r08576j88287Q50433J171512Q21112L61684K2057j70492j08167
$$ plain form
38163 3824673 3080341 2706028 2911562 3362715 3534136 3179953 2440565 1598686 840725
38154 840725 213855 -303788 -729563 -1057105 -1329795 -1698439 -2257395 -2781517 -2834597 -2291459
38144 -2291459 -1563680 -1100033 -857974 -556506 -253888 -235533 -394490 -224670 445778 1109339
38134 1109339 1148870 491108 -389393 -832718 -355527 913794 2067029 2187933 1516338
38125 1516338 1339269 2381175 3773236 4087850 3025268 1540937 565973 185348 -23009
38116 -23009 -379179 -887062 -1292879 -1355289 -1246395 -1476493 -2146222 -2593671 -2230427 -1433818
38106 -1433818 -1045065 -1230521 -1515700 -1748276 -2166383 -2513308 -2061040 -842685 -3236
38097 -3236 -366100 -1274676 -1462963 -612530 558982 1380094 1741778 1763835 1593343 1485176
38087A485176J02535R8559j28103r6244L47642O28982K73241l82854p73837r07356
38077F47741j035497r67775l89414L98822P29208M39614n0268l81575m19560J7001
38067a011703Q77117J428728R04863l18411r97483o70177j97245l28732o23523
38058i36566l87554J22220K45640L5831q5307k46998o47842o21187M72307J613147
38048d36309R90735j183808k337930q59166J569808K157335N66091j104549j326242
38039a964035o33287k07102l29724n50098m36180J72485J005271J316194O54458
38030i72018k77948l01712O09410J199793O46813m18428r37324p03706j93380
38021a348500K04257K95277k3505n10423o66844m15094j89930j00382L17246J139532
$$ plain form
38087 1485176 1587711 1686270 1558167 1461923 1809565 2438547 2711788 2328934 1555097 647741
38077 647741 -387756 -1355531 -1744945 -1346123 -616915 -177301 -227569 -609144 -1028704 -1011703
38067 -1011703 -134586 1294142 2199005 1880594 883111 212934 15689 -313043 -936566
38058 -936566 -1324120 -1201900 -956260 -920429 -1005736 -1252734 -1900576 -2521763 -2049456 -436309
38048 -436309 554426 -629382 -2967312 -3826478 -2256670 -99335 466756 -637793 -1964035
38039 -1964035 -2597322 -2804424 -3134148 -3684246 -4120426 -3947941 -2942670 -1626476 -972018
38030 -972018 -1249966 -1551678 -942268 257525 904338 485910 -451414 -1155120 -1348500
38021 -1348500 -1144243 -848966 -872471 -1382894 -2049738 -2464832 -2654762 -2755144 -2437898 -1298366
38011a298366J623147J285939O78683M04483J11735o65731j320306r13311K74286
38002A80559J027636Q51135L28140k7230k28499j80433K94919O74230J05503j126650
37992A899310j607833p63711K22664J73841l63956j72503N83408O33141l06095
37983B98266j004798n27953N01971R87005Q78491Q35890Q76321L67713o58442
37974B554464j151662m28503P51648J117016M80980k84854o25564q22427j125276
37965D65822j224146q96062m74736k42406O9283O87334J209648J145502O38362
37956A378601J42286k18839m64568m05796q9779j00445o56340q81236O6494J459220
37946B29598J696122M53112r49414j396275j105165o85239j92129L54848M39848
$$ plain form
38011 -1298366 324781 1610720 2289403 2693886 2805621 2139890 819584 -93727 180559
38002 180559 1208195 2059330 2387470 2360240 2131741 1951308 2246227 2920457 3025960 1899310
37992 1899310 291477 -472234 -249570 -75729 -439685 -612188 -28780 604361 298266
37983 298266 -706532 -1234485 -732514 254491 1132982 1968872 2845193 3212906 2554464
37974 2554464 1402802 974299 1725947 2842963 3323943 3039089 2413525 1591098 465822
37965 465822 -758324 -1654386 -2129122 -2371528 -2302245 -1614911 -405263 740239 1378601
37956 1378601 1520887 1302048 837480 431684 341905 241460 -414880 -1296116 -1229622 229598
37946 229598 1925720 2378832 1429418 33143 -1072022 -1757261 -1949390 -1594542 -1154694
37937a154694k40944j091818j244307n31765N14264J248964J249929N61131j30951
37928h20191o6123N97258Q89312L48208l82824n46688j97861J97799M12266L16546
37918G47702k23115q67563q90468j98220M11584M43334L60446N37429M77315j99215
37908E99229q84277r68582q13192p66083j94533J207800K075559J030586q98968
37899C87539j403503k08879O87417J87188n34106l41219J31042J8873j89143J34357
37889a130434L25645l51134j087322o66691M69065Q26070J49422l59677l228N98679
37879a229605P75687O88821O23619L80108j85305o95039p26451l01764K80754
37870c89175O50861L71730o33526j566204j391825k50187N00623N8451o92526
$$ plain form
37937 -1154694 -1395638 -2487456 -3731763 -4263528 -3749264 -2500300 -1250371 -689240 -820191
37928 -820191 -886314 -289056 600256 948464 565640 18952 -178909 18890 431156 747702
37918 747702 524587 -342976 -1233444 -1431664 -1020080 -576746 -216300 321129 798444 599229
37908 599229 -285048 -1253630 -2066822 -2832905 -3027438 -1819638 255921 1286507 387539
37899 387539 -1015964 -1224843 -537426 -350238 -884344 -1225563 -1094521 -1075648 -1264791 -1130434
37889 -1130434 -804789 -1155923 -2243245 -2909936 -2440871 -1614801 -1465379 -1825056 -1828284 -1229605
37879 -1229605 -453918 234903 858522 1238630 1053325 358286 -368165 -669929 -389175
37870 -389175 261686 633416 -110 -1566314 -2958139 -3208326 -2707703 -2649252 -3341778
37861c341778m35353P22034J412115Q05550m74286j224333q70327K67821J403871
37852a734686J785969J161298L2597p14825o39744j25923J33505j06920n09260
37843g17989o42138m21515n9831K68141N52768P32042N51304j03404p82221p62007
37833a384850N8336Q84891R62319M88085J56245N2804l24189r89306j211505o07790
37823a914960K03547N10489M82292O27296P50636K40815q09983j539651j372391
37814b821910n47798L75730R72205R64646M31187j7750Q8952K93409j39985q49099
37804a250413o91143L86712R78497K48324q05357r17915l65184j49523k45260
37795b811262M1400N31490M03663k84585o48175m65847l31496l18215J53257R45262
$$ plain form
37861 -3341778 -3777131 -3055097 -1642982 -837432 -1311718 -2536051 -3406378 -3138557 -1734686
37852 -1734686 51283 1212581 1245178 530353 -109391 -235314 -101809 -208729 -717989
37843 -717989 -1360127 -1781642 -1841473 -1573332 -1020564 -288522 262782 159378 -622843 -1384850
37833 -1384850 -1326514 -441623 520696 1008781 1165026 1217830 893641 -95665 -1307170 -1914960
37823 -1914960 -1711413 -1200924 -718632 -91336 659300 900115 90132 -1449519 -2821910
37814 -2821910 -3369708 -2993978 -2021773 -1057127 -625940 -643690 -554738 -261329 -401314 -1250413
37804 -1250413 -1941556 -1554844 -576347 -328023 -1133380 -2051295 -2416479 -2566002 -2811262
37795 -2811262 -2769862 -2238372 -1834709 -2119294 -2767469 -3233316 -3564812 -3883027 -3729770 -2784508
37785b784508J104968N23112L02741Q66264J072518J28300q81184o03006M16292
37776A45497O04877k20402q18845o03568k35458j11942K60332R88665J196145
37767A205301M16831m16373k79528L54302K66824n58023q93129k30266L38670
37758B04609k23484j195061j043027K50898J009712K85387o76107k63447J028816
37749f21704J294340J02515q51949l38283O26686M92402m57869p46740n4787M99950
37739e5439K56664j75813j98100j29760l66343n52239k33904K79110L55258r407
37729h29973k21744J12471P87050J233448R40441j10936j200156j355417m11419
37720a056235O44050P20252j12117p07876j38468J320920K450730K204698O66265
$$ plain form
37785 -2784508 -1679540 -1156428 -853687 12577 1085095 1213395 332211 -270795 145497
37776 145497 750374 529972 -288873 -892441 -1127899 -1239841 -979509 9156 1205301
37767 1205301 1622132 1205759 926231 1280533 1547357 989334 96205 -134061 204609
37758 204609 -18875 -1213936 -2256963 -2006065 -996353 -710966 -1387073 -1650520 -621704
37749 -621704 672636 775151 -76798 -415081 211605 704007 246138 -500602 -555389 -55439
37739 -55439 201225 25412 -172688 -302448 -668791 -1221030 -1454934 -1175824 -820566 -829973
37729 -829973 -1051717 -939246 -152196 1081252 2021693 1910757 710601 -644816 -1056235
37720 -1056235 -412185 308067 195950 -511926 -650394 670526 3121256 5325954 5992219
37711E992219r96551j635219j234043p47098q17821j039091p03597R4235N65694
37702e21272K98443k29070k58131M12931J261145J515980Q14009m09073j198430
37693A686532r95071k67644M4278k87584n60507k42120K09509P5086m49474n24297
37683a311292m5177R1521n74607j147348n88235O70008J239025O86464o2184k65755
37673a307580k35496l11620n2110Q06230J428893R27939k10207p83961o06738
37664c44650m64271n37399j34865Q39227J373621Q07673j62782n39475k91489
37655E45590O5515M35689R13406J136559P18091M879l53638l44158l67891l36508
37645B417534J34833P04622M46724p19482j574650j100720J31105P05296J74593
$$ plain form
37711 5992219 4995668 3360449 2126406 1379308 561487 -477604 -1181201 -1086966 -521272
37702 -521272 -222829 -451899 -710030 -297099 964046 2480026 3294035 2884962 1686532
37693 1686532 691461 423817 468095 180511 -379996 -622116 -412607 -337521 -786995 -1311292
37683 -1311292 -1356469 -1264948 -1839555 -2986903 -3575138 -2905130 -1666105 -979641 -1041825 -1307580
37673 -1307580 -1543076 -1854696 -1906806 -1100576 328317 1256256 1046049 262088 -344650
37664 -344650 -808921 -1346320 -1481185 -641958 731663 1539336 1376554 837079 545590
37655 545590 611105 1046794 1960200 3096759 3814850 3819729 3466091 3121933 2754042 2417534
37645 2417534 2552367 3256989 3703713 2984231 1409581 308861 439966 1145262 1319855
37636A319855n61636o40683k95308k24537m39986l58591J26894L91660R2322k03716
37626g93726J28253P78960J005217P59984N37330L23822l21540j139078j202668
37617G6554l79467K91222J82941J5397M59301P90147J1599j379772j975517j400657
37607c308252m91588K05662Q72886J426977J360266P66936L99205L99148L3140
37598A664380r07050j469814r13584J36519N96875L47871O4100J15891L03844
37589f0968L76348K87885J56415K41733O13821O92148k37476j729073k200080
37580a859247q70645J022579J742703J188711N78520M77828L18643k42571o88434
37571A668087o30905m66083n71835n83325n2376O46764P01521k4979p80003q35753
$$ plain form
37636 1319855 758219 117536 -177772 -402309 -842295 -1200886 -1073992 -682332 -590010 -793726
37626 -793726 -665473 113487 1118704 1878688 2416018 2739840 2418300 1279222 76554
37617 76554 -302913 -11691 171250 186647 645948 1436095 1447694 67922 -1907595 -3308252
37607 -3308252 -3799840 -3594178 -2721292 -1294315 65951 832887 1232092 1631240 1664380
37598 1664380 757330 -712484 -1626068 -1489549 -892674 -544803 -480703 -364812 -60968
37589 -60968 315380 603265 759680 1001413 1615234 2307382 2069906 340833 -1859247
37580 -1859247 -2729892 -1707313 35390 1224101 1802621 2280449 2599092 2356521 1668087
37571 1668087 1037182 571099 -736 -584061 -636437 10327 711848 686869 -93134 -928887
37561i28887k42969M48756R17233J191184J165481N24738n57025j120093m87865
37552I10553N95773P51764j08034o52974k04432K37919k47207q50048l20173R09263
37542A022404J346997P44625K07655J48212k00019r62171r86484K19819J288566
37533B829604P86547p17094j469828q31729K39024O32685J69633n62812q23077
37524B52953l37359L08525K61464l29983l26480O27136J216832K63647j323503
37515F13232j626139l52259Q93036Q69582J6594n79261m08165M58559J533041
37506A418220J831993O92794r77712j345067n2122J081177M90308r96771j461941
37497F80879n71356K84474J54936m21448n78787k83123j802O5276K6474j4819
$$ plain form
37561 -928887 -1171856 -723100 194133 1385317 2550798 3075536 2518511 1398418 910553
37552 910553 1506326 2258090 2150056 1497082 1292650 1530569 1283362 433314 113141 1022404
37542 1022404 2369401 3114026 3321681 3469893 3269874 2307703 1321219 1541038 2829604
37533 2829604 3616151 2899057 1429229 597500 836524 1469209 1638842 1076030 252953
37524 252953 -84406 224119 485583 155600 -170880 456256 1673088 1936735 613232
37515 613232 -1012907 -1365166 -472130 397452 414046 -165215 -573380 -114821 1418220
37506 1418220 3250213 3943007 2965295 1620228 1568106 2649283 3139591 2142820 680879
37497 680879 109523 393997 548933 127485 -451302 -734425 -736227 -670951 -644477 -659296
37487f59296j2177N9801J44004J41969R635k96428p66613j039091n39676O37110
37477b320762J393267Q89503j29647j99453P33145J145489K05749r29901q20483
37468c3093J75640N76162k3796o38385o19666m73648o94141q38451l47576M53501
37458b463453Q72426Q88686R54626J043847O72461j50298o98609m68260J71749
37449H23175N29140L87508k9803n12122q69898p71385r1802O59331P61440J77186
37439A062770m19238n72970m98189m22083q2598O58903J193026Q40386p3789n51731
37429A134487k96058k7093l00063p13414o19826n0443M71748N96109K64138l76344
37419H3241q03022l93089O37575J113485L75001o36200o05573K65006O44584J17642
$$ plain form
37487 -659296 -671473 -611672 -467668 -325699 -316064 -612492 -1379105 -2418196 -2957872 -2320762
37477 -2320762 -927495 -37992 -167639 -367092 366053 1511542 1717291 787390 -33093
37468 -33093 142547 718709 694913 56528 -563138 -1036786 -1730927 -2569378 -2916954 -2463453
37458 -2463453 -1591027 -702341 252285 1296132 1968593 1818295 1119686 651426 823175
37449 823175 1352315 1739823 1710020 1197898 328000 -443385 -535187 124144 885584 1062770
37439 1062770 643532 70562 -427627 -849710 -932308 -273405 919621 1760007 1686218 1134487
37429 1134487 838429 811336 511273 -202141 -821967 -872410 -400662 195447 459585 83241
37419 83241 -719781 -1112870 -475295 638190 1013191 376991 -228582 36424 681008 798650
37409G98650l77174k22807J9662j79002m03240k11598K9382k0973Q8876O40354
37399A62130Q25031j05636j358821j505353n41234K29516K72512M37488J231231
37390c53136J730776R13129p48760j799212j512781m98457J93659J18054l43227
37381b299955n25988j99520K86594N89819Q19041J120618J193015P56052K10792
37372A950468J29263K92360O5436l93987l05103L00143M16727l33248j006822
37363A115237p82028j44284K2923l03257o52793r22349j070792o42628N07184
37354b872787J530709J511915O94608K7745j06540K1025K08932L45723J51117
37345A512447l25100m31265P4812L68152j57033o79048k41972M61288J55970o92041
$$ plain form
37409 798650 421476 198669 218331 39329 -363911 -575509 -546127 -567100 -478224 162130
37399 162130 987161 881525 -477296 -1982649 -2523883 -2294367 -2021855 -1584367 -353136
37390 -353136 1377640 2290769 1542009 -257203 -1769984 -2268441 -2074782 -1956728 -2299955
37381 -2299955 -2825943 -3025463 -2738869 -2149050 -1330009 -209391 983624 1739676 1950468
37372 1950468 2079731 2372091 2437527 2043540 1738437 2038580 2455307 2122059 1115237
37363 1115237 333209 188925 211848 -91409 -744202 -1666551 -2737343 -3379971 -2872787
37354 -2872787 -1342078 169837 864445 892190 785650 806675 1015607 1361330 1512447
37345 1512447 1187347 756082 830894 1199046 1042013 362965 120993 582281 738251 46210
37335D6210m74684Q16334J441986P07000j13536j64659l13678j139188j516717
37326g10932n61126N82438M67239l53177m26273J41348J18018n58831p31683m6523
37316b079502O19846P55869P46998O89386J09862p95765r65448q5361O62840J72310
37306a68965j030251j490811o01196R10627J917595J836585Q64343l00827r90132
37297I46968j004118n79015n5276K70246J95341j35508j97117K95496Q71161Q45494
37287A453672K56519k20283k06405J5946J8617l51398r80996j461234j196493
37278b672055r2503R97340J125905M51593o2072k0899J18330J17778L85170J073617
37268A422204J544744J136512m3737j324952j992617j558423j82902J061665J091598
$$ plain form
37335 46210 -428474 387860 1829846 2536846 2423310 2258651 1944973 805785 -710932
37326 -710932 -1272058 -689620 -222381 -575558 -1001831 -860483 -742465 -1301296 -2032979 -2079502
37316 -2079502 -1459656 -703787 43211 732597 842459 46694 -918754 -1004115 -341275 -168965
37306 -168965 -1199216 -2690027 -3291223 -2380596 -463001 1373584 2237927 1937100 946968
37297 946968 -57150 -636165 -691441 -421195 -225854 -361362 -558479 -262983 608178 1453672
37287 1453672 1710191 1489908 1283503 1299449 1318066 966668 -14328 -1475562 -2672055
37278 -2672055 -2764558 -1767218 -641313 -189720 -251792 -272691 -154361 -36583 348587 1422204
37268 1422204 2966948 4103460 4059723 2734771 742154 -816269 -999171 62494 1154092
37259A154092J52608m75898k38958J31404J6446j92909m2151J93184K50069M05849
37249A353736O20433K49705n90757o10600N87581J290093R2001j553014j232736
37240B06442O57356J419080K10285q27665j63993Q28678M07489p61383j058891
37231I17398n99493m94596n03766M12266J710083J644946J05056r51541m03474
37222A836879M47444N0544j083473j395797n89188L14993O30332N60771M07695
37213A180200K16060Q2883L9095k17611p71517r41919j30550J003358J211438
37204A671437M51846n8406K63717N55563L1780p32345p73358k12160Q1010k15051
37194A064033o79508r02472p70630l01320K41643L79762N7115j52998O6188K57113
$$ plain form
37259 1154092 1306700 830802 591844 723248 739694 546785 504634 697818 947887 1353736
37249 1353736 1974169 2223874 1633117 1022517 1610098 2900191 2992192 1439178 206442
37240 206442 863798 2282878 2493163 1665498 1501505 2330183 2737672 1976289 917398
37231 917398 317905 -176691 -680457 -268191 1441892 3086838 3191894 2240353 1836879
37222 1836879 2284323 2334867 1251394 -144403 -733591 -418598 211734 772505 1180200
37213 1180200 1396260 1479143 1518238 1300627 529110 -412809 -543359 459999 1671437
37204 1671437 2123283 2064877 2328594 2884157 2915937 2183592 1410234 1198074 1279084 1064033
37194 1064033 384525 -517947 -1288577 -1589897 -1348254 -968492 -911377 -1064375 -998187 -741074
37184g41074J10491J45243O41883P27848k72298j279112p92341O42923J076555
37175B60118J77534l13406M90226J193247M81710p88698j080372m26031J24733
37166A19061K74218L46386K05577l41304o68586j48679O24912O34157K3110k94902
37156G73950j93812k48994m35727k24810K16523K06333j70628k05857Q9686N4578
37146a38758k65170j88335J38546j66164r45024q91698K80653J098458N50306
37137e27186l48211k60909L91714L56358l02814m07035L72609J068066R27710
37128A270302L53213J12033K90257L16443k51224j095314j308338l97067R12376
37119B02681J335599N71798m03973p31793n88446l99712j7183O75714J092454
$$ plain form
37184 -741074 -630583 -485340 156543 884391 612093 -667019 -1459360 -816437 260118
37175 260118 437652 124246 614472 1807719 2289429 1500731 420359 -5672 119061
37166 119061 393279 739665 945242 603938 -64648 -213327 411585 1045742 1068852 773950
37156 773950 580138 331144 -104583 -329393 -112870 93463 -77165 -283022 -193336 -138758
37146 -138758 -403928 -592263 -453717 -619881 -1564905 -2456603 -2175950 -1077492 -527186
37137 -527186 -875397 -1136306 -744592 -388234 -691048 -1098083 -725474 342592 1270302
37128 1270302 1623515 1735548 2025805 2342248 2091024 995710 -312628 -709695 202681
37119 202681 1538280 2110078 1706105 974312 385866 -13846 -31029 644685 1737139
37110A737139P18077K5665k24196j69715m44048r05798p61503Q5596O97972L20273
37100A079462o58415j192165p22839K63648P23754K29143l60083J24808J422020
37091I09333J894259P49303p24879r58605k74320r3899o05636o78996J01332P95298
37081A113190O80090J86253r2725k32815l88057l24097l5323j8523m44382p56393
37071c12782n32238q5336J81716L37424M36388K10745k56362k71651M27736R92812
37061A128452N33426n82061j194713q08771L8785O08421N90451Q8639n32713q70858
37051a000942q48712p05958n12224q3272M67316O72460M95476N07663Q67988Q69114
37041G28909J14609n99822m19715J97416K45845k05030k94120N8323J11227k62128
$$ plain form
37110 1737139 2455216 2480881 2256685 2086970 1642922 737124 -24379 61217 759189 1079462
37100 1079462 421047 -771118 -1493957 -1230309 -506555 -277412 -637495 -512687 909333
37091 909333 2803592 3552895 2828016 1869411 1595091 1501192 895556 216560 317892 1113190
37081 1113190 1793280 1979533 1886808 1653993 1265936 941839 906516 887993 443611 -312782
37071 -312782 -845020 -930356 -748640 -411216 25172 235917 -20445 -292096 135640 1128452
37061 1128452 1661878 1079817 -114896 -923667 -884882 -276461 313990 402629 -130084 -1000942
37051 -1000942 -1849654 -2555612 -3067836 -3151108 -2683792 -2011332 -1515856 -1008193 -140205 728909
37041 728909 843518 243696 -176019 21397 267242 62212 -231908 -173585 -62358 -324486
37031c24486l60384M252J49700k14981m98138l69896k93355m15244m4346J037634
37021a329244J768759J255044J99089j77483L2773j34269p19176q51923m10581
37012c67011k64742o55329o53114K27020J017238P28832p6251j65389M64661P01937
37002I57852J47629l09942L7410O41671O05625o216m11756k79049O282O8298q0311
36991A377493l66100p85273j081174p96036R6699R60179J142636N96737k94214
36982H50947j117983j427310q33343L92430J180993P80104j90756m85843P8262
36973g72499M89378J61347k38253K0210N57630O02661K60951K11000M89167M94102
36963B275694J01879j09424J37013L82181K66720J07365K33697L13557j23035
$$ plain form
37031 -324486 -684870 -680618 -530918 -745899 -1244037 -1613933 -1907288 -2322532 -2366878 -1329244
37021 -1329244 439515 1694559 1893648 1716165 1748938 1614669 895493 43570 -367011
37012 -367011 -631753 -1287082 -1940196 -1713176 -695938 32894 -43357 -208746 255915 957852
37002 957852 1105481 795539 832949 1474620 2080245 2074029 1662273 1383224 1389506 1457804 1377493
36991 1377493 1011393 226120 -855054 -1651090 -1554391 -594212 548424 1145161 850947
36982 850947 -267036 -1694346 -2527689 -2135259 -954266 -174162 -364918 -850761 -772499
36973 -772499 -283121 -121774 -360027 -339817 217813 820474 1081425 1292425 1781592 2275694
36963 2275694 2377573 2268149 2405162 2787343 3054063 3161428 3395125 3708682 3585647
36954C585647q28639j058314n45085J46673K65365l21820r64618q65812k5953
36945f12556N68122J13609p36586n19973R10822J851656J015686n23371p94552
36936A272857K10342O18667m16951j479499j114337O9959N23407J1420m37317
36927g41452k68320J18914L75008N64388N73850J77454k40100J3318P59462J029747
36917B362269N65907K20639M07968K19384j066858k426023k193799l83732J214029
36908a080216J249728K02993n99530n34524R2688P33953J016196Q04596K72065
36899B157949k07403m46964n98056p94384q54852n25171J28920P35129R35329
36890E30497O11405p2388p42080j033082q41890l33171K59052O93992O69892M7157
$$ plain form
36954 3585647 2757008 1698694 1153609 1300282 1565647 1243827 279209 -586603 -612556
36945 -612556 -44434 69175 -667411 -1187384 -276562 1575094 2590780 2067409 1272857
36936 1272857 1483199 2101866 1684915 205416 -908921 -838962 -315555 -304135 -741452
36927 -741452 -1009772 -890858 -515850 48538 622388 799842 559742 573060 1332522 2362269
36917 2362269 2928176 3148815 3556783 3776167 2709309 283286 -1910513 -2294245 -1080216
36908 -1080216 169512 372505 -227025 -761549 -668861 65092 1081288 1885884 2157949
36899 2157949 1950546 1503582 905526 111142 -743710 -1268881 -1139961 -404832 530497
36890 530497 1141902 1069514 327434 -705648 -1547538 -1880709 -1621657 -927665 -257773 -210616
36880b10616p61042r63914k72726N81509O08983j60438n84252J53210J325960
36871b83326J420526J16967j115455q45040L93644Q21225r3783r33518m53438
36862i72198O64754R97426M61982M4066k1067l69883r36669p73867K40478R21439
36852B56461N96956J03646J49359k3995j126809k058649j277826O58011J629447
36843a093399Q76686k48678n71155m93470o10550m51358M23891J168881O79956
36834c19196o74076j391889p04947O43242J366022Q55605m15672j303613r82306
36825b926830J58758Q64632N04434k18484l69370k2461J68606J23655K69690O06749
36815h40621O70782L73929J54913K38948L64211L28932K63306K55211J95455R3072
$$ plain form
36880 -210616 -971658 -1935572 -2208298 -1626789 -1017806 -1178244 -1762496 -1609286 -283326
36871 -283326 1137200 1254167 138712 -706328 -312684 508541 414758 -518760 -972198
36862 -972198 -307444 689982 1151964 1196030 1174963 805080 -131589 -905456 -664978 256461
36852 256461 853417 957063 1106422 1082427 -44382 -2103031 -3380857 -2722846 -1093399
36843 -1093399 -216713 -465391 -1036546 -1530016 -2140566 -2591924 -2168033 -999152 -319196
36834 -319196 -993272 -2385161 -3090108 -2446866 -1080844 -225239 -640911 -1944524 -2926830
36825 -2926830 -2768072 -1903440 -1399006 -1617490 -1986860 -2009321 -1840715 -1717060 -1447370 -840621
36815 -840621 -169839 204090 359003 597951 962162 1291094 1554400 1809611 2005066 2098138
36805B098138Q9567Q5506j70004n24727m73694N5931M63136K84515j77581l65197
36795A365590k50882k16380l67680m02106j36341J58699O1071m95703j103421
36786a387153j244963p59964L9615O64057P99972M60289j3645j15713L55597R08551
36776b93357Q10181J17810j92154M77755J339783J133671j76302j311933j277641
36767F27813m06538L05500L42981p6598m54183m39328n7525L27355M23876L55262
36757I48615L80241M33822L11599J40408J68996K07680j40790p30655r71047p00889
36747D7980l44528j43213J10100M72982O74047O65344O58902M91606k33308j162500
36737A237412j275189l63052M58493K77107l80589m83844N1973N53460O12112
$$ plain form
36805 2098138 2187705 2273211 2103207 1578480 1104786 1160717 1623853 1908368 1730787 1365590
36795 1365590 1114708 898328 530648 128542 -7799 150900 211971 -283732 -1387153
36786 -1387153 -2632116 -3392080 -3352465 -2688408 -1888436 -1428147 -1441792 -1557505 -1201908 -293357
36776 -293357 516824 634634 442480 920235 2260018 3393689 3217387 1905454 627813
36767 627813 221275 526775 869756 793158 338975 -100353 -157878 169477 593353 948615
36757 948615 1328856 1762678 2074277 2214685 2383681 2591361 2450571 1719916 748869 47980
36747 47980 -296548 -439761 -329661 143321 817368 1482712 2141614 2633220 2399912 1237412
36737 1237412 -37777 -400829 57664 334771 -45818 -529662 -477689 75771 687883
36728F87883K42548l90012p58541j66564J113716J610585M49820j272219j892305
36719c75089j321841o63915k97495K60674R20046R67224M83957M18600J004503
36710A396664J338289Q49229N6286m96278r50291j329931j113907k43966L76343
36701a17562J35464k87254L1326P92479R03733O7604q11675p70282J45130R87211
36691A076174Q90153l2177p91626o89807j72308j14462n23293o67239l63717k06272
36681a594574l96991l37359K68528Q07343P26791L08913j5555l12958n57529k69620
36671a373011N25843Q23527O5658o71801p3055J316843J677125M59419r24199
36662A826349j148681n52539j67374j07384K65346J051660J554851J305489P11210
$$ plain form
36728 687883 930431 540419 -218122 -384686 729030 2339615 2789435 1517216 -375089
36719 -375089 -1696930 -2360845 -2658340 -2397666 -1477620 -510396 -26439 392161 1396664
36710 1396664 2734953 3584182 3640468 3144190 2193899 863968 -249939 -493905 -117562
36701 -117562 17902 -269352 -238026 554453 1458186 1525790 714115 -56167 88963 1076174
36691 1076174 1966327 1934150 1142524 452717 280409 165947 -357346 -1024585 -1388302 -1594574
36681 -1594574 -1991565 -2328924 -2060396 -1253053 -526262 -217349 -232904 -545862 -1103391 -1373011
36671 -1373011 -847168 -23641 42017 -629784 -702839 614004 2291129 2750548 1826349
36662 1826349 677668 125129 -42245 -149629 115717 1167377 2722228 4027717 4738927
36653D738927M23956M43236K54796k86099p06630o60155m30732l80916l43663
36644C052720n7093J82078m0597m43829m42974j60981j87570m63053m05838j33325
36634H99538m00543j142320j305697n29683K31040L02775K63443N96303O49106
36625d36038p5903p59227n65252p2815j09514j25255P45140J773582J524316K10402
36615B109436n75196l28203j51431p07993j212992q22517K07973J112657J409172
36606A040906R59167J30739j66542M11449P51770k80387j826171k021150q45764
36597a845983j26110n36628o78763K41134R16917K49179p03197n45456J94326
36588b834581K79669J0858M28210J145389R20765l3586j90767Q50243J699747
$$ plain form
36653 4738927 5162883 5606119 5860915 5574816 4868186 4208031 3777299 3396383 3052720
36644 3052720 2995627 3177705 3137108 2693279 2250305 2089324 1901754 1438701 1032863 899538
36634 899538 498995 -643325 -1949022 -2478705 -2247665 -1944890 -1681447 -1085144 -436038
36625 -436038 -511941 -1271168 -1836420 -1909235 -2018749 -2144004 -1398864 374718 1899034 2109436
36615 2109436 1534240 1206037 1054606 346613 -866379 -1688896 -1480923 -368266 1040906
36606 1040906 2000073 2130812 1964270 2375719 3127489 2847102 1020931 -1000219 -1845983
36597 -1845983 -1972093 -2508721 -3187484 -2946350 -2029433 -1780254 -2483451 -3028907 -2834581
36588 -2834581 -2554912 -2544054 -2115844 -970455 -49690 -83276 -274043 576200 2275947
36579B275947J229514k9630r29873j089213p94470l44411M2733J93990J90057
36570G44644K84982N22251P43103Q95069R28772N46117m09081j392592j560404
36561A302861p60018L14730R31455Q87582L87519j90030m79858m86125o10755
36552A297361r62588r63401j97766O88598P08106n7627o21217n67114m11557m26320
36542a513525j62689M93313P78053J86268o12175p09832k32144Q1741P9415J15228
36532a496347J12943k92744p56487m10130P15569J421983R87660K35754K27343
36523G45544O06304K94902n74726p23629K07800R48236M68448n33545q30268m57324
36513A51742k66131l27721n626O94747J088485J047595J077974J097008L77776
$$ plain form
36579 2275947 3505461 3475831 2545958 1456745 662275 317864 360597 554587 744644
36570 744644 1029626 1551877 2294980 3190049 4118821 4664938 4255857 2863265 1302861
36561 1302861 542843 857573 1789028 2676610 3064129 2874099 2394241 1908116 1297361
36552 1297361 334773 -628628 -826394 -137796 570310 512683 -108534 -675648 -1087205 -1513525
36542 -1513525 -1676214 -1182901 -404848 -218580 -830755 -1540587 -1772731 -1690990 -1611575 -1496347
36532 -1496347 -1383404 -1676148 -2432635 -2842765 -2127196 -705213 282447 518201 745544
36523 745544 1351848 1646750 1072024 348395 556195 1504431 1972879 1439334 609066 151742
36513 151742 -114389 -442110 -447736 247011 1335496 2383091 3461065 4558073 4935849
36504D935849r94303j819312j453577p02745m24271k82091K85860P90143M37917
36495G73470m45812p99574l01481M16615P80370P26363L59388j52834n13575o50847
36485A92083q47320j076168p53814K19356Q27256K57378p00587o77756K37010
36476b322562P16294K80201j45721J20010N37982L93935j84594p01883r59043
36467b265381q27770j25610Q12531J102932L76282o11706q74783l08156M31619
36458b290042P55616N24073l2004m48134l66662L6260K41738J30097J45232N34911
36448g68915Q39070M54250n26377j312367j195865k69597N82955N43278j74657
36439a828225n10411L7350O62331M34978k71784m02127Q7531K73280n5847j1945
$$ plain form
36504 4935849 3941546 2122234 668657 -34088 -458359 -740450 -454590 335553 773470
36495 773470 327658 -471916 -773397 -356782 423588 1149951 1509339 1356505 842930 192083
36485 192083 -655237 -1731405 -2485219 -2265863 -1438607 -1181229 -1881816 -2559572 -2322562
36476 -2322562 -1606268 -1326067 -1471788 -1351778 -813796 -419861 -604455 -1306338 -2265381
36467 -2265381 -3093151 -3218761 -2406230 -1303298 -927016 -1538722 -2413505 -2721661 -2290042
36458 -2290042 -1534426 -1010353 -1042357 -1490491 -1857153 -1820893 -1579155 -1449058 -1303826 -768915
36448 -768915 70155 524405 -1972 -1314339 -2510204 -2779801 -2196846 -1653568 -1828225
36439 -1828225 -2338636 -2301286 -1638955 -1203977 -1475761 -1877888 -1790357 -1517077 -1572924 -1584869
36429a584869P74870J325471P68478k55730m68811L19189J134004J175987N67751
36420C756340j08988n06942o90745q44899q92962n58171N2366K82843j77219o08235
36410b96612k30262M54040L29760m57395n91217K83505R13482M31287l46846m05843
36400H3899r3196j86717m48084k71643N8218k3038j70078K04406O26479K24601
36390D847p03860j091350p90959n75747o27425l49683L36727P98092Q62921R64838
36380a171599J028692N28463j64324M6331J013073J066946m68457j878573j376111
36371a375559K73242R17222J20047n41714j04660M95482J64809o37736p40800
36362a429667j0433O39151O20585K51328K4260l0323j05463k17975k87027l03008
$$ plain form
36429 -1584869 -809999 515472 1283950 1028220 559409 878598 2012602 3188589 3756340
36420 3756340 3647352 3140410 2449665 1604766 711804 153633 205999 488842 311623 -296612
36410 -296612 -526874 -72834 256926 -200469 -791686 -508181 405301 836588 489742 83899
36400 83899 -9297 -196014 -644098 -915741 -857523 -880561 -1050639 -846233 -219754 4847
36390 4847 -699013 -1790363 -2581322 -3157069 -3784494 -4134177 -3797450 -2999358 -2136437 -1171599
36380 -1171599 -142907 385556 221232 267563 1280636 2347582 1879125 552 -1375559
36371 -1375559 -1102317 -185095 -65048 -606762 -711422 -215940 -51131 -688867 -1429667
36362 -1429667 -1440100 -800949 -180364 70964 95224 64901 -40562 -258537 -545564 -848572
36352h48572j99520J68294O64013P63433J84165n58813o77687j24303L94087M11538
36342A76635J75781k953k86633q39988j278380j052213j59574Q63998J464530
36333i38797J335143M77704o56790j337702j195318n09705K93325J029683J425646
36324g6811J025255n2310q24942o14456m6637r6942n63551m91663J35850L21274
36314a284933k52966o26157o4008Q26225J083222P22259L74869J55873l16459
36305F17925j008606j304615q40044q1191J44880l67220q33465l38408Q59277
36296c151467J343886L26660j054268j060552L03035J403522J421521J275467
36288H07804J652479J612707K59247j356502j506174l31232M41529P2463m61703
$$ plain form
36352 -848572 -1048092 -879798 -215785 547648 731813 173000 -504687 -628990 -234903 176635
36342 176635 352416 349463 62830 -777158 -2055538 -3107751 -3267325 -2403327 -938797
36333 -938797 396346 874050 217260 -1120442 -2315760 -2825465 -2532140 -1502457 -76811
36324 -76811 948444 896134 71192 -543264 -589901 -686843 -1250394 -1742057 -1606207 -1284933
36314 -1284933 -1537899 -2164056 -2228064 -1401839 -318617 403642 778511 934384 617925
36305 617925 -390681 -1695296 -2535340 -2616531 -2471651 -2838871 -3672336 -4010744 -3151467
36296 -3151467 -1807581 -1480921 -2535189 -3595741 -3292706 -1889184 -467663 807804
36288 807804 2460283 4072990 4332237 2975735 1469561 1138329 1579858 1652321 1190618
36279A190618l73875j59790l43447m87036j68110J46391J0476j44302O6151O1759
36269b01165o49551j251095p19331L63213N38980j89423l19182O82670J448513
36260b96371Q73400j78745l07235L58661O86116L79961O5519p632j34104k63375
36250A176195q3301J02951l27521j122037j287147n40864L23905O71999O80041
36241d05779N86987K69739j61912k82356j47752k41094l92957J08107R70433Q10554
36231A113970o74726j772703j055498N12417J046077M01168r1727R3760K37647
36222a89615n9158l25072k43387l7507J98394N30911O10368Q4114n02325k87137
36212b20414M81418P11363J60462k86987j29064J31798Q2692n071L2458q6300
$$ plain form
36279 1190618 816743 656953 313506 -173530 -341640 -195249 -184773 -329075 -262924 -201165
36269 -201165 -850716 -2101811 -2821142 -2457929 -1918949 -2108372 -2427554 -1744884 -296371
36260 -296371 577029 398284 91049 449710 1135826 1515787 1581306 1573674 1439570 1176195
36250 1176195 1092894 1195845 868324 -253713 -1540860 -2081724 -1757819 -1085820 -405779
36241 -405779 181208 450947 289035 6679 -141073 -382167 -775124 -667017 303416 1113970
36231 1113970 439244 -1333459 -2388957 -1876540 -830463 -429295 -521022 -427262 -189615
36222 -189615 -248773 -573845 -817232 -854739 -656345 -125434 484934 569048 66723 -220414
36212 -220414 261004 972367 1132829 845842 716778 848576 931268 926197 958655 872355
36202H72355l18360j96997J76873O8964n92701q94174l65623K69514L05038N5800
36192f19311O9703K47990L80712O81805J094195Q97170j86448j185760j024825
36183C55231M5406R01030R74565N49455M4884l31140n03024n85166p36522p29118
36173a4399k03985M37455K30279q42860j466958p83929L29349O26701L12875M26193
36163i49279J014051J134967M17176m75522q85989p97060m27483O8753M55028
36154d45358N22156L66314J95585O706k28460l39344k64441k35828l15544j71416
36144i09630L23725P47318P52410N21585K74356l7603k28700J04568O66675N33364
36134B748068l53479q83547o00138m69492r29247p60361O63279J572953K83998
$$ plain form
36202 872355 553995 356998 533871 602835 10134 -884040 -1249663 -980149 -675111 -619311
36192 -619311 -549608 -301618 79094 760899 1855094 2752264 2565816 1380056 355231
36183 355231 400637 1301667 2276232 2825687 2870571 2539431 2036407 1451241 714719 -14399
36173 -14399 -218384 219071 449350 -393510 -1860468 -2644397 -2315048 -1688347 -1375472 -949279
36163 -949279 64772 1199739 1616915 1141393 255404 -541656 -969139 -900386 -445358
36154 -445358 76798 443112 638697 645403 416943 77599 -186842 -422670 -738214 -909630
36144 -909630 -585905 161413 913823 1435408 1709764 1672161 1443461 1548029 2214704 2748068
36134 2748068 2394589 1511042 910904 441412 -487835 -1248196 -584917 988036 1272034
36125A272034j736710j711345K54225J410574N58454o44403q02643o16758q58834
36116b875406q34484J0088Q08645P99244O15203R43535J251959R28612M39401
36107B086797K97335P2567n07619o53943J10039P40066J32340j067108j414452
36098b03978p71071k14869l28794o95245p71691l84303L28815Q26411N29507j81704
36088a866922j23845Q96176J455415N86663o07715o31301J22690K74117j64644
36079e9366p3704N72538O45485o4749m69207q6891K47830k6732l24752j55279
36069B05173J3003k29273m07032n9410L78417K74632k72421p74745j026415r39999
36059b838070l18286O73455J329473J217387P21460L40393j5346m83905n77290
$$ plain form
36125 1272034 -464676 -2176021 -1921796 -511222 47232 -597171 -1399814 -2016572 -2875406
36116 -2875406 -3709890 -3699802 -2891157 -2091913 -1476710 -533175 718784 1647396 2086797
36107 2086797 2384132 2456699 1949080 1295137 1405176 2145242 2277582 1210474 -203978
36098 -203978 -975049 -1189918 -1518712 -2213957 -2985648 -3369951 -3041136 -2214725 -1685218 -1866922
36088 -1866922 -1990767 -1094591 360824 947487 339772 -291529 -168839 105278 -59366
36079 -59366 -133070 439468 1084953 1020204 550997 464106 711936 685204 360452 205173
36069 205173 218176 -11097 -418129 -477539 -99122 175510 -96911 -871656 -1898071 -2838070
36059 -2838070 -3156356 -2482901 -1153428 63959 785419 1125812 1110466 626561 49271
36050D9271J35917R55731N87930j083699k483369k073773k58283J015528N90389
36041b564358n06602m49561R42489J965159J350313j10213q85908q24990q55086
36032a938757j058419n06072Q67234J657164R27940l26693n63582K34262Q66840
36023A59917P82954N07756L79044J0569p16204j053088l78314P12544R68554M3260
36013A416992j002835r15557K92371J352768J194008J10540p35740p94556o41619
36004B76372r16992j282698r24016J70855J040486R13336P4374n71353m26787
35995a646423M33016J396064J593754N35060j107280j763643o56626J025257J408448
35986A217627L17702n35389L6561J101936J094372P1169n61609j83943L44119
$$ plain form
36050 49271 185188 1140919 1728849 645150 -1838219 -3911992 -4170275 -3154747 -2564358
36041 -2564358 -3070960 -3520521 -2578032 -612873 737440 627227 -258681 -1083671 -1938757
36032 -1938757 -2997176 -3503248 -2636014 -978850 -50910 -377603 -941185 -706923 159917
36023 159917 942871 1450627 1829671 1840240 1124036 70948 -307366 405178 1373732 1416992
36013 1416992 414157 -501400 -209029 1143739 2337747 2448287 1712547 917991 276372
36004 276372 -640620 -1923318 -2847334 -2676479 -1635993 -722657 -648283 -1219636 -1646423
35995 -1646423 -1213407 182657 1776411 2311471 1204191 -559452 -1216078 -190821 1217627
35986 1217627 1535329 999940 1036501 2138437 3232809 3303978 2742369 2558426 2902545
35977B902545J71534l89182n45914j08166N36107R71303R08593K69470n33796
35968D182494q38219n71371l98793p00821r23257m25931M72428Q93982N77597
35959B268109R0537l870K57251L87489q8015j128072j902108j409928K34996J555358
35949B61747J295898n8363r60438p38853j54924j41728p12653j205096j039047
35940c453457j34870R59280J328097N64240n77518q93449j59923O44074O23777
35931a099749n3627o40707p44095m56282M7492O10894R37623P00914q1877q90588
35921a670002j062646m45410L55353O14805L70916K86851N69412O19784Q3132
35912b77805m12474j82890L90603M58734J6428k70335k36400k20680j23052L85064
$$ plain form
35977 2902545 3074079 2684897 2138983 2030817 2566924 3538227 4446820 4716290 4182494
35968 4182494 3344275 2772904 2374111 1673290 750033 324102 796530 1690512 2268109
35959 2268109 2358646 2354776 2612027 2999516 2911501 1783429 -118679 -1528607 -1293611 261747
35949 261747 1557645 1499282 538844 -200009 -354933 -496661 -1209314 -2414410 -3453457
35940 -3453457 -3588327 -2629047 -1300950 -736710 -1314228 -2207677 -2367600 -1723526 -1099749
35931 -1099749 -1153376 -1794083 -2538178 -2994460 -2946968 -2336074 -1398451 -697537 -779414 -1670002
35921 -1670002 -2732648 -3178058 -2822705 -2207900 -1836984 -1550133 -980721 -360937 -277805
35912 -277805 -690279 -873169 -482566 -23832 -7404 -277739 -514139 -734819 -857871 -472807
35902d72807P61525K5081j459563j974745q15988N67983O53048k8231M0478R78918
35892a724301J559119J223346O69330M29973J32791m96023r19263o44629q3783
35883A46560O8222j41111j34817K14838M38987K59177k2797n0008R8799J59150
35873A037000Q1997r0712m42446q91718r55260l39328L95176M39548n592R5325
35863f76010R64897J458404P06239n29966r74102o55968n95266j070075j302571
35854b674418p61614K00391J022433J413623J181879L92061l36540m50906k52433
35845b65524k79575k26741M53615J182991Q75899j62976m97392J56694N37624
35836A774615N8119l13126K0636K42206j40331k67997K61062L19930o15978j008270
$$ plain form
35902 -472807 288718 313799 -1145764 -3120509 -3936497 -3368514 -2715466 -2743697 -2703219 -1724301
35892 -1724301 -165182 1058164 1727494 2157467 2290258 1794235 874972 230343 146560
35883 146560 214782 73671 -61146 153692 592679 851856 829059 779051 877850 1037000
35873 1037000 1118997 1028285 585839 -305879 -1261139 -1600467 -1205291 -765743 -771335 -676010
35863 -676010 288887 1747291 2453530 1923564 949462 293494 -301772 -1371847 -2674418
35854 -2674418 -3436032 -3235641 -2213208 -799585 382294 774355 437815 -13091 -265524
35845 -265524 -545099 -771840 -318225 864766 1740665 1577689 1080297 1236991 1774615
35836 1774615 1832734 1519608 1540244 1782450 1642119 1374122 1635184 1955114 1339136 330866
35826C30866K66904J539499O69168j424388k042999p94195K32292R4827Q3958
35817a044068Q67044J144083P8461j050995q58547O5056L20413k16698o20625
35808a315876l67978L76988J226615J575438Q30680o86770j691555j364850k86920
35799a704228M56415M63426K020m42350k90008O47221J510557J145993j81078
35790A607968q89526k97189M80711M13973j857m2670j41416p61450j051019j19715
35780h02190J181135J346835N39971K12964P05005Q44061n087r82455j158794
35771A881445p32624l74930l06607m48208p48683r73768p34758n3478N06543M66364
35761a518704r5026o83973p42063p2043P38462P15588j73717o30571K72805J556821
$$ plain form
35826 330866 597770 2137269 2806437 1382049 -660950 -1455145 -1222853 -1128026 -1044068
35817 -1044068 -177024 967059 1045520 -5475 -864022 -798966 -478553 -695251 -1315876
35808 -1315876 -1683854 -1306866 -80251 1495187 2325867 1639097 -52458 -1417308 -1704228
35799 -1704228 -1247813 -784387 -782367 -1224717 -1514725 -867504 643053 1789046 1607968
35790 1607968 718442 421253 901964 1315937 1314080 1271410 1129994 368544 -682475 -802190
35780 -802190 378945 1725780 2265751 2478715 3183720 4027781 4022694 3040239 1881445
35771 1881445 1148821 773891 467284 19076 -729607 -1703375 -2438133 -2491611 -1985068 -1518704
35761 -1518704 -1613730 -2297703 -3039766 -3111809 -2373347 -1657759 -1831476 -2462047 -2189242 -632421
35751f32421J573644L60770n66105n81763n84559j074537j172239k23609R00949
35742a999870J031130L34397j55102j9202L02719L04894j34360p11291p80973
35733a827658j7078Q33731O80702j99850l15850O95408J237167K05339j085896
35724B06015q57539L59481P03799J1774k06303L95645L56833r86655k191372j858065
35714d066387n74971L04693O16512R92071J413700J334274P27754P2976l40359
35705D80263l94534P0679P65602Q18682p3341r23385p51531l8998J36368j19996
35695c0191R8333O31655K81324j124420k095075j442320K10758J479396J828633
35686a61907J477319N85268n79991j280289j042289m27175k80680m87078k54799
$$ plain form
35751 -632421 941223 1301993 735888 154125 -430434 -1504971 -2677210 -2900819 -1999870
35742 -1999870 -968740 -634343 -789445 -808647 -505928 -201034 -335394 -1046685 -1827658
35733 -1827658 -1844736 -1011005 -330303 -530153 -846003 -150595 1086572 1291911 206015
35724 206015 -651524 -292043 411756 423530 217227 612872 969705 -16950 -2208322 -4066387
35714 -4066387 -4641358 -4336665 -3720153 -2728082 -1314382 19892 747646 820622 480263
35705 480263 85729 156408 922010 1740692 1667351 743966 -7565 -46563 89805 -30191
35695 -30191 68142 699797 981121 -143299 -2238374 -3680694 -3469936 -1990540 -161907
35686 -161907 1315412 1900680 1320689 40400 -1001889 -1429064 -1709744 -2196822 -2451621
35677b451621N29455J060967P90962J43264j50989O5363L95775M50670J71223
$$ plain form
35677 -2451621 -1922166 -861199 -70237 73027 -77962 -12599 383176 833846 1005069
$$ [...]
##END NTUPLES=NMR SPECTRUM
##END=
