##TITLE=31Pdec_11-2024-Bay
 CDCl3
 64 sc
 5.2.2024
##JCAMPDX= 6.0         $$ Bruker NMR JCAMP-DX V2.0
##DATA TYPE= NMR SPECTRUM
##DATA CLASS= NTUPLES
##ORIGIN= UXNMR, Bruker Analytische Messtechnik GmbH
##OWNER= root
$$ XWIN-NMR		Version 3.5
$$ Mon Feb  5 15:53:23 2024 Russian Standard Time (UT+4h)  she@DPX200
##.OBSERVE FREQUENCY= 81.013821
##.OBSERVE NUCLEUS= ^31P
##.ACQUISITION MODE= SIMULTANEOUS
##.ACQUISITION SCHEME= undefined
##.AVERAGES= 64
##.DIGITISER RES= 16
##SPECTROMETER/DATA SYSTEM= spect
##.PULSE SEQUENCE= zgpg30
##.SOLVENT NAME= CDCl3
##.SHIFT REFERENCE= (INTERNAL, CDCl3, 0, 248.564)
##AUDIT TRAIL= $$ (NUMBER, WHEN, WHO, WHERE, WHAT)
$$ ##TITLE= Audit trail, XWIN-NMR		Version 3.5
$$ ##JCAMPDX= 5.01
$$ ##ORIGIN= Bruker BioSpin GmbH
$$ ##OWNER= she
$$ F:/spectra/data/she/nmr/P31/1/pdata/1/auditp.txt
$$ ##AUDIT TRAIL=  $$ (NUMBER, WHEN, WHO, WHERE, WHAT)
(   1,<2024-02-05 15:51:48.14 +0400>,<she>,<DPX200>,
      <continue with go, POWCHK disabled, PULCHK disabled
       configuration hash MD5:
       00 E9 B6 7A A2 85 ED C7 34 08 36 98 17 FE 4E 26
       data hash MD5: 32K
       2F E9 87 99 A8 AC 25 0C 95 5D 23 BC 63 61 ED 7D>)
(   2,<2024-02-05 15:51:51.46 +0400>,<she>,<DPX200>,
      <Start of raw data processing
       efp BC_mod = 2 LB = 10 FT_mod = 6 PKNL = 1 PHC0 = -12142.21 PHC1 = 25.68849 SI = 64K 
       data hash MD5: 64K
       C8 3F DF 59 60 60 92 4C 76 F6 81 5B EE 82 7D 72>)
(   3,<2024-02-05 15:52:37.34 +0400>,<she>,<DPX200>,
      <pk PHC0 = -728.9061 PHC1 = 1509.997 
       data hash MD5: 64K
       B7 7B 52 79 90 06 9A 21 7E 25 DD 0F 3C 16 1A AA>)
(   4,<2024-02-05 15:52:43.85 +0400>,<she>,<DPX200>,
      <abs ABSG = 5 
       data hash MD5: 64K
       8D 9D 16 7A 4F 12 AB AC 92 E1 18 08 21 C5 C4 D6>)
$$ ##END=
$$ 
$$ hash MD5
$$ A6 87 C4 03 8F 81 DB EE 8A 67 43 C7 46 C8 6C DA
##$RELAX= 
##$RELAX= 
##$RELAX= 
##$RELAX= 
##$RELAX= 
##$RELAX= 
##$RELAX= 
##$RELAX= 
##$RELAX= 
$$ Bruker specific parameters
$$ --------------------------
##$DU= <F:/spectra>
##$EXPNO= 1
##$NAME= <P31>
##$PROCNO= 1
##$TYPE= <nmr>
##$USER= <she>
##$AMP= (0..31)
100 100 100 100 100 100 100 100 100 100 100 100 100 100 100 100 100 100 
100 100 100 100 100 100 100 100 100 100 100 100 100 100 
##$AQSEQ= 0
##$AQ_mod= 1
##$AUNM= <au_zg>
##$AUTOPOS= <>
##$BF1= 81.014009
##$BF2= 200.13
##$BF3= 200.13
##$BF4= 200.13
##$BF5= 200.13
##$BF6= 200.13
##$BF7= 200.13
##$BF8= 200.13
##$BYTORDA= 1
##$CFDGTYP= 0
##$CFRGTYP= 5
##$CHEMSTR= <none>
##$CNST= (0..31)
1 1 145 1 1 1 1 1 1 1 1 1 1 1 1 1 1 1 1 1 1 1 1 1 1 1 1 1 1 1 1 1 
##$CPDPRG= <waltz16>
##$CPDPRG1= <>
##$CPDPRG2= <waltz16>
##$CPDPRG3= <>
##$CPDPRG4= <mlev>
##$CPDPRG5= <mlev>
##$CPDPRG6= <mlev>
##$CPDPRG7= <mlev>
##$CPDPRG8= <mlev>
##$CPDPRGB= <>
##$CPDPRGT= <>
##$D= (0..31)
0 1 0 0 0 0 0 0 0 0 0 0.03 2e-05 3e-06 0 0 0 0 0 0 0 0 0 0 0 0 0 0 0 0 
0 0 
##$DATE= 1707133828
##$DBL= (0..7)
120 120 120 11 120 120 24 19 
##$DBP= (0..7)
150 150 150 150 150 150 150 150 
##$DBP07= 0
##$DBPNAM0= <>
$$ [...]
##$SUBNAM3= <"">
##$SUBNAM4= <"">
##$SUBNAM5= <"">
##$SUBNAM6= <"">
##$SUBNAM7= <"">
##$SUBNAM8= <"">
##$SUBNAM9= <"">
##$SW= 501.771253377433
##$SWIBOX= (0..15)
0 1 3 0 0 0 0 0 0 0 0 0 0 0 0 0 
##$SW_h= 40650.406504065
##$TD= 32768
##$TD0= 1
##$TE= 0
##$TE2= 300
##$TE3= 300
##$TEG= 300
##$TL= (0..7)
0 120 53 12 22 120 120 120 
##$TP= (0..7)
150 150 150 150 150 150 150 150 
##$TP07= 0
##$TPNAME0= <>
##$TPNAME1= <>
##$TPNAME2= <>
##$TPNAME3= <>
##$TPNAME4= <>
##$TPNAME5= <>
##$TPNAME6= <>
##$TPNAME7= <>
##$TPOAL= (0..7)
0.5 0.5 0.5 0.5 0.5 0.5 0.5 0.5 
##$TPOFFS= (0..7)
0 0 0 0 0 0 0 0 
##$TUNHIN= 0
##$TUNHOUT= 0
##$TUNXOUT= 0
##$USERA1= <user>
##$USERA2= <user>
##$USERA3= <user>
##$USERA4= <user>
##$USERA5= <user>
##$V9= 5
##$VALIST= <valist>
##$VCLIST= <CCCCCCCCCCCCCCC>
##$VD= 0
##$VDLIST= <DDDDDDDDDDDDDDD>
##$VPLIST= <PPPPPPPPPPPPPPP>
##$VTLIST= <TTTTTTTTTTTTTTT>
##$WBST= 1024
##$WBSW= 4
##$XGAIN= (0..3)
0 0 0 0 
##$XL= 0
##$YL= 0
##$YMAX_a= 2225
##$YMIN_a= -2869
##$ZGOPTNS= <>
##$ZL1= 120
##$ZL2= 120
##$ZL3= 120
##$ZL4= 120
##$ABSF1= 248.5645
##$ABSF2= -253.2056
##$ABSG= 5
##$ABSL= 3
##$ALPHA= 0
##$AQORDER= 0
##$ASSFAC= 0
##$ASSFACI= 0
##$ASSFACX= 0
##$ASSWID= 0
##$AUNMP= <proc_1d>
##$AZFE= 0.1
##$AZFW= 0.5
##$BCFW= 0
##$BC_mod= 2
##$BYTORDP= 0
##$COROFFS= 0
##$CY= -3
##$DATMOD= 1
##$DC= 0
##$DFILT= <>
##$DTYPP= 0
##$F1P= 0
##$F2P= 0
##$FCOR= 1
##$FTSIZE= 65536
##$FT_mod= 6
##$GAMMA= 0
##$GB= 0
##$INTBC= 1
##$INTSCL= 6.047779e-11
##$ISEN= 30
##$LB= 10
##$LEV0= 0
##$LPBIN= 0
##$MAXI= 10000
##$MC2= 0
##$MEAN= 0
##$ME_mod= 0
##$MI= 50
##$NCOEF= 0
##$NC_proc= -9
##$NLEV= 6
##$NOISF1= 182.463
##$NOISF2= 159.3651
##$NSP= 0
##$NTH_PI= 0
##$NZP= 0
##$OFFSET= 248.5645
##$PC= 4
##$PHC0= -12871.12
##$PHC1= 1535.685
##$PH_mod= 1
##$PKNL= yes
##$PPARMOD= 0
##$PSCAL= 0
##$PSIGN= 0
##$REVERSE= no
##$SF= 81.0140089999694
##$SI= 65536
##$SIGF1= 159.3651
##$SIGF2= -187.1042
##$SINO= 113.3802
##$SIOLD= 16384
##$SREGLST= <1H.CDCl3>
##$SSB= 0
##$STSI= 65536
##$STSR= 0
##$SW_p= 40650.406504065
##$SYMM= 0
##$S_DEV= 0
##$TDeff= 32768
##$TDoff= 0
##$TI= <>
##$TILT= no
##$TM1= 0
##$TM2= 0
##$TOPLEV= 0
##$USERP1= <user>
##$USERP2= <user>
##$USERP3= <user>
##$USERP4= <user>
##$USERP5= <user>
##$WDW= 1
##$XDIM= 65536
##$YMAX_p= 177644304
##$YMIN_p= -188835529
$$ End of Bruker specific parameters
$$ ---------------------------------
##NTUPLES= NMR SPECTRUM
##VAR_NAME=  FREQUENCY,     SPECTRUM/REAL,   SPECTRUM/IMAG
##SYMBOL=    X,             R,               I
##VAR_TYPE=  INDEPENDENT,   DEPENDENT,       DEPENDENT
##VAR_FORM=  AFFN,          ASDF,            ASDF
##VAR_DIM=   65536,         65536,           65536
##UNITS=     HZ,            ARBITRARY UNITS, ARBITRARY UNITS
##FACTOR=    0.620285442955139, 1,           1
##FIRST=     20137.2065510682, 0,            0
##LAST=      -20513.1999529968, 0,           0
##MIN=       -20513.1999529968, -188835529,  0
##MAX=       20137.2065510682, 177644304,    0
$$ Real data points
##PAGE= N=1
##DATA TABLE= (X++(R..R)), XYDATA
$$ [...]
##PAGE= N=2
##DATA TABLE= (X++(I..I)), XYDATA
15211 -5800834 -5542842 -5453856 -5535818 -5757121 -6055991 -6357894 -6599963 -6751158 -6819627 -6845126
15201 -6845126 -6880681 -6972005 -7143742 -7396832 -7714155 -8067811 -8423491 -8742296 -8982899 -9106030
15191 -9106030 -9080580 -8888940 -8529546 -8016408 -7376855 -6648632 -5876885 -5111454 -4404596 -3807394
15181 -3807394 -3361880 -3088972 -2978581 -2990615 -3069739 -3166876 -3255903 -3337975 -3433957 -3570630
15171 -3570630 -3766746 -4022692 -4315707 -4602065 -4826839 -4939099 -4906622 -4723571 -4408719 -3997705
15161 -3997705 -3534750 -3066409 -2636158 -2278370 -2012778 -1842720 -1758866 -1745708 -1784977 -1852502
15151 -1852502 -1912338 -1917051 -1819447 -1590872 -1234078 -781676 -281210 223488 703823 1145362
15141 1145362 1537001 1859615 2083866 2180101 2133846 1955943 1680619 1353491 1017419 703333
15131 703333 428288 198722 15439 -122514 -216606 -270474 -293467 -303975 -330153 -406243 -564474
15120 -564474 -825151 -1189500 -1639212 -2142931 -2665690 -3175859 -3646671 -4053834 -4373642 -4585225
15110 -4585225 -4676396 -4648411 -4514956 -4295532 -4008282 -3667010 -3282185 -2862174 -2412735 -1936760
15100 -1936760 -1437179 -922640 -412134 65176 475546 789056 987413 1069225 1052455 973525
15090 973525 881388 825658 841655 938715 1097567 1278099 1433996 1528264 1543888 1486336 1378470
15079 1378470 1251258 1133609 1043258 980888 931394 874240 797939 708341 624316 565077 539679
15068 539679 544815 568368 593639 603616 587461 547510 500404 468865 469355 505310 570539 658061
15056 658061 766134 897422 1053765 1231685 1421654 1610368 1783119 1924359 2017033 2042423
15046 2042423 1981331 1816516 1536772 1142593 650448 90611 -502707 -1102760 -1694526 -2269732
15036 -2269732 -2818767 -3326862 -3775754 -4146751 -4421446 -4580032 -4599914 -4457688 -4136054 -3634012
15026 -3634012 -2975367 -2210041 -1406421 -637617 33407 565918 948277 1197721 1352148
15017 1352148 1455761 1543944 1634139 1726617 1812959 1885006 1937493 1963590 1949200 1873049 1714419
15006 1714419 1463652 1128297 731380 304014 -122557 -521925 -874022 -1164610 -1383876
14997 -1383876 -1524957 -1583438 -1558583 -1455301 -1284340 -1059292 -792353 -492896 -171156 154706
14987 154706 452861 677339 773908 690547 389512 -141863 -883934 -1783087 -2757418 -3710483
14977 -3710483 -4550794 -5210662 -5656220 -5884391 -5910831 -5758510 -5454064 -5030455 -4528459 -3991771
14967 -3991771 -3457587 -2949026 -2474307 -2033254 -1628087 -1273233 -998439 -842124 -837672 -1000178
14957 -1000178 -1320865 -1771153 -2312904 -2909105 -3530039 -4152656 -4754462 -5306138 -5767278
14948 -5767278 -6087144 -6209964 -6083935 -5673205 -4970218 -4003157 -2833533 -1543681 -219641
14939 -219641 1063164 2247504 3296650 4195363 4950801 5590244 6151822 6669580 7160308
14930 7160308 7619972 8030869 8372423 8626533 8774828 8793976 8657890 8349145 7872318 7258884
14920 7258884 6559559 5829045 5111886 4435266 3809565 3234025 2703271 2210716 1747743
14911 1747743 1301702 857140 401457 -68327 -542537 -1001936 -1425757 -1800903 -2127898
14902 -2127898 -2420415 -2698360 -2978068 -3264365 -3547485 -3804972 -4007192 -4125425 -4141398 -4055371
14892 -4055371 -3888150 -3674043 -3447229 -3228787 -3020982 -2809942 -2573112 -2287235 -1934541
14883 -1934541 -1505966 -1000861 -424166 216120 908686 1636485 2375241 3095417 3767272
14874 3767272 4366632 4879300 5303137 5646901 5924413 6144544 6301918 6375715 6339728 6178034
14864 6178034 5895514 5516298 5072123 4588527 4076113 3529601 2933113 2268059 1520190
14855 1520190 684363 -232528 -1209867 -2213488 -3198599 -4114637 -4910056 -5536334 -5953320
14846 -5953320 -6138484 -6099027 -5880730 -5566125 -5259126 -5060508 -5042878 -5232965 -5605558 -6090270
14836 -6090270 -6589793 -7005296 -7261966 -7326852 -7213254 -6970499 -6663781 -6352881 -6077715 -5853460
14826 -5853460 -5673358 -5516595 -5359431 -5186445 -4996845 -4802840 -4622402 -4472043 -4363468
14817 -4363468 -4304005 -4298545 -4351148 -4465964 -4648502 -4907809 -5257746 -5714068 -6286791 -6972162
14807 -6972162 -7749393 -8583074 -9428383 -10237152 -10965024 -11578948 -12061635 -12410470 -12632338
14798 -12632338 -12738304 -12740743 -12653047 -12490753 -12272882 -12022216 -11763410 -11518498 -11300485 -11107318
14788 -11107318 -10919529 -10703586 -10419645 -10030218 -9507409 -8838611 -8030634 -7110736 -6123316
14779 -6123316 -5123167 -4167404 -3307775 -2584634 -2023747 -1635757 -1416195 -1344308 -1382029 -1476249
14769 -1476249 -1566178 -1594826 -1522243 -1337161 -1062420 -749953 -465246 -266897 -189975 -240169
14759 -240169 -400554 -646347 -958730 -1329740 -1756750 -2232168 -2736097 -3236045 -3692638 -4067550
14749 -4067550 -4330329 -4462848 -4461615 -4337818 -4113961 -3816503 -3467047 -3076646 -2645864 -2169076
14739 -2169076 -1639937 -1057025 -430261 212969 825848 1348259 1721066 1903508 1885566 1688687
14729 1688687 1354319 926642 438572 -93118 -663292 -1268008 -1893201 -2507736 -3064376
14720 -3064376 -3507931 -3786024 -3858356 -3703496 -3323224 -2742492 -2002799 -1151060 -230229 723786
14710 723786 1680338 2612423 3498180 4323979 5085467 5783873 6417938 6975190 7428081 7738593
14700 7738593 7869600 7796960 7516426 7043711 6410212 5658228 4837722 4003817 3212543 2513852
14690 2513852 1944083 1521719 1248016 1110435 1085632 1141260 1238712 1339079 1412009 1444176
14680 1444176 1443151 1434520 1453854 1537605 1716167 2009254 2422054 2941679 3535348 4152035
14670 4152035 4728189 5197001 5499426 5593385 5456935 5084186 4478294 3648502 2614294
14661 2614294 1412618 100895 -1247556 -2552930 -3738447 -4738530 -5506899 -6024182
14653 -6024182 -6300895 -6372048 -6285185 -6088760 -5826365 -5536064 -5250276 -4994033 -4783800 -4629115
14643 -4629115 -4535424 -4504666 -4533014 -4608559 -4711037 -4813036 -4882187 -4886090 -4801057 -4620935 -4359223
14632 -4359223 -4041366 -3691796 -3324278 -2940915 -2538294 -2114954 -1675612 -1232161 -804176
14623 -804176 -419696 -113342 80955 140331 60209 -145689 -451136 -824613 -1235400 -1658208
14613 -1658208 -2076244 -2482214 -2877343 -3269344 -3670200 -4094230 -4556448 -5070273 -5642840
14604 -5642840 -6267759 -6918954 -7551161 -8109649 -8546157 -8834428 -8979151 -9015105 -8997134 -8984877
14594 -8984877 -9027482 -9152378 -9360222 -9627120 -9914000 -10179935 -10393176 -10534866 -10595997 -10572694
14584 -10572694 -10464010 -10272108 -10002362 -9662456 -9261658 -8810981 -8322921 -7809151 -7276612
14575 -7276612 -6724687 -6145990 -5531161 -4875806 -4186820 -3485417 -2804996 -2183570 -1652784
14566 -1652784 -1227600 -901207 -648109 -434884 -234140 -35133 153641 309832 406475 420729
14556 420729 340055 165590 -87694 -394766 -727811 -1064413 -1392835 -1711664 -2024236 -2331575
14546 -2331575 -2628467 -2904180 -3144817 -3332989 -3444597 -3447693 -3308779 -3006411 -2545546 -1964276
14536 -1964276 -1328272 -714295 -189477 204660 456929 579993 598910 541778 434831 299878
14526 299878 151817 -3547 -170072 -359939 -590754 -880734 -1241947 -1673556 -2158767 -2668144
14516 -2668144 -3168866 -3636091 -4060913 -4450390 -4819446 -5179680 -5531917 -5865673 -6163199
14507 -6163199 -6403822 -6567076 -6636189 -6603018 -6472441 -6262708 -6000492 -5713058 -5421389 -5136226
14497 -5136226 -4856427 -4568801 -4249934 -3870837 -3403706 -2828602 -2138374 -1341461 -462582
14488 -462582 459287 1376191 2238780 3003827 3639051 4124166 4449300 4613419 4624615 4501877
14478 4501877 4276203 3988893 3685985 3409428 3187969 3032678 2940072 2899831 2899434 2921396
14468 2921396 2937650 2910261 2802115 2591204 2278093 1881998 1430220 949791 466550 9560
14458 9560 -385578 -679584 -838563 -845080 -706017 -453608 -139203 177246 436940 587930
14448 587930 588235 410547 49885 -469797 -1095570 -1753554 -2362041 -2846268 -3153383 -3265850
14438 -3265850 -3208433 -3042687 -2847419 -2692001 -2614905 -2617424 -2673587 -2748398 -2813884 -2856641 -2876739
14427 -2876739 -2881326 -2876473 -2860010 -2818106 -2727796 -2565298 -2316469 -1984213 -1589475 -1166119 -752267
14416 -752267 -380617 -70047 178288 377239 542988 683686 795003 865014 883800 850864
14406 850864 776535 677862 571905 470443 379706 305375 258273 255267 315011 453781 685545
14395 685545 1023777 1478662 2047117 2700421 3377862 3992208 4446841 4658694 4578032 4197522
14385 4197522 3548741 2690837 1698259 651383 -370575 -1296360 -2069772 -2656402 -3049342
14376 -3049342 -3272676 -3379856 -3443849 -3539521 -3724000 -4022524 -4424028 -4885756 -5343996 -5728373
14366 -5728373 -5977313 -6051061 -5938146 -5653027 -5226517 -4693964 -4087128 -3433051 -2758076 -2090974
14356 -2090974 -1459718 -882147 -356777 138851 639844 1179561 1775833 2422588 3088608
14347 3088608 3723617 4270920 4683045 4933897 5021898 4964538 4789914 4530089 4216487 3875526
14337 3875526 3525314 3176195 2835333 2511092 2212450 1943000 1694123 1443109 1158846
14328 1158846 812616 388426 -112014 -670982 -1261240 -1854571 -2429418 -2974431 -3485374
14319 -3485374 -3956361 -4370774 -4698629 -4903522 -4956260 -4848024 -4596345 -4241553 -3836365 -3433516
14309 -3433516 -3075163 -2785764 -2569220 -2410743 -2282838 -2153263 -1992495 -1779007 -1501701
14300 -1501701 -1159678 -760001 -314043 167367 679129 1224223 1809612 2435641 3084366
14291 3084366 3713908 4262434 4660693 4849779 4799830 4524030 4082238 3571870 3108690 2802814
14281 2802814 2735056 2938726 3392674 4029811 4759384 5494365 6173080 6767978 7280720 7727729
14271 7727729 8123238 8467645 8746576 8939890 9033893 9028961 8939575 8789325 8605100 8412508
14261 8412508 8232455 8078577 7956184 7863402 7793923 7739050 7686598 7617009 7500995 7303823
14251 7303823 6996938 6571360 6045165 5460869 4874049 4338090 3890699 3546951 3301479
14242 3301479 3139078 3048993 3035437 3117243 3314569 3628887 4028523 4449957 4815065 5054276
14232 5054276 5123437 5008759 4722604 4296081 3771924 3197802 2620248 2081196 1618351 1266254
14222 1266254 1052331 986238 1048714 1189448 1337950 1422170 1385222 1193952 839783 336191
14212 336191 -283886 -970838 -1663272 -2295631 -2806701 -3146993 -3284515 -3209059 -2933835 -2492640
14202 -2492640 -1932785 -1306857 -666414 -58092 479542 919503 1249381 1472120 1603853
14193 1603853 1669448 1697030 1712548 1735518 1777245 1842058 1930155 2039539 2165751 2300611 2432068
14182 2432068 2546050 2630015 2677456 2691547 2684706 2671901 2660047 2639464 2582063 2446504 2188070
14171 2188070 1771431 1184263 447543 -382810 -1225649 -1993692 -2616336 -3058690 -3329533
14162 -3329533 -3474310 -3555639 -3629710 -3727939 -3849357 -3963877 -4022877 -3972271 -3764180 -3366009
14152 -3366009 -2768202 -1991301 -1089685 -147510 734806 1459838 1951520 2167859 2106597 1804219
14142 1804219 1328454 764687 198582 -300712 -692068 -965908 -1140059 -1250640 -1341411 -1454805
14132 -1454805 -1627085 -1888491 -2266110 -2784275 -3458013 -4280618 -5212626 -6180641 -7089330
14123 -7089330 -7842962 -8368837 -8634840 -8655719 -8486213 -8203285 -7883487 -7583345 -7329782 -7123572
14113 -7123572 -6952609 -6806811 -6686371 -6600349 -6558848 -6564616 -6608088 -6667084 -6710768 -6706841 -6629857
14102 -6629857 -6467660 -6223549 -5913887 -5562968 -5197352 -4841331 -4514983 -4236143 -4025782
14093 -4025782 -3912671 -3931353 -4110925 -4459071 -4950286 -5525556 -6104936 -6608701 -6979160 -7194505
14083 -7194505 -7269014 -7240547 -7152833 -7041617 -6929125 -6824845 -6727771 -6627861 -6508247 -6350281
14073 -6350281 -6140033 -5872245 -5549664 -5179963 -4773789 -4345011 -3912157 -3500322 -3142956
14064 -3142956 -2880820 -2754819 -2793342 -2999904 -3347250 -3779748 -4222325 -4593766 -4822319 -4860268
14054 -4860268 -4693420 -4342797 -3857910 -3302846 -2739262 -2213285 -1752205 -1370150 -1075411
14045 -1075411 -872380 -757477 -713910 -709896 -701632 -639999 -479977 -191635 229376 754760
14035 754760 1322597 1844431 2221094 2365183 2223883 1793507 1120005 286322 -607797 -1467928
14025 -1467928 -2225068 -2849327 -3352246 -3776196 -4175556 -4597569 -5068249 -5584786 -6114941
14016 -6114941 -6604795 -6994618 -7238342 -7318963 -7253711 -7088092 -6883033 -6700566 -6590985 -6581994
14006 -6581994 -6671336 -6826737 -6995448 -7119763 -7150827 -7055854 -6820357 -6449234 -5966890 -5412986
13996 -5412986 -4832484 -4264170 -3733896 -3255001 -2832649 -2467300 -2155872 -1892921 -1673935
13987 -1673935 -1499450 -1376355 -1314189 -1317853 -1380656 -1481433 -1587007 -1658378 -1657495 -1552589 -1322309
13976 -1322309 -959795 -476351 97329 714451 1320256 1863257 2306117 2632237 2845557
13967 2845557 2964313 3012170 3010931 2978023 2929661 2886871 2878215 2934178 3074862 3299175 3583442
13956 3583442 3890370 4182305 4431350 4622560 4751821 4823348 4850767 4860429 4890869 4983893
13946 4983893 5170123 5457423 5828646 6248317 6673345 7063038 7385591 7619449 7749343
13937 7749343 7759378 7627466 7324584 6819558 6087572 5119589 3929749 2557880 1065585
13928 1065585 -472679 -1979189 -3379007 -4602128 -5585374 -6277622 -6647980 -6692870 -6438328
13919 -6438328 -5937035 -5261869 -4497661 -3731789 -3044129 -2497479 -2129927 -1950541 -1939443 -2052856
13909 -2052856 -2232825 -2419815 -2564944 -2638226 -2630591 -2550249 -2416219 -2251753 -2078624 -1911964
13899 -1911964 -1756236 -1604168 -1439503 -1241777 -990127 -665171 -250626 263998 880892
13890 880892 1593578 2387996 3241978 4122106 4981587 5764150 6414452 6889545 7164860 7233223
13880 7233223 7101209 6787772 6325445 5759995 5145391 4535655 3977918 3508564 3150850
13871 3150850 2912705 2786470 2752787 2787362 2866807 2971853 3089332 3213744 3346179 3488852
13861 3488852 3638302 3783390 3910745 4013673 4097863 4180420 4283660 4427161 4620587 4858664
13851 4858664 5119582 5368400 5566062 5682139 5706532 5654421 5561401 5470918 5420367 5432111
13841 5432111 5511598 5650255 5829481 6023936 6204551 6342112 6411256 6394058 6282419 6078646
13831 6078646 5794016 5446178 5057258 4653620 4265534 3923672 3651748 3458618 3334626
13822 3334626 3254255 3183244 3086595 2934830 2707867 2397304 2007985 1558597 1080101 611472
13812 611472 193844 -135193 -346738 -425653 -374884 -216639 11240 262534 490591 655068
13802 655068 727414 695486 566486 366477 134921 -85836 -263918 -389953 -483187 -588459
13792 -588459 -763983 -1063499 -1519213 -2131910 -2870967 -3682249 -4499468 -5255444 -5891342 -6362682
13782 -6362682 -6641721 -6717437 -6595466 -6299033 -5869498 -5364081 -4849331 -4390768 -4041033 -3830004
13772 -3830004 -3759989 -3806912 -3926510 -4064405 -4168831 -4202928 -4151572 -4019680 -3824418 -3587171
13762 -3587171 -3329088 -3069816 -2827508 -2619507 -2463436 -2377011 -2374346 -2458930 -2616736 -2813706
13752 -2813706 -2999460 -3115624 -3105661 -2924037 -2544224 -1964878 -1212060 -335602 599076 1519513
13742 1519513 2352657 3031212 3502895 3740968 3749572 3558976 3212869 2755018 2221494 1639935
13732 1639935 1034058 430768 -133265 -610013 -947428 -1105504 -1074056 -881697 -589393 -271629
13722 -271629 4395 192354 271447 245634 139647 -9232 -163370 -296104 -396269 -464976
13712 -464976 -509557 -540472 -572967 -630864 -748104 -964928 -1318470 -1830954 -2500315 -3297144
13702 -3297144 -4169517 -5054820 -5895118 -6650230 -7302797 -7853602 -8310920 -8679918 -8956347
13693 -8956347 -9125940 -9169237 -9070082 -8824250 -8444672 -7962428 -7424996 -6892224 -6428143 -6087615
13683 -6087615 -5901646 -5868843 -5958389 -6123334 -6317299 -6506819 -6675058 -6817430 -6933428 -7020313
13673 -7020313 -7073070 -7090777 -7084271 -7077421 -7097941 -7161544 -7259288 -7356661 -7405622 -7363096 -7206282
13662 -7206282 -6937537 -6577572 -6152194 -5680753 -5172240 -4629251 -4055785 -3464134 -2877603
13653 -2877603 -2327678 -1846702 -1459905 -1181167 -1013392 -950358 -976879 -1068206 -1192328 -1316919
13643 -1316919 -1418687 -1491007 -1546619 -1614286 -1730630 -1930203 -2236750 -2656301 -3171243 -3736939
13633 -3736939 -4285562 -4739744 -5031215 -5115116 -4974965 -4621687 -4092689 -3451157 -2780022 -2167285
13623 -2167285 -1686837 -1383048 -1264166 -1304259 -1451880 -1644547 -1826850 -1965968 -2057307 -2118285
13613 -2118285 -2175591 -2253473 -2366756 -2518005 -2697320 -2884367 -3052222 -3172021 -3217819 -3171603
13603 -3171603 -3027750 -2795080 -2495694 -2161771 -1831771 -1546130 -1342456 -1251863 -1297992 -1497354
13593 -1497354 -1857567 -2372630 -3018866 -3755942 -4533458 -5299457 -6007042 -6618224 -7106493
13584 -7106493 -7459273 -7679128 -7781145 -7785524 -7708210 -7554754 -7320739 -6997851 -6581991 -6079969
13574 -6079969 -5512389 -4911095 -4311334 -3741884 -3218108 -2741075 -2302017 -1888789 -1490854
13565 -1490854 -1100626 -711204 -313576 102426 541943 997734 1448358 1864786 2221423
13556 2221423 2504073 2710280 2843447 2905659 2893720 2800352 2620047 2356959 2030520 1674689
13546 1674689 1330111 1033027 806693 658980 585999 578840 629309 731050 875526 1046866
13536 1046866 1221431 1374125 1487598 1558984 1602250 1647237 1735501 1911405 2208996 2639270
13526 2639270 3183771 3797575 4420618 4993286 5470463 5828521 6063193 6181712 6195735 6119541
13516 6119541 5972661 5782270 5581050 5400102 5260351 5166884 5108512 5061966 4999074 4895392
13506 4895392 4738262 4531195 4291897 4044233 3807757 3589643 3382651 3170376 2938093
13497 2938093 2684687 2429723 2211266 2074140 2052897 2156651 2362523 2620672 2868211 3045237
13487 3045237 3106381 3025179 2792706 2413374 1899596 1265659 521481 -331560 -1299937 -2391350
13477 -2391350 -3604200 -4917588 -6286580 -7645696 -8920325 -10042098 -10961935 -11655547
13469 -11655547 -12120353 -12367587 -12415258 -12285747 -12007609 -11617871 -11160711 -10681464 -10218822
13460 -10218822 -9799824 -9440027 -9147260 -8925310 -8775674 -8698645 -8695302 -8768498 -8918899 -9135920
13450 -9135920 -9390641 -9639515 -9840176 -9970441 -10039144 -10083736 -10157170 -10309660 -10570915 -10938342
13440 -10938342 -11375545 -11821470 -12206064 -12466801 -12561630 -12475564 -12219773 -11824626 -11330137 -10776811
13430 -10776811 -10198382 -9618032 -9050322 -8508660 -8013097 -7591583 -7272427 -7072653 -6989417
13421 -6989417 -6998323 -7057681 -7115580 -7118029 -7018296 -6787236 -6421546 -5945062 -5400464 -4834200 -4281005
13410 -4281005 -3753536 -3239650 -2707759 -2119361 -1445015 -676840 168987 1060837 1965630
13401 1965630 2859887 3732551 4579991 5397504 6172062 6879308 7485863 7956157 8261110
13392 8261110 8384868 8326672 8098040 7718435 7213140 6614115 5960545 5294429 4650497 4046235
13382 4046235 3480197 2941255 2422352 1928635 1475210 1078764 751528 502474 343328
13373 343328 292301 370118 589581 945897 1415058 1961472 2549398 3150980 3747309 4324207
13363 4324207 4867676 5363119 5798420 6166711 6464621 6686624 6821074 6852861 6771712 6579891
13353 6579891 6293131 5933551 5518742 5053751 4530828 3936640 3261900 2507913 1688436
13344 1688436 828900 -35080 -860689 -1604177 -2230077 -2720255 -3079024 -3331656 -3515735
13335 -3515735 -3667543 -3808460 -3937461 -4033135 -4063740 -4000010 -3825118 -3538603 -3153950 -2691739
13325 -2691739 -2171773 -1608171 -1009914 -385815 250658 881600 1490784 2071038 2626154
13316 2626154 3164039 3684137 4166273 4567483 4829489 4894708 4724991 4316239 3704007 2959128
13306 2959128 2175248 1451054 870424 485305 306864 308108 436342 629877 832699 1002977
13296 1002977 1114776 1155391 1121557 1016394 847014 622651 353876 53045 -265341 -585559
13286 -585559 -892239 -1171227 -1410096 -1600342 -1742083 -1849133 -1950821 -2088053 -2303710 -2630171
13276 -2630171 -3079073 -3638453 -4279140 -4966976 -5674370 -6386198 -7099692 -7821499 -8564711
13267 -8564711 -9345693 -10178647 -11067594 -11999176 -12941179 -13849208 -14679210 -15400220 -16001592
13258 -16001592 -16491908 -16891218 -17221426 -17499468 -17734576 -17927876 -18072270 -18152392 -18145867 -18027030
13248 -18027030 -17773029 -17370640 -16821363 -16143234 -15369660 -14546196 -13725204 -12958114 -12286985
13239 -12286985 -11738537 -11322291 -11031919 -10849156 -10751104 -10719983 -10749828 -10844171 -11005605 -11225476
13229 -11225476 -11481504 -11743432 -11981008 -12169455 -12291799 -12339129 -12308754 -12199706 -12006702 -11716001
13219 -11716001 -11307136 -10762277 -10080182 -9286922 -8435092 -7589335 -6805096 -6112079 -5510350
13210 -5510350 -4978850 -4490022 -4023143 -3571789 -3144770 -2762880 -2453991 -2246650 -2160974 -2198554
13200 -2198554 -2337464 -2537643 -2754417 -2951301 -3104952 -3203228 -3242262 -3225645 -3163493 -3068455
13190 -3068455 -2949965 -2811405 -2652988 -2478252 -2298763 -2133091 -2000501 -1913694 -1875240 -1879382
13180 -1879382 -1917231 -1981930 -2071686 -2190278 -2344724 -2539160 -2765441 -2995065 -3179606 -3263641
13170 -3263641 -3206481 -3002681 -2691083 -2347400 -2062591 -1915205 -1948652 -2162296 -2519080 -2964956
13160 -2964956 -3450755 -3946755 -4443983 -4943138 -5438742 -5908368 -6312585 -6604053 -6740049
13151 -6740049 -6693263 -6458219 -6051985 -5508787 -4870157 -4174505 -3449902 -2711374 -1961705 -1194913
13141 -1194913 -402775 416186 1249006 2066878 2831339 3503209 4047673 4433492 4630398
13132 4630398 4609931 4351002 3847195 3111931 2179772 1104188 -47625 -1203154 -2296093
13123 -2296093 -3278143 -4125780 -4838524 -5431120 -5925680 -6347452 -6722416 -7073174 -7412893
13114 -7412893 -7740649 -8041397 -8290966 -8463740 -8539726 -8508679 -8370966 -8136016 -7818692 -7433682
13104 -7433682 -6990328 -6492566 -5946080 -5367836 -4789104 -4247049 -3768846 -3358333 -2993936
13095 -2993936 -2639537 -2261952 -1844828 -1391866 -919939 -448670 6974 438602 842053
13086 842053 1213370 1545485 1827175 2044506 2183623 2233431 2187328 2044279 1810226 1500373
13076 1500373 1140869 767103 417865 128501 -73263 -169354 -155075 -45140 123363 296905
13066 296905 419592 448574 364535 175769 -83023 -356860 -582109 -702828 -687891 -542551
13056 -542551 -308343 -49480 169033 301274 329482 261162 120253 -60582 -244397 -393653
13046 -393653 -475648 -468447 -363581 -163396 125549 499388 960894 1518871 2183105 2956582
13036 2956582 3827643 4764932 5717267 6619496 7403858 8014422 8420508 8624769 8662774 8592939
13026 8592939 8478418 8366206 8271372 8173017 8023107 7763479 7344271 6738835 5952614 5024751
13016 5024751 4022076 3026679 2119906 1366121 799572 417981 186182 50327 -41982
13007 -41982 -124520 -206291 -278093 -325697 -340197 -320037 -266692 -180513 -61110 89030 262366
12996 262366 448784 641826 844372 1068607 1327759 1622640 1931143 2208255 2397322 2446224
12986 2446224 2320940 2012891 1539748 940042 262526 -446356 -1151771 -1833157 -2480944
12977 -2480944 -3091319 -3663372 -4200430 -4713548 -5222688 -5752461 -6323311 -6942287 -7597576
12968 -7597576 -8259238 -8886514 -9439762 -9892289 -10236650 -10483151 -10653416 -10774100 -10873205 -10976975
12958 -10976975 -11104322 -11259662 -11429854 -11590230 -11717908 -11804132 -11858315 -11903495 -11968184 -12079042
12948 -12079042 -12255710 -12507804 -12833894 -13221336 -13645563 -14069757 -14448101 -14734181 -14891623
12939 -14891623 -14901739 -14765025 -14497243 -14123352 -13672759 -13177564 -12672629 -12194846 -11780224
12930 -11780224 -11459405 -11252432 -11162974 -11173780 -11247448 -11335495 -11393144 -11392469 -11326938 -11205238 -11037705
12919 -11037705 -10822295 -10537684 -10147727 -9615597 -8921196 -8075089 -7124308 -6147525 -5239124
12910 -5239124 -4485968 -3945204 -3632133 -3521877 -3561587 -3686563 -3834872 -3957302 -4020518 -4002500
12900 -4002500 -3883450 -3639618 -3247095 -2695624 -2004329 -1228584 -451966 234776 758816
12891 758816 1082958 1208208 1161922 979983 692521 317574 -138248 -674570 -1289399 -1970980
12881 -1970980 -2693004 -3416362 -4097725 -4701228 -5207073 -5612086 -5922420 -6144161 -6278429
12872 -6278429 -6323158 -6278546 -6151765 -5958292 -5719145 -5454997 -5180129 -4900317 -4616720 -4333748
12862 -4333748 -4066147 -3841001 -3692733 -3652124 -3733521 -3926616 -4198186 -4504170 -4806585 -5086879
12852 -5086879 -5349402 -5614096 -5902838 -6226437 -6578379 -6937731 -7279004 -7583148 -7843208
12843 -7843208 -8061597 -8241364 -8377482 -8453715 -8446981 -8337108 -8117121 -7798728 -7410459 -6990641
12833 -6990641 -6580406 -6220217 -5948555 -5798491 -5789397 -5915548 -6137814 -6385935 -6575326 -6633890
12823 -6633890 -6526396 -6263451 -5890933 -5467038 -5039419 -4632016 -4244469 -3861228 -3464292
12814 -3464292 -3043244 -2599393 -2145393 -1703711 -1304876 -983170 -768207 -674929 -697119 -807550
12804 -807550 -964374 -1121420 -1239360 -1293880 -1277549 -1195500 -1058823 -879521 -667556 -428771
12794 -428771 -164095 128333 448837 793431 1155737 1532475 1928216 2355532 2829760 3360488
12784 3360488 3943097 4553203 5145752 5659659 6027910 6190760 6107344 5761636 5162766 4343225
12774 4343225 3357418 2279236 1195323 192777 -656293 -1308207 -1753297 -2010388 -2112707
12765 -2112707 -2093170 -1977086 -1784544 -1538134 -1269308 -1018710 -829508 -736189 -753465 -870403
12755 -870403 -1053111 -1256146 -1438867 -1579610 -1680403 -1760083 -1841287 -1940245 -2064196 -2214336
12745 -2214336 -2389165 -2585207 -2795326 -3006214 -3196783 -3339299 -3404179 -3367109 -3215188 -2949108
12735 -2949108 -2580610 -2127052 -1606113 -1033396 -424144 201652 813388 1367302 1811799
12726 1811799 2101988 2218101 2177024 2029066 1842731 1688837 1632528 1730845 2027074 2537922
12716 2537922 3239835 4065073 4913137 5673944 6252954 6588349 6655805 6463849 6046397 5456334
12706 5456334 4758605 4020385 3300318 2642025 2074257 1614607 1271856 1044712 918080
12697 918080 859731 820950 743875 574616 276989 -159055 -716885 -1359280 -2038551 -2707888
12687 -2707888 -3330927 -3887270 -4373662 -4801544 -5190892 -5560545 -5918185 -6255404 -6550783
12678 -6550783 -6778363 -6916125 -6950937 -6879680 -6707767 -6446278 -6108791 -5708747 -5257695 -4764741
12668 -4764741 -4237577 -3684724 -3117186 -2547781 -1988415 -1447555 -929919 -438625 21640
12659 21640 442287 810701 1112538 1335550 1473871 1532257 1529412 1498168 1479895 1512945 1619058
12648 1619058 1794174 2008901 2219289 2382893 2471693 2475624 2397308 2244891 2029683 1769021
12638 1769021 1488736 1219719 988843 810094 682480 596851 547950 544253 608797 768784
12628 768784 1038656 1406375 1831846 2259057 2634988 2925300 3121262 3238750 3312425 3386420
12618 3386420 3501683 3682420 3927073 4208883 4486655 4720689 4885994 4976842 5002687 4981035
12608 4981035 4933306 4884409 4861516 4887969 4974233 5112254 5277720 5438890 5566956 5643835
12598 5643835 5665605 5640948 5585022 5511960 5431638 5353807 5296011 5287079 5360861 5542833 5838195
12587 5838195 6229388 6684770 7173147 7675312 8186208 8707984 9239862 9770909 10277869
12578 10277869 10726960 11078210 11291506 11333449 11184061 10842853 10333042 9701081 9009451
12569 9009451 8325150 7709431 7211755 6865617 6683417 6652387 6736992 6889504 7063564 7222838
12559 7222838 7341077 7396767 7369132 7239873 6999008 6649125 6204186 5684303 5110908 4504746
12549 4504746 3885443 3270212 2670918 2090668 1522250 950668 360117 -257327 -895454
12540 -895454 -1532375 -2133220 -2656167 -3061747 -3324160 -3440192 -3430392 -3331032 -3181127 -3011800
12530 -3011800 -2842998 -2686817 -2551711 -2442117 -2353857 -2271292 -2171332 -2032769 -1844926 -1611537
12520 -1611537 -1350402 -1090588 -867086 -712578 -648104 -675747 -775496 -907490 -1020932 -1069233
12510 -1069233 -1025970 -893131 -697132 -476910 -273229 -124567 -67528 -136625 -361079 -759709
12500 -759709 -1335462 -2070568 -2924398 -3837694 -4744765 -5589718 -6338593 -6981330 -7524500 -7981733
12490 -7981733 -8368432 -8701836 -9002433 -9292653 -9592569 -9915023 -10262446 -10626502 -10991228
12481 -10991228 -11339097 -11656351 -11932505 -12153000 -12290964 -12306295 -12155251 -11806404 -11255590
12472 -11255590 -10533270 -9700023 -8829587 -7984942 -7198126 -6463277 -5744631 -4993450 -4165742
12463 -4165742 -3235527 -2202125 -1091464 48512 1158227 2181028 3077300 3831657 4449352
12454 4449352 4944175 5324835 5586067 5706709 5654319 5395284 4908059 4194792 3286271 2238479
12444 2238479 1122682 11939 -1033288 -1976002 -2803994 -3519510 -4124005 -4609862 -4965454
12435 -4965454 -5188003 -5292161 -5306830 -5262964 -5181532 -5069498 -4925428 -4750048 -4554224 -4359375
12425 -4359375 -4191370 -4073542 -4023471 -4053716 -4173859 -4391847 -4713686 -5140233 -5660606 -6245691
12415 -6245691 -6848281 -7413242 -7892995 -8258846 -8502574 -8631102 -8660787 -8613865 -8514177 -8379838
12405 -8379838 -8216061 -8014293 -7759872 -7444019 -7073672 -6675191 -6290851 -5968832 -5749878
12396 -5749878 -5656903 -5692755 -5844956 -6090433 -6395311 -6712435 -6983709 -7150751 -7170488 -7028868
12386 -7028868 -6747365 -6379983 -6000634 -5682751 -5476394 -5391619 -5397047 -5436218 -5453809 -5416991
12376 -5416991 -5320456 -5175087 -4990555 -4763857 -4479631 -4119923 -3676271 -3157079 -2587326 -2002583
12366 -2002583 -1441566 -939970 -525606 -213990 -4727 120004 193659 259816 363355 540042
12356 540042 807916 1164255 1589512 2055531 2532576 2991275 3400421 3725526 3932112 3993329
12346 3993329 3897808 3653398 3284258 2821505 2291197 1706474 1069258 380092 -351735 -1104831
12336 -1104831 -1849355 -2552801 -3183795 -3713362 -4115188 -4366595 -4452025 -4369522 -4137349 -3795313
12326 -3795313 -3397792 -3001656 -2655918 -2397534 -2252341 -2237258 -2361035 -2623257 -3012493 -3504978
12316 -3504978 -4066051 -4656261 -5241135 -5799671 -6326086 -6824063 -7298655 -7752363 -8187492
12307 -8187492 -8611075 -9036471 -9478437 -9943443 -10421092 -10882872 -11290707 -11611486 -11829445
12298 -11829445 -11949267 -11988825 -11967113 -11895238 -11774844 -11602585 -11375900 -11096472 -10770720 -10408510
12288 -10408510 -10021468 -9622057 -9224197 -8844667 -8502830 -8216695 -7996424 -7839196 -7729280
12279 -7729280 -7644644 -7568410 -7500960 -7466637 -7509736 -7679010 -8006548 -8490647 -9090465 -9734272
12269 -9734272 -10337341 -10822448 -11135949 -11254708 -11183231 -10944779 -10572153 -10101983 -9572575 -9022821
12259 -9022821 -8489640 -8002749 -7577564 -7209637 -6875497 -6542015 -6180076 -5774151 -5322618
12250 -5322618 -4831472 -4308565 -3762797 -3206505 -2655969 -2127097 -1628352 -1156422 -698395
12241 -698395 -238480 236634 737277 1272395 1848134 2462260 3098624 3726488 4305674 4794486
12231 4794486 5156197 5361776 5390154 5229981 4885300 4382535 3773055 3127984 2527311 2047964
12221 2047964 1753942 1688880 1870317 2285919 2893614 3628278 4415061 5184730 5884202 6478682
12211 6478682 6947440 7278173 7464196 7506816 7422393 7249137 7046076 6880571 6809220 6861677
12201 6861677 7034016 7292460 7585131 7858231 8071117 8204207 8257410 8242644 8176277 8074827
12191 8074827 7953593 7826427 7704984 7596631 7501901 7414306 7324917 7230406 7139159 7069917
12181 7069917 7042515 7066501 7135437 7230854 7333515 7435577 7546803 7690264 7887219 8137231
12171 8137231 8404801 8622629 8712222 8611385 8294034 7773444 7090219 6293583 5425848 4516142
12161 4516142 3583716 2646281 1727126 856560 67249 -613105 -1167038 -1587961 -1877616
12152 -1877616 -2044076 -2102400 -2076240 -1997061 -1899909 -1818300 -1781470 -1814327 -1937528 -2165554 -2503430
12141 -2503430 -2944623 -3471580 -4058660 -4676374 -5295873 -5892429 -6446829 -6944714 -7374929
12132 -7374929 -7727879 -7994781 -8169466 -8253761 -8263841 -8231206 -8194116 -8182927 -8208283 -8258736 -8307513
12121 -8307513 -8323639 -8282913 -8176017 -8011747 -7813565 -7609040 -7414960 -7224964 -7007965 -6720742
12111 -6720742 -6328538 -5821388 -5217608 -4556009 -3884879 -3253886 -2709117 -2288167 -2013566
12102 -2013566 -1886423 -1884606 -1968961 -2096645 -2235806 -2375048 -2524881 -2712534 -2972812 -3337292
12092 -3337292 -3824444 -4433515 -5143434 -5915453 -6697832 -7432396 -8063241 -8545624 -8851354
12083 -8851354 -8968900 -8900676 -8661767 -8281296 -7803006 -7280795 -6769170 -6313357 -5944116 -5678195
12073 -5678195 -5521324 -5470300 -5513391 -5630729 -5796922 -5986684 -6181993 -6377105 -6577541 -6791905
12063 -6791905 -7020035 -7244228 -7429246 -7532057 -7516957 -7369455 -7103692 -6761311 -6402553 -6092641
12053 -6092641 -5888205 -5828256 -5931132 -6195192 -6600390 -7110812 -7680545 -8263118 -8820442 -9325898
12043 -9325898 -9760381 -10105964 -10343775 -10458640 -10446390 -10316503 -10086441 -9771659 -9379651 -8912972
12033 -8912972 -8378235 -7793193 -7186277 -6588973 -6025739 -5506550 -5025288 -4564968 -4108224
12024 -4108224 -3648849 -3198639 -2785256 -2441065 -2187799 -2024256 -1922896 -1837110 -1716230 -1521693
12014 -1521693 -1236917 -866880 -430033 50137 548426 1037257 1487445 1873228 2178924
12005 2178924 2402384 2553176 2647174 2700862 2728023 2739627 2745174 2752604 2765835 2782336 2793907
11994 2793907 2790689 2765049 2712195 2627499 2503046 2326190 2081312 1754038 1335951 828023
11984 828023 241973 -400569 -1070604 -1734077 -2351510 -2875432 -3251059 -3425710 -3364991 -3066004
11974 -3066004 -2559073 -1898368 -1148690 -374783 364858 1020033 1547503 1908736 2070486
11965 2070486 2009971 1721842 1222090 546481 -254976 -1124759 -2004409 -2840982 -3592827 -4232964
11955 -4232964 -4748871 -5139340 -5409800 -5566463 -5609437 -5527565 -5300140 -4908147 -4350552 -3655717
11945 -3655717 -2879652 -2090553 -1347119 -681665 -96125 428516 916048 1380893 1821403
11936 1821403 2221157 2556004 2803585 2951631 3002150 2970780 2882739 2767332 2652714 2562398
11926 2562398 2513816 2517676 2576794 2685664 2833372 3010006 3213052 3450266 3738504 4099562
11916 4099562 4553163 5107234 5748512 6438953 7122012 7738212 8244466 8628936 8914125
11907 8914125 9145905 9372919 9625380 9902126 10170992 10382071 10487987 10461871 10304999 10041986
11897 10041986 9708054 9335598 8945217 8542613 8120171 7661633 7148696 6568345 5919055
11888 5919055 5213838 4479185 3750847 3068422 2470320 1989260 1647077 1447844 1371078 1369941
11878 1369941 1379156 1331878 1178598 899786 507981 40228 -455320 -933989 -1366167 -1743488
11868 -1743488 -2079061 -2401445 -2741802 -3116631 -3513617 -3889564 -4182794 -4332875 -4296926 -4056638
11858 -4056638 -3617866 -3008092 -2274486 -1480708 -699198 612 562933 949780 1138908
11849 1138908 1120678 897799 486320 -86151 -785451 -1574712 -2413182 -3251676 -4030961 -4687589
11839 -4687589 -5165059 -5423642 -5444079 -5226394 -4788108 -4163722 -3403222 -2566717 -1715522 -903081
11829 -903081 -169248 461137 977315 1381550 1687562 1915255 2080418 2184022 2209230 2129931
11819 2129931 1925990 1595824 1159896 655136 124844 -390243 -856101 -1245106 -1534630
11810 -1534630 -1706939 -1749205 -1651572 -1404793 -1001672 -443702 251201 1045578 1886035 2711791
11800 2711791 3465291 4102332 4598623 4949882 5165508 5260067 5248140 5144690 4967808 4738209
11790 4738209 4472809 4175560 3832356 3414705 2890929 2239173 1456338 560156 -415143
11781 -415143 -1427223 -2434867 -3405141 -4316931 -5161178 -5939112 -6659107 -7331800 -7963122
11772 -7963122 -8546686 -9058937 -9460632 -9705366 -9752252 -9577788 -9183066 -8594961 -7862140 -7047863
11762 -7047863 -6221766 -5452121 -4798912 -4307558 -4003828 -3890919 -3948923 -4136219 -4393486 -4652224
11752 -4652224 -4847641 -4931153 -4876163 -4675445 -4334604 -3867263 -3293474 -2639597 -1938472 -1230211
11742 -1230211 -562692 10944 439009 679868 709120 524519 149366 -367062 -955781 -1542108
11732 -1542108 -2062187 -2473571 -2755142 -2898532 -2897263 -2739645 -2409409 -1895157 -1204606 -374480
11722 -374480 532626 1444493 2298483 3051945 3680500 4170526 4513675 4705749 4747605 4646556
11712 4646556 4419201 4095459 3719866 3345727 3022822 2785523 2648594 2611956 2669030 2812070
11702 2812070 3032202 3317043 3650235 4014602 4396999 4791269 5197185 5616080 6045638
11693 6045638 6476124 6889290 7260516 7563981 7779111 7895086 7911051 7832835 7669748 7434150
11683 7434150 7142810 6816472 6475414 6132765 5789604 5434615 5048273 4610332 4109269
11674 4109269 3551124 2963364 2390299 1881170 1476267 1196517 1039407 982084 991076 1035093
11664 1035093 1094300 1160742 1230981 1297673 1346488 1359791 1323863 1235105 1101936 941582 773546
11653 773546 612813 465150 325320 178249 2894 -221923 -511285 -869388 -1287786 -1747517
11643 -1747517 -2224375 -2694654 -3138374 -3539536 -3885807 -4170126 -4394072 -4570496 -4723052
11634 -4723052 -4881611 -5073843 -5314869 -5599098 -5899082 -6173487 -6381356 -6496330 -6515029 -6457063
11624 -6457063 -6357176 -6251875 -6164449 -6094066 -6014620 -5884897 -5665069 -5330693 -4877887 -4320136
11614 -4320136 -3682453 -2998034 -2307553 -1656979 -1090435 -639456 -314015 -100273 33992
11605 33992 128858 220343 330850 465095 612350 752461 861846 918117 904700 815931 660031
11594 660031 456893 230972 3103 -214129 -414852 -593417 -738560 -835286 -876272 -875028
11584 -875028 -868639 -904842 -1021109 -1229708 -1516971 -1853481 -2205838 -2543584 -2841724 -3082630
11574 -3082630 -3258851 -3374555 -3442751 -3478615 -3492497 -3485912 -3450605 -3368480 -3211479 -2943992 -2531387
11563 -2531387 -1954104 -1220703 -371774 527675 1402173 2178817 2796436 3212148 3406130
11554 3406130 3382705 3166305 2794414 2311508 1765473 1204455 672081 202101 -184439 -478427
11544 -478427 -680848 -803223 -869657 -915597 -979194 -1087684 -1247094 -1442252 -1646514 -1834030
11534 -1834030 -1987263 -2097506 -2160767 -2173092 -2128554 -2021053 -1848367 -1615226 -1333491 -1020614
11524 -1020614 -698641 -393646 -133138 59948 174541 216371 208114 184011 179141 215500 290188
11513 290188 372138 410016 348180 144414 -216092 -714248 -1300248 -1905843 -2460653 -2904992
11503 -2904992 -3194648 -3299528 -3202037 -2898826 -2404069 -1749837 -981789 -152730 682439 1469674
11493 1469674 2158680 2707613 3088974 3294263 3334784 3236997 3033024 2749731 2401313 1988595
11483 1988595 1504252 940129 292630 -435875 -1239236 -2110899 -3045485 -4036995 -5074994
11474 -5074994 -6141733 -7211961 -8254365 -9232223 -10102725 -10817591 -11328634 -11598554 -11612023
11465 -11612023 -11380609 -10939467 -10339655 -9641085 -8907305 -8200379 -7575451 -7076723 -6735215
11456 -6735215 -6565918 -6562884 -6695267 -6909695 -7140841 -7326254 -7418577 -7390051 -7228653 -6930012
11446 -6930012 -6492025 -5917416 -5222837 -4446643 -3647402 -2892331 -2242682 -1743873 -1422176
11437 -1422176 -1284160 -1315770 -1482941 -1737936 -2031767 -2327572 -2609008 -2881662 -3169163 -3505363
11427 -3505363 -3922878 -4440285 -5053722 -5737920 -6455370 -7166258 -7832086 -8412489 -8861155
11418 -8861155 -9127813 -9168785 -8962313 -8521106 -7895346 -7164035 -6417972 -5740829 -5194540 -4812676
11408 -4812676 -4601893 -4548444 -4625774 -4800809 -5039121 -5309736 -5588876 -5860870 -6115669 -6344520
11398 -6344520 -6535730 -6671634 -6727976 -6677861 -6501065 -6194684 -5777287 -5281510 -4738905 -4167562
11388 -4167562 -3570624 -2944620 -2289878 -1616321 -943016 -293058 313971 868501 1371639
11379 1371639 1827787 2233307 2569319 2804039 2903584 2845754 2630785 2284317 1850521 1378119
11369 1378119 906526 459239 46201 -328960 -662580 -948971 -1182882 -1363632 -1497102
11360 -1497102 -1593405 -1661622 -1705223 -1720457 -1697535 -1623896 -1489857 -1295943 -1058123 -806351
11350 -806351 -575911 -396722 -287161 -255014 -302770 -431959 -642618 -927863 -1267973 -1630324
11340 -1630324 -1978242 -2284783 -2542450 -2762201 -2962840 -3157810 -3346187 -3510910 -3624345
11331 -3624345 -3659898 -3606013 -3475849 -3306030 -3143586 -3028280 -2981058 -3004716 -3093486 -3241994
11321 -3241994 -3446196 -3696941 -3973202 -4241197 -4459669 -4586937 -4586239 -4429759 -4103113 -3609111
11311 -3609111 -2966804 -2204201 -1349109 -424733 548642 1551268 2565458 3578308 4579258
11302 4579258 5551857 6467087 7285257 7965222 8473913 8791539 8913554 8851667 8633012 8294903
11292 8294903 7875475 7404601 6900256 6372041 5828797 5284521 4758167 4267350 3820320
11283 3820320 3411433 3022243 2626902 2199712 1723947 1200458 651848 117480 -360037
11274 -360037 -749187 -1036109 -1221669 -1314444 -1325290 -1264587 -1140458 -957739 -719335 -430479
11264 -430479 -103706 239142 570430 864991 1108655 1301506 1453942 1579236 1688351 1789357
11254 1789357 1888718 1990297 2090924 2175328 2214862 2172573 2013225 1713803 1270145 698382
11244 698382 32268 -682406 -1396220 -2066444 -2666117 -3187825 -3640566 -4041934 -4409573 -4754747
11234 -4754747 -5079277 -5376722 -5638368 -5861867 -6057081 -6244124 -6444032 -6668324 -6914349
11225 -6914349 -7168749 -7415886 -7645497 -7855034 -8045833 -8216389 -8357445 -8451560 -8476676 -8411523
11215 -8411523 -8240029 -7951665 -7536803 -6981354 -6267594 -5383112 -4331358 -3135882 -1837735
11206 -1837735 -491906 834089 2063113 3117571 3933790 4475357 4739468 4754496 4571043
11197 4571043 4250366 3853061 3428694 3006975 2593546 2174289 1727632 1237982 702621
11188 702621 130098 -466210 -1074951 -1691623 -2319721 -2966758 -3636390 -4321688 -5004969 -5664652
11178 -5664652 -6284013 -6855769 -7380885 -7864501 -8312229 -8727014 -9105440 -9434638 -9693175
11169 -9693175 -9857535 -9911071 -9850266 -9686097 -9442836 -9157491 -8879300 -8664946 -8566394 -8614563
11159 -8614563 -8807726 -9112208 -9474931 -9839702 -10158625 -10395810 -10526434 -10535575 -10419008 -10185653
11149 -10185653 -9860076 -9483195 -9109476 -8799403 -8607179 -8566022 -8676354 -8902990 -9184070
11140 -9184070 -9448232 -9632516 -9694629 -9617670 -9408424 -9090516 -8693571 -8241506 -7745342 -7204825
11130 -7204825 -6618046 -5993273 -5356373 -4750571 -4229553 -3847347 -3648763 -3662931 -3900056 -4349795
11120 -4349795 -4980215 -5738611 -6556062 -7355517 -8061097 -8607442 -8950146 -9077296 -9017469 -8836557
11110 -8836557 -8619720 -8443925 -8353600 -8350622 -8400931 -8451094 -8445875 -8342120 -8118618 -7781317 -7360834
11099 -7360834 -6900023 -6434992 -5978372 -5513741 -5004142 -4410294 -3710254 -2913082 -2062280
11090 -2062280 -1227794 -488501 88740 464588 630721 602394 407073 75741 -361517 -877108
11080 -877108 -1445603 -2041553 -2636619 -3198386 -3692582 -4088567 -4366315 -4521685 -4566229 -4520111
11070 -4520111 -4401691 -4220495 -3978022 -3675068 -3320305 -2935293 -2553805 -2215754 -1957785
11061 -1957785 -1803797 -1758573 -1806361 -1915059 -2046128 -2168750 -2273157 -2375648 -2511103 -2716940
11051 -2716940 -3018479 -3423658 -3927090 -4516992 -5178539 -5892279 -6631212 -7361454 -8048268
11042 -8048268 -8664553 -9196520 -9643497 -10013236 -10316337 -10562046 -10755173 -10893169 -10963631 -10944128
11032 -10944128 -10806967 -10529837 -10109108 -9568654 -8957846 -8338723 -7769047 -7289628 -6920263
11023 -6920263 -6663014 -6508294 -6439666 -6436542 -6476752 -6540198 -6611544 -6678941 -6729421 -6745608 -6707345
11012 -6707345 -6597116 -6405358 -6133292 -5793165 -5406245 -4998285 -4592795 -4203889 -3831561
11003 -3831561 -3462368 -3076834 -2661139 -2216960 -1763844 -1333474 -960441 -674803 -498367
10994 -498367 -443162 -509815 -685570 -944569 -1253688 -1583913 -1921895 -2274445 -2663032 -3111953
10984 -3111953 -3636381 -4233935 -4880711 -5532906 -6135704 -6637962 -7006440 -7232559 -7329865 -7326299
10974 -7326299 -7256554 -7156617 -7059593 -6991346 -6965452 -6978109 -7005511 -7007298 -6937528 -6759544 -6457661
10963 -6457661 -6040510 -5536120 -4982639 -4418963 -3878199 -3385187 -2957444 -2607368 -2343345
10954 -2343345 -2168848 -2080413 -2066457 -2108450 -2184380 -2273166 -2358785 -2433762 -2501062 -2571829 -2657453
10943 -2657453 -2759283 -2863479 -2946194 -2986522 -2978242 -2931633 -2863185 -2779347 -2665120 -2485843 -2202119
10932 -2202119 -1789898 -1255699 -640602 -11463 557646 1006538 1303435 1447421 1460520 1375481
10922 1375481 1224440 1031302 810286 571622 330686 112695 -52354 -141732 -150242 -91296
10912 -91296 11825 138683 280408 439867 624904 841225 1090614 1374361 1696298 2060556
10902 2060556 2464922 2895241 3324685 3716322 4025300 4200194 4186790 3936233 3415093 2613145
10892 2613145 1547357 263397 -1164785 -2639227 -4048438 -5283873 -6258884 -6925082
10884 -6925082 -7281721 -7375519 -7290089 -7126119 -6976326 -6902753 -6925051 -7024281 -7159365 -7287768
10874 -7287768 -7381703 -7435304 -7463068 -7492709 -7555442 -7675230 -7858288 -8085977 -8315197 -8487873
10864 -8487873 -8546564 -8450819 -8189649 -7787063 -7298602 -6798823 -6363489 -6053115 -5903624 -5925847
10854 -5925847 -6111449 -6440924 -6890109 -7434077 -8049089 -8713055 -9404071 -10097460 -10763990
10845 -10763990 -11372323 -11895767 -12319426 -12642822 -12876273 -13034192 -13130918 -13181777 -13206101 -13226268
10835 -13226268 -13261113 -13318776 -13395136 -13478573 -13556428 -13618841 -13659392 -13674124 -13659966 -13612560 -13523632
10824 -13523632 -13379501 -13163490 -12863782 -12483811 -12048265 -11599650 -11187287 -10855532 -10635941
10815 -10635941 -10542952 -10571076 -10694147 -10869231 -11046338 -11181784 -11250325 -11250885 -11203370 -11138879 -11088928
10804 -11088928 -11078154 -11121003 -11220241 -11365921 -11535347 -11694840 -11803009 -11814644 -11685341 -11378053
10794 -11378053 -10871772 -10169784 -9303144 -8326842 -7309856 -6322674 -5425633 -4660401 -4046211
10785 -4046211 -3581265 -3247745 -3018096 -2861337 -2749106 -2660655 -2585263 -2521381 -2473517 -2448423
10775 -2448423 -2451390 -2482501 -2532619 -2580254 -2592027 -2529251 -2359893 -2071322 -1678374 -1223629 -769621
10764 -769621 -384810 -127641 -35058 -119740 -374414 -777527 -1296733 -1891524 -2518162 -3137583
10754 -3137583 -3723740 -4268436 -4779167 -5268943 -5741240 -6177180 -6532477 -6747564 -6767292 -6560607
10744 -6560607 -6129995 -5506840 -4737512 -3868992 -2940047 -1979213 -1008489 -50824 862163
10735 862163 1686579 2369252 2856665 3107275 3103464 2857915 2410094 1813780 1122410 379387
10725 379387 -384598 -1149620 -1902690 -2633209 -3328953 -3974778 -4555526 -5061665 -5493678 -5861782
10715 -5861782 -6181103 -6465712 -6724782 -6961198 -7170736 -7340811 -7450101 -7471306 -7377881 -7152748
10705 -7152748 -6794790 -6319613 -5754964 -5135021 -4497221 -3881227 -3327124 -2871378 -2541897
10696 -2541897 -2354441 -2311934 -2406696 -2623628 -2941712 -3333889 -3768645 -4215213 -4648936 -5052030
10686 -5052030 -5410176 -5709912 -5939196 -6088594 -6150506 -6117649 -5983174 -5743011 -5399856 -4968258
10676 -4968258 -4478904 -3978720 -3525100 -3176010 -2978973 -2960965 -3121155 -3429042 -3829474 -4254128
10666 -4254128 -4637876 -4936477 -5138067 -5260728 -5336817 -5395155 -5452366 -5513803 -5575957 -5624844
10656 -5624844 -5633249 -5562764 -5371968 -5025794 -4499789 -3778227 -2852622 -1728410 -438483 949230
10646 949230 2342876 3655076 4832062 5865397 6780430 7610276 8371070 9051573 9620955
10637 9620955 10048279 10320962 10450734 10463696 10381302 10204921 9914033 9478436 8876196 8107856
10627 8107856 7202570 6216552 5224941 4307779 3532814 2941121 2541990 2319112 2243535 2285459
10617 2285459 2419472 2623778 2877647 3160337 3451772 3733601 3988923 4199859 4344767
10608 4344767 4399642 4346608 4185795 3941928 3659614 3388747 3166859 3006202 2891272 2788097
10598 2788097 2660691 2486572 2265215 2017547 1777318 1577179 1435543 1351116 1306741 1277801
10588 1277801 1239941 1174837 1074099 939662 779977 605339 426325 254877 103868 -17346
10578 -17346 -109841 -190353 -290931 -451877 -711073 -1094740 -1611616 -2248738 -2968188 -3708448
10568 -3708448 -4393656 -4948305 -5310925 -5442591 -5330683 -4990262 -4463949 -3818750 -3136954
10559 -3136954 -2500481 -1973260 -1589135 -1349677 -1230482 -1191786 -1189018 -1179156 -1121185 -975289
10549 -975289 -708341 -306315 215607 814737 1434547 2022787 2546533 2999709 3401429 3787019
10539 3787019 4196080 4660301 5191853 5776247 6376460 6949185 7463691 7912300 8310005
10530 8310005 8687167 9078630 9511950 9999866 10541381 11130167 11765238 12459075 13238566
10521 13238566 14135634 15172042 16350378 17658958 19085810 20631738 22317766 24185792
10513 24185792 26289965 28679764 31384507 34409951 37747915 41392399 45355847 49679028
10505 49679028 54427680 59677760 65503852 71983778 79217406 87349717 96592173 107237168
10497 107237168 119655641 134272757 151526339 171805973 195354376 222116220 251542019
10490 251542019 282374707 312487532 338930154 358379277 368013406 366472008 354350816
10483 354350816 333915717 308234390 280255380 252250285 225682376 201331606 179499253
10476 179499253 160198293 143290383 128561417 115757256 104609070 94857602 86269942
10469 86269942 78647024 71825712 65675068 60086430 54964950 50230159 45822329 41706518
10461 41706518 37872054 34328358 31094956 28185856 25596282 23299652 21253256 19406703
10453 19406703 17710967 16126912 14628809 13200864 11832872 10521195 9271986 8099729
10445 8099729 7021152 6050182 5196228 4463708 3852076 3357165 2972952 2692704 2511183
10436 2511183 2428543 2451437 2586936 2832497 3170097 3568169 3988249 4392126 4747475 5030976
10426 5030976 5229050 5338378 5368123 5342359 5299543 5287629 5355113 5538808 5851888 6279250
10416 6279250 6784826 7326905 7872222 8402872 8916344 9421231 9930545 10454488 10994533
10407 10994533 11539714 12065854 12539258 12925052 13196610 13340991 13358182 13255803 13042707
10398 13042707 12725088 12307384 11796490 11204004 10542822 9820551 9035600 8178760 7238587
10389 7238587 6207923 5090259 3905016 2690445 1503125 413454 -503257 -1179241
10381 -1179241 -1567835 -1655208 -1467354 -1068839 -550638 -9594 472240 840765 1073829 1178118
10371 1178118 1180263 1114433 1012605 903194 815472 780087 819854 935902 1100114 1260527
10361 1260527 1357377 1341443 1186328 891110 475424 -28599 -584725 -1160587 -1734560 -2299847
10351 -2299847 -2864247 -3445171 -4061028 -4721829 -5422424 -6140019 -6834878 -7453237 -7933744
10342 -7933744 -8218518 -8265925 -8059310 -7608199 -6943382 -6109895 -5161116 -4154726 -3148766
10333 -3148766 -2195112 -1330087 -566146 109985 730805 1335893 1958743 2616597 3306461
10324 3306461 4008861 4697441 5349134 5949748 6493343 6977963 7402338 7766891 8078182
10315 8078182 8351526 8606611 8856913 9100373 9319541 9492343 9605993 9664174 9683813 9686435
10305 9686435 9691845 9716947 9776524 9882348 10040363 10247601 10489613 10739208 10958422 11104918
10295 11104918 11140947 11041168 10797006 10417085 9923613 9345121 8707857 8029450 7317426 6572882
10285 6572882 5797511 5000425 4200892 3425514 2702063 2053394 1493325 1025233 644032
10276 644032 340393 103443 -80921 -233633 -382494 -556623 -778498 -1057411 -1385410 -1735849
10266 -1735849 -2066001 -2324729 -2463239 -2444667 -2249085 -1873487 -1329467 -642682 144162 967984
10256 967984 1747966 2397814 2844927 3048722 3009898 2766382 2378134 1908409 1409478 916221
10246 916221 446082 2609 -419001 -825546 -1219959 -1596831 -1939799 -2222482 -2414779 -2493361
10236 -2493361 -2451565 -2304087 -2085436 -1843397 -1628924 -1484730 -1436861 -1493437 -1650665 -1901732
10226 -1901732 -2243199 -2675744 -3199348 -3806130 -4475876 -5178103 -5879862 -6554331 -7185857
10217 -7185857 -7770980 -8317211 -8839475 -9352415 -9859357 -10343437 -10767096 -11080950 -11237267
10208 -11237267 -11202165 -10963404 -10533301 -9947213 -9258343 -8529482 -7821352 -7178137 -6614805
10199 -6614805 -6114083 -5637017 -5141706 -4599287 -3999995 -3349996 -2663848 -1957065 -1241832
10190 -1241832 -527443 175519 850937 1476527 2028204 2488157 2853068 3137514 3369235
10181 3369235 3578420 3788057 4010952 4252752 4515807 4800016 5100741 5406064 5695392
10172 5695392 5940351 6108115 6166539 6089918 5863601 5485535 4963786 4311841 3545704 2685655
10162 2685655 1761162 813822 -105932 -948150 -1674127 -2263410 -2714806 -3042670 -3270759
10153 -3270759 -3424591 -3522659 -3568751 -3549809 -3442274 -3224846 -2890945 -2454071 -1943985 -1397423
10143 -1397423 -849195 -326991 150502 573452 938380 1243224 1482365 1645088 1717732 1686724
10133 1686724 1541169 1277322 906602 463404 5286 -398781 -688974 -834867 -845455 -763388
10123 -763388 -646058 -543636 -485309 -478322 -515260 -580991 -654460 -707755 -708655 -630316 -465157
10112 -465157 -235091 8989 199549 270853 174785 -112433 -593309 -1257219 -2087192 -3061479
10102 -3061479 -4150398 -5312131 -6491540 -7624201 -8644802 -9496686 -10139561 -10554751 -10748973
10093 -10748973 -10755890 -10632010 -10444198 -10251062 -10085921 -9950005 -9820142 -9667671 -9479136 -9268282
10083 -9268282 -9074319 -8949600 -8944139 -9092563 -9405024 -9862542 -10418988 -11011459 -11576135 -12062189
10073 -12062189 -12437144 -12683150 -12789618 -12748794 -12557410 -12222439 -11765393 -11219909 -10622253
10064 -10622253 -10000739 -9371686 -8743907 -8126232 -7531115 -6972397 -6459833 -5992630 -5553104
10055 -5553104 -5103869 -4594130 -3976485 -3226909 -2356600 -1409945 -452193 445263 1216604
10046 1216604 1809332 2189095 2341755 2271843 1997331 1542864 935107 202240 -623776 -1505571
10036 -1505571 -2401274 -3267245 -4061167 -4745280 -5290544 -5681647 -5921194 -6030591 -6045874 -6008937
10026 -6008937 -5957546 -5918847 -5909080 -5937601 -6010252 -6128655 -6286753 -6469121 -6654240 -6821962
10016 -6821962 -6961788 -7078858 -7196326 -7353751 -7601098 -7988242 -8551292 -9298953 -10203621
10007 -10203621 -11201413 -12202695 -13110459 -13840711 -14338615 -14586279 -14600783 -14423515 -14104406
9998 -14104406 -13686898 -13199560 -12656990 -12067754 -11443795 -10805654 -10180303 -9592324 -9053396
9989 -9053396 -8556731 -8080170 -7595538 -7077996 -6510999 -5887191 -5208074 -4484228 -3735846 -2992766
9979 -2992766 -2293205 -1680293 -1195988 -873744 -732981 -778024 -1001376 -1387897 -1915794 -2554021
9969 -2554021 -3260755 -3988362 -4694469 -5352236 -5953175 -6502767 -7014457 -7506288 -7999755 -8518121
9959 -8518121 -9082311 -9704230 -10379125 -11080664 -11763125 -12372481 -12863471 -13215968 -13443496 -13590131
9949 -13590131 -13717668 -13889619 -14158351 -14557771 -15101037 -15782611 -16583591 -17477303 -18432275
9940 -18432275 -19413532 -20385593 -21317504 -22186123 -22974815 -23669402 -24254767 -24713078 -25022984
9931 -25022984 -25160318 -25102166 -24835150 -24366258 -23731941 -23000204 -22263334 -21624249 -21181867 -21017777
9921 -21017777 -21183923 -21693584 -22521346 -23614503 -24911101 -26356610 -27913288 -29559437 -31279169
9912 -31279169 -33048611 -34827220 -36558153 -38173259 -39594887 -40728555 -41443953 -41547948
9904 -41547948 -40762733 -38725868 -35023364 -29264222 -21207273 -10929564 1036147 13712369
9896 13712369 25897825 36514040 44889967 50845474 54584235 56510751 57073458 56667149
9888 56667149 55587194 54025422 52097480 49882954 47458413 44913850 42352506 39877798
9880 39877798 37574095 35490249 33631842 31962973 30416964 28915278 27390188 25802788
9872 25802788 24149986 22460694 20785533 19184817 17718601 16440020 15389253 14585416
9864 14585416 14019611 13656663 13447867 13347347 13321412 13346433 13398931 13446111 13444829 13351960 13140631
9853 13140631 12811396 12391037 11920947 11442913 10989076 10578566 10219704 9914122 9659070
9844 9659070 9447539 9269474 9116111 8984636 8878402 8802278 8758300 8746928 8773814 8856047
9834 8856047 9021094 9296621 9695893 10206348 10786978 11376390 11909712 12338752 12646762 12850752
9824 12850752 12990934 13113167 13251277 13414170 13581731 13712016 13756843 13676955 13448895 13063982
9814 13063982 12526118 11852957 11078117 10249421 9422101 8650997 7985900 7469253 7131881
9805 7131881 6984804 7011520 7168022 7393607 7628129 7827327 7969461 8051576 8079176 8056257
9795 8056257 7981067 7847311 7646087 7365210 6987569 6492593 5862391 5090207 4187490 3186914
9785 3186914 2140256 1111288 165258 -642117 -1272788 -1709515 -1954499 -2026158 -1956377 -1788066
9775 -1788066 -1570790 -1352941 -1171767 -1045403 -971550 -934510 -916796 -907741 -903809 -902231 -894195
9764 -894195 -862069 -780279 -617381 -338123 93603 708774 1522530 2520621 3650172 4823037
9754 4823037 5933272 6881202 7593941 8036912 8215706 8168799 7952338 7621629 7216790 6758162
9744 6758162 6251791 5701005 5118779 4536221 4003934 3585128 3342006 3319533 3532336 3959891
9734 3959891 4551842 5241010 5959265 6651473 7283703 7843207 8330499 8748045 9092090 9351620
9724 9351620 9513180 9567027 9511230 9353440 9111674 8814243 8497412 8200195 7958190 7799541
9714 7799541 7743930 7802678 7977693 8259425 8626181 9046999 9488162 9920886 10326280 10694739
9704 10694739 11020618 11296493 11511197 11651971 11707605 11670007 11534937 11304423 10991256 10622250
9694 10622250 10236070 9874560 9571072 9341338 9180837 9068876 8976119 8871215 8724243 8508416
9684 8508416 8202903 7796925 7292127 6700989 6042788 5340151 4617042 3897037 3201452 2547626
9674 2547626 1946833 1401667 905637 448530 26288 -351818 -665169 -891936 -1020148 -1052740
9664 -1052740 -1005049 -898580 -756443 -602685 -462597 -359722 -309900 -317875 -380601 -494673
9654 -494673 -661384 -885458 -1168606 -1501639 -1859166 -2200130 -2475189 -2638329 -2657960 -2524129
9644 -2524129 -2251040 -1875062 -1448062 -1026513 -658902 -375705 -185694 -79173 -34720 -24769
9634 -24769 -18290 17456 113828 296852 584233 983478 1489780 2083509 2729262 3379065 3981117
9623 3981117 4492584 4891154 5178379 5371831 5491190 5547615 5541965 5469930 5328328 5118123
9613 5118123 4843183 4506797 4109960 3654555 3150235 2619461 2095822 1615914 1209407 891877
9603 891877 662325 505085 394631 301047 194042 45314 -168772 -462202 -833238 -1261859
9593 -1261859 -1714862 -2157540 -2565053 -2925842 -3235171 -3484286 -3653857 -3716937 -3649725 -3442954
9583 -3442954 -3106525 -2664928 -2147130 -1577397 -971531 -338882 312429 970367 1616501 2227074
9573 2227074 2776530 3241035 3600191 3837208 3939379 3900115 3721464 3414599 2997158 2489294
9563 2489294 1911663 1286412 639362 736 -596709 -1122075 -1552622 -1880061 -2113203 -2273972
9553 -2273972 -2387457 -2470674 -2525306 -2537061 -2480980 -2330287 -2066192 -1686030 -1206645 -660005
9543 -660005 -81056 506848 1100568 1714506 2368359 3072031 3814849 4563961 5273363 5899583
9533 5899583 6414668 6807573 7073504 7200359 7163375 6932316 6486744 5830601 4998423 4050156
9523 4050156 3057221 2086674 1190320 401665 -261749 -795303 -1206226 -1512919 -1741209 -1916636
9513 -1916636 -2056050 -2162906 -2227659 -2231768 -2154032 -1979378 -1709377 -1370771 -1016844 -718744
9503 -718744 -548784 -562004 -783160 -1203132 -1783756 -2466829 -3183096 -3859051 -4421647 -4802945
9493 -4802945 -4947641 -4824318 -4436447 -3825692 -3062375 -2225184 -1379189 -562845 210363 938775
9483 938775 1618054 2235210 2773633 3223568 3589945 3893143 4163278 4431415 4721446 5045338
9473 5045338 5402931 5786148 6186538 6603520 7048909 7543672 8107361 8746367 9448567 10187415
9463 10187415 10931876 11655551 12340408 12974960 13549959 14055194 14479875 14817451 15073106
9454 15073106 15269005 15441424 15628453 15854430 16120550 16406389 16679687 16908579 17072039
9445 17072039 17166011 17202824 17202916 17181483 17135890 17039816 16847897 16510890 15996263 15304691 14473706
9434 14473706 13566823 12654864 11799314 11043900 10414585 9923926 9574916 9361514 9266402 9259079
9424 9259079 9297286 9332220 9315600 9206370 8976195 8613410 8124445 7531813 6869880 6181572
9414 6181572 5517371 4933832 4487537 4224311 4168397 4316929 4641290 5093299 5613139 6137092
9404 6137092 6604874 6967328 7193791 7275762 7223391 7056014 6793254 6452696 6053899 5623338
9394 5623338 5195085 4805718 4485433 4249271 4092939 3995718 3929141 3867570 3797277 3721814
9384 3721814 3661596 3646352 3702222 3838675 4040753 4269785 4472952 4599230 4615789 4517274
9374 4517274 4323943 4071503 3799266 3540908 3317810 3133927 2973260 2802195 2577532 2259282
9364 2259282 1826093 1289562 701127 145559 -279202 -487983 -429225 -94039 486786 1255022
9354 1255022 2142914 3091277 4060230 5027889 5980016 6899113 7759591 8529320 9174013 9661719
9344 9661719 9966686 10072681 9975715 9686072 9229036 8643049 7974541 7271024 6575928 5927614
9334 5927614 5361118 4908059 4591551 4418080 4372721 4423037 4531284 4669273 4829193 5026140
9324 5026140 5291153 5656716 6140083 6732049 7396749 8081886 8732872 9303267 9757979 10071174
9314 10071174 10223792 10204408 10013845 9670760 9214424 8701901 8198910 7765985 7443617 7241084
9304 7241084 7133311 7068258 6983972 6830107 6585403 6263241 5902888 5551304 5244534 4996847
9294 4996847 4801115 4638567 4492045 4355960 4238805 4158451 4133948 4178440 4296545 4486695
9284 4486695 4745662 5070472 5454770 5881196 6315000 6703604 6983474 7092376 6983214 6635169
9274 6635169 6059103 5297004 4417647 3510014 2673716 2005250 1581694 1446041 1598396 1995352
9264 1995352 2558228 3189026 3790288 4283332 4620487 4789925 4813209 4736111 4614882 4502494
9254 4502494 4438790 4444549 4517243 4628971 4730600 4764372 4681163 4454815 4088185 3610254 3066891
9243 3066891 2509192 1984050 1530361 1180450 962392 898825 1001535 1265002 1663281 2152901
9233 2152901 2681269 3196860 3656255 4025175 4274704 4377226 4306976 4047306 3601919 3002924
9223 3002924 2308394 1588558 908209 315491 -159209 -499459 -701322 -775611 -748919 -658740
9213 -658740 -543510 -433001 -343804 -280308 -237768 -204002 -159469 -78160 68930 309128 664635
9202 664635 1150206 1769330 2507877 3328630 4171958 4965188 5638671 6143587 6465175 6625302
9192 6625302 6671537 6656696 6618855 6571548 6507073 6408036 6259211 6054098 5795303 5491608 5155926
9181 5155926 4806721 4472061 4192218 4015813 3987532 4131008 4435167 4852173 5309811 5734049
9171 5734049 6073117 6313625 6481555 6626495 6795483 7009262 7252699 7482172 7642807 7685037
9161 7685037 7573954 7291405 6834675 6215600 5460997 4611764 3717097 2824156 1968968 1175527
9151 1175527 463861 -140459 -605261 -902592 -1025052 -996566 -870340 -715414 -599798 -577926
9141 -577926 -684720 -933685 -1316636 -1806255 -2363540 -2948096 -3525261 -4066511 -4547037 -4947993
9131 -4947993 -5265316 -5517946 -5745922 -5996148 -6303779 -6680496 -7115408 -7585141 -8064340 -8530098
9121 -8530098 -8960806 -9335167 -9636042 -9857909 -10012177 -10125217 -10228761 -10346659 -10483514 -10619076
9111 -10619076 -10709622 -10695315 -10511481 -10101450 -9428408 -8483775 -7290461 -5900556 -4387997
9102 -4387997 -2837745 -1334598 44624 1234222 2181109 2849018 3225394 3325486 3188070
9093 3188070 2863467 2400396 1838380 1207657 533737 -158139 -841951 -1493241 -2091450 -2618539
9083 -2618539 -3053711 -3368714 -3528753 -3499881 -3258592 -2798267 -2129979 -1278874 -278842 832462
9073 832462 2017398 3240672 4470139 5676536 6833726 7921308 8929285 9861065 10730102
9064 10730102 11549471 12319464 13020527 13615338 14058345 14308120 14338429 14145456 13749893 13193741
9054 13193741 12533215 11830141 11144121 10526664 10017410 9641577 9407463 9303578 9297234 9338008
9044 9338008 9367988 9335811 9207853 8971700 8633364 8213582 7746041 7275358 6851938 6524749
9034 6524749 6335467 6315196 6482167 6839822 7377457 8075144 8910612 9863185 10911742 12028538
9024 12028538 13174476 14301246 15361182 16319408 17160301 17884378 18499215 19011653 19425538
9015 19425538 19743210 19966075 20091665 20109377 19999945 19741945 19322957 18748853 18045842 17254995
9005 17254995 16422774 15591204 14790277 14034510 13324481 12651866 12005185 11374530 10754905
8996 10754905 10147826 9560384 9002195 8482012 8005494 7574539 7188511 6847710 6557433
8987 6557433 6328810 6174025 6098312 6094081 6140498 6207636 6262496 6275321 6225757 6107963 5933069
8976 5933069 5727691 5528616 5375050 5300808 5328787 5468596 5716063 6052525 6444208 6845273
8966 6845273 7207541 7494278 7689672 7796859 7825608 7778510 7644739 7404324 7039532 6547257
8956 6547257 5946537 5277162 4589277 3929013 3327895 2801095 2353069 1984411 1694412 1478957
8946 1478957 1328114 1228107 1168375 1149844 1189112 1315449 1561102 1948084 2476152 3116889
8936 3116889 3817238 4511970 5140074 5657880 6043916 6295672 6422894 6442351 6375802 6249298
8926 6249298 6091065 5926830 5773834 5636698 5508908 5381493 5255117 5147316 5088836 5111425
8916 5111425 5236265 5469891 5806328 6229664 6714467 7226488 7726369 8175850 8544182 8812931
8906 8812931 8977528 9043921 9021289 8916136 8733276 8483616 8192058 7898156 7647217 7475516
8896 7475516 7396599 7395152 7431025 7450377 7397584 7223221 6888124 6366752 5652774 4766850 3762531
8885 3762531 2723651 1749169 929415 324677 -44654 -195907 -176035 -52528 96286 192584
8875 192584 170962 -11923 -372651 -902715 -1576397 -2362063 -3232069 -4167086 -5153878 -6179172
8865 -6179172 -7223760 -8259665 -9250281 -10151620 -10914269 -11488301 -11832777 -11926821 -11775528
8856 -11775528 -11406435 -10859029 -10174410 -9390682 -8544121 -7671413 -6807897 -5981043 -5203800
8847 -5203800 -4473940 -3781383 -3119279 -2491937 -1915167 -1409406 -989471 -655394 -387530 -147628
8837 -147628 113207 440579 861669 1376863 1963388 2588125 3220370 3837288 4422109 4959831
8827 4959831 5433996 5824859 6108390 6256888 6242751 6045192 5656741 5085489 4352483 3488417
8817 3488417 2533528 1538605 560822 -347530 -1150890 -1834189 -2396529 -2840291 -3162681 -3353667
8807 -3353667 -3400987 -3300100 -3064031 -2727137 -2339971 -1957381 -1624633 -1365584 -1175405 -1019636
8797 -1019636 -841319 -576433 -174024 386851 1091608 1898221 2753284 3607535 4425705 5189630
8787 5189630 5894864 6542193 7128688 7644405 8076677 8417439 8667259 8834189 8930389 8970164
8777 8970164 8970233 8950208 8930669 8928302 8950462 8992586 9039807 9071546 9067633 9015353 8915802 8785772
8765 8785772 8652307 8542135 8472402 8447967 8465460 8520265 8612321 8748371 8940016 9198413
8755 9198413 9527977 9922353 10364781 10832307 11300985 11749600 12161453 12524849 12831870 13074345
8745 13074345 13237972 13298627 13224827 12986096 12562641 11951679 11169293 10249585 9242153 8206537
8735 8206537 7202358 6277264 5458144 4750199 4143415 3621445 3167679 2767014 2405655
8726 2405655 2072300 1761773 1478675 1236788 1052483 935926 886824 897574 959272 1063524
8716 1063524 1198653 1345860 1481129 1582451 1637303 1646422 1623323 1590060 1569482 1575991 1609366
8705 1609366 1655302 1691494 1694638 1644976 1528520 1338322 1075003 746380 367211 -39768
8695 -39768 -442716 -802624 -1079854 -1242250 -1269540 -1151704 -884825 -470198 81532 745455
8685 745455 1482225 2243646 2980223 3646903 4206351 4631027 4904513 5021514 4986167 4809060
8675 4809060 4503913 4085273 3568076 2968175 2301698 1582636 820873 23045 -804313 -1652001
8665 -1652001 -2507056 -3352514 -4167465 -4928703 -5615119 -6213631 -6723594 -7157190 -7535562 -7882607
8655 -7882607 -8219142 -8559198 -8908365 -9263025 -9609951 -9926956 -10185826 -10357935 -10421510 -10367999
8645 -10367999 -10204789 -9952962 -9641263 -9298904 -8949772 -8610020 -8289791 -7997468 -7742599
8636 -7742599 -7534863 -7380720 -7282272 -7240566 -7260690 -7353861 -7533825 -7808837 -8173471 -8604933
8626 -8604933 -9066061 -9512898 -9902438 -10197663 -10370092 -10401201 -10283382 -10020716 -9629648 -9138392
8616 -9138392 -8582810 -7998359 -7411135 -6831828 -6253704 -5653550 -4995877 -4242618 -3368934 -2380442
8606 -2380442 -1322875 -276228 666977 1430155 1974493 2305843 2467924 2528493 2563206 2638286
8596 2638286 2793618 3031318 3315219 3582335 3761564 3792069 3635435 3279922 2738987 2046921
8586 2046921 1252695 412003 -421416 -1202837 -1900929 -2500516 -3004364 -3431846 -3811509 -4168324
8576 -4168324 -4511508 -4829950 -5098197 -5290172 -5394111 -5421863 -5408101 -5399514 -5438717 -5549363
8566 -5549363 -5727032 -5937719 -6124958 -6225781 -6191538 -6004541 -5682403 -5270146 -4827564 -4418397
8556 -4418397 -4101995 -3925498 -3916981 -4081500 -4400030 -4830163 -5309700 -5765924 -6130093 -6351458
8546 -6351458 -6404075 -6284394 -6003498 -5580111 -5037704 -4404023 -3708836 -2978468 -2230801 -1475452
8536 -1475452 -719059 29430 757887 1454058 2108898 2717621 3278471 3790465 4251235 4655283
8526 4655283 4992346 5245909 5393571 5411666 5283876 5009338 4604516 4096808 3513285 2870962
8516 2870962 2174171 1420687 613281 -230099 -1073483 -1868620 -2565811 -3124985 -3523911 -3762091
8506 -3762091 -3859377 -3848964 -3766941 -3643391 -3499695 -3352009 -3215838 -3106566 -3036058 -3009946
8496 -3009946 -3028884 -3092042 -3199168 -3350309 -3545333 -3784637 -4069714 -4401953 -4780269 -5199614
8486 -5199614 -5651439 -6125558 -6612488 -7105451 -7600590 -8093701 -8574072 -9019924 -9400977 -9689072
8476 -9689072 -9870811 -9953764 -9962338 -9926872 -9872808 -9814570 -9754351 -9683845 -9587543 -9447248 -9246966
8465 -9246966 -8976052 -8629022 -8203483 -7700061 -7126118 -6499505 -5846293 -5191458 -4549107 -3920564
8455 -3920564 -3301906 -2694450 -2109605 -1564535 -1072358 -634430 -240545 123276 465409 784069
8445 784069 1068953 1305304 1476388 1564240 1551325 1424658 1180637 827259 381782 -135071
8435 -135071 -705472 -1318895 -1973752 -2676025 -3434252 -4250564 -5109915 -5972994 -6778835 -7459084
8425 -7459084 -7958655 -8252002 -8345743 -8267132 -8047473 -7711578 -7277191 -6759750 -6176085 -5545171
8415 -5545171 -4887879 -4226568 -3582653 -2970816 -2392149 -1831225 -1260493 -650554 19706 759136
8405 759136 1567589 2441508 3375496 4358120 5366203 6363620 7307280 8158071 8891190 9500009
8395 9500009 9991212 10375134 10659674 10853300 10973781 11053031 11131902 11248279 11427039 11676506
8385 11676506 11989089 12341923 12697107 13004555 13209538 13263645 13135674 12819193 12335102 11728889
8375 11728889 11062888 10403910 9807767 9305051 8894638 8549332 8231882 7913989 7589749
8366 7589749 7278024 7012943 6826887 6734809 6728842 6786327 6885899 7021797 7208679 7474595
8356 7474595 7845345 8327628 8899705 9514468 10112431 10636946 11045030 11311666 11428403 11397875
8346 11397875 11226795 10921038 10485334 9926963 9261066 8515474 7733195 6969809 6283881
8337 6283881 5722740 5310519 5045013 4904407 4859046 4881712 4952548 5058884 5192740 5348762
8327 5348762 5523724 5717222 5932514 6176935 6462266 6805921 7232287 7770747 8446559 9265998
8317 9265998 10204624 11208701 12211059 13151230 13986806 14691414 15246187 15635699 15853809
8308 15853809 15915023 15861168 15755493 15665044 15640126 15700503 15832158 15992266 16118760 16142723
8298 16142723 16002357 15655705 15088809 14317876 13385993 12355015 11293192 10261029 9300285
8289 9300285 8430460 7653319 6962315 6353104 5832145 5420673 5151619 5059671 5168599 5481466
8279 5481466 5976960 6611567 7326230 8056438 8743848 9345784 9839244 10219153 10493677 10679473
8269 10679473 10797528 10868488 10906698 10914049 10876349 10764880 10543595 10179560 9653232 8966105
8259 8966105 8144668 7239750 6320341 5462181 4733556 4182235 3827445 3659495 3647421 3751933
8249 3751933 3937948 4180799 4463907 4771587 5084015 5378766 5637050 5848960 6014691 6144069
8239 6144069 6257662 6388234 6577664 6867087 7284165 7833864 8496119 9229957 9982479 10701148
8229 10701148 11346160 11897827 12355208 12726993 13019972 13230643 13342590 13329302 13160938 12813463
8219 12813463 12278004 11567436 10717467 9781156 8818447 7884308 7019397 6245741 5567854
8210 5567854 4978543 4468473 4037256 3701370 3493629 3453113 3610451 3975279 4529578 5227338
8200 5227338 6000858 6774026 7479552 8073177 8538717 8883272 9127053 9293470 9403257 9473448
8190 9473448 9518981 9553409 9586990 9623357 9656788 9670710 9637722 9522670 9290368 8916758 8399316
8179 8399316 7761935 7051365 6325394 5636844 5020491 4488899 4037807 3656512 3337487 3081540
8169 3081540 2897074 2793905 2774359 2826317 2922637 3028803 3116268 3174734 3215510 3263074 3340317
8158 3340317 3457199 3608564 3779695 3954801 4124632 4290583 4463084 4654568 4871329 5109637
8148 5109637 5357849 5602142 5832385 6045681 6246246 6441759 6638462 6838379 7040194 7242254
8138 7242254 7444802 7649497 7856110 8058006 8238752 8371979 8425217 8366831 8174255 7841033
8128 7841033 7379897 6819803 6197530 5547850 4897676 4266867 3673094 3134926 2669591 2287530
8118 2287530 1988662 1762465 1590428 1449864 1320639 1194754 1083392 1014618 1021377 1127351
8108 1127351 1338892 1644841 2020208 2429987 2833178 3188765 3463322 3636866 3703590 3667643
8098 3667643 3537628 3323458 3036169 2688882 2297500 1881014 1461327 1061728 703270 399263
8088 399263 149420 -63298 -269558 -503248 -788255 -1130025 -1516085 -1922752 -2322321 -2688326
8078 -2688326 -3000207 -3247559 -3430855 -3556301 -3627631 -3641093 -3586999 -3455152 -3238657 -2933297
8068 -2933297 -2534197 -2033637 -1423098 -700141 122480 1010962 1913247 2771332 3537367 4184681
8058 4184681 4707586 5110397 5392674 5540371 5529141 5337245 4958288 4404954 3703421 2885064
8048 2885064 1981304 1022146 36254 -948358 -1902661 -2794565 -3588797 -4251186 -4757842 -5105546
8038 -5105546 -5315787 -5426238 -5471639 -5465051 -5391151 -5215127 -4901531 -4434054 -3828642 -3135311
8028 -3135311 -2427929 -1786139 -1276849 -941540 -791693 -811675 -967244 -1216288 -1516788 -1828193
8018 -1828193 -2107443 -2306113 -2374785 -2274517 -1988656 -1527919 -927602 -241352 464516 1116657
8008 1116657 1642630 1980811 2089222 1951470 1580688 1021725 348252 -349281 -983788 -1491406
7998 -1491406 -1840806 -2027861 -2061552 -1952270 -1710094 -1351906 -909852 -434151 11954 363093
7988 363093 564952 586131 424962 108390 -317377 -800793 -1297357 -1775831 -2218069 -2615792
7978 -2615792 -2967210 -3273261 -3531889 -3731287 -3846658 -3845029 -3697642 -3393208 -2943850 -2380913
7968 -2380913 -1745385 -1080081 -426092 179323 706051 1133743 1450368 1647078 1713579 1637292
7958 1637292 1405914 1011681 456873 -239870 -1039302 -1883896 -2708594 -3456159 -4089669 -4596775
7948 -4596775 -4986190 -5280723 -5509875 -5702180 -5877877 -6045075 -6201717 -6340938 -6455138 -6537567
7938 -6537567 -6583989 -6594874 -6574278 -6523240 -6432871 -6285446 -6065296 -5771537 -5422165 -5046196
7928 -5046196 -4669833 -4306114 -3953047 -3598218 -3224434 -2813573 -2350066 -1826316 -1249370 -645710
7918 -645710 -61506 442414 800431 955021 868765 530752 -44322 -821469 -1751088 -2774166
7908 -2774166 -3829080 -4860762 -5829260 -6713953 -7512660 -8237497 -8908444 -9544469 -10154100
7899 -10154100 -10730523 -11254736 -11704264 -12061428 -12317839 -12475905 -12547719 -12549253 -12489925 -12363426
7889 -12363426 -12147689 -11815919 -11352485 -10764599 -10084180 -9359898 -8643822 -7979103 -7393838
7880 -7393838 -6902142 -6509318 -6216791 -6024076 -5927383 -5916086 -5969407 -6055962 -6137625 -6176508 -6141557
7869 -6141557 -6011342 -5772534 -5417211 -4942947 -4356473 -3677267 -2936616 -2171107 -1413757 -687417
7859 -687417 -3398 634729 1225190 1764153 2246115 2666258 3020431 3301765 3498429 3597917
7849 3597917 3597321 3511722 3372213 3212725 3054515 2899696 2737927 2560213 2370180 2187711
7839 2187711 2045958 1983987 2035997 2219020 2524195 2916984 3347141 3764022 4131124 4434802
7829 4434802 4683730 4898112 5092422 5260555 5372746 5387571 5273060 5025380 4675153 4279214
7819 4279214 3903677 3607454 3432362 3400272 3514356 3762080 4119922 4560242 5058749 5598845
7809 5598845 6169527 6757162 7335950 7863686 8286653 8551672 8619063 8470482 8109484 7556242
7799 7556242 6839641 5990212 5036888 4008267 2935178 1849632 778416 -264403 -1278967
7790 -1278967 -2271728 -3242252 -4173559 -5032785 -5781227 -6385677 -6822675 -7074560 -7123956 -6954092
7780 -6954092 -6555949 -5936827 -5124631 -4166432 -3123616 -2065955 -1064740 -183766 531866
7771 531866 1065841 1433975 1676940 1844176 1976318 2094210 2198117 2274742 2306198 2276070
7761 2276070 2171408 1982765 1705026 1340475 904120 429464 -29654 -406437 -638355 -686613
7751 -686613 -546393 -242180 187164 703475 1277192 1886854 2513245 3132756 3714410 4222867
7741 4222867 4626380 4906271 5064617 5127665 5142468 5164988 5241620 5391398 5597851 5815077
7731 5815077 5984631 6054331 5990262 5778514 5419864 4924529 4312483 3618365 2894253 2204311
7721 2204311 1612094 1167036 895976 800981 862568 1047924 1322560 1660285 2045909 2470309
7711 2470309 2923214 3389133 3847605 4276170 4654644 4969181 5213666 5386885 5487663 5512684
7701 5512684 5459728 5334180 5153686 4947274 4749680 4594825 4511623 4521534 4635043 4846043
7691 4846043 5126744 5427226 5682196 5824428 5800995 5585912 5183955 4626141 3962603 3257528
7681 3257528 2584842 2020641 1632347 1469472 1560128 1912599 2518415 3354348 4383139 5554254
7671 5554254 6806497 8073467 9290720 10401946 11362640 12142127 12724947 13110639 13310399
7662 13310399 13341807 13225451 12985615 12652297 12259170 11835603 11397440 10943949 10464091 9947926
7652 9947926 9395501 8818287 8233497 7655330 7088202 6525871 5957299 5375758 4785157 4199638
7642 4199638 3637506 3114120 2637718 2208971 1823174 1474293 1160667 890614 683998 566379
7632 566379 557451 660580 860074 1127082 1429333 1739290 2038227 2316288 2569257 2793360
7622 2793360 2980925 3120175 3199736 3213986 3163372 3047386 2854954 2561017 2134297 1552653
7612 1552653 816763 -45233 -983279 -1937394 -2850982 -3681550 -4407047 -5027957 -5565421 -6054167
7602 -6054167 -6529060 -7007700 -7476299 -7887005 -8170127 -8256990 -8103290 -7702515 -7085256 -6309071
7592 -6309071 -5447550 -4582547 -3796069 -3157363 -2707817 -2452445 -2364231 -2398771 -2510307 -2661462
7582 -2661462 -2825189 -2982477 -3119994 -3228942 -3303882 -3340746 -3335585 -3286103 -3195484 -3075023 -2942178
7571 -2942178 -2814028 -2699914 -2598142 -2498962 -2391457 -2269394 -2132988 -1987573 -1841648 -1704498
7561 -1704498 -1581965 -1471122 -1357578 -1218076 -1026810 -761866 -410287 27669 535681 1082667
7551 1082667 1629666 2139370 2582811 2939805 3194726 3332392 3338002 3201358 2922442 2515318
7541 2515318 2009440 1448852 889104 391112 12814 -198396 -210041 -6475 409479 1015094
7531 1015094 1768605 2613184 3482107 4304117 5011548 5553570 5910618 6100439 6169557 6174459
7521 6174459 6163790 6169509 6205943 6270907 6346146 6399539 6392202 6289492 6071315 5737702 5308482
7510 5308482 4817971 4306361 3810455 3357135 2961323 2626665 2345644 2098282 1851961 1564900
7500 1564900 1193063 698580 58317 -728734 -1638244 -2624891 -3634321 -4617930 -5543921
7491 -5543921 -6401010 -7195662 -7946299 -8676860 -9409532 -10155817 -10907755 -11634348 -12287080 -12812532
7481 -12812532 -13165031 -13313269 -13240297 -12940634 -12418435 -11688452 -10779357 -9736851 -8622994
7472 -8622994 -7509906 -6469752 -5564911 -4840017 -4314708 -3976536 -3777639 -3641013 -3478783
7463 -3478783 -3217462 -2819494 -2291218 -1674734 -1029636 -413859 130358 584312 955103 1271914
7453 1271914 1576233 1908706 2297374 2750675 3255463 3778727 4272596 4683750 4967570 5103821
7443 5103821 5106166 5017530 4889808 4756628 4613699 4417554 4103169 3611151 2911654 2015441
7433 2015441 970031 -153802 -1277189 -2324719 -3232139 -3952445 -4461607 -4762607 -4884958
7424 -4884958 -4877721 -4797289 -4694870 -4609079 -4564581 -4572633 -4628996 -4709887 -4771415 -4757300 -4614261
7413 -4614261 -4308858 -3837836 -3227386 -2523099 -1777173 -1038906 -349763 258937 767014 1164932
7403 1164932 1452757 1641346 1756385 1840960 1950542 2139017 2441498 2862712 3376503 3935941
7393 3935941 4488671 4990669 5413244 5742305 5973491 6108829 6158290 6144361 6103953 6083331
7383 6083331 6126965 6265516 6508010 6840059 7227249 7622094 7972986 8233225 8368374 8361273
7373 8361273 8214869 7952390 7613229 7243859 6886478 6570656 6311757 6115059 5980748 5905507
7363 5905507 5880112 5885613 5891433 5857609 5741742 5509531 5145977 4663022 4099709 3513607 2966305
7352 2966305 2508702 2171012 1958756 1853340 1816268 1797286 1745581 1620351 1396684 1065845
7342 1065845 632573 112675 -467907 -1073914 -1663996 -2197595 -2643437 -2985398 -3223065 -3368100
7332 -3368100 -3439281 -3457554 -3441371 -3404033 -3355235 -3305725 -3270103 -3263647 -3294425 -3356163 -3426884 -3474565
7320 -3474565 -3467283 -3382822 -3212900 -2960312 -2631809 -2231885 -1761142 -1219498 -611767 47770
7310 47770 734276 1415362 2056857 2629029 3111047 3492390 3771420 3952710 4044736 4058223
7300 4058223 4004509 3893734 3733161 3525570 3268074 2953479 2576485 2143042 1676482 1215044
7290 1215044 801903 473939 254525 151706 161221 273561 482830 792965 1217245 1771027
7280 1771027 2462045 3283566 4212816 5213313 6238395 7234536 8144604 8911036 9478387
7271 9478387 9796211 9824926 9545571 8969181 8138890 7121906 5995463 4833544 3697996
7262 3697996 2633661 1666974 809349 66154 -551920 -1021778 -1310620 -1388283 -1242980 -891478
7252 -891478 -377071 244970 926869 1640786 2376228 3125370 3868503 4571005 5193183 5704595
7242 5704595 6092625 6360999 6521328 6584534 6557380 6444672 6254082 6000234 5706072 5400148
7232 5400148 5109297 4849497 4621176 4413742 4216916 4030710 3867145 3743349 3671271 3650747
7222 3650747 3670172 3714024 3771231 3837646 3910812 3981822 4031280 4033120 3964745 3817654 3601681
7211 3601681 3339771 3057434 2775230 2508829 2273275 2085137 1960451 1911346 1943843 2056286
7201 2056286 2237527 2466415 2714783 2953742 3160884 3326508 3458236 3582310 3738180 3965123
7191 3965123 4286118 4698823 5179904 5698916 6230719 6757365 7259558 7705986 8050684 8243139
7181 8243139 8246366 8051531 7679718 7171542 6573747 5931029 5283729 4667366 4112001 3642891
7171 3642891 3283474 3058393 2992442 3102934 3387608 3815338 4328196 4857064 5342617 5748830
7161 5748830 6062875 6286759 6430400 6510084 6548186 6568797 6589105 6611393 6620493 6588125 6482865
7150 6482865 6283511 5992352 5642509 5293460 5014054 4860101 4856967 4993754 5228616 5500844
7140 5500844 5745288 5905667 5943874 5843907 5611482 5271483 4863733 4435538 4030337 3675443
7130 3675443 3374717 3110696 2855612 2585441 2289293 1969464 1633528 1285011 919592 528926
7120 528926 107913 -340863 -808267 -1282733 -1753051 -2207979 -2634606 -3018757 -3349222 -3624113
7110 -3624113 -3854762 -4062803 -4270393 -4488842 -4712542 -4921690 -5091927 -5205808 -5260871 -5270992
7100 -5270992 -5260525 -5253502 -5262010 -5278448 -5275774 -5217166 -5071466 -4826049 -4489557 -4083947 -3632625
7089 -3632625 -3152492 -2652854 -2139137 -1617953 -1101002 -606266 -155837 228955 533352 753753
7079 753753 899075 987362 1037952 1062637 1061020 1023314 939015 805861 633543 440244 244806
7068 244806 60103 -107683 -253129 -363239 -413568 -373201 -216482 66545 468654 973272
7058 973272 1564404 2230789 2963310 3750907 4579272 5430896 6282732 7101900 7844491 8461320
7048 8461320 8908522 9156972 9196351 9034089 8691768 8200910 7598515 6922125 6204421 5468098
7038 5468098 4722580 3964372 3181845 2363301 1505485 619371 -268512 -1118698 -1883546 -2513160
7028 -2513160 -2963006 -3203323 -3227676 -3056180 -2731027 -2306716 -1840394 -1386751 -997817 -724064
7018 -724064 -611869 -695003 -982929 -1452480 -2048367 -2693070 -3301744 -3796207 -4113912 -4211583
7008 -4211583 -4066510 -3678456 -3071425 -2291503 -1399006 -458351 469691 1333097 2094037 2734776
6998 2734776 3259358 3687583 4044205 4349842 4616945 4849443 5043914 5192051 5284671 5316227
6988 5316227 5288390 5212110 5107605 5001085 4917863 4874408 4873594 4905515 4952496 4995128 5017252
6977 5017252 5009559 4971788 4912938 4849075 4799323 4781316 4807228 4881005 4997263 5142407 5298202
6966 5298202 5446934 5575807 5677774 5747881 5777784 5753184 5656858 5475125 5202804 4843965
6956 4843965 4410494 3922221 3408888 2909873 2467744 2117313 1876842 1746593 1713270 1754722
6946 1754722 1842341 1944395 2034075 2100084 2152432 2218105 2328462 2505405 2753168 3058505
6936 3058505 3397851 3747125 4089468 4418236 4735460 5047491 5359180 5667574 5956552 6194305
6926 6194305 6335129 6326094 6118314 5680971 5013867 4152981 3165816 2138301 1158748 303808
6916 303808 -372214 -845144 -1124722 -1251070 -1282276 -1276689 -1277137 -1302537 -1347435 -1386964 -1385174 -1305977
6904 -1305977 -1125284 -840967 -476578 -76818 303672 613693 816135 892909 843878 681164
6894 681164 421247 78111 -339159 -822777 -1358639 -1918975 -2459187 -2920706 -3239803 -3360382
6884 -3360382 -3246522 -2889572 -2307152 -1536248 -625522 369643 1389790 2374280 3266379
6875 3266379 4020365 4608489 5024346 5279851 5396118 5392511 5279034 5054543 4710019 4235188
6865 4235188 3626885 2896476 2072848 1199726 329999 -479437 -1172230 -1699153 -2027289 -2147921
6855 -2147921 -2078064 -1854060 -1520194 -1117212 -674703 -208881 275022 777604 1298887 1831872
6845 1831872 2358429 2850630 3278392 3619486 3865649 4021571 4099165 4111863 4071009 3982966
6835 3982966 3845873 3648548 3375425 3017603 2584123 2106079 1630812 1209508 883822 675867
6825 675867 584171 586852 650452 739661 823324 876347 880912 829410 727418 593361 453832
6814 453832 336691 264898 252898 306254 424457 605384 848344 1153027 1514614 1918695
6804 1918695 2340144 2747498 3110662 3408009 3629624 3775752 3851986 3864321 3816991 3714133
6794 3714133 3564118 3383956 3201003 3050061 2966342 2977530 3098841 3332561 3670325 4095647
6784 4095647 4585748 5112703 5643818 6141673 6565952 6879359 7056842 7093666 7007499 6833055
6774 6833055 6612077 6383483 6177395 6013712 5903267 5849357 5849165 5895761 5980705 6096160 6235371
6763 6235371 6391161 6553066 6704785 6824391 6888553 6878990 6787688 6619032 6389654 6126954
6753 6126954 5865677 5641892 5485628 5414348 5428679 5511259 5630044 5746329 5824603 5839586
6743 5839586 5777934 5635994 5416590 5126501 4774693 4371001 3925309 3447530 2948391 2440279
6733 2440279 1936705 1449832 987646 553002 144907 -239648 -603983 -948600 -1265457 -1531880
6723 -1531880 -1708504 -1744078 -1586591 -1197779 -566856 281317 1287404 2368429 3435218
6714 3435218 4411654 5250877 5943455 6514078 7007635 7470180 7931220 8391506 8819011 9155889
6704 9155889 9336842 9312717 9068447 8627490 8043796 7388132 6734455 6147752 5673109 5326954
6694 5326954 5092923 4924984 4759260 4532989 4204668 3767064 3247864 2699608 2185246 1764967
6684 1764967 1486551 1379771 1455597 1710143 2130597 2698506 3387349 4155755 4941834 5665287
6674 5665287 6240973 6601197 6717661 6612528 6353493 6035968 5759845 5606972 5622756 5805613
6664 5805613 6109050 6457896 6772527 6989632 7070930 7000037 6774688 6401555 5895986 5284127
6654 5284127 4603291 3897747 3210089 2571443 1995522 1480237 1016406 598638 232217 -67484
6644 -67484 -281979 -398645 -416563 -345862 -200892 8096 278442 610630 999379 1427662
6634 1427662 1868928 2296580 2694725 3063788 3417948 3776124 4151825 4547543 4956198 5367397
6624 5367397 5773632 6172444 6563841 6945434 7308928 7639924 7919704 8126247 8234440 8219172
6614 8219172 8063888 7770560 7362579 6876213 6345811 5792697 5223951 4640145 4046953 3464656
6604 3464656 2929976 2487221 2171766 1994557 1935960 1950948 1981487 1970587 1873974 1666732
6594 1666732 1343895 917103 411832 -132279 -660703 -1108393 -1411504 -1522264 -1419375 -1109107
6584 -1109107 -618810 10839 729959 1480765 2200814 2830888 3324867 3656507 3820758 3831162
6574 3831162 3715658 3511628 3260139 2999789 2760765 2559896 2398823 2268237 2158508 2071689
6564 2071689 2027238 2057601 2196496 2466365 2869974 3387704 3979571 4590100 5154478 5605915
6554 5605915 5885293 5952721 5797211 5438941 4921586 4297792 3614561 2904858 2188023 1476887
6544 1476887 785919 134769 -454336 -961558 -1371530 -1671090 -1846117 -1882044 -1769125 -1509467
6534 -1509467 -1121652 -640245 -109908 424193 926215 1375158 1762936 2086001 2336303 2498573
6524 2498573 2556627 2504465 2354020 2133907 1880508 1628518 1407980 1248891 1187135 1262943
6514 1262943 1508409 1930434 2501465 3166244 3860943 4532192 5145357 5681185 6127373 6471475
6504 6471475 6697865 6789930 6738348 6552815 6269521 5947006 5650663 5434004 5325092 5321182
6494 5321182 5390654 5481498 5535559 5504771 5362901 5108133 4757014 4334663 3866613 3375382
6484 3375382 2881441 2405936 1972167 1604593 1325918 1153338 1094550 1144106 1281338 1471444
6474 1471444 1670611 1834501 1927709 1930931 1843345 1679861 1465012 1226194 988509 772283
6464 772283 592632 459363 376005 338678 336791 356664 386830 421945 462391 508957 555552
6453 555552 585191 572647 491963 323355 55824 -313414 -779059 -1325782 -1925659 -2537642
6443 -2537642 -3110979 -3593189 -3941213 -4131925 -4167041 -4069479 -3872678 -3608213 -3297496 -2950184
6433 -2950184 -2567704 -2148528 -1692902 -1206224 -699853 -187737 320248 823615 1330573 1851697
6423 1851697 2393020 2952918 3522722 4088565 4633249 5138761 5589665 5976290 6296309 6553869
6413 6553869 6755964 6906547 7000671 7022233 6947596 6754095 6429932 5982139 5440554 4856368
6403 4856368 4294451 3820814 3489209 3331000 3349646 3519125 3786383 4079398 4320862 4444003
6393 4444003 4405274 4190250 3811758 3301375 2697404 2034294 1338147 629409 -70442 -733578
6383 -733578 -1326304 -1816465 -2184177 -2428847 -2566838 -2620601 -2606436 -2528484 -2381383 -2158154
6373 -2158154 -1858011 -1490412 -1074721 -636987 -205534 194115 544950 842909 1096559 1320337
6363 1320337 1524719 1709721 1865574 1978624 2037348 2035135 1970585 1847856 1678023 1479702
6353 1479702 1276648 1092161 942944 835461 765627 720218 678305 613099 495857 302094
6343 302094 17620 -358594 -815302 -1331741 -1880386 -2429623 -2946943 -3402335 -3770816 -4033663
6333 -4033663 -4178749 -4200320 -4098311 -3877535 -3547293 -3121478 -2618839 -2063272 -1483852 -913444
6323 -913444 -384484 77310 457988 755773 976587 1127680 1212929 1231791 1181945 1064225
6313 1064225 887135 667459 424919 173168 -86757 -365474 -677730 -1034362 -1438238 -1883294
6303 -1883294 -2353753 -2823929 -3261737 -3636375 -3925984 -4120446 -4217945 -4217568 -4111989 -3884936
6293 -3884936 -3516661 -2995546 -2329037 -1547754 -702508 142282 917074 1558919 2026035 2310270
6283 2310270 2440848 2476207 2486319 2532074 2649730 2846425 3107384 3409368 3732133 4062508
6273 4062508 4391944 4712888 5018506 5305246 5574121 5828176 6068292 6291230 6491201 6662896
6263 6662896 6803644 6914016 6996873 7054955 7088006 7091737 7060434 6992668 6896867 6792710 6705779
6252 6705779 6656560 6648590 6661729 6654215 6573612 6373751 6032280 5561565 5007202 4434597 3910785
6241 3910785 3489962 3206733 3076182 3098380 3265341 3567834 3998312 4547316 5194800 5902435
6231 5902435 6613804 7264791 7799235 8181315 8399220 8461083 8387712 8205908 7943704 7627345
6221 7627345 7279133 6915362 6545183 6172838 5804074 5453115 5144331 4905978 4759007 4706842
6211 4706842 4731075 4795365 4856079 4874343 4823051 4686772 4458965 4142534 3754340 3328129
6201 3328129 2910179 2547673 2275534 2108536 2041960 2058975 2139625 2266402 2424806 2601276
6191 2601276 2783001 2962370 3144277 3349710 3609143 3945601 4355921 4801635 5215081 5517272
6181 5517272 5639295 5540138 5216555 4702375 4057293 3349688 2641170 1978853 1396131 918529
6171 918529 570202 377556 367737 561460 962418 1548039 2266729 3044189 3797393 4451582
6161 4451582 4955162 5288706 5465755 5524429 5511995 5469104 5421882 5384614 5367180 5378293 5421456
6150 5421456 5488763 5559620 5606253 5602203 5529112 5379991 5159565 4882359 4568616 4238659 3907620
6139 3907620 3582684 3263658 2946095 2626011 2305508 1997723 1728003 1529059 1431709 1456046
6129 1456046 1606869 1873445 2231623 2647404 3082353 3500221 3872480 4180877 4417695 4586306
6119 4586306 4703524 4801937 4927940 5132415 5455554 5911809 6481691 7114027 7737744 8278700
6109 8278700 8675363 8887826 8898191 8705018 8317009 7749790 7026704 6182873 5270976 4365574
6099 4365574 3561322 2961712 2660015 2718766 3155054 3935911 4984471 6194567 7449206
6090 7449206 8637349 9665637 10466209 11004241 11285582 11358955 11305898 11218035 11169953 11199122
6080 11199122 11299653 11429489 11526130 11525249 11377402 11059046 10575561 9956172 9243369 8481411
6070 8481411 7708625 6955757 6248684 5610991 5062553 4613877 4260176 3981222 3750867 3553822
6060 3553822 3400559 3330101 3397537 3653351 4125919 4813898 5687449 6693836 7764625 8823769
6050 8823769 9796165 10616391 11237927 11641944 11841677 11878086 11807839 11690623 11582097 11532254
6040 11532254 11584462 11772437 12116810 12623623 13284845 14079615 14975669 15930713 16892963 17800734
6030 17800734 18583160 19164881 19475299 19459710 19088577 18362832 17315104 16007237 14523592
6021 14523592 12959589 11407170 9942061 8617887 7468178 6512117 5758902 5208863 4853098
6012 4853098 4673800 4646040 4740838 4928859 5183239 5479846 5795170 6104595 6383924 6614035
6002 6614035 6785761 6902364 6979627 7045182 7137538 7302889 7587037 8021900 8610078 9314073
5992 9314073 10056619 10734623 11242790 11498305 11457900 11123229 10535619 9763956 8889752 7993196
5982 7993196 7143580 6395475 5788856 5349499 5087229 4992734 5035894 5168369 5331283 5466592
5972 5466592 5528991 5494484 5362238 5148963 4879198 4577639 4267876 3976039 3733224 3571282
5962 3571282 3511725 3552552 3660292 3773866 3822226 3749720 3536560 3203435 2798715 2376379
5952 2376379 1975922 1612401 1279347 961721 651495 357593 105958 -68537 -132929 -64205
5942 -64205 149011 510809 1023660 1689482 2504535 3452237 4499310 5597150 6687275
5933 6687275 7709858 8614610 9371313 9975376 10445385 10813858 11115627 11378478 11618531
5924 11618531 11840350 12040347 12211792 12349742 12453910 12527936 12575545 12596412 12584360 12528217
5914 12528217 12413733 12225401 11948422 11571901 11093896 10527285 9903023 9266695 8667961
5905 8667961 8148314 7734502 7439896 7269147 7219642 7277810 7413849 7580360 7717826 7765698
5895 7765698 7674926 7417586 6991358 6418635 5740890 5009427 4274687 3577054 2941308 2375375
5885 2375375 1872963 1419126 996914 592941 200869 -176445 -525249 -820196 -1026395 -1105555
5875 -1105555 -1025837 -772795 -356903 186287 803621 1435691 2027950 2540199 2954293 3277596
5865 3277596 3537923 3769537 3996789 4224974 4443126 4634890 4788823 4901490 4973110 5000863
5855 5000863 4975675 4884517 4715075 4457955 4104872 3646231 3072557 2380126 1576488 682075
5845 682075 -271606 -1244148 -2188020 -3052201 -3789091 -4362560 -4753644 -4962772 -5009575 -4930785
5835 -4930785 -4775444 -4597520 -4447985 -4368501 -4387170 -4516337 -4753788 -5088435 -5508080 -6003625
5825 -6003625 -6566272 -7180893 -7822998 -8463714 -9080040 -9663309 -10220364 -10766783 -11315696 -11867802
5815 -11867802 -12407890 -12909747 -13346079 -13696858 -13951555 -14106458 -14162007 -14123509 -14003680 -13822618
5805 -13822618 -13602755 -13360966 -13102518 -12819773 -12494680 -12102212 -11613352 -10998548 -10232919
5796 -10232919 -9302797 -8210978 -6977635 -5635606 -4221928 -2769554 -1302492 164882
5788 164882 1624983 3070844 4487076 5840922 7078851 8132985 8936600 9442552 9636132
5779 9636132 9536555 9187559 8643551 7958385 7179009 6341657 5468861 4569327 3643325 2692439
5769 2692439 1729034 781267 -107699 -885468 -1499268 -1905486 -2077990 -2014495 -1740278 -1306853
5759 -1306853 -782950 -238574 272072 720842 1104154 1431144 1708717 1932206 2085889 2150385
5749 2150385 2110194 1957434 1693051 1328503 888214 410137 -58095 -467681 -779693 -975308
5739 -975308 -1061601 -1070468 -1050671 -1055728 -1131650 -1307885 -1592958 -1975056 -2427523 -2918309 -3419631
5728 -3419631 -3912027 -4379728 -4801425 -5145269 -5373967 -5457723 -5387157 -5179522 -4876654 -4537469
5718 -4537469 -4228635 -4015030 -3949584 -4062526 -4353001 -4787684 -5308675 -5848214 -6344700 -6754731
5708 -6754731 -7057982 -7254802 -7359568 -7394177 -7383811 -7353566 -7324107 -7307311 -7304146 -7305079 -7291421
5697 -7291421 -7237386 -7114636 -6899736 -6581319 -6162761 -5659467 -5093888 -4492051 -3882295 -3293409
5687 -3293409 -2749307 -2261419 -1824366 -1420010 -1028806 -641160 -261514 96068 415761 684654
5677 684654 890900 1016917 1033118 898192 568706 15123 -763168 -1731081 -2822328 -3952616
$$ [...]
##END NTUPLES=NMR SPECTRUM
##END=
