##TITLE=31Pdec_106-2023
 CDCl3
  24 sc
 1.11.2023
##JCAMPDX= 6.0         $$ Bruker NMR JCAMP-DX V2.0
##DATA TYPE= NMR SPECTRUM
##DATA CLASS= NTUPLES
##ORIGIN= UXNMR, Bruker Analytische Messtechnik GmbH
##OWNER= root
$$ XWIN-NMR		Version 3.5
$$ Wed Nov  1 13:54:18 2023 Russian Standard Time (UT+4h)  she@DPX200
##.OBSERVE FREQUENCY= 81.013821
##.OBSERVE NUCLEUS= ^31P
##.ACQUISITION MODE= SIMULTANEOUS
##.ACQUISITION SCHEME= undefined
##.AVERAGES= 24
##.DIGITISER RES= 16
##SPECTROMETER/DATA SYSTEM= spect
##.PULSE SEQUENCE= zgpg30
##.SOLVENT NAME= CDCl3
##.SHIFT REFERENCE= (INTERNAL, CDCl3, 0, 248.564)
##AUDIT TRAIL= $$ (NUMBER, WHEN, WHO, WHERE, WHAT)
$$ ##TITLE= Audit trail, XWIN-NMR		Version 3.5
$$ ##JCAMPDX= 5.01
$$ ##ORIGIN= Bruker BioSpin GmbH
$$ ##OWNER= she
$$ F:/spectra/data/she/nmr/P31/1/pdata/1/auditp.txt
$$ ##AUDIT TRAIL=  $$ (NUMBER, WHEN, WHO, WHERE, WHAT)
(   1,<2023-11-01 13:53:09.17 +0400>,<she>,<DPX200>,
      <created by zg, POWCHK disabled, PULCHK disabled
       configuration hash MD5:
       00 E9 B6 7A A2 85 ED C7 34 08 36 98 17 FE 4E 26
       data hash MD5: 32K
       20 83 03 7C 12 E1 D8 2E 91 36 B1 3C 1E 26 F0 2E>)
(   2,<2023-11-01 13:53:11.87 +0400>,<she>,<DPX200>,
      <Start of raw data processing
       efp BC_mod = 2 LB = 5 FT_mod = 6 PKNL = 1 PHC0 = -10640.16 PHC1 = 193.8902 SI = 64K 
       data hash MD5: 64K
       50 70 82 F5 68 98 51 38 92 DF E8 DE 8E 71 93 8E>)
(   3,<2023-11-01 13:53:29.70 +0400>,<she>,<DPX200>,
      <pk PHC0 = 16.63589 PHC1 = 0 
       data hash MD5: 64K
       83 DB BF 51 75 81 DD 50 8B 3B 26 41 22 E4 0B BD>)
(   4,<2023-11-01 13:53:34.48 +0400>,<she>,<DPX200>,
      <abs ABSG = 5 
       data hash MD5: 64K
       78 AB 85 5C BF 9E 0A 76 06 40 E3 3E 8E BE 83 7D>)
$$ ##END=
$$ 
$$ hash MD5
$$ 5A 44 2C 38 69 EB 02 D4 6D D7 03 ED C3 3E F2 42
##$RELAX= 
##$RELAX= 
##$RELAX= 
##$RELAX= 
##$RELAX= 
##$RELAX= 
##$RELAX= 
##$RELAX= 
##$RELAX= 
$$ Bruker specific parameters
$$ --------------------------
##$DU= <F:/spectra>
##$EXPNO= 1
##$NAME= <P31>
##$PROCNO= 1
##$TYPE= <nmr>
##$USER= <she>
##$AMP= (0..31)
100 100 100 100 100 100 100 100 100 100 100 100 100 100 100 100 100 100 
100 100 100 100 100 100 100 100 100 100 100 100 100 100 
##$AQSEQ= 0
##$AQ_mod= 1
##$AUNM= <au_zg>
##$AUTOPOS= <>
##$BF1= 81.014009
##$BF2= 200.13
##$BF3= 200.13
##$BF4= 200.13
##$BF5= 200.13
##$BF6= 200.13
##$BF7= 200.13
##$BF8= 200.13
##$BYTORDA= 1
##$CFDGTYP= 0
##$CFRGTYP= 5
##$CHEMSTR= <none>
##$CNST= (0..31)
1 1 145 1 1 1 1 1 1 1 1 1 1 1 1 1 1 1 1 1 1 1 1 1 1 1 1 1 1 1 1 1 
##$CPDPRG= <waltz16>
##$CPDPRG1= <>
##$CPDPRG2= <waltz16>
##$CPDPRG3= <>
##$CPDPRG4= <mlev>
##$CPDPRG5= <mlev>
##$CPDPRG6= <mlev>
##$CPDPRG7= <mlev>
##$CPDPRG8= <mlev>
##$CPDPRGB= <>
##$CPDPRGT= <>
##$D= (0..31)
0 1 0 0 0 0 0 0 0 0 0 0.03 2e-05 3e-06 0 0 0 0 0 0 0 0 0 0 0 0 0 0 0 0 
0 0 
##$DATE= 1698832388
##$DBL= (0..7)
120 120 120 11 120 120 24 19 
##$DBP= (0..7)
150 150 150 150 150 150 150 150 
##$DBP07= 0
##$DBPNAM0= <>
##$DBPNAM1= <>
$$ [...]
##$SUBNAM3= <"">
##$SUBNAM4= <"">
##$SUBNAM5= <"">
##$SUBNAM6= <"">
##$SUBNAM7= <"">
##$SUBNAM8= <"">
##$SUBNAM9= <"">
##$SW= 501.771253377433
##$SWIBOX= (0..15)
0 1 3 0 0 0 0 0 0 0 0 0 0 0 0 0 
##$SW_h= 40650.406504065
##$TD= 32768
##$TD0= 1
##$TE= 0
##$TE2= 300
##$TE3= 300
##$TEG= 300
##$TL= (0..7)
0 120 53 12 22 120 120 120 
##$TP= (0..7)
150 150 150 150 150 150 150 150 
##$TP07= 0
##$TPNAME0= <>
##$TPNAME1= <>
##$TPNAME2= <>
##$TPNAME3= <>
##$TPNAME4= <>
##$TPNAME5= <>
##$TPNAME6= <>
##$TPNAME7= <>
##$TPOAL= (0..7)
0.5 0.5 0.5 0.5 0.5 0.5 0.5 0.5 
##$TPOFFS= (0..7)
0 0 0 0 0 0 0 0 
##$TUNHIN= 0
##$TUNHOUT= 0
##$TUNXOUT= 0
##$USERA1= <user>
##$USERA2= <user>
##$USERA3= <user>
##$USERA4= <user>
##$USERA5= <user>
##$V9= 5
##$VALIST= <valist>
##$VCLIST= <CCCCCCCCCCCCCCC>
##$VD= 0
##$VDLIST= <DDDDDDDDDDDDDDD>
##$VPLIST= <PPPPPPPPPPPPPPP>
##$VTLIST= <TTTTTTTTTTTTTTT>
##$WBST= 1024
##$WBSW= 4
##$XGAIN= (0..3)
0 0 0 0 
##$XL= 0
##$YL= 0
##$YMAX_a= 153
##$YMIN_a= -230
##$ZGOPTNS= <>
##$ZL1= 120
##$ZL2= 120
##$ZL3= 120
##$ZL4= 120
##$ABSF1= 248.5645
##$ABSF2= -253.2056
##$ABSG= 5
##$ABSL= 3
##$ALPHA= 0
##$AQORDER= 0
##$ASSFAC= 0
##$ASSFACI= 0
##$ASSFACX= 0
##$ASSWID= 0
##$AUNMP= <proc_1d>
##$AZFE= 0.1
##$AZFW= 0.5
##$BCFW= 0
##$BC_mod= 2
##$BYTORDP= 0
##$COROFFS= 0
##$CY= -3
##$DATMOD= 1
##$DC= 0
##$DFILT= <>
##$DTYPP= 0
##$F1P= 0
##$F2P= 0
##$FCOR= 1
##$FTSIZE= 65536
##$FT_mod= 6
##$GAMMA= 0
##$GB= 0
##$INTBC= 1
##$INTSCL= 6.047779e-11
##$ISEN= 30
##$LB= 5
##$LEV0= 0
##$LPBIN= 0
##$MAXI= 10000
##$MC2= 0
##$MEAN= 0
##$ME_mod= 0
##$MI= 50
##$NCOEF= 0
##$NC_proc= -11
##$NLEV= 6
##$NOISF1= 182.463
##$NOISF2= 159.3651
##$NSP= 0
##$NTH_PI= 0
##$NZP= 0
##$OFFSET= 248.5645
##$PC= 4
##$PHC0= -10623.52
##$PHC1= 193.8902
##$PH_mod= 1
##$PKNL= yes
##$PPARMOD= 0
##$PSCAL= 0
##$PSIGN= 0
##$REVERSE= no
##$SF= 81.0140089999694
##$SI= 65536
##$SIGF1= 159.3651
##$SIGF2= -187.1042
##$SINO= 113.3802
##$SIOLD= 16384
##$SREGLST= <1H.CDCl3>
##$SSB= 0
##$STSI= 65536
##$STSR= 0
##$SW_p= 40650.406504065
##$SYMM= 0
##$S_DEV= 0
##$TDeff= 32768
##$TDoff= 0
##$TI= <>
##$TILT= no
##$TM1= 0
##$TM2= 0
##$TOPLEV= 0
##$USERP1= <user>
##$USERP2= <user>
##$USERP3= <user>
##$USERP4= <user>
##$USERP5= <user>
##$WDW= 1
##$XDIM= 65536
##$YMAX_p= 326040462
##$YMIN_p= -53739622
$$ End of Bruker specific parameters
$$ ---------------------------------
##NTUPLES= NMR SPECTRUM
##VAR_NAME=  FREQUENCY,     SPECTRUM/REAL,   SPECTRUM/IMAG
##SYMBOL=    X,             R,               I
##VAR_TYPE=  INDEPENDENT,   DEPENDENT,       DEPENDENT
##VAR_FORM=  AFFN,          ASDF,            ASDF
##VAR_DIM=   65536,         65536,           65536
##UNITS=     HZ,            ARBITRARY UNITS, ARBITRARY UNITS
##FACTOR=    0.620285442955139, 1,           1
##FIRST=     20137.2065510682, 0,            0
##LAST=      -20513.1999529968, 0,           0
##MIN=       -20513.1999529968, -53739622,   0
##MAX=       20137.2065510682, 326040462,    0
$$ Real data points
##PAGE= N=1
##DATA TABLE= (X++(R..R)), XYDATA
$$ [...]
39596a83669K91162K52412P8587j88847m45740n86080n61423l98916j76329K1358
39586a897485J42641J92066K16646K54534K88032K58109J37118k3282j36561j70577
39576g38759j67589j69766j55733p4747P8874K57544M09752M97709M78450L26750
39566G42485R3839j07553k11219k60411l36778m58420n75763o30303n78549l96951
39556b719623j22238J33162K66188K79722K48933K08379J34017K7849n6548q9914
39546a690073j03589j26673j46247j56458j84878k30455k30818j40578K821J41510
39536b865438K80001M41743N77819N99273M96691L58334K57930J82480R2290N67
39526D21690m9151o2093j03634k17191l48673l83031k74591j20946o3631j13806
$$ plain form
39596 -183669 107493 359905 438492 249645 -196095 -782175 -1343598 -1742514 -1918843 -1897485
39586 -1897485 -1754844 -1562778 -1346132 -1091598 -803566 -545457 -408339 -431621 -568182 -738759
39576 -738759 -906348 -1076114 -1231847 -1306594 -1227720 -970176 -560424 -62715 415735 742485
39566 742485 836324 728771 517552 257141 -79637 -538057 -1113820 -1744123 -2322672 -2719623
39556 -2719623 -2841861 -2708699 -2442511 -2162789 -1913856 -1705477 -1571460 -1543611 -1600159 -1690073
39546 -1690073 -1793662 -1920335 -2066582 -2223040 -2407918 -2638373 -2869191 -3009769 -3006948 -2865438
39536 -2865438 -2585437 -2143694 -1565875 -966602 -469911 -111577 146353 328833 421123 421690
39526 421690 372539 310446 206812 -10379 -359052 -742083 -1016674 -1137620 -1201251 -1315057
39516a315057j33050j6630J58480K23999J22824m3396j44810j24595K2138K73901
39506i76196N45135O92132O25293L98070J45803m3512j61868k12983j77450o4293
39496G70131M8257O9290q335r8145j20847r5607j06471j88487k84271l20480k86422
39485f21387k12270j09973J5602J19793J43899R3351M2139M6734R5893J58244
39475b27975K32465L18469L72640L35087J95235N619j64169k71744l13621l17236
39465A64770l20049l39731l62626l67543l52555l24319k66985j46837L4395K00681
39455b080799K48201J55741L7062M7178K26381M66480O41920P29940P67724P39584
39445A979412N82732K99187q335k30424l30029l16759k09754o7247J579p8007
$$ plain form
39516 -1315057 -1448107 -1464737 -1306257 -1082258 -959434 -1002830 -1147640 -1272235 -1250097 -976196
39506 -976196 -431061 261071 886364 1284434 1430237 1386725 1224857 1011874 834424 770131
39496 770131 818388 887678 879343 781198 660351 564744 458273 269786 -14485 -334965 -621387
39485 -621387 -833657 -943630 -928028 -808235 -664336 -570985 -528846 -482112 -386219 -227975
39475 -227975 4490 322959 695599 1030686 1225921 1231540 1067371 795627 482006 164770
39465 164770 -155279 -495010 -857636 -1225179 -1577734 -1902053 -2169038 -2315875 -2281480 -2080799
39455 -2080799 -1832598 -1676857 -1639795 -1592617 -1366236 -899756 -257836 472104 1239828 1979412
39445 1979412 2562144 2861331 2852996 2622572 2292543 1975784 1766030 1698783 1700362 1622355
39435A622355k59981m21403m86980m76835m42918m04185l53552k91830k29075
39426a744404j64596q7069j62N8997L8818p9124k51155l94716m37564l45305j26399
39415c532679J61349M22138N79099O25684N95666M93553L04021P3129q5436j02434
39405d65910k7437M7654R7662J46852J79086J37803J5972j10741j56350r7945
39395b33354K4299J39647J70331O7878j36810l29006l82039k50817j0487J88332
39385g52026K22782R1477q4320j65952j08792K9008J63292K43475K56524K20025
39375A15493J79191J71360J72830J08812n5559k45985l27497k29708j8217J60526
39365C1246K07737J53220J11239J54803K40728K67597J97226R5793N1596P5286
$$ plain form
39435 1622355 1362374 940971 453991 -22844 -465762 -869947 -1223499 -1515329 -1744404
39426 -1744404 -1909000 -1996069 -1996231 -1937234 -1898416 -1977540 -2228695 -2623411 -3060975 -3406280 -3532679
39415 -3532679 -3371330 -2949192 -2370093 -1744409 -1148743 -655190 -351169 -278040 -363476 -465910
39405 -465910 -493347 -445693 -348031 -201179 -22093 115710 131682 20941 -135409 -233354
39395 -233354 -209055 -69408 100923 168801 31991 -297015 -679054 -929871 -940358 -752026
39385 -752026 -529244 -437767 -522087 -688039 -796831 -767823 -604531 -361056 -104532 115493
39375 115493 294684 466044 638874 747686 692127 446142 118645 -111063 -129280 31246
39365 31246 238983 392203 503442 658245 898973 1166570 1363796 1459589 1511185 1586471
39355A586471R9911P0356J0124j0415L8973J10990J33952Q4683o884j10014k17158
39344A790989l12240l48945k85868j34504L9791J59359J82838J39098J15562J76819
39334A522899K79751L05777J98623L0344r8914j78076k49878l01866k73668j62770
39324A072222m1577M6638J38493K65209L71692L63415K02046p6889m08003p18701
39314A214545r31621r93208r10702p47022n75848m35976l09206j40033R7140L41821
39304c390110M84560M70000L36325J50404m5870k01851k33562j01822J06771K44980
39294b180175K55633K06506J72612J48133J06418Q9270J66900L20918M36601M41029
39284A63845M03736M46453N64644N99790M17264P3119k37577l76041l55120k55471
$$ plain form
39355 1586471 1686382 1756738 1766862 1756447 1795420 1906410 2040362 2125045 2118161 2008147 1790989
39344 1790989 1478749 1129804 843936 709432 749223 908582 1091420 1230518 1346080 1522899
39334 1522899 1802650 2108427 2307050 2337394 2238480 2060404 1810526 1508660 1234992 1072222
39324 1072222 1030645 1077283 1215776 1480985 1852677 2216092 2418138 2341249 1933246 1214545
39314 1214545 282924 -710284 -1620986 -2368008 -2943856 -3379832 -3689038 -3829071 -3731931 -3390110
39304 -3390110 -2905550 -2435550 -2099225 -1948821 -1994691 -2196542 -2430104 -2531926 -2425155 -2180175
39294 -2180175 -1924542 -1718036 -1545424 -1397291 -1290873 -1201603 -1034703 -713785 -277184 163845
39284 163845 567581 1014034 1578678 2178468 2595732 2668851 2431274 2055233 1700113 1444642
39274A444642j22388K0434J11547P5926r0538k99664m43151m71042m08740l26421
39264e09395k92363l23465l61781l15161j43663R0949K70279L18329K54342J49524
39254h62405M6095o1689j71400k37751k26594j80138j76167k17434k10208p6420
39244b374111J48421L55361M68764M85413M44277M04651M30529N35113O35257
39235A533675O09630M21126J53710q0652k39765l44174m09198m17318l49647k24950
39225F52437j07177p3848j57536l04619m03808l73721k27475n3601O1194R7923
39215h90231J12932J79834L05337M03435L77830K33131P3410k0058p2428j51679
39205E51513k58296l25168l09652k32326j24094J0550J56345K60013K80223K40084
$$ plain form
39274 1444642 1322254 1342688 1454235 1530161 1439623 1139959 696808 225766 -182974 -509395
39264 -509395 -801758 -1125223 -1487004 -1802165 -1945828 -1854879 -1584600 -1266271 -1011929 -862405
39254 -862405 -816310 -877999 -1049399 -1287150 -1513744 -1693882 -1870049 -2087483 -2297691 -2374111
39244 -2374111 -2225690 -1870329 -1401565 -916152 -471875 -67224 363305 898418 1533675
39235 1533675 2143305 2564431 2718141 2637489 2397724 2053550 1644352 1227034 877387 652437
39225 652437 545260 471412 313876 9257 -394551 -768272 -995747 -1049348 -988154 -890231
39215 -890231 -777299 -597465 -292128 111307 489137 722268 795678 775620 703192 551513
39205 551513 293217 -31951 -341603 -573929 -698023 -687473 -531128 -271115 9108 249192
39195B49192J87725J16040l0837k57788m61191n04768l52619j12115O0115R2977
39185a013269M5862K9016R1584J96509K91944L68616M25509M16609K94954J15665
39175A262999L1253J35283L37293M43757L59550J69737K2490k4050k2919m6289
39165B669104j06715j56535j40164n0609N2986R2086M5547k8749o0302m3422l5165
39154B238062q8773k08289l58960m95510n78117n84335n18737m04741k66617j28672
39144a394689k5041J4447l883l7873n1747m4046k8474j2108r207m6527j14270
39133a753418j25652J8485L05281N92060P45707P70499P58511P40431O49235M35683
39123C136822J56669q3262k33309l00612k94752k28218j53060j27750j37728j07689
$$ plain form
39195 249192 436917 552957 522120 264332 -196859 -701627 -1054246 -1166361 -1106246 -1013269
39185 -1013269 -967407 -938391 -846807 -650298 -358354 10262 435771 852380 1147334 1262999
39175 1262999 1294252 1429535 1766828 2210585 2570135 2739872 2762362 2738312 2715393 2669104
39165 2669104 2562389 2405854 2265690 2215081 2268067 2360153 2405700 2376951 2316649 2273227 2238062
39154 2238062 2149289 1941000 1582040 1086530 508413 -75922 -594659 -999400 -1266017 -1394689
39144 -1394689 -1419730 -1405283 -1409166 -1447039 -1498786 -1542832 -1571306 -1583414 -1592621 -1639148 -1753418
39133 -1753418 -1879070 -1860585 -1555304 -963244 -217537 552962 1311473 2051904 2701139 3136822
39123 3136822 3293491 3210229 2976920 2676308 2381556 2153338 2000278 1872528 1734800 1627111
39113A627111j6780N0024L777j33772k64019l34006l70868m02982m04698l35935
39103e82148j96631k1605J48438K71526L12638K79668K30449K06956J72184N1832
39093H73307j58139l63559m68281m69367m32728l96230l30569j91636J6534K33786
39083a686882L77196L82410K42931K8689j47572k01844j22262M8845K52326M25948
39073d00215N12194M85137L68100K10343N2411p6371j46735j44380r1039k7746
39063G41699J8008K7069l4966j91472l92546n15718m60677k39302L4913K33388
39053g79604K87818K12522Q0955k7511p8206q5466p5053o3524p5250j41116k50327
39042i94762l27400k99569j86490q9409q3384j45950k02070k12683j96429j79877
$$ plain form
39113 1627111 1610331 1660355 1664132 1530360 1266341 932335 561467 158485 -246213 -582148
39103 -582148 -778779 -800384 -651946 -380420 -67782 211886 442335 649291 821475 873307
39093 873307 715168 351609 -116672 -586039 -1018767 -1414997 -1745566 -1937202 -1920668 -1686882
39083 -1686882 -1309686 -927276 -684345 -655656 -803228 -1005072 -1127334 -1078489 -826163 -400215
39073 -400215 111979 597116 965216 1175559 1227970 1151599 1004864 860484 769445 741699
39063 741699 759707 786776 751810 560338 167792 -347926 -808603 -1047905 -1012992 -779604
39053 -779604 -491786 -279264 -198309 -225820 -304026 -389492 -464545 -528069 -603319 -744435 -994762
39042 -994762 -1322162 -1621731 -1808221 -1897630 -1981014 -2126964 -2329034 -2541717 -2738146 -2918023
39032b918023j57643j07743k6270O7379J50330K06114K19671J84177J21320P6261
39022b184427P3179Q4677O7026K4249J4982Q8899K32146L81428M75580M85341
39012b56920M11675K75952J09528n8657k05702l06074l31347k71876j59441o0527
39002h53389l7586j02793j98397k28836j32028O8967K82815M13515M10485K85183
38992i2064J09738j2121j6646N9238J09567O5184m2572j22384j06653q2J20170
38981G1375J48445L8984j24317j78919l6863K28029M63605N84948O15113O13930
38971B424330O11239O02361N70732N05808M13611L10584K03917R2503r192p7835
38961E648058j25861k03080l26162m42981n06973n52239o37544p36360p52052
$$ plain form
39032 -2918023 -3075666 -3183409 -3209679 -3142300 -2991970 -2785856 -2566185 -2382008 -2260688 -2184427
39022 -2184427 -2111248 -2026571 -1959545 -1935296 -1920314 -1831415 -1599269 -1217841 -742261 -256920
39012 -256920 154755 430707 540235 481578 275876 -30198 -361545 -633421 -792862 -853389
39002 -853389 -890975 -993768 -1192165 -1421001 -1553029 -1484062 -1201247 -787732 -377247 -92064
38992 -92064 17674 5553 -11093 48145 157712 222896 180324 57940 -48713 -48795 71375
38981 71375 219820 258804 134487 -44432 -81295 146734 610339 1195287 1810400 2424330
38971 2424330 3035569 3637930 4208662 4714470 5128081 5438665 5642582 5735085 5725893 5648058
38961 5648058 5522197 5319117 4992955 4549974 4043001 3490762 2853218 2116858 1364806
38952A364806o48550n05807m24096m18295m32183m21574l90651l63402l46540
38943b586292l21009k64336j84733j25068j15446j26887r4835J0834J57127K83216
38933c367429L40586L05605J88020L6249r1436j71922k17686k30762j77724k0471
38923c406970K33167N03353O61282O13930M00832J80626P2871K9881p9054k70446
38913a060528m10733l91393k64452j62705j39695j36161o8535R1322K93621M28875
38903a820384L99023K14782L737j13077j30997j17933r7490l1550R9458K62277
38893a332154M20523N63918O70621O85653N71025L60251J37337l5651j57846k58041
38883A625636l35350l46482k64387j38945o4412o9995p2153L0077K22621L72161
$$ plain form
38952 1364806 716256 210449 -213647 -631942 -1064125 -1485699 -1876350 -2239752 -2586292
38943 -2586292 -2907301 -3171637 -3356370 -3481438 -3596884 -3723771 -3818606 -3807772 -3650645 -3367429
38933 -3367429 -3026843 -2721238 -2533218 -2496969 -2588405 -2760327 -2978013 -3208775 -3386499 -3406970
38923 -3406970 -3173803 -2670450 -2009168 -1395238 -994406 -813780 -740909 -711028 -790082 -1060528
38913 -1060528 -1471261 -1862654 -2127106 -2289811 -2429506 -2565667 -2634202 -2542880 -2249259 -1820384
38903 -1820384 -1421361 -1206579 -1202842 -1315919 -1446916 -1564849 -1662339 -1693889 -1594431 -1332154
38893 -1332154 -911631 -347713 322908 1008561 1579586 1939837 2077174 2041523 1883677 1625636
38883 1625636 1290286 943804 679417 540472 476060 406065 333912 363989 586610 958771
38873I58771L57737J85944k6096j61528j90397j63049j38023j28424j20057j21367
38863D53511j63384k46008l14947l10233k19513p3087Q6126K08277K42090J69311
38853a67857K3707j43962l02489m26187m80877m64446m36614m58187n10493n20568
38843c887973m58433l60760k61831j55936l5721Q7111K16680L74458N36222O16492
38833c329691N61196M26175L18453K75915K44575J63296L2984r2280j47089r0979
38823a637445N7166K11628K80808K55111K13671K27929K79093K92325K34910J47453
38813E62649P9817L1369k8132j04085j74075k29930k88297l50359l78067l29990
38803a209100k06767m6599J08214K22945K72143K67830K78341L70156N09995N60571
$$ plain form
38873 958771 1316508 1502452 1476356 1314828 1124431 961382 823359 694935 574878 453511
38863 453511 290127 44119 -270828 -581061 -800574 -873661 -787535 -579258 -337168 -167857
38853 -167857 -144150 -288112 -590601 -1016788 -1497665 -1962111 -2398725 -2856912 -3367405 -3887973
38843 -3887973 -4346406 -4707166 -4968997 -5124933 -5160654 -5073543 -4856863 -4482405 -3946183 -3329691
38833 -3329691 -2768495 -2342320 -2023867 -1747952 -1503377 -1340081 -1307097 -1399377 -1546466 -1637445
38823 -1637445 -1580279 -1368651 -1087843 -832732 -619061 -391132 -112039 180286 415196 562649
38813 562649 642466 673835 645703 541618 367543 137613 -150684 -501043 -879110 -1209100
38803 -1209100 -1415867 -1462466 -1354252 -1131307 -859164 -591334 -312993 57163 567158 1127729
38793A127729M12299J11614j69549k91732k57288j70687j25515j45395k04163
38784B87313k59504k60898j62665L3752K51267L76734L43942J77227l8334k12992
38774E35842k88946k65082k10346k21853l26866m33957m20886k72444r1238L6638
38764a959138J36454K69877M04183M22663K73819O1242m6935K0899J91655L41382
38754A16101M01081L67392K47509L3549k61471n63853p60619p74670o22107l94609
38744b211697j85432l3640O6128J19421J19261P7095M1337O1496J35852K11654
38734a598525K41980K31385K21112K41615K91421L55563M25410M89553N14103
38725A413617M52112K85050N0618j79087l42625m06307l56292k10500m1623N6009
$$ plain form
38793 1127729 1540028 1651642 1482093 1190361 933073 762386 636871 491476 287313
38784 287313 27809 -233089 -395754 -362002 -110735 265999 609941 787168 748834 535842
38774 535842 246896 -18186 -228532 -450385 -777251 -1211208 -1632094 -1904538 -1995776 -1959138
38764 -1959138 -1822684 -1552807 -1148624 -725961 -452142 -390900 -437835 -416936 -225281 116101
38754 116101 517182 884574 1132083 1165632 904161 340308 -420311 -1194981 -1817088 -2211697
38744 -2211697 -2397129 -2430769 -2364641 -2245220 -2125959 -2048864 -2007527 -1946031 -1810179 -1598525
38734 -1598525 -1356545 -1125160 -904048 -662433 -371012 -15449 409961 899514 1413617
38725 1413617 1865729 2150779 2201397 2022310 1679685 1273378 917086 706586 664963 720972
38715G20972N4973K4590L6438O1553J1269j25141k39880k23020p9866Q9758J95145
38704E26791K11130J62074Q8318J9988m1967j14759j92715k35062k14087j57878
38694E1833j18967j10052r4446l4748O7548J71615K17085J56579k783j89958l21946
38683b08240l65802l36268k45040q5992J19041K86311L14653J78766k7523j61455
38673e31549j60661r2943o2870r1930j30305j65112k38976l41974l68000k42918
38663b427238m4218Q2326R6808Q1016R7088J12508P3546j8785j27981k21444k69760
38652b566134k55564k02020j46731p5032O0953K30124K94619J51075j34139l80428
38642c023277m61111l77696k00850k923J51868K10504J61746N6279j6788J7087
$$ plain form
38715 720972 775945 800535 836973 898526 909795 784654 544774 321754 241888 331646 526791
38704 526791 737921 899995 988313 1008301 966334 851575 658860 423798 209711 51833
38694 51833 -67134 -177186 -271632 -306380 -238832 -67217 149868 306447 303664 113706 -208240
38683 -208240 -574042 -910310 -1155350 -1241342 -1122301 -835990 -521337 -342571 -370094 -531549
38673 -531549 -692210 -785153 -848023 -939953 -1070258 -1235370 -1474346 -1816320 -2184320 -2427238
38663 -2427238 -2471456 -2389130 -2292322 -2211306 -2114218 -2001710 -1928164 -1946949 -2074930 -2296374 -2566134
38652 -2566134 -2821698 -3023718 -3170449 -3245481 -3184528 -2954404 -2659785 -2508710 -2642849 -3023277
38642 -3023277 -3484388 -3862084 -4062934 -4065857 -3913989 -3703485 -3541739 -3485460 -3502248 -3485161
38632c485161J65791L52625M61149M22066K65745R2969l07J5536Q2676R1953j9838
38621a554796j86211k53701j33636J09721L37416M65262M88767M27934L11050
38612A1806J95236J32890J02506K0955j52729l56061m82146m75567l58941j95957
38602a558008n2158K9718M8284L8636L4074L4161K0227n361j4976M298K1811r655
38590a408949r8128j95452k42498k26413j89273j86765k40464l14419l24734j90553
38580c617648R2414M27593O90487Q28095Q66299Q30582P06769M94006K50391N0288
38570A619276p9943j57118k00339k30238k85477l92405n18789n91581n65681m57467
38560a859762l17784j90754q4257M3384K45558M96918O59070N95535L31097N0537
$$ plain form
38632 -3485161 -3319370 -2966745 -2505596 -2083530 -1817785 -1724816 -1725123 -1709587 -1626911 -1534958 -1554796
38621 -1554796 -1741007 -1994708 -2128344 -2018623 -1681207 -1215945 -727178 -299244 11806
38612 11806 207042 339932 442438 463393 310664 -45397 -527543 -1003110 -1362051 -1558008
38602 -1558008 -1610166 -1580448 -1532164 -1493528 -1459454 -1425293 -1405066 -1410427 -1425403 -1421105 -1399294 -1408949
38590 -1408949 -1507077 -1702529 -1945027 -2171440 -2360713 -2547478 -2787942 -3102361 -3427095 -3617648
38580 -3617648 -3525234 -3097641 -2407154 -1579059 -712760 117822 824591 1318597 1568988 1619276
38570 1619276 1539333 1382215 1181876 951638 666161 273756 -245033 -836614 -1402295 -1859762
38560 -1859762 -2177546 -2368300 -2452557 -2409173 -2163615 -1666697 -1007627 -412092 -80995 -30458
38550c0458p8986m9730L0889P6241P8824O9464O8409P4865P4654N1690J528o9907
38538B97483j64431k92641m45501n80327o51478o45109n72222m44001k74869r9402
38528c872498L8464J14190J27978Q9589J9896l3427q528J21513L10969M58332
38518b633522M70564L32609J32655J0296N2528K28985M36639O03201P24890Q04055
38508A162900P92014O31356L42787L3069j90008k89976k93209k45961j97348j92260
38498A553364k42220l06820l29411k92462k21896j42909n4308N2716J69910K67342
38488D53306K98444K19845M1322j37564j78612k4352K40893M61768N35166M64318
38478B374534L23520J96136J31503J30600J63044J97271K06422J55320K2227j47844
$$ plain form
38550 -30458 -109444 -159174 -128285 -52044 26780 96244 164653 239518 314172 365862 367390 297483
38538 297483 133052 -159589 -605090 -1185417 -1836895 -2482004 -3054226 -3498227 -3773096 -3872498
38528 -3872498 -3834034 -3719844 -3591866 -3502277 -3482381 -3515808 -3524336 -3402823 -3091854 -2633522
38518 -2633522 -2162958 -1830349 -1697694 -1687398 -1634870 -1405885 -969246 -366045 358845 1162900
38508 1162900 1954914 2586270 2929057 2962126 2772118 2482142 2188933 1942972 1745624 1553364
38498 1553364 1311144 1004324 674913 382451 160555 17646 -36662 16054 185964 453306
38488 453306 751750 971595 1012917 875353 696741 672389 913282 1375050 1910216 2374534
38478 2374534 2698054 2894190 3025693 3156293 3319337 3516608 3723030 3878350 3900577 3752733
38468C752733k51033k29666j52764j46452k44154l44371l26412j79510o183Q1419
38458A953607N9059K319J0069J03318J95502J75502K2064j76301l13421l60939
38448A670779l72227m11454m88015n51518n45495m67796l72184l04638k51804
38439b094352j67017l2141J29517K88689M25678N12898N14843M14984K26054k0490
38429A98663k69187m36129m58332l62242k45302j69154j01342J8150J85301L34517
38419a305057M07515L91654L12224K18245J57697J31702Q5440j8183j21800j12428
38409A47009N2227K85894M53395M82549L88025K24207N5758m2404j6790R8660
38399B128530J74639R2067j32250l49863m24775l57345k55658k10295k23687k43444
$$ plain form
38468 3752733 3501700 3272034 3119270 2972818 2728664 2384293 2057881 1878371 1872188 1953607
38458 1953607 2012666 2014985 2025054 2128372 2323874 2499376 2521440 2345139 2031718 1670779
38448 1670779 1298552 887098 399083 -152435 -697930 -1165726 -1537910 -1842548 -2094352
38439 -2094352 -2261369 -2293510 -2163993 -1875304 -1449626 -936728 -421885 -6901 219153 198663
38429 198663 -70524 -506653 -964985 -1327227 -1572529 -1741683 -1843025 -1824875 -1639574 -1305057
38419 -1305057 -897542 -505888 -193664 24581 182278 313980 399420 381237 259437 147009
38409 147009 199236 485130 938525 1421074 1809099 2033306 2089064 2046660 2029870 2128530
38399 2128530 2303169 2395236 2262986 1913123 1488348 1131003 875345 665050 441363 197919
38389A97919k25077j61524q3986l9248l7557j9294R1888K90365M76293N59145
38379A048924N38898M59213L21997J06315j38508k84374k45132q3044L7940N928
38369A768157j48566l14893m25953m90947n18330m66028l10117j27076l6827n8021
38359a128601q1463j0722J25437K34800K80669K82732K40700J35791L160o7727
38349A4776k4368J02099K53051L96998N08218N40154M64089L13542J52956R626
38339B731141j35015k89780m17729m68174m34589l68594l30817l27772l04540
38330c45869k06815m5093J10677J92116J77162Q9137k0827r4382j04994r2019
38320c40907j30017k40822l48818l44889j92323L9563K36614L23819L04998K45562
$$ plain form
38389 197919 -27158 -188682 -272668 -311916 -349473 -368767 -276879 13486 489779 1048924
38379 1048924 1587822 2047035 2369032 2475347 2336839 2052465 1807333 1724289 1762229 1768157
38369 1768157 1619591 1304698 878745 387798 -130532 -596560 -906677 -1033753 -1070580 -1128601
38359 -1128601 -1210064 -1220786 -1095349 -860549 -579880 -297148 -56448 79343 82503 14776
38349 14776 -9592 92507 345558 742556 1250774 1790928 2255017 2568559 2721515 2731141
38339 2731141 2596126 2306346 1888617 1420443 985854 617260 286443 -41329 -345869
38330 -345869 -552684 -597777 -487100 -294984 -117822 -28685 -49512 -143894 -248888 -340907
38320 -340907 -470924 -711746 -1060564 -1405453 -1597776 -1558213 -1321599 -997780 -692782 -447220
38310d47220K17309K41351K76160K66585K03699J28132P7131M4538K660m5902
38300I64443n6509O985J13644J71787J09054m9904j94655k27458j50557n2490
38290F34340j4625m4590j00874j57114k14325k56161k33565j23902J3756Q6239
38280d10821P9520R0528K17253M30184N82547N52946L62535J46810K4578L717
38270B079797R340j2896m0971k8238J3921K1244l3075r1198p8226P680J02991
38259A950369J59382J79576J77855J44302O1540o5374k05601l13941l45747k85345
38249A457016j67436m9312M5370J31960K05139K05203P4464j60995l89548m96834
38239H55027m45356k84727j01663M1149J31191J81604J89152J29178o817j86382
$$ plain form
38310 -447220 -229911 11440 287600 554185 757884 886016 963147 1007685 1010345 964443
38300 964443 907934 914919 1028563 1200350 1309404 1259500 1064845 837387 686830 634340
38290 634340 619715 575125 474251 317137 102812 -153349 -386914 -510816 -497060 -410821
38280 -410821 -331301 -240773 -23520 406664 989211 1542157 1904692 2051502 2076080 2079797
38270 2079797 2089137 2076241 2035270 2007032 2020953 2042197 2009122 1917924 1839698 1847378 1950369
38259 1950369 2109751 2289327 2467182 2611484 2673024 2607650 2402049 2088108 1742361 1457016
38249 1457016 1289580 1240268 1285638 1417598 1622737 1827940 1902404 1741409 1351861 855027
38239 855027 409671 124944 23281 64430 195621 377225 566377 695555 688738 502356
38229E02356l59565m92345n62765n42246m14091k14732k6240R8403J94916L45528
38219a470781N66094P54207P75596O02651L46673J49201O3912M9567L8797j7066
38209A858851j35312k76585l43192k64598r6229K0654J7609l3455l7445l334m922
38198G02042o0056j16099j34884j28010j18471j32142k21984m20048o38732o91070
38188a959454m65495n0022L52533N97185O50217N26628K62547m9816k78862l50512
38178g65051l03091k24217j57898r2858j2748P7836J67235K46231L04496L39737
38168d20328L68752M06601M34164M11313L27583K11301P4729j16840l85646o67229
38158F44400q39574q33806o85165m67319k13564P2624L59315N80612O87969O81015
$$ plain form
38229 502356 142791 -349554 -912319 -1454565 -1868656 -2083388 -2109628 -2011225 -1816309 -1470781
38219 -1470781 -904687 -150480 625116 1227767 1574440 1723641 1787553 1837120 1875917 1858851
38209 1858851 1723539 1446954 1103762 839164 742935 763589 781198 747743 710298 706964 702042
38198 702042 641986 525887 391003 262993 144522 12380 -209604 -629652 -1268384 -1959454
38188 -1959454 -2424949 -2474971 -2122438 -1525253 -875036 -348408 -85861 -135677 -414539 -765051
38178 -765051 -1068142 -1292359 -1450257 -1543115 -1555863 -1478027 -1310792 -1064561 -760065 -420328
38168 -420328 -51576 355025 789189 1200502 1528085 1739386 1814115 1697275 1311629 644400
38158 644400 -195174 -1028980 -1714145 -2181464 -2395028 -2322404 -1963089 -1382477 -694508 -13493
38148a3493N87860M38042K58429P5649q7704k13935k91014l22367l25457l00259
38138a94249k08939k2037K07400L50143L08561J10545j12948k30554j90350l5966
38128a8394J22899J74106Q0904q8238k17702k35323j48829k0203P2813P5718M125
38117a98124n0085j428J31947K49690K95641L17837L79466M55171M61495L66139
38107B407749K18120P7779l6325j25720j79395j85003j54456j22685j24133j65258
38097A610673k09094k00996j33613p2751q3993j43789j70050j40192j18471j43666
38087A94058j48870m2830J63053L59854M55056M38221L50014K34743J22179J8395
38077B143873q7060j81598k14771j60554p6302m7408q0507j10178j15415j64412
$$ plain form
38148 -13493 574367 1012409 1270838 1346487 1258783 1044848 753834 431467 106010 -194249
38138 -194249 -403188 -425225 -217825 132318 440879 551424 438476 207922 17572 -18394
38128 -18394 104505 278611 359515 271277 53575 -181748 -330577 -350780 -277967 -202249 -198124
38117 -198124 -248209 -249637 -117690 132000 427641 745478 1124944 1580115 2041610 2407749
38107 2407749 2625869 2703648 2667323 2541603 2362208 2177205 2022749 1900064 1775931 1610673
38097 1610673 1401579 1200583 1066970 994219 910226 766437 596387 456195 337724 194058
38087 194058 45188 2358 165411 525265 980321 1418542 1768556 2003299 2125478 2143873
38077 2143873 2056813 1875215 1660444 1499890 1423588 1376180 1295673 1185495 1070080 905668
38067I05668l18058n39684p29679q07313p33713n07557j86420J20132L26562M25327
38057b044735M40461L67470K07898L1753o2034m7780J2836N9726R1785J28192
38047h14428J55056J33190M3272q3362j71567j56498n5395L1249K2371n5502j18400
38036a070014j39175j55213j77921j73242j46639j68331k67840l58154l20438
38027b976967j35346J11634L25987M61518N10498M92781M49914M08537L50558
38018h86K48552J19929J2712n0214p3547m7477M4825J69645K41078K04576R8628
38007I67821J3881N483N2468Q1328K0113j45489l50483m96867n32272m73287l57052
37996a214356k04944m4777P4427J27539J48336J77451J89807J20590m1110k37955
$$ plain form
38067 905668 587610 47926 -681753 -1489066 -2222779 -2730336 -2916756 -2796624 -2470062 -2044735
38057 -2044735 -1604274 -1236804 -1028906 -997153 -1059187 -1106967 -1094131 -1034405 -942620 -814428
38047 -814428 -659372 -526182 -482910 -566272 -737839 -894337 -949732 -918483 -896112 -951614 -1070014
38036 -1070014 -1209189 -1364402 -1542323 -1715565 -1862204 -2030535 -2298375 -2656529 -2976967
38027 -2976967 -3112313 -3000679 -2674692 -2213174 -1702676 -1209895 -759981 -351444 -886
38018 -886 247666 367595 380307 330093 256546 209069 253894 423539 664617 869193 967821
38007 967821 981702 987185 1039653 1120981 1141094 995605 645122 148255 -384017 -857304 -1214356
37996 -1214356 -1419300 -1464077 -1389650 -1262111 -1113775 -936324 -746517 -625927 -667037 -904992
37986i04992m33711o54256q94174j027697q89693m54440J14374O04540R06115
37977c633934J014846R53694P54402M93460K76629J65241J43785J61765J75080
37968E04968J46753N6667o3952j44176j53539j47147j96415k90568l43020k90429
37958i20858j56658k3763L2424j4714j25813k15028k19523j66570j51654k34940
37948b197097l70054m40285l53382j06357K11412M66534N63069N09179M04841
37939a312140L53136L81660M40662M53578L67021J85387j9774j55196j86323j61187
37929C46824j37148j06893k9712Q2246J60544J72193J68945K13180K79673K73612
37919A423464J52648L543k7184J17258L32344M37875L36553Q8251j60437l00461
$$ plain form
37986 -904992 -1338703 -1992959 -2887133 -3914830 -4804523 -5258963 -5144589 -4540049 -3633934
37977 -3633934 -2619088 -1665394 -910992 -417532 -140903 24338 168123 329888 504968
37968 504968 651721 708388 644436 500260 346721 199574 3159 -287409 -630429 -920858
37958 -920858 -1077516 -1101279 -1068855 -1083569 -1209382 -1424410 -1643933 -1810503 -1962157 -2197097
37948 -2197097 -2567151 -3007436 -3360818 -3467175 -3255763 -2789229 -2226160 -1716981 -1312140
37939 -1312140 -959004 -577344 -136682 316896 683917 869304 849530 694334 508011 346824
37929 346824 209676 102783 73071 155317 315861 488054 656999 870179 1149852 1423464
37919 1423464 1576112 1579655 1552471 1669729 2002073 2439948 2776501 2864752 2704315 2403854
37909B403854l16803k57466j79715j20330r0137q7536j21905k12603l49667m72967
37899A94725n24697n19370n23512n56740n49831m22717j78062J04525L44331N05773
37889b125575N90494O14772N87590M92294L04133M6598j87219k96651k46158o1083
37879b80805K13427N05844P02056P10955N57942L60185J98883O9445l4869p1471
37869B931592l1356r736j13447l18492m89099n34812m87427m15796l26919j86883
37859A7625o870J32874J49345L8372j13647k09342k36803k66319l36451l77729
37849a208945k94088r9997Q4298J77348K14427K57679K85998K25053O0281j30228
37839d28174k53208k76430k23905j22614K5442K16360M01541M99146M72456L82930
$$ plain form
37909 2403854 2087051 1829585 1649870 1529540 1439403 1351867 1229962 1017359 667692 194725
37899 194725 -329972 -849342 -1372854 -1929594 -2479425 -2902142 -3080204 -2975679 -2631348 -2125575
37889 -2125575 -1535081 -920309 -332719 159575 463708 510306 323087 26436 -219722 -280805
37879 -280805 -67378 438466 1140522 1851477 2409419 2769604 2968487 3037932 3003063 2931592
37869 2931592 2900236 2890500 2777053 2458561 1969462 1434650 947223 531427 204508 17625
37859 17625 10755 143629 292974 331346 217699 8357 -228446 -494765 -831216 -1208945
37849 -1208945 -1503033 -1603030 -1518732 -1341384 -1126957 -869278 -583280 -358227 -297946 -428174
37839 -428174 -681382 -957812 -1181717 -1304331 -1278889 -1062529 -660988 -161842 310614 693544
37829F93544L29219L35905L43632L12729K80763K89088L03386K57908J49317L2646
37819C328137o2394j58450k73826l84525m53883m68085m34233l73272l25739l35048
37809E8682m01465m62458m36194k90213p0339J35127K65036L23318L43039L23266
37799b12201K34303R2488j6220k3825L9243R2455J04068Q6768K2001j25474l03913
37788a0307l66631k19729O1886L08203M17202M13786L79772L70116L82794L71706
37778B108798K93159J62500M9070j0651o8476j86336l18612l40270k13983p3453
37768A401746r1175k86369n10743o14709n75973m56075k92995r1962J05691K20324
37758a192240K24372J86632J87455K15198J85809N2219j42386l14087m05172m01859
$$ plain form
37829 693544 1022763 1358668 1702300 2015029 2295792 2584880 2888266 3146174 3295491 3328137
37819 3328137 3265743 3107293 2833467 2448942 1995059 1526974 1092741 719469 393730 58682
37809 58682 -342783 -805241 -1241435 -1531648 -1601987 -1466860 -1201824 -878506 -535467 -212201
37799 -212201 22102 114590 98370 74545 113788 206243 310311 397079 419080 293606 -10307
37788 -10307 -376938 -596667 -534781 -226578 190624 604410 984182 1354298 1737092 2108798
37778 2108798 2401957 2564457 2613527 2602876 2534400 2348064 2029452 1689182 1475199 1401746
37768 1401746 1310571 1024202 513459 -101250 -677223 -1133298 -1426293 -1518255 -1412564 -1192240
37758 -1192240 -967868 -781236 -593781 -378583 -192774 -140555 -282941 -597028 -1002200 -1404059
37748a404059l22676k06151r5131k6508l8336j60226l59218n10335m80122k61886
37738c864648M896J67838J91293J51843J47865K29750L72680M80356M45428K50646
37728a422053L917j54432j77336j36084j39236k38640l89254m77930m10008j90517
37718c731573Q7005L30307M95425N48072M50564K35482L9196j2068O5708J51422
37708a340460J69642J43807J15318Q7646O1784N5964O0630K9609m7401j06567
37698g70028q3920K011P8680J08507J13009J21946J34053J26862P9507j7163j54371
37687b60907l00537m07799m29766l43843j71724K0575J59533K13882K09649K01801
37677a109136K36011L19870M04172L98986K44117k3966k96682m91745o05968o69710
$$ plain form
37748 -1404059 -1726735 -1932886 -2028017 -2054525 -2092861 -2253087 -2612305 -3122640 -3602762 -3864648
37738 -3864648 -3859752 -3691914 -3500621 -3348778 -3200913 -2971163 -2598483 -2118127 -1672699 -1422053
37728 -1422053 -1418136 -1572568 -1749904 -1885988 -2025224 -2263864 -2653118 -3131048 -3541056 -3731573
37718 -3731573 -3644568 -3314261 -2818836 -2270764 -1820200 -1584718 -1545522 -1557590 -1491882 -1340460
37708 -1340460 -1170818 -1027011 -911693 -824047 -762263 -706299 -645669 -616060 -663461 -770028
37698 -770028 -853948 -851937 -773257 -664750 -551741 -429795 -295742 -168880 -89373 -106536 -260907
37687 -260907 -561444 -969243 -1399009 -1742852 -1914576 -1894001 -1734468 -1520586 -1310937 -1109136
37677 -1109136 -873125 -553255 -149083 249903 494020 470054 173372 -318373 -924341 -1594051
37667a594051o86660o40056n30813l80547k09860l4168J31633K81729M15928N06908
37657b739957M91628L33012Q8457j18761k11756k24848k42235k87290k95950k02339
37647c410039l1314J12462J45341P8444j0880n8628n1420q930L6807N0666J8053
37636c129438l2271n1557k1663L8211J11305J95951K75833L20958L35642L62331
37626a594698M06561L97062K67486N5997j25731k13424k33568k29931k00504j25808
37616a596558j8808Q2873J52297J76778J45679O5186k0737n4878k4881J6892N805
37605a070352o4948j37427j54808j23423r8486j15661j56832j87177k03570k28435
37595b541119k68000k97520k83914k04981m9687J76024M33905O61713Q14379Q91828
$$ plain form
37667 -1594051 -2280711 -2920767 -3451580 -3832127 -4041987 -4076155 -3944522 -3662793 -3246865 -2739957
37657 -2739957 -2248329 -1915317 -1826860 -1945621 -2157377 -2382225 -2624460 -2911750 -3207700 -3410039
37647 -3410039 -3441353 -3328891 -3183550 -3105106 -3115986 -3174614 -3226034 -3234964 -3198157 -3147491 -3129438
37636 -3129438 -3161709 -3213266 -3234929 -3196718 -3085413 -2889462 -2613629 -2292671 -1957029 -1594698
37626 -1594698 -1188137 -791075 -523589 -467592 -593323 -806747 -1040315 -1270246 -1470750 -1596558
37616 -1596558 -1615366 -1532493 -1380196 -1203418 -1057739 -992553 -1013290 -1068168 -1093049 -1076157 -1070352
37605 -1070352 -1135300 -1272727 -1427535 -1550958 -1649444 -1765105 -1921937 -2109114 -2312684 -2541119
37595 -2541119 -2809119 -3106639 -3390553 -3595534 -3645221 -3469197 -3035292 -2373579 -1559200 -667372
37585f67372R13198Q69829P27879M90141K36433P1215K5954L8554M0827L5596
37575B782254N7128Q1256L1170j17748k83199l51152k82767j32312J1867Q2782
37565A879279O0398k3198j11589j75477k26331k72692k94008k77902k46880k11336
37555A00264j28474L8971K38791L59568L45609K38001J06082r635q3357r3548
37545A112272n2755o199K2589M8546P0977N0850k4375r4277q6863K84J17278K28028
37533A386355L09535L12308J91819j3743j93370k71879k71325k49290k18990j61357
37523H20063q3829k3837m143k1739p9266j88313l26183m21349m15659l32402k52516
37512a329173k22619k16935j96909j67752j45136j01889n989R8240J16928L9481
$$ plain form
37585 -667372 245826 1115655 1843534 2333675 2570108 2641323 2667277 2705831 2746658 2782254
37575 2782254 2839382 2920638 2951808 2834060 2550861 2199709 1916942 1784630 1796497 1879279
37565 1879279 1939677 1916479 1804890 1629413 1403082 1130390 836382 558480 311600 100264
37555 100264 -28210 10761 249552 609120 954729 1192730 1298812 1289177 1205820 1112272
37545 1112272 1059517 1053318 1075907 1124453 1195430 1246280 1221905 1127628 1040765 1041049 1158327 1386355
37533 1386355 1695890 2008198 2200017 2186274 1992904 1721025 1449700 1200410 981420 820063
37523 820063 736234 712397 708254 686515 607249 418936 92753 -328596 -744255 -1076657 -1329173
37512 -1329173 -1551792 -1768727 -1965636 -2133388 -2278524 -2380413 -2386402 -2288162 -2171234 -2131753
37502b131753j3210P7896K80894M46184M68023L63590K07811N4308o8105j37434
37492d51796j50565j24822o5181M3809J92595L21500L71524L44652K88323K35259
37482A005298J86369J39196R4251K8645j01455l05911n14695o07782n10661k75755
37472h62500o6436l2753j76719l42733l55965j71089J12849L55065M64972M21795
37462f53514K65940R1478N667N3578J81536K86877L00258K23173J11540L5013
37452I01546K5727M2841N797j12440k41555k88596k35470j26319J6029J94215
37442A81775L56336L94809K75376J13614N6313J12267J65647J40703P4789J8946
37432A890575n0155j70776l05216l71085l37517k39100j18526j4899Q359r5856
$$ plain form
37502 -2131753 -2144963 -2067067 -1786173 -1339989 -871966 -508376 -300565 -246257 -314362 -451796
37492 -451796 -602361 -727183 -792364 -748555 -555960 -234460 137064 481716 770039 1005298
37482 1005298 1191667 1330863 1425114 1453759 1352304 1046393 531698 -76084 -586745 -862500
37472 -862500 -928936 -961689 -1138408 -1481141 -1837106 -2008195 -1895346 -1540281 -1075309 -653514
37462 -653514 -387574 -296096 -290429 -236851 -55315 231562 531820 754993 866533 901546
37452 901546 927273 970114 975911 863471 621916 333320 97850 -28469 -12440 181775
37442 181775 538111 932920 1208296 1321910 1378223 1490490 1656137 1796840 1871629 1890575
37432 1890575 1840420 1669644 1364428 993343 655826 416726 298200 283301 291660 195804
37422A95804k68614l62104k93481j47359q2283j55674k79998l36830k90918j91448
37412b212905j00735m0284J2264R2024K09659L34829M11755L92904K72037J05538
37402e22914p94M0052K16158M16170N23743N00214L69078J58559j01658l50419
37392A248189n14663n64719n21863m19907k96555k12419k22193l11211m01278
37383b216619m33724m08450l31530j80533M0685K52103L49850K97922J48322m501
37373b486475p0586r289J27687K22772K05599J23545O6557N1383K8860k0465o2004
37362a822416o7698l5990M6729J93630L51051M13339L38475J98171Q0249q107
37352c12567r8713j73789j81603j17997l4181L0821P9126J19632J50413J77696
$$ plain form
37422 195804 -72810 -434914 -728395 -875754 -958037 -1113711 -1393709 -1730539 -2021457 -2212905
37412 -2212905 -2313640 -2353924 -2341660 -2249636 -2039977 -1705148 -1293393 -900489 -628452 -522914
37402 -522914 -523708 -483656 -267498 148672 672415 1172629 1541707 1700266 1598608 1248189
37392 1248189 733526 168807 -353056 -772963 -1069518 -1281937 -1504130 -1815341 -2216619
37383 -2216619 -2650343 -3058793 -3390323 -3570856 -3530171 -3278068 -2928218 -2630296 -2481974 -2486475
37373 -2486475 -2557061 -2566350 -2438663 -2215891 -2010292 -1886747 -1820190 -1768807 -1739947 -1760412 -1822416
37362 -1822416 -1890114 -1926104 -1879375 -1685745 -1334694 -921355 -582880 -384709 -304460 -312567
37352 -312567 -411280 -585069 -766672 -884669 -918850 -888029 -808903 -689271 -538858 -361162
37342c61162K07941K09876J26962m6419k28751l21800l07032k51707k27761k44636
37332a444489k57169k17967j18294M794R1275R9039L6133m7209j02226j11224
37322b067337p1392K8555J83893L28525L57982K33216M7653m5425K0752J72488
37312h11090K89457L25605L21370L18426K98747K20069R1330j5727l7637J7535
37302A018085R6115J72487K62417L60876M07600L42934J78556j1063j52241k09324
37292B466442j86429j28978j07836j58780k36299k58214j96349r7970k4799q87
37282A069901j1708j8551J8670R1089J19479L5372j11579j82950j06414M8165
37272I51474J67771K16300K19057J77011N5538j55768m12403o36529p46744o89358
$$ plain form
37342 -361162 -153221 56655 183617 137198 -91553 -413353 -720385 -972092 -1199853 -1444489
37332 -1444489 -1701658 -1919625 -2037919 -2033125 -1941850 -1842811 -1806678 -1853887 -1956113 -2067337
37322 -2067337 -2138729 -2110174 -1926281 -1597756 -1239774 -1006558 -958905 -1004330 -983578 -811090
37312 -811090 -521633 -196028 125342 443768 742515 962584 1053914 1038187 1000550 1018085
37302 1018085 1114200 1286687 1549104 1909980 2317580 2660514 2839070 2828007 2675766 2466442
37292 2466442 2280013 2151035 2043199 1884419 1648120 1389906 1193557 1095587 1070788 1069901
37282 1069901 1058193 1039642 1058312 1149401 1268880 1304252 1192673 1009723 903309 951474
37272 951474 1119245 1335545 1554602 1731613 1787151 1631383 1218980 582451 -164293 -853651
37262h53651m78221k00742L8689J83087K34076K27517K10454K12414K20996K11114
37252E733K05760K59325L54935L75991K38809K0506j10845q3963J1686M5863j8120
37241A305680j12720j46873q6876J3119N1365l3894k15676m21001n95341p01627
37231i43844o91736n34423k65936K9928K91086M95061O23374O57616O12967N33890
37221H07983M48227L51380K29247O8567j34556l29001l91746k29778Q8096L60245
37211A268664M36560L35724J77191N7748J2099K3697K4711o7944k60934m51381
37201A556135n25535m70510l58198k51175j67454j08139o0992J1246J23691K05883
37191d5048J50013m4995k24544k24890n2801J25821J70636Q8728l9113j87008
$$ plain form
37262 -853651 -1331872 -1532614 -1493925 -1310838 -1076762 -849245 -638791 -426377 -205381 5733
37252 5733 211493 470818 825753 1201744 1440553 1461059 1350214 1266251 1277937 1323800 1305680
37241 1305680 1192960 1046087 959211 972330 1023695 989801 774125 353124 -242217 -943844
37231 -943844 -1635580 -2170003 -2435939 -2406011 -2114925 -1619864 -996490 -338874 274093 807983
37221 807983 1256210 1607590 1836837 1905404 1770848 1441847 1050101 820323 908419 1268664
37211 1268664 1705224 2040948 2218139 2275887 2287986 2311683 2336394 2268450 2007516 1556135
37201 1556135 1030600 560090 201892 -49283 -216737 -324876 -385868 -374622 -250931 -45048
37191 -45048 104965 59970 -164574 -389464 -442265 -316444 -145808 -57080 -96193 -283201
37181b83201l73687n54709o20232n33480m03555l61156l99702m02194l02986j52961
37171d387863k6192O8338J62214K72261M03040N63860P43895Q89845R39111Q69674
37161D98183P07856N04912L17346J86795J15861O9020O550q7371k04601l18966
37151A795585l89643l82866l02987j92772j02681o7454r3711j41184j32245k5249
37141c5207J22956K12176K18837K12716K47355K90824K86931K29115J39044K4003
37131A948750r5469j56341j14612k2301J0769o5319j95404k89921l09504k78714
37121D31934k43682k25449k04588j50521o6893O121L9723M5591M6433M2516K7324
37110b51491J5788L4789R9830K14349L66648N05977N51340M61383K82313R5331
$$ plain form
37181 -283201 -656888 -1211597 -1831829 -2365309 -2768864 -3130020 -3529722 -3931916 -4234902 -4387863
37171 -4387863 -4414055 -4345717 -4183503 -3911242 -3508202 -2944342 -2200447 -1310602 -371491 498183
37161 498183 1206039 1710951 2028297 2215092 2330953 2399973 2406523 2319152 2114551 1795585
37151 1795585 1405942 1023076 720089 527317 424636 357182 263471 122287 -9958 -35207
37141 -35207 87749 299925 518762 731478 978833 1269657 1556588 1785703 1924747 1948750
37131 1948750 1853281 1696940 1582328 1560027 1570796 1505477 1310073 1020152 710648 431934
37121 431934 188252 -37197 -241785 -392306 -459199 -453078 -413355 -367764 -321331 -278815 -251491
37110 -251491 -235703 -200914 -101084 113265 479913 985890 1537230 1998613 2280926 2376257
37100B376257o9173k30331l82430m69590m48205l44277k29117j52417j15008j00117
37090a64408j10792j62117k41488l02041l12976k96521k83968k49411j34181N9357
37080b198546K47322L55675L88733L83519L41705K47615J23332K1979k1475p217
37070a17358L9010O6264K0639r2118j86889j82602r0319J7384J02251J76574K36587
37059a0577K37744J49414k573j60229k75766l26430l14048k59373j84225j00971
37049a247034k8195K212k2280p0029j00148j07794j06529q4967k1334P0124J51116
37038a564858K13439K77153L34496L44117K96266K45326K55757L37614M46131
37029A185441N22895N32184M83446M25146L90471L45144K22453K0853j69112k56993
$$ plain form
37100 2376257 2307084 2076753 1694323 1224733 776528 432251 203134 50717 -64291 -164408
37090 -164408 -275200 -437317 -678805 -980846 -1293822 -1590343 -1874311 -2123722 -2257903 -2198546
37080 -2198546 -1951224 -1595549 -1206816 -823297 -481592 -233977 -110645 -88666 -110141 -117358
37070 -117358 -78348 -12084 8555 -83563 -270452 -453054 -543373 -525989 -423738 -247164 -10577
37059 -10577 227167 376581 374008 213779 -61987 -388417 -702465 -961838 -1146063 -1247034
37049 -1247034 -1275229 -1273017 -1295297 -1365326 -1465474 -1573268 -1679797 -1764764 -1786098 -1715974 -1564858
37038 -1564858 -1351419 -1074266 -739770 -395653 -99387 145939 401696 739310 1185441
37029 1185441 1708336 2240520 2723966 3149112 3539583 3884727 4107180 4128033 3958921 3701928
37019C701928k44151k01577j84059j97148k27266k60308k70131k28641j47463
37010A741184q6439r4015j46672j74102j47450j13738j25590j65011j74742j51310
37000C62115j54068k09779k58190k25406j16223N566R9901J62582J68742O6975
36990i7785j46078l77764m96416m38914k64654j10726q0301j49820j86269p6796
36980b425523J54714L69877M44234L53471J46690j16861l77401n48762n36333
36971b535894l15416J0273K57065K96239J45717p5175k60545l61604l44128j77516
36961c360984J01720L65247M85655M45732L32375K42704K21128K61113L27513
36952e77797L83406M18363M37505M11858K82761N6349j45935j98980j27543q5634
$$ plain form
37019 3701928 3457777 3256200 3072141 2874993 2647727 2387419 2117288 1888647 1741184
37010 1741184 1654745 1560730 1414058 1239956 1092506 978768 853178 688167 513425 362115
37000 362115 208047 -1732 -259922 -485328 -601551 -595985 -496084 -333502 -164760 -97785
36990 -97785 -243863 -621627 -1118043 -1556957 -1821611 -1932337 -2012638 -2162458 -2348727 -2425523
36980 -2425523 -2270809 -1900932 -1456698 -1103227 -956537 -1073398 -1450799 -1999561 -2535894
36971 -2535894 -2851310 -2841037 -2583972 -2287733 -2142016 -2217191 -2477736 -2839340 -3183468 -3360984
36961 -3360984 -3259264 -2894017 -2408362 -1962630 -1630255 -1387551 -1166423 -905310 -577797
36952 -577797 -194391 223972 661477 1073335 1356096 1412445 1266510 1067530 939987 854353
36942H54353j74206l31212m20082l84317k87659k27210k34906k60182k35959j53726
36932a855106o3950n992L2262P1416R5660Q8341Q4279J33727K20875K66824K20113
36921g11551J07027j5279j21518k19999l14969l83942l89235l13547j87015o4493
36911b614521L2557J31650K55805L82764M76104N23724N17630M31701K63292P3561
36901D74267n7009r9461p2343L483J01221J64264J40502L5016j05937k44491l48373
36890h861l69025k78550j17418L7432J38228J71028J35921P3796P0810J66681
36880B0042K87906L40419L35689L45734L67080L30602K33436J55713J38217J37591
36870B692429J14477P4236O241j19069k61151l04891j86110M2731K91023M97152
$$ plain form
36942 854353 680147 348935 -71147 -455464 -743123 -970333 -1205239 -1465421 -1701380 -1855106
36932 -1855106 -1919056 -1925048 -1892786 -1821370 -1725710 -1637369 -1553090 -1419363 -1198488 -931664 -711551
36921 -711551 -604524 -619803 -741321 -961320 -1276289 -1660231 -2049466 -2363013 -2550028 -2614521
36911 -2614521 -2581964 -2450314 -2194509 -1811745 -1335641 -811917 -294287 137414 400706 474267
36901 474267 417258 317797 245454 248937 350158 514422 654924 689940 584003 339512 -8861
36890 -8861 -377886 -656436 -773854 -736422 -598194 -427166 -291245 -217449 -146639 20042
36880 20042 307948 648367 984056 1329790 1696870 2027472 2260908 2416621 2554838 2692429
36870 2692429 2806906 2881142 2887383 2768314 2507163 2202272 2016162 2058893 2349916 2847068
36860B847068O02044N56285L99437K46143J42132J5937j69569l06020k69064j02569
36850C961824K2017R074p6845j26472j20856j30982k11022l12605l16130j57575
36840B540428R3272L09749M40604N14984N36710M56306K64972M5647j01845j38693
36830D962134p3161P5000K69598M60635O11727O93921O62296M97262K66311P7658
36820H503381l3544j14369k02496l04145m48056o53915q37613q61102p09364n19187
36810C819590m01025l31823k53926j65929o8527O3980J93599K08254P9794o0168
36800C083819q1179o928O8755J31325K17099L03983L31274K94443K45112K18770
36790D806473K06618J69567O1528j11081k47431k44401j34221l5418L4351J70575
$$ plain form
36860 2847068 3449112 4005397 4404834 4650977 4793109 4809046 4639477 4333457 4064393 3961824
36850 3961824 3983841 3992915 3916070 3789598 3668742 3537760 3326738 3014133 2698003 2540428
36840 2540428 2633700 2943449 3384053 3899037 4435747 4892053 5157025 5202672 5100827 4962134
36830 4962134 4888973 4963973 5233571 5694206 6305933 6999854 7662150 8159412 8425723 8503381
36820 8503381 8469837 8355468 8152972 7848827 7400771 6746856 5909243 5048141 4338777 3819590
36810 3819590 3418565 3086742 2832816 2666887 2598360 2662340 2855939 3064193 3143987 3083819
36800 3083819 3002640 2995712 3064467 3195792 3412891 3716874 4048148 4342591 4587703 4806473
36790 4806473 5013091 5182658 5244186 5133105 4885674 4641273 4507052 4471634 4505985 4676560
36780D676560L89868N73027O45244O65468O76971O21641M81504L58782L27237
36771I416302L42990L85314N31653P94255J036695J164693J258090J412065J598590
36762A7940647J780368J989822K193714K273002K254406K360765K717846L240579
36754C6751149L919816M925511O261939P643725Q917248J0258583J1741501J3160990
36746A03580462J4609043J6727559J9953979K4017941K8549816L3147951L5716388
36739B76303139L1786293J7951030l266987k3600249l5391040l7288479l3332900
36732A93160807k7874491k2751780j8356415j5089582j3086735j1750341j0407540
36725G3843923q987310p691953o495394n327853m357688l733784l313792k910048
$$ plain form
36780 4676560 5066428 5639455 6284699 6950167 7627138 8248779 8730283 9089065 9416302
36771 9416302 9759292 10144606 10676259 11470514 12507209 13671902 14929992 16342057 17940647
36762 17940647 19721015 21710837 23904551 26177553 28431959 30792724 33510570 36751149
36754 36751149 40670965 45596476 51858415 59502140 68419388 78677971 90419472 103580462
36746 103580462 118189505 134917064 154871043 178888984 207438800 240586751 276303139
36739 276303139 308089432 326040462 322773475 299173226 263782186 226493707 193160807
36732 193160807 165286316 142534536 124178121 109088539 96001804 84251463 73843923
36725 73843923 64856613 57164660 50669266 45341413 40983725 37249941 33936149 31026101
36717C1026101k570650k400438k322496k219156k120185k068341j961499j691453
36709A3671883j304570r00989n15564k06424j03362k35200m31649n13883m83324
36700H976918m44239m61570n71267p91495j023874j068910q48657n16387k58535
36691B991984r1140O4262K15663L14026L42086K98424J75053K7802k5937L3568
36681D345791O5027m0673j87994k02419n9650J16790K32199K88017L05429K77905
36671E140422J92679M3788j52954l20302l47124k10532k2648R8308J53070K04894
36661D779601K61465K87354K85159K84796K85850K81886L05991L70934L86940
36652G529976K26556j20334n15266q00516r16162q94465p91800o42565m52586
$$ plain form
36717 31026101 28455451 26055013 23732517 21513361 19393176 17324835 15363336 13671883
36709 13671883 12367313 11466324 10950760 10744336 10640974 10405774 9974125 9460242 8976918
36700 8976918 8532679 8071109 7499842 6708347 5684473 4615563 3766906 3250519 2991984
36691 2991984 2900844 2965106 3180769 3494795 3836881 4135305 4310358 4338160 4312223 4345791
36681 4345791 4410818 4370145 4182151 3979732 3920082 4036872 4269071 4557088 4862517 5140422
36671 5140422 5333101 5376889 5223935 4903633 4556509 4345977 4323329 4421637 4574707 4779601
36661 4779601 5041066 5328420 5613579 5898375 6184225 6466111 6772102 7143036 7529976
36652 7529976 7756532 7636198 7120932 6320416 5404254 4509789 3717989 3075424 2622838
36643B622838k26523p348J27684J30176K7421j09036k24360k96350l17244k88067
36633A439191k21540j34476m4543K5501O2367Q0397R3178O5743n9364k69045m50273
36622E87136m80808l30666o7953K00756L84709M48538M31135M07528M15142M31884
36612B427401M25249L92406L47892L00789K44957J47861l1040k67534m44641m67405
36602C075935l93995l71771m43220n04799m69157l67374k60252j54763o5208n8979
36592a3583j60625k82296l29273l15191k99732k79078k28031j92051k27687k80746
36582b608293k28422l3929K26958M77465O81832P83054P12309M97702K79684J67333
36572I55693J30611P2778l7680j48015j95368j52213j7491J87869M05087N43287
$$ plain form
36643 2622838 2396315 2388967 2516651 2646827 2674248 2565212 2340852 2044502 1727258 1439191
36633 1439191 1217651 1083175 1038632 1064133 1126500 1206897 1300075 1365818 1306454 1037409 587136
36622 587136 106328 -224338 -292291 -91535 293174 741712 1172847 1580375 1995517 2427401
36612 2427401 2852650 3245056 3592948 3893737 4138694 4286555 4255515 3987981 3543340 3075935
36602 3075935 2681940 2310169 1866949 1362150 892993 525619 265367 110604 45396 -13583
36592 -13583 -174208 -456504 -785777 -1100968 -1400700 -1679778 -1907809 -2099860 -2327547 -2608293
36582 -2608293 -2836715 -2870644 -2643686 -2166221 -1484389 -701335 10974 508676 788360 955693
36572 955693 1086304 1159082 1121402 973387 778019 625806 608315 796184 1201271 1744558
36562A744558N27882L55641J00207j44272l20596m01786l53240j55390J26114
36553A479118L49148M12288L30634J70974l2579k45715l72321l21460j33419L8839
36543A675507Q9472M2035l8436j44258k93968m50588n29266m81449l41596j91612
36533f64159r4482n6818m0394o131N1099J07931J40701J37856R6732L1679j3979
36522c09965J2187J22490K60812L31400K68566R5115q5693j75790j72205j57663
36512A89254j93950k49310k50634j79865q1270J2673J16247K43793L65331M30607
36502D02876M19614L53146K67642J97122J68870J89465K27353K30271J79488J14093
36492B749940P3289K2082j17340l40277n15001n13451l58809j88915r5226o5069
$$ plain form
36562 1744558 2272440 2628081 2728288 2584016 2263420 1861634 1508394 1353004 1479118
36553 1479118 1828266 2240554 2571188 2742162 2709583 2463868 2091547 1770087 1636668 1675507
36543 1675507 1764979 1807014 1768578 1624320 1330352 879764 350498 -130951 -472547 -664159
36533 -664159 -758641 -815459 -855853 -861984 -810885 -702954 -562253 -424397 -327665 -295986 -309965
36522 -309965 -297778 -175288 85524 416924 685490 780605 694912 519122 346917 189254
36512 189254 -4696 -254006 -504640 -684505 -765775 -753102 -636855 -393062 -27731 402876
36502 402876 822490 1175636 1443278 1640400 1809270 1998735 2226088 2456359 2635847 2749940
36492 2749940 2823229 2845311 2727971 2387694 1872693 1359242 1000433 811518 716292 651223
36482F51223o8912j12292j76436j91080j19839j7778M7058Q5551J52174K57064
36472E06733L62610M32404M33558L25179J05013j49969l39334m21968m09606l14684
36462E29936j60034j1509O6155P7954P1916O0556K4302k5732n6294p6521j25622
36451C75107j92579k13385j61881q8862n7480q6533j63154k58118l16541k83366
36441a446792j54622L0087K37386M30364N27263M59391K86572J65905J66504J94254
36431H96312J49938Q1280J00472K09346K99038K96141K22520J18284j3509j73535
36421B186287l41994n05371o54218p34752o55773l83532l385L44992N77625O89766
36411E19645O97248O03973M35254K61320J48076Q5824p040j97216m61590o98829
$$ plain form
36482 651223 582311 470019 293583 102503 -17336 -35114 11944 97495 249669 506733
36472 506733 869343 1301747 1735305 2060484 2165497 2015528 1676194 1254226 844620 529936
36462 529936 369902 358393 424548 502502 574418 634974 659276 633544 577250 500729 375107
36451 375107 182528 -30857 -192738 -281600 -339080 -425613 -588767 -846885 -1163426 -1446792
36441 -1446792 -1601414 -1571327 -1333941 -903577 -376314 83077 369649 535554 702058 896312
36431 896312 1046250 1127530 1228002 1437348 1736386 2032527 2255047 2373331 2359822 2186287
36421 2186287 1844293 1338922 684704 -50048 -705821 -1089353 -1092738 -747746 -170121 519645
36411 519645 1216893 1820866 2256120 2517440 2665516 2751340 2744300 2547084 2085494 1386665
36401A386665p97583o92339l91005J3520L72083N63818N67278M35962K19317n3771
36391A623945l21865m86145m95275m02002l00551k30632j75340j27668j08052
36382a023585j16452j12082n9463K9768J16921J79042K12126K02546J20656m7607
36372d98130k70106m73882n75915n12847k69532Q8784M18068N75164N29391L82479
36362f06526K57484J83737J12556J9691n6322p5835n1731k5331j9273l0703m8662
36351c40915o2724o7910o5956m6708K5189J72686L52521M76076M97551M48904
36341A388714L74209K70833J27356j1589o3775P626J48307K44280J94268j9721
36331B660508l04919n13355n53305m54087l26387k74543l34891m50439m90010
$$ plain form
36401 1386665 589082 -103257 -494262 -480742 -108659 455159 1022437 1458399 1677716 1623945
36391 1623945 1302080 815935 320660 -81342 -381893 -612525 -787865 -915533 -1023585
36382 -1023585 -1140037 -1252119 -1311582 -1281814 -1164893 -985851 -773725 -571179 -450523 -498130
36372 -498130 -768236 -1242118 -1818033 -2330880 -2600412 -2511628 -2093560 -1518396 -989005 -606526
36362 -606526 -349042 -165305 -52749 -33058 -89380 -165215 -216946 -242277 -261550 -292253 -340915
36351 -340915 -403639 -471549 -537505 -584213 -559024 -386338 -33817 442259 939810 1388714
36341 1388714 1762923 2033756 2161112 2149523 2085748 2093374 2241681 2485961 2680229 2660508
36331 2660508 2355589 1842234 1288929 834842 508455 233912 -100979 -551418 -1041428
36322a041428l45276n1655K18159L20663K76558K08782J89809K06423K37066K77549
36312D96650K91684K20321P0627n9020p7473Q243J16451J65736J10846m5402k38121
36301A060542l70596l98601l70626l62220l92891m30439m46716m31572l72740
36292b515859k67964j55826r8854j27346k16013l10647l57176l14780j74870K4664
36282d514671K26255M01551N57446O90066P55011P00318N24188K91597R2978j7299
36272b92560n0306n3852n4904l7471K0178J01725J58319J44431L4976j69479m18062
36261f17005n98044n96260l98938j16013J05987J87232J41597M0834l0979k1065
36251a902654N7994J43379J87713J99333K06942K07427J73069R4687p571j03241
$$ plain form
36322 -1041428 -1386704 -1438359 -1220200 -899537 -622979 -414197 -224388 -17965 219101 496650
36312 496650 788334 1008655 1079282 1020262 942789 951032 1067483 1233219 1344065 1298663 1060542
36301 1060542 689946 291345 -79281 -441501 -834392 -1264831 -1711547 -2143119 -2515859
36292 -2515859 -2783823 -2939649 -3038503 -3165849 -3381862 -3692509 -4049685 -4364465 -4539335 -4514671
36282 -4514671 -4288416 -3886865 -3329419 -2639353 -1884342 -1184024 -659836 -368239 -275261 -292560
36272 -292560 -342866 -396718 -451622 -489093 -468915 -367190 -208871 -64440 -29464 -198943 -617005
36261 -617005 -1215049 -1811309 -2210247 -2326260 -2220273 -2033041 -1891444 -1850610 -1881589 -1902654
36251 -1902654 -1844660 -1701281 -1513568 -1314235 -1107293 -899866 -726797 -632110 -639681 -742922
36241g42922j56767j31610k5843J01780J75162J71083J22823O7885L1288M8399
36231c38722J43577K70339L26318K59622J25766J6067k9435j0916P3529J97481
36221A033626K64431J72634o6752l21218m56717m38194l20884j89250j08740q7713
36211e18777o5355K5756J61258K21066J15124j04514k85534l21369k34955j23184
36201a130484m0490N0948K14936M32175N80236N47113L56237J46198K4362k3385
36191A157846o6859j20097j33571p7227R017N0186N56j24475k58694l20994k56500
36180a40812o2571K05890M48138N59508N04997L58045K29712J44600K2418j98446
36170B071479m61293o48458o97128o09788l90778n6145K95086N05892M99994L49779
$$ plain form
36241 -742922 -899689 -1031299 -1057142 -955362 -780200 -609117 -486294 -418409 -387121 -338722
36231 -338722 -195145 75194 401512 661134 786900 802967 773532 762616 836145 1033626
36221 1033626 1298057 1470691 1403939 1082721 626004 187810 -133074 -322324 -431064 -518777
36211 -518777 -584132 -558376 -397118 -176052 -60928 -165442 -450976 -772345 -1007300 -1130484
36201 -1130484 -1170974 -1120026 -905090 -472915 107321 654434 1010671 1156869 1181231 1157846
36191 1157846 1090987 970890 837319 760092 769109 819295 819851 695376 436682 115688 -140812
36180 -140812 -203383 2507 450645 1010153 1515150 1873195 2102907 2247507 2269925 2071479
36170 2071479 1610186 961728 264600 -345188 -735966 -792111 -497025 8867 508861 858640
36160H58640J71472n049k16546m47297n92063n50271l28566m0394J81680K73328
36150f95066K58669J97038J14069o177j61130k87306l05195k02779n3433N0148
36140a091162O5336J1746n3985o6840R152J37830K13848J43129o5669l02951m56530
36129a456096m93274m41925l30382j74181q538J21423K17426L33525M94593O39297
36119a098132O84941O32329N59794N16378M70528L76694K44105J08219l0043j93093
36109B271720l69406n06213n57257n11561l82650k03529l5530M9753J5106j21587
36099c51154l02955m48132m70392l33170j10803M5377L9862p8795j80120j79606
36089b369888q3481N6656J79766K20610J46324P527r6350j30275j60587k45563
$$ plain form
36160 858640 1030112 1025063 808517 361220 -230843 -781114 -1109680 -1150074 -968394 -695066
36150 -695066 -436397 -239359 -125290 -131467 -292597 -579903 -885098 -1087877 -1141310 -1091162
36140 -1091162 -1025826 -1014080 -1068065 -1134905 -1125753 -987923 -774075 -630946 -696615 -999566 -1456096
36129 -1456096 -1949370 -2391295 -2721677 -2895858 -2904396 -2782973 -2565547 -2232022 -1737429 -1098132
36119 -1098132 -413191 219138 778932 1295310 1765838 2142532 2386637 2494856 2464813 2271720
36109 2271720 1902314 1396101 838844 327283 -55367 -258896 -294426 -244673 -229567 -351154
36099 -351154 -654109 -1102241 -1572633 -1905803 -2016606 -1971229 -1931367 -2010162 -2190282 -2369888
36089 -2369888 -2453369 -2396713 -2216947 -1996337 -1850013 -1842486 -1938836 -2069111 -2229698 -2475261
36079b475261l31404l12532j73461r335R1854J28421J39223J43450J55716K02931
36069b440398K74838K98225K23761J18618J04620K02176K99080K94550K21135
36060d03395J89747K50700L46547L79981K95406J10759r6995k43798l01575l08207
36050B19170l04617k80310k00493o6771P7168J85838K32566K10387J47940J07988
36040C28866J27778J69679J73575J48100J55760K06425K24755J40029m1866k69848
36030A363253m90710o33974o20280m41180j91639K6672K01107L64084N01315N71131
36020F49779N79944N56099M65096K43592o7709l08141l54950k48619j33020j16204
36010A265867k14552l80493n37006o11671n80241m74150l34719j79167j6164J41253
$$ plain form
36079 -2475261 -2806665 -3119197 -3292658 -3301993 -3210139 -3081718 -2942495 -2799045 -2643329 -2440398
36069 -2440398 -2165560 -1867335 -1643574 -1524956 -1420336 -1218160 -919080 -624530 -403395
36060 -403395 -213648 37052 383599 763580 1058986 1169745 1072750 828952 527377 219170
36050 219170 -85447 -365757 -566250 -633021 -555853 -370015 -137449 72938 220878 328866
36040 328866 456644 626323 799898 947998 1103758 1310183 1534938 1674967 1633101 1363253
36030 1363253 872543 238569 -381711 -822891 -1014530 -987858 -786751 -422667 78648 649779
36020 649779 1229723 1785822 2250918 2494510 2426801 2118660 1763710 1515091 1382071 1265867
36010 1265867 1051315 670822 133816 -477855 -1058096 -1532246 -1866965 -2046132 -2062296 -1921043
36000a921043K93400M48446N81970O42798O23843N85563N75821N64145M94489
35991B889432L69201K35968J18421O786j02595k04741l07805m13655m91240n14119
35981A585653n11333n31927n65092n45200m39095k86435j48978n5352K755N2437
35971a442567J14170J63581J34962R324j16399j12111L0554J87652K54622K39789
35961e36423J87253Q6258q6837k88864m36996m93182m75308m08191l11567k17929
35951b981786j47961o9323P3322K74633M46128M95163M14989K89321K15424K26654
35941g63436K84043L28840L22243K33460L6331k32570m40045m58768l16154j71331
35931a177387j18925q8450J9697J78442K92206L50766M20203N01332N04827L86159
$$ plain form
36000 -1921043 -1627643 -1179197 -597227 45571 669414 1254977 1830798 2394943 2889432
35991 2889432 3258633 3494601 3613022 3619808 3517213 3312472 3004667 2591012 2099772 1585653
35981 1585653 1074320 542393 -22699 -567899 -1006994 -1293429 -1442407 -1497759 -1495004 -1442567
35971 -1442567 -1328397 -1164816 -1029854 -1020530 -1136929 -1249040 -1218486 -1030834 -776212 -536423
35961 -536423 -349170 -262912 -349749 -638613 -1075609 -1568791 -2044099 -2452290 -2763857 -2981786
35951 -2981786 -3129747 -3199070 -3125748 -2851115 -2404987 -1909824 -1494835 -1205514 -990090 -763436
35941 -763436 -479393 -150553 171690 405150 441481 208911 -231134 -689902 -1006056 -1177387
35931 -1177387 -1296312 -1384762 -1365065 -1186623 -894417 -543651 -123448 377884 882711 1268870
35921A268870K21193J11225O9538L6417l4025j29203j88278j41363K5241K27384
35911A466999L42949L29560K50583J80498J36895J22302J65906K70795L61941
35902C628428L50910K43042J35041J06873J43653J56631N7609j74464m71869p25764
35892C450090q69427r03511q39547o65588l99974j32429M9886J57876K63863L81762
35882D93001M47541M17970L19617J82759o575k51336m90324o43599o77778n93944
35872h02668l96624j29252R4299J69808J19403P2142J14590K06238K59697K57717
35862c4650K54934K90686L38294L31402K13244k9123l42928o15132p30863o53995
35852i78131m51432k32215o4376N1684J45785K30484K88370K94533K47959J83471
$$ plain form
35921 1268870 1490063 1601288 1670826 1707243 1673218 1544015 1355737 1214374 1239615 1466999
35911 1466999 1809948 2139508 2390091 2570589 2707484 2829786 2995692 3266487 3628428
35902 3628428 3979338 4222380 4357421 4464294 4607947 4764578 4822187 4647723 4175854 3450090
35892 3450090 2580663 1677152 837605 172017 -227957 -360386 -310500 -152624 111239 493001
35882 493001 940542 1358512 1678129 1860888 1854313 1602977 1112653 469054 -208724 -802668
35872 -802668 -1199292 -1328544 -1234245 -1064437 -945034 -872892 -758302 -552064 -292367 -34650
35862 -34650 220284 510970 849264 1180666 1393910 1364787 1021859 406727 -324136 -978131
35852 -978131 -1429563 -1661778 -1726154 -1674470 -1528685 -1298201 -1009831 -715298 -467339 -283868
35842b83868J47840J53649J58437J05611m748r7040q6740L5190J91346K85182
35832F04859K70650J69283M6966k1532N694J05906K07638K54884K54584K53864
35822B152796K80079L17146L33563L15298K71128K21649J85832J63168J22018
35813D362677J9221j52339l34125m30941l83977k25262n7849K9033L0554J0516
35803B867508K3637P1794J32684J94843K43117K40187J61152L4462q6883j87850
35793C694651k89661l91897m59085m67539m20463l06581r5351J96943M76661O46466
35783B584144O84557O21286M71757K41488j7929k15717k98861k96438k83119l16608
35773C174560m03630n00601n45699n06018l89400k06759M0898L05211M59856L98990
$$ plain form
35842 -283868 -136028 17621 176058 281669 276921 179881 93141 128331 319677 604859
35832 604859 875509 1044792 1091758 1070226 1075920 1181826 1389464 1644348 1898932 2152796
35822 2152796 2432875 2750021 3083584 3398882 3670010 3891659 4077491 4240659 4362677
35813 4362677 4381898 4229559 3895434 3464493 3080516 2855254 2797405 2826438 2856992 2867508
35803 2867508 2891145 2962939 3095623 3290466 3533583 3773770 3934922 3969384 3882501 3694651
35793 3694651 3404990 3013093 2554008 2086469 1666006 1359425 1264074 1461017 1937678 2584144
35783 2584144 3268701 3889987 4361744 4603232 4585303 4369586 4070725 3774287 3491168 3174560
35773 3174560 2770930 2270329 1724630 1218612 829212 622453 663351 968562 1428418 1827408
35763A827408J68704n9467j61716j61669j49719j69755k22173l17555m55931n72628
35753b74501n71665m27193k17480m6452N0960J26187K56825M61702O55836P03126
35743G17345N46979K84302P1066n1095j90072m41791p35577q92397q24822o24144
35733b140206m36598l03686j61119M2333K85268N23322P30563Q67222Q66593P13624
35723I87316N11982M07589M34058M75633L96892J76192r9363l27367m45461m27096
35713B090375k81741p4963Q3753J07037m992j66228k74803k86538k25595j35049
35703H31256l5737N9243J11733P5236m4384j64173j83948q1203N6759J10609N7436
35692G92827J7753J43190M39960P26837P90841N67786J57018k94050o65226q59940
$$ plain form
35763 1827408 1996112 1936645 1774929 1613260 1463541 1293786 1071613 754058 298127 -274501
35753 -274501 -846166 -1273359 -1490839 -1537291 -1486331 -1360144 -1103319 -641617 14219 717345
35743 717345 1264324 1548626 1619692 1568597 1378525 936734 201157 -691240 -1516062 -2140206
35733 -2140206 -2576804 -2880490 -3041609 -2999276 -2714008 -2190686 -1460123 -592901 273692 987316
35723 987316 1499298 1906887 2340945 2816578 3213470 3389662 3290299 2962932 2517471 2090375
35713 2090375 1808634 1733671 1817424 1924461 1919469 1753241 1478438 1191900 966305 831256
35703 831256 795519 854762 966495 1041731 997347 833174 649226 568023 624782 735391 792827
35692 792827 810580 953770 1393730 2120567 2911408 3479194 3636212 3342162 2676936 1816996
35682A816996q25634o14744l71189k11466j38118q6051j8376N1399J01298J26230
35672a69655J29441J11585O6126j6759j24668k01935j86441q0732L8620R1468
35662c42950M8021q3311k68115m27437m65861l66610k28891j70261k11603k81729
35652b798747k99056k17539l7269J79199L33835L89809M14969M76755N24888M46548
35642e86608K21753m5508k42841l26011k85365j23750J00335K72776L13286K36302
35632d65631J05624l1568j47646k18894k41024k32554k01062j35967n0891Q713
35622a610900K9627O3407J52311K47759K50076J25876m6186j46058j09386L3156
35612a010318J82226K35710J59077R732j11273j37805p5813K1203R6988J14910
$$ plain form
35682 1816996 991362 376618 5429 -206037 -344155 -430206 -448582 -397183 -295885 -169655
35672 -169655 -40214 71371 137497 120738 -3930 -205865 -392306 -473038 -434418 -342950
35662 -342950 -294929 -378240 -646355 -1073792 -1539653 -1906263 -2135154 -2305415 -2517018 -2798747
35652 -2798747 -3097803 -3315342 -3352611 -3173412 -2839577 -2449768 -2034799 -1558044 -1033156 -586608
35642 -586608 -364855 -410363 -653204 -979215 -1264580 -1388330 -1287995 -1015219 -701933 -465631
35632 -465631 -360007 -391575 -539221 -758115 -999139 -1231693 -1432755 -1568722 -1619613 -1610900
35622 -1610900 -1581273 -1517866 -1365555 -1117796 -867720 -741844 -788030 -934088 -1043474 -1010318
35612 -1010318 -828092 -592382 -433305 -423573 -534846 -672651 -748464 -727261 -630273 -515363
35602e15363N7719o8235k16082l02354k62519j17211L8187J27678J61605J94819
35592i01756K45317K84316K84962K42815J63606P1019J1607K625j6116j20964
35582B67431k91178m13341m11193l17567k03305r6669n157L9778J0820p1459j60033
35571a651873k23453k46654k31011k22311k87931m17343m87770l92038j76137
35562d336521J3152J04053J61914K82432M87175P32742R60081J104524J100579
35553F10131R18631N90296J87237k10895n29007p13313p60346p15500o25402m99676
35543a747844l31447j47139j8493j3783j30394k75593l25782k17364J7458K96580
35533b893801N49961P35026Q24680Q11421P15267N67169L91134K14736P6607n318
$$ plain form
35602 -515363 -457644 -525879 -741961 -1044315 -1306834 -1424045 -1385858 -1258180 -1096575 -901756
35592 -901756 -656439 -372123 -87161 155654 319260 390279 401886 404511 388395 267431
35582 267431 -23747 -437088 -848281 -1165848 -1369153 -1465822 -1470979 -1431201 -1420381 -1491840 -1651873
35571 -1651873 -1875326 -2121980 -2352991 -2575302 -2863233 -3280576 -3768346 -4160384 -4336521
35562 -4336521 -4323369 -4219316 -4057402 -3774970 -3287795 -2555053 -1594972 -490448 610131
35553 610131 1528762 2119058 2306295 2095400 1566393 853080 92734 -622766 -1248168 -1747844
35543 -1747844 -2079291 -2226430 -2244923 -2258706 -2389100 -2664693 -2990475 -3207839 -3190381 -2893801
35533 -2893801 -2343840 -1608814 -784134 27287 742554 1309723 1700857 1915593 1992200 1986882
35523A986882o3282j48249k69214l82867m38186m13610l22251k05835j14315o2725
35513d33652j2514P8534J95292K83251L18366L21919L09928K72367K11864J60492
35503A705847J37022J17799P0358p443r4380j61424j64339o0475J27522K84349
35493A954836K81631R1993j88859m22406n15154m54257l02240j60529j02508j22383
35483F0124j58652j65271j38504p9658K3259J51976K35822K26714J85395K30672
35473E71877L82087N07824M75884L19419J87039J45868J15379J2794j19466j85421
35463B413284j70963j30451p6642K2682J44178K00552J60571R8045P4770M1290
35453B777316p9332k53461l62716l56574l07965l07651l63121m24780m62091m74186
$$ plain form
35523 1986882 1923600 1775351 1506137 1123270 685084 271474 -50777 -256612 -370927 -433652
35513 -433652 -446166 -367632 -172340 110911 429277 751196 1061124 1333491 1545355 1705847
35503 1705847 1842869 1960668 2031026 2023583 1929203 1767779 1603440 1542965 1670487 1954836
35493 1954836 2236467 2328460 2139601 1717195 1202041 747784 445544 285015 182507 60124
35483 60124 -98528 -263799 -402303 -481961 -458702 -306726 -70904 155810 341205 571877
35473 571877 953964 1461788 1937672 2257091 2444130 2589998 2705377 2718171 2598705 2413284
35463 2413284 2242321 2111870 2035228 2057910 2202088 2402640 2563211 2661256 2736026 2777316
35453 2777316 2697984 2444523 2081807 1725233 1417268 1109617 746496 321716 -140375 -614561
35443f14561m53605l84278k72250j46177k0489J19407K81522M29509N00086M63392
35433i7444L57612K56831K07782K01457J96893J58166P1902m8944j66159k33465
35423I04631k27666j62319o9431K1427Q3587R5384O1489K0899J3272M2432Q7345
35412H71050J35112J77090J81551J06666n1499k49848m40992n93581o64385n98682
35402a127518l96348j49239L2567J20949J58593J63357J01746l1968j67388k27243
35392a522492k13124j82242j58393j10528j7202Q9101J57174J72403J59883J44155
35382a481265J20462O6808j6099p7505m3944J05835K95385M01001L55026J90445
35372h3851r009j75953k74739k88473k22697j11342L549R3079J31644Q8183l7768
$$ plain form
35443 -614561 -1068166 -1452444 -1724694 -1870871 -1891360 -1771953 -1490431 -1060922 -560836 -97444
35433 -97444 260168 516999 724781 926238 1123131 1281297 1353199 1304255 1138096 904631
35423 904631 676965 514646 445215 466642 550229 645613 707102 728001 741273 783705 871050
35412 871050 1006162 1183252 1364803 1471469 1419970 1170122 729130 135549 -528836 -1127518
35402 -1127518 -1523866 -1673105 -1640538 -1519589 -1360996 -1197639 -1095893 -1127861 -1295249 -1522492
35392 -1522492 -1735616 -1917858 -2076251 -2186779 -2203981 -2114880 -1957706 -1785303 -1625420 -1481265
35382 -1481265 -1360803 -1293995 -1310094 -1387599 -1431543 -1325708 -1030323 -629322 -274296 -83851
35372 -83851 -92860 -268813 -543552 -832025 -1054722 -1166064 -1162515 -1069436 -937792 -849609 -887377
35361h87377j76403k25277j46585n619J03786J49708J54310J19680J3348j58825
35351a059254l08126l32889k22993o0957P8105J89168K89347L50626L22580K09321
35341e45072Q3459J6635K1904P0906J40042K19985K93866L29253K97767J99812
35331A128557P0518m0789j04360j26745j35167j52815j90745k42875k69980k09333
35321b73734m0643J55540K43482J56156m3452k31182l28883l38430l05194k73047
35311a279387k54319k18320j18755N3126K54233M33027N61479O15952N70570M45873
35301A063479L31164L05860L46930L57628K83662J59136L9658o0444j50555k28934
35291B447584k94083l58781m16074m07652k68440j3579K43346L80251L73798L07279
$$ plain form
35361 -887377 -1063780 -1289057 -1435642 -1441261 -1337475 -1187767 -1033457 -913777 -900429 -1059254
35351 -1059254 -1367380 -1700269 -1923262 -1984219 -1906114 -1716946 -1427599 -1076973 -754393 -545072
35341 -545072 -461613 -444978 -423074 -352168 -212126 7859 301725 630978 928745 1128557
35331 1128557 1199075 1158286 1053926 927181 792014 639199 448454 205579 -64401 -273734
35321 -273734 -314377 -158837 84645 240801 197349 -33833 -362716 -701146 -1006340 -1279387
35311 -1279387 -1533706 -1752026 -1870781 -1817655 -1563422 -1130395 -568916 47036 617606 1063479
35301 1063479 1394643 1700503 2047433 2405061 2688723 2847859 2887517 2827073 2676518 2447584
35291 2447584 2153501 1794720 1378646 970994 702554 688975 932321 1312572 1686370 1993649
35281A993649K74088K89909L07907K96310K65225K18881J23321n4891k99709n53008
35271B861682p49549q31122p61408n61180l07502o5415J59655L71537N19151N38421
35261A174270M43845L20323K25641J53651Q8891K9860n2026j98481l67864m17318
35251A400792k49988M4573K54091K42574N1880j76927l34368l94843l88556l54611
35241I4617l14735k76445k51616k61159l15588l96192m56864m39300k99130m8679
35231b965091K17650L71935L55185K26747J03458O1786J02024J77605K32855K26272
35221h89574J46571J4595j31629k48280k89962k29730q4107J01794K96902M82688
35211h30732O06627N89187M13307J72983j0673j03954j56061k04043k32447k21691
$$ plain form
35281 1993649 2267737 2557646 2865553 3161863 3427088 3645969 3769290 3714399 3414690 2861682
35271 2861682 2112133 1281011 519603 -41577 -349079 -414494 -254839 116698 635849 1174270
35261 1174270 1618115 1938438 2164079 2317730 2406621 2436481 2384455 2185974 1818110 1400792
35251 1400792 1150804 1195377 1449468 1692042 1743922 1566995 1232627 837784 449228 94617
35241 94617 -220118 -496563 -748179 -1009338 -1324926 -1721118 -2177982 -2617282 -2916412 -2965091
35231 -2965091 -2747441 -2375506 -2020321 -1793574 -1690116 -1628330 -1526306 -1348701 -1115846 -889574
35221 -889574 -743003 -728408 -860037 -1108317 -1398279 -1628009 -1712116 -1610322 -1313420 -830732
35211 -830732 -224105 365082 778389 951372 940699 836745 680684 476641 244194 22503
35201B2503j88313j66287j78022k26746k87125k99866k08923j8418K06729M02859
35191i41609N50272O52058O99384O73884N67962L89633J60397p8980k72840l82257
35181B017904m20543m49533n23794o25388o61760n50454l07628l0528K06147L97066
35171i48511N39528N79335M76642K92508J43720P7127M4369j639m8206p4362r9814
35160I80697j48558k05144k43177k68163k97638l19096k99971k29941j31114l4378
35150a196483M1618J01227J71056K69311L67219M08237L79815L31859K96808K25520
35140A396187N0568j97373l82721l86775k16600Q478J60916J98553J76497J74381
35130I82111K11519K45226K52604K75976L54444M36726M13701K40718q577k14075
$$ plain form
35201 22503 -165810 -332097 -510119 -736865 -1023990 -1323856 -1532779 -1551197 -1344468 -941609
35191 -941609 -391337 260721 960105 1633989 2201951 2591584 2751981 2673001 2400161 2017904
35181 2017904 1597361 1147828 624034 -1354 -663114 -1213568 -1521196 -1551724 -1345577 -948511
35171 -948511 -408983 170352 646994 939502 1083222 1160349 1204718 1203079 1154873 1080511 980697
35160 980697 832139 626995 383818 115655 -181983 -501079 -801050 -1030991 -1162105 -1196483
35150 -1196483 -1154865 -1053638 -882582 -613271 -246052 162185 542000 873859 1170667 1396187
35140 1396187 1446755 1249382 866661 479886 263286 271764 432680 631233 807730 982111
35130 982111 1193630 1438856 1691460 1967436 2321880 2758606 3172307 3413025 3404448 3190373
35120C190373l03265k74649j72519n9780J3547M0728M8323N2153M5126L0910L2801
35109B643748N0933M5125j1092q7134j38882j71374k18666k79550l19522l26709
35099A186877l15117k75236j81723o2593P714K3522R2339K92109N20160N75600
35089A863652L98492J47352P602j1890m3124j70566l45680m70218m98903m51495
35079D25222l71634k93400k20293j22683K4332J94061L19040L51607K92757J65168
35069G64177n905j76401k86873l05778k47343j35999J2088J55444K22925J86387
35059A82722J07891O8610P5220Q8514J21030K29977M02184N14796M50456K21106
35049B462506m3153j98437j74000j2304J38859J17721j10638m12878o18468o76563
$$ plain form
35120 3190373 2887108 2612459 2439940 2380160 2393707 2434435 2482758 2534911 2580037 2610947 2643748
35109 2643748 2694681 2739806 2728714 2641580 2502698 2331324 2112658 1833108 1513586 1186877
35099 1186877 871760 596524 414801 352208 359922 383444 475783 767892 1288052 1863652
35089 1863652 2262144 2409496 2417098 2405208 2362084 2191518 1845838 1375620 876717 425222
35079 425222 53588 -239812 -460105 -582788 -558456 -364395 -45355 306252 599009 764177
35069 764177 758272 581871 294998 -10780 -258123 -394122 -382034 -226590 -3665 182722
35059 182722 290613 359223 434443 522957 643987 873964 1276148 1790944 2241400 2462506
35049 2462506 2419353 2220916 2046916 2034612 2173471 2291192 2180554 1767676 1149208 472645
35039D72645o55132o15512n42710l94398j69350Q1019K75121L35122K39820N5746
35029i17629j14074k19452k75318k92989k50697j45677k1818Q8716K10514L67521
35019a570903N06741N28156L88622J50338o2430j35407k6720J91057L62213L74593
35009G06260K63000J49720Q6421R313j38545l04897l89347l59987k54710r8988
34999c31760J03781K98461L71103K64334O5888p2445j02733j23970k39947m07999
34989a75287m68737l21945l7594K18492L38126L30791K67406K15684K22477K97713
34979H87126L82904L70062J95584q5759l38285m50201l94867k20997k3189Q8776
34969D11154M5999j20929k91545l45101k48000o1696J17196K19025K23750J49062
$$ plain form
35039 472645 -182487 -797999 -1340709 -1735107 -1904457 -1823438 -1548317 -1213195 -973375 -917629
35029 -917629 -1031703 -1251155 -1526473 -1819462 -2070159 -2215836 -2237654 -2148938 -1938424 -1570903
35019 -1570903 -1064162 -536006 -147384 2954 -59476 -194883 -221603 -30546 331667 706260
35009 706260 969260 1118980 1205401 1214714 1076169 771272 381925 21938 -232772 -331760
34999 -331760 -227979 70482 441585 705919 771807 699362 596629 472659 232712 -175287
34989 -175287 -644024 -965969 -1003563 -785071 -446945 -116154 151252 366936 589413 887126
34979 887126 1270030 1640092 1835676 1749917 1411632 961431 566564 345567 322378 411154
34969 411154 457153 336224 44679 -300422 -548422 -610118 -492922 -273897 -50147 98915
34959I8915L1010q4275j45860j20648k2173R6631J91048K51800K75399K36862
34949H08709J27827N881m5193j5361J1217m3929j62955k63044k92371k66282k24048
34938c59549j81462j28805o1466q183j9050j02096j75284j26452N5020K44252
34928h63075L13304K66476K05077J93466K17548K45755K48397J60532p7262m00886
34918E09332o20025n95857l83079j49731o76O3630O1223m605r1561j11511j2516
34907a335376J67596L44588M53268M65070L82854K36746N9195j38458l29241m20307
34897a14065l17409p8876O2781q4509m48944p47826p64155n23165k02849N6254
34887c162763K20321L06359L35556L43367L79640M63603N51444N72837N01933
$$ plain form
34959 98915 129925 45650 -100210 -220858 -243031 -146400 44648 296448 571847 808709
34949 808709 936536 942417 897224 881863 893080 849151 686196 423152 130781 -135501 -359549
34938 -359549 -541011 -669816 -731282 -739465 -758515 -860611 -1035895 -1162347 -1107327 -863075
34928 -863075 -549771 -283295 -78218 115248 332796 578551 826948 987480 910218 509332
34918 509332 -110693 -706550 -1089629 -1239360 -1240036 -1176406 -1115183 -1119788 -1211349 -1322860 -1335376
34907 -1335376 -1167780 -823192 -369924 95146 478000 714746 773941 635483 306242 -114065
34897 -114065 -431474 -510350 -447569 -532078 -981022 -1728848 -2493003 -3016168 -3219017 -3162763
34887 -3162763 -2942442 -2636083 -2300527 -1957160 -1577520 -1113917 -562473 10364 512297
34878E12297L79290K60321J57175M7097o9478j45351j33888m4937O5223J55740
34868A183489K35890L32957M34165M69232L59714R9866k06016m04244m14297k97640
34858A793116j96973k06617l06380m09312m47956m07512l02387j54735l219R1119
34848e50856P8051l1596j61330k30168k17006j55918q0589k482N3726L3036r5051
34837a360183k73468l81103l29939j32758J16387L10975L89941L62095K95695
34828a002358K75286L46852M87499O19299O56346N56236L40965P0134k02776m39173
34818A708310n93765o23240n34117l92117k57419j32997j334J22055K16832L10256
34808a77536M33485N31420M93838L05101J02713M1209J30625K45086K61186J53272
$$ plain form
34878 512297 891587 1151908 1309083 1356180 1286702 1141351 1007463 962526 1027749 1183489
34868 1183489 1419379 1752336 2186501 2655733 3015447 3115313 2909297 2505053 2090756 1793116
34858 1793116 1596143 1389526 1083146 673834 225878 -181634 -484021 -638756 -641975 -550856
34848 -550856 -472805 -504401 -665731 -895899 -1112905 -1268823 -1349412 -1351894 -1298168 -1265132 -1360183
34837 -1360183 -1633651 -2014754 -2344693 -2477451 -2361064 -2050089 -1660148 -1298053 -1002358
34828 -1002358 -727072 -380220 107279 726578 1382924 1939160 2280125 2350259 2147483 1708310
34818 1708310 1114545 491305 -42812 -434929 -692348 -825345 -826679 -704624 -487792 -177536
34808 -177536 255949 787369 1281207 1586308 1689021 1730230 1860855 2105941 2367127 2520399
34798B520399j6809j57596k09945j92800j83551k27371k81298k77684k20559j72919
34788E79867j59440j35632o1053M4023J31464J73615J54748N0459j44928l80380
34778B52743n65246o25997n41939l46271j13660O8774J52757J60462J50901J52362
34768a255114J40709Q4407o378q1691q8584o14J67619L52697M59687M21153K56307
34757D50198O0380p6860j37320j58724j72831j76937j54147r6988j1191Q2290
34747c92130J42844J26250K0455j35443k70636l23423k77699j75812q9413n9365
34737a434372o6348p3264q2399j22061j86477k30011k25627j89061j33914m5735
34727b789269P7185J95688K69548K91094K55114J43514j5290j17505q3798L3215
$$ plain form
34798 2520399 2503590 2345994 2136049 1943249 1759698 1532327 1251029 973345 752786 579867
34788 579867 420427 284795 223742 267765 399229 572844 727592 778051 633123 252743
34778 252743 -312503 -938500 -1480439 -1826710 -1940370 -1871596 -1718839 -1558377 -1407476 -1255114
34768 -1255114 -1114405 -1029998 -1036376 -1118067 -1206651 -1207265 -1039646 -686949 -227262 193891 450198
34757 450198 510578 433718 296398 137674 -35157 -212094 -366241 -463229 -474420 -392130
34747 -392130 -249286 -123036 -102581 -238024 -508660 -832083 -1109782 -1285594 -1375007 -1434372
34737 -1434372 -1500720 -1573984 -1656383 -1778444 -1964921 -2194932 -2420559 -2609620 -2743534 -2789269
34727 -2789269 -2712084 -2516396 -2246848 -1955754 -1700640 -1557126 -1572416 -1689921 -1773719 -1740504
34717a740504J11446J20455J45904K46658L64434M04628L42152K08856L7632j23034
34707A18627j84966q8202J12383K83427L38000K84364J60970j5191k17350l80171
34697D11891m45078m12610l17304j69109M0631K79286M62071N21330M65561L53793
34687A190462K33043J24658N1817L6730O6342J00351J30735J97958L19100M30679
34677B881875M46620L55970K14901N4218j37444l25113m00550l04436j30720l3339
34667B621982m2208m8327J8031P5040N643j67931k99039k90011j81047n8919N3345
34656A686559J74629K81155L06513K19384N6511j20684k60129l08567k24950m1804
34646A768617J20039J46976M1889q8547j49465j33664q9762n4681l3146j7614
$$ plain form
34717 -1740504 -1629058 -1508603 -1362699 -1116041 -751607 -346979 -4827 204029 241661 118627
34707 118627 -66339 -154541 -42158 241269 579269 863633 1024603 1009412 792062 411891
34697 411891 -33187 -445797 -763101 -932210 -891579 -612293 -150222 371108 836669 1190462
34687 1190462 1423505 1548163 1599980 1636710 1703052 1803403 1934138 2132096 2451196 2881875
34677 2881875 3328495 3684465 3899366 3953584 3816140 3491027 3090477 2786041 2655321 2621982
34667 2621982 2579774 2531447 2549478 2624518 2630161 2462230 2163191 1873180 1692133 1633214 1686559
34656 1686559 1861188 2142343 2448856 2668240 2724751 2604067 2343938 2035371 1810421 1768617
34646 1768617 1888656 2035632 2077521 1988974 1839509 1705845 1616083 1561402 1528256 1510642
34636A510642l977O654J0040Q274K2629Q3314J89972K86553K94245J80226r824
34625B578748j94021l28061m30730n34935o25041o38931n36280l56450k04350
34616a270051j79588l06572n07911o40533n87832l49354m3870J85452K68959K21845
34606c209455R1666p7505k42653l58271l87829l16624j64411Q161J32915K00424
34596d323582K69904L76200M51205L99340K49060J55433K18084L53207L97660
34587a453489L02073J60813P1901L7351R801k6464n8399r3001j60673k75401m13240
34576a898728n24569n54737m69371k86555p9266Q1265J88148K83328L79582M32633
34566b448270M08079L40795K87173K36432J25031m6883j60686q3697J80063M71591
$$ plain form
34636 1510642 1506665 1513319 1523359 1531633 1554262 1637576 1827548 2114101 2408346 2588572 2578748
34625 2578748 2384727 2056666 1625936 1091001 465960 -172971 -709251 -1065701 -1270051
34616 -1270051 -1449639 -1756211 -2264122 -2904655 -3492487 -3841841 -3885711 -3700259 -3431300 -3209455
34606 -3209455 -3117789 -3195294 -3437947 -3796218 -4184047 -4500671 -4665082 -4656921 -4524006 -4323582
34596 -4323582 -4053678 -3677478 -3226273 -2826933 -2577873 -2422440 -2204356 -1851149 -1453489
34587 -1453489 -1151416 -990603 -918702 -881351 -871550 -898014 -956413 -1049414 -1210087 -1485488 -1898728
34576 -1898728 -2423297 -2978034 -3447405 -3733960 -3813226 -3731961 -3543813 -3260485 -2880903 -2448270
34566 -2448270 -2040191 -1699396 -1412223 -1175791 -1050760 -1097643 -1258329 -1342026 -1161963 -690372
34556f90372O13721N56894L95159K55722J84364J40854R3145Q0155J52510K74812
34546B056964L44561L20476K78988L06819L72958L53572J70577j30285m28378
34537C646252o22582o86050o59624n92948m81793k84668j7799K06537K82026K23158
34527A012509J27766M7436m2416j56309k58916l24554l68994l95010l61092k37061
34517i56641m9793J52462L39101M73898N00725L97354K16909L9334r7289j89292
34507H26768k21515j71490n1365Q0978J48663R1233r1444l08017m23734l79060
34497d98983k46609j47521j34821j81920k47004k99936l08406k56468j80908j45411
34487b647987j65101j81551j20763L8174K46430M15978M72851M09948K98644K36349
$$ plain form
34556 -690372 -76651 480243 875402 1131124 1315488 1456342 1549487 1629642 1782152 2056964
34546 2056964 2401525 2722001 3000989 3307808 3680766 4034338 4204915 4074630 3646252
34537 3646252 3023670 2337620 1677996 1085048 603255 318587 300788 507325 789351 1012509
34527 1012509 1140275 1187711 1145295 988986 730070 405516 36522 -358488 -719580 -956641
34517 -956641 -1006434 -853972 -514871 -40973 459752 857106 1074015 1113349 1016060 826768
34507 826768 605253 433763 382398 463376 612039 703272 611828 303811 -119923 -498983
34497 -498983 -745592 -893113 -1027934 -1209854 -1456858 -1756794 -2065200 -2321668 -2502576 -2647987
34487 -2647987 -2813088 -2994639 -3115402 -3077228 -2830798 -2414820 -1941969 -1532021 -1233377 -997028
34477i97028K71979L73933M56095M36292K96952J04854m6723j27151j81590k52721
34467C34892l28397l83345m21662m33445l51101j18905K00207M48878N22425M54235
34457g6218L43473K34599R3153j16019l52701n14602n29286m24985k93864j90272
34447a826722r4538K3116J49071K55994L40028L95830L97068L43941K92410K87066
34437E63264K97688K75535K38616K34915K45967K04181R7576k0122j27850k68337
34427A741433m58619o32433p01181o28195m26328j32479J90614M67979O51779
34418G2570P22837O58436M52121J73754n1225j50994j55834j27015r3033p3208
34408A428409r4238j38895j32935l6250R0339J58628J64121J77356K44740L35591
$$ plain form
34477 -997028 -725049 -351116 104979 541271 838223 943077 896354 769203 587613 334892
34467 334892 6495 -376850 -798512 -1231957 -1583058 -1701963 -1501756 -1052878 -530453 -76218
34457 -76218 267255 501854 595007 478988 126287 -388315 -917601 -1342586 -1636450 -1826722
34447 -1826722 -1921260 -1898144 -1749073 -1493079 -1153051 -757221 -360153 -16212 276198 563264
34437 563264 860952 1136487 1375103 1610018 1855985 2060166 2157742 2137620 2009770 1741433
34427 1741433 1282814 650381 -50800 -678995 -1105323 -1237802 -1047188 -579209 72570
34418 72570 795407 1453843 1905964 2079718 2028493 1877499 1721665 1594650 1501617 1428409
34408 1428409 1334171 1195276 1062341 1026091 1116430 1275058 1439179 1616535 1861275 2196866
34398B196866L69506K69353J8129k97750n22929n48843l90685j46204P9833J95117
34388A222393J35572o9084k78097l55980k97812j94144r4971L1387K14418M17612
34378G31294N66449O01582N09182L39462J86256J01565L5460r2606k71182m02590
34368B304872m30020l93423l44967k78943j84143j06367r4734j10189n1661J15880
34358D26305K97525L54691K44993O2804n8691p4698m8802n7104j04940j51781
34348H90302j81504k05356k13095j74752r7406l4323j9013k5326j5695q3j7259
34337i3510p2030j18483j06684l6300L3603K7706p9244k31844l36557l36076k37406
34326a586825q1820Q7052K31704L33082M06162M79736N52085N89126N72674N23489
$$ plain form
34398 2196866 2566372 2835725 2853854 2556104 2033175 1484332 1093647 947443 1027276 1222393
34388 1222393 1357965 1288881 1010784 654804 356992 162848 67877 99264 313682 731294
34378 731294 1297743 1899325 2408507 2747969 2934225 3035790 3071250 2978644 2707462 2304872
34368 2304872 1874852 1481429 1136462 857519 673376 567009 472275 362086 310425 426305
34358 426305 723830 1078521 1323514 1386318 1327627 1252929 1204127 1147023 1042083 890302
34348 890302 708798 503442 290347 115595 18189 -16134 -35147 -60473 -76168 -76251 -93510
34337 -93510 -165540 -284023 -390707 -427007 -393404 -365698 -444942 -676786 -1013343 -1349419 -1586825
34326 -1586825 -1668645 -1581593 -1349889 -1016807 -610645 -130909 421176 1010302 1582976 2106465
34316B106465M64876L90376K83695J47924l359j67439l50330n54787p70750r53549
34306E93122j014791q82366n92786k88233r4440k6923k7048l3704J6516J91691
34296b158962M80861P32688P67312N64788K86622J04340N8694Q3464R3253K7176
34286A040236j22433k82994l54756l29064l04152l42614l69011k71469o4295J25039
34276a275513K11768K22661K12344J86733J34843Q2553P5343J26560K01350K39948
34266D18590J96075P4181o8254j71230k17088k07729j25336L6375K16210L20649
34256D72443L18996K51432J45053o031j63611k35758j95129j39695j72408k71147
34246D145l42880l56993l41463k81130j22079J17077L23176M02105L56693K39704
$$ plain form
34316 2106465 2571341 2961717 3245412 3393336 3389977 3222538 2872208 2317421 1546671 593122
34306 593122 -421669 -1304035 -1896821 -2185054 -2279494 -2306417 -2333465 -2367169 -2350653 -2158962
34296 -2158962 -1678101 -945413 -178101 386687 673309 777649 836343 919807 1013060 1040236
34286 1040236 917803 634809 280053 -49011 -353163 -695777 -1064788 -1336257 -1400552 -1275513
34276 -1275513 -1063745 -841084 -628740 -442007 -307164 -224611 -149268 -22708 178642 418590
34266 418590 614665 688846 620592 449362 232274 24545 -100791 -64416 151794 472443
34256 472443 791439 1042871 1187924 1181893 1018282 782524 587395 447700 275292 4145
34246 4145 -338735 -695728 -1037191 -1318321 -1440400 -1323323 -1000147 -598042 -241349 -1645
34236a645R4075l9020j19928j63134k46629m21617o33246p63075p36979n75649
34226c606847l63197j87064q8932n3449n0667q2934j59618k30624j99246k6136
34216e048714K18463M30772N64515O21265N96930M86644L19130J41649j7692j43253
34206a830291k10067k06946j64671j21497p1335J6854J37092K41074K90210K80153
34196a639424K20024J24417K6793l3668m7040l3155n820M3982J30427K51655L73578
34185e88231M21268L21314R7247j00521j23780J0019J37531J42675P3531M3319
34175D34372P2716Q0198l384j64441l37721m55319m57221l00659q61L37126N53156
34164b42038N27696K67460r1037l65988m38102l07417p4342J31912K33723K40161
$$ plain form
34236 -1645 92430 53410 -66518 -229652 -476281 -897898 -1531144 -2294219 -3031198 -3606847
34226 -3606847 -3970044 -4157108 -4246040 -4299489 -4350156 -4433090 -4592708 -4823332 -5022578 -5048714
34216 -5048714 -4830251 -4399479 -3834964 -3213699 -2616769 -2130125 -1810995 -1669346 -1687038 -1830291
34206 -1830291 -2040358 -2247304 -2411975 -2533472 -2604807 -2587953 -2450861 -2209787 -1919577 -1639424
34196 -1639424 -1419400 -1294983 -1268190 -1301858 -1348898 -1382053 -1387873 -1343891 -1213464 -961809 -588231
34185 -588231 -166963 154351 251598 151077 27297 37316 174847 317522 391053 434372
34175 434372 507088 587286 583902 419461 81740 -373579 -830800 -1131459 -1132320 -795194 -242038
34164 -242038 285658 553118 462081 96093 -342009 -649426 -723768 -591856 -358133 -117972
34154a17972K05540J57621Q6919K930m8469n5023q3566k01982l78345n16598n80263
34143a529208o12763o30499n69665l72528p4992K25356M46254N39387M88894L45536
34133a744228K26463K18552K89144L32545K91425J93493Q7641q10n0443l2267
34123a88485N7664J75348K51005K27472R2715r4629k18340j84287m853K09801
34113C23411L44559L49260K37864O8861o5080q0756J9110J27776J25660n906j71198
34102A273561k55356k27129j55139j30723j73695k18370j98908j33381r7618j24919
34092d41677j72150j93116j98546k10440j91249p1004J56439M01761N54154N66898
34082B01070M69546L21810J68446K7274q9163j45662r7612M7710J99465K51873
$$ plain form
34154 -117972 87568 245189 332108 335038 286569 231546 147980 -54002 -432347 -948945 -1529208
34143 -1529208 -2141971 -2772470 -3342135 -3714663 -3789655 -3564299 -3118045 -2578658 -2089764 -1744228
34133 -1744228 -1517765 -1299213 -1010069 -677524 -386099 -192606 -104965 -105775 -156218 -188485
34123 -188485 -130821 44527 295532 523004 615719 521090 302750 118463 113610 323411
34113 323411 667970 1017230 1255094 1323955 1258875 1178119 1197229 1325005 1450665 1444759 1273561
34102 1273561 1018205 791076 635937 505214 331519 113149 -85759 -219140 -316758 -441677
34092 -441677 -613827 -806943 -1005489 -1215929 -1407178 -1478182 -1321743 -919982 -365828 201070
34082 201070 670616 992426 1160872 1188146 1098983 953321 855709 903419 1102884 1354757
34072A354757J89437Q9687J2408p0276k01825l35803l61040k35717n1963N4353
34062D44018L4672m9967j18053j50681j85026k46868l08714l19736k67111j89259
34052a356725j22367n4907M0841J44167J90289J49199O9124K0507J8959K7865
34042h73048J6863j7531p9879j81232l05638m05546m51896m64063m63692m17765
34032c643427k66427j0195K62409M49300N16713M93098M07171K66972R3599o6579
34022a497366j83615k72177l52228l97272l52934k05131o684J61745K36802J92279
34012b676581N8218p1810r8209r076J11237J89468K43727L21734L96492L84941
34002a149859K61088R2310m1989j14151j18757l8893J17770K82162L64281L21120
$$ plain form
34072 1354757 1544194 1633881 1646289 1576013 1374188 1038385 677345 441628 389665 444018
34062 444018 478690 428723 310670 159989 -25037 -271905 -580619 -900355 -1167466 -1356725
34052 -1356725 -1479092 -1533999 -1493158 -1348991 -1158702 -1009503 -940379 -919872 -900913 -873048
34042 -873048 -856185 -873716 -953595 -1134827 -1440465 -1846011 -2297907 -2761970 -3225662 -3643427
34032 -3643427 -3909854 -3920049 -3657640 -3208340 -2691627 -2198529 -1791358 -1524386 -1430787 -1497366
34022 -1497366 -1680981 -1953158 -2305386 -2702658 -3055592 -3260723 -3267407 -3105662 -2868860 -2676581
34012 -2676581 -2618363 -2690173 -2788382 -2797458 -2686221 -2496753 -2253026 -1931292 -1534800 -1149859
34002 -1149859 -888771 -796461 -838450 -952601 -1071358 -1110251 -992481 -710319 -346038 -24918
33992b4918J69407m0636k36241l35877k99878j69430k8370P3898J45425K11300
33982e35320K78900L37770L64780L28675K18291P5639j9663j4385P0715J54075
33972A259477J51682M1932j05802j81919j47116q7497j27279k88428m73174n87293
33962e45417o31828o50942o36949n37460l40707j08944P6220J75284J99747J87903
33952b813093J79626J97975K46365L22774M21637N08638N15049L91415J64793
33943A35179q2918k86714m15692m29909k85141j7570K18666K61090R6182j19459
33933i26286k03617j06118O7418J66007J24795L892q8680j01402n7386J4773J22058
33922i84546K59242L64055L68710K76963J41792j7381k11589l95100m58184l48928
$$ plain form
33992 -24918 144489 103853 -132388 -468265 -768143 -937573 -965943 -892045 -746620 -535320
33982 -535320 -256420 81350 446130 774805 993096 1068735 1049072 1034687 1105402 1259477
33972 1259477 1411159 1453091 1347289 1165370 1018254 930757 803478 515050 41876 -545417
33962 -545417 -1177245 -1828187 -2465136 -3002596 -3343303 -3452247 -3376027 -3200743 -3000996 -2813093
33952 -2813093 -2633467 -2435492 -2189127 -1866353 -1444716 -936078 -421029 -29614 135179
33943 135179 52261 -234453 -650145 -1080054 -1365195 -1382765 -1164099 -903009 -806827 -926286
33933 -926286 -1129903 -1236021 -1168603 -1002596 -877801 -873909 -962589 -1063991 -1121377 -1106604 -984546
33922 -984546 -725304 -361249 7461 284424 426216 408835 197246 -197854 -656038 -1004966
33912a004966j52482k23O7505J02386J45771J89524K28022K79674L36562L42012
33902E33785K51213R0504o6562j65850k01218j97221j83869j77159j68805j42596
33892d27778j08001r8947j22935j30135o4227N7415J43962J25855L2451m3105
33882f35445m7790j4561k003j6316j8178Q541L6158M9536Q1245J56366K28772
$$ plain form
33912 -1004966 -1157448 -1157671 -1090166 -987780 -842009 -652485 -424463 -144789 191773 533785
33902 533785 784998 875502 808940 643090 441872 244651 60782 -116377 -285182 -427778
33892 -427778 -535779 -634726 -757661 -887796 -952023 -894608 -750646 -624791 -592340 -635445
33882 -635445 -683235 -697796 -699799 -716115 -734293 -725752 -689594 -640058 -558813 -402447 -173675
$$ [...]
##END NTUPLES=NMR SPECTRUM
##END=
