##TITLE=31Pdec_105-2025-Bay
CDCl3, 24 sc
 1.9.2025
##JCAMPDX= 6.0         $$ Bruker NMR JCAMP-DX V2.0
##DATA TYPE= NMR SPECTRUM
##DATA CLASS= NTUPLES
##ORIGIN= UXNMR, Bruker Analytische Messtechnik GmbH
##OWNER= root
$$ XWIN-NMR		Version 3.5
$$ Mon Sep  1 14:44:21 2025 Russian Standard Time (UT+4h)  she@DPX200
##.OBSERVE FREQUENCY= 81.013821
##.OBSERVE NUCLEUS= ^31P
##.ACQUISITION MODE= SIMULTANEOUS
##.ACQUISITION SCHEME= undefined
##.AVERAGES= 24
##.DIGITISER RES= 17
##SPECTROMETER/DATA SYSTEM= spect
##.PULSE SEQUENCE= zgpg30
##.SOLVENT NAME= CDCl3
##.SHIFT REFERENCE= (INTERNAL, CDCl3, 0, 198.062)
##AUDIT TRAIL= $$ (NUMBER, WHEN, WHO, WHERE, WHAT)
$$ ##TITLE= Audit trail, XWIN-NMR		Version 3.5
$$ ##JCAMPDX= 5.01
$$ ##ORIGIN= Bruker BioSpin GmbH
$$ ##OWNER= she
$$ F:/spectra/data/she/nmr/P31/2/pdata/1/auditp.txt
$$ ##AUDIT TRAIL=  $$ (NUMBER, WHEN, WHO, WHERE, WHAT)
(   1,<2025-09-01 14:43:05.51 +0400>,<she>,<DPX200>,
      <created by zg, POWCHK disabled, PULCHK disabled
       configuration hash MD5:
       00 E9 B6 7A A2 85 ED C7 34 08 36 98 17 FE 4E 26
       data hash MD5: 32K
       77 37 1F 0A 30 95 65 DD 0C C6 DC 87 D7 C8 1F 8C>)
(   2,<2025-09-01 14:43:08.92 +0400>,<she>,<DPX200>,
      <Start of raw data processing
       efp BC_mod = 2 LB = 1.5 FT_mod = 6 PKNL = 1 PHC0 = 1348.142 PHC1 = 162.4999 SI = 64K 
       data hash MD5: 64K
       06 39 A2 88 9C 08 B0 C7 0A 60 59 73 1A 1A 6C 95>)
(   3,<2025-09-01 14:43:28.00 +0400>,<she>,<DPX200>,
      <pk PHC0 = 7.980678 PHC1 = 0 
       data hash MD5: 64K
       72 94 13 81 6F 17 F8 64 48 B3 C8 1D 00 B4 A9 0E>)
(   4,<2025-09-01 14:43:46.96 +0400>,<she>,<DPX200>,
      <pk PHC0 = -3 PHC1 = 0 
       data hash MD5: 64K
       0A 3B FD FA 1D 06 47 42 BA 1F 7D 1B 03 93 FC AF>)
$$ ##END=
$$ 
$$ hash MD5
$$ 7C 29 77 BB 00 D8 D8 74 1E D1 41 F5 9C 42 0F 17
##$RELAX= 
##$RELAX= 
##$RELAX= 
##$RELAX= 
##$RELAX= 
##$RELAX= 
##$RELAX= 
##$RELAX= 
$$ Bruker specific parameters
$$ --------------------------
##$DU= <F:/spectra>
##$EXPNO= 2
##$NAME= <P31>
##$PROCNO= 1
##$TYPE= <nmr>
##$USER= <she>
##$AMP= (0..31)
100 100 100 100 100 100 100 100 100 100 100 100 100 100 100 100 100 100 
100 100 100 100 100 100 100 100 100 100 100 100 100 100 
##$AQSEQ= 0
##$AQ_mod= 1
##$AUNM= <au_zg>
##$AUTOPOS= <>
##$BF1= 81.014009
##$BF2= 200.13
##$BF3= 200.13
##$BF4= 200.13
##$BF5= 200.13
##$BF6= 200.13
##$BF7= 200.13
##$BF8= 200.13
##$BYTORDA= 1
##$CFDGTYP= 0
##$CFRGTYP= 5
##$CHEMSTR= <none>
##$CNST= (0..31)
1 1 145 1 1 1 1 1 1 1 1 1 1 1 1 1 1 1 1 1 1 1 1 1 1 1 1 1 1 1 1 1 
##$CPDPRG= <waltz16>
##$CPDPRG1= <>
##$CPDPRG2= <waltz16>
##$CPDPRG3= <>
##$CPDPRG4= <mlev>
##$CPDPRG5= <mlev>
##$CPDPRG6= <mlev>
##$CPDPRG7= <mlev>
##$CPDPRG8= <mlev>
##$CPDPRGB= <>
##$CPDPRGT= <>
##$D= (0..31)
0 1 0 0 0 0 0 0 0 0.06 0 0.03 2e-05 3e-06 0 0 0.0002 0 0 0 0 0 0 0 0 0 
0 0 0 0 0 0 
##$DATE= 1756723385
##$DBL= (0..7)
120 120 120 11 120 120 24 19 
##$DBP= (0..7)
150 150 150 150 150 150 150 150 
##$DBP07= 0
##$DBPNAM0= <>
##$DBPNAM1= <>
$$ [...]
##$SUBNAM2= <"">
##$SUBNAM3= <"">
##$SUBNAM4= <"">
##$SUBNAM5= <"">
##$SUBNAM6= <"">
##$SUBNAM7= <"">
##$SUBNAM8= <"">
##$SUBNAM9= <"">
##$SW= 400.765351723535
##$SWIBOX= (0..15)
0 1 3 0 0 0 0 0 0 0 0 0 0 0 0 0 
##$SW_h= 32467.5324675325
##$TD= 32768
##$TD0= 1
##$TE= 0
##$TE2= 300
##$TE3= 300
##$TEG= 300
##$TL= (0..7)
0 120 53 12 22 120 120 120 
##$TP= (0..7)
150 150 150 150 150 150 150 150 
##$TP07= 0
##$TPNAME0= <>
##$TPNAME1= <>
##$TPNAME2= <>
##$TPNAME3= <>
##$TPNAME4= <>
##$TPNAME5= <>
##$TPNAME6= <>
##$TPNAME7= <>
##$TPOAL= (0..7)
0.5 0.5 0.5 0.5 0.5 0.5 0.5 0.5 
##$TPOFFS= (0..7)
0 0 0 0 0 0 0 0 
##$TUNHIN= 0
##$TUNHOUT= 0
##$TUNXOUT= 0
##$USERA1= <user>
##$USERA2= <user>
##$USERA3= <user>
##$USERA4= <user>
##$USERA5= <user>
##$V9= 5
##$VALIST= <valist>
##$VCLIST= <CCCCCCCCCCCCCCC>
##$VD= 0
##$VDLIST= <DDDDDDDDDDDDDDD>
##$VPLIST= <PPPPPPPPPPPPPPP>
##$VTLIST= <TTTTTTTTTTTTTTT>
##$WBST= 1024
##$WBSW= 4
##$XGAIN= (0..3)
0 0 0 0 
##$XL= 0
##$YL= 0
##$YMAX_a= 30027
##$YMIN_a= -30445
##$ZGOPTNS= <>
##$ZL1= 120
##$ZL2= 120
##$ZL3= 120
##$ZL4= 120
##$ABSF1= 0
##$ABSF2= 0
##$ABSG= 0
##$ABSL= 0
##$ALPHA= 0
##$AQORDER= 0
##$ASSFAC= 0
##$ASSFACI= 0
##$ASSFACX= 0
##$ASSWID= 0
##$AUNMP= <proc_1d>
##$AZFE= 0.1
##$AZFW= 0.5
##$BCFW= 0
##$BC_mod= 2
##$BYTORDP= 0
##$COROFFS= 0
##$CY= -3
##$DATMOD= 1
##$DC= 0
##$DFILT= <>
##$DTYPP= 0
##$F1P= 0
##$F2P= 0
##$FCOR= 1
##$FTSIZE= 65536
##$FT_mod= 6
##$GAMMA= 0
##$GB= 0
##$INTBC= 1
##$INTSCL= 9.790993e-09
##$ISEN= 30
##$LB= 1.5
##$LEV0= 0
##$LPBIN= 0
##$MAXI= 10000
##$MC2= 0
##$MEAN= 0
##$ME_mod= 0
##$MI= 50
##$NCOEF= 0
##$NC_proc= -3
##$NLEV= 6
##$NOISF1= 182.463
##$NOISF2= 159.3651
##$NSP= 0
##$NTH_PI= 0
##$NZP= 0
##$OFFSET= 198.0616
##$PC= 4
##$PHC0= 1353.123
##$PHC1= 162.4999
##$PH_mod= 1
##$PKNL= yes
##$PPARMOD= 0
##$PSCAL= 0
##$PSIGN= 0
##$REVERSE= no
##$SF= 81.0140089999434
##$SI= 65536
##$SIGF1= 159.3651
##$SIGF2= -187.1042
##$SINO= 113.3802
##$SIOLD= 16384
##$SREGLST= <1H.CDCl3>
##$SSB= 0
##$STSI= 65536
##$STSR= 0
##$SW_p= 32467.5324675325
##$SYMM= 0
##$S_DEV= 0
##$TDeff= 32768
##$TDoff= 0
##$TI= <>
##$TILT= no
##$TM1= 0
##$TM2= 0
##$TOPLEV= 0
##$USERP1= <user>
##$USERP2= <user>
##$USERP3= <user>
##$USERP4= <user>
##$USERP5= <user>
##$WDW= 1
##$XDIM= 65536
##$YMAX_p= 365875032
##$YMIN_p= -1356773
$$ End of Bruker specific parameters
$$ ---------------------------------
##NTUPLES= NMR SPECTRUM
##VAR_NAME=  FREQUENCY,     SPECTRUM/REAL,   SPECTRUM/IMAG
##SYMBOL=    X,             R,               I
##VAR_TYPE=  INDEPENDENT,   DEPENDENT,       DEPENDENT
##VAR_FORM=  AFFN,          ASDF,            ASDF
##VAR_DIM=   65536,         65536,           65536
##UNITS=     HZ,            ARBITRARY UNITS, ARBITRARY UNITS
##FACTOR=    0.49542278885378, 1,            1
##FIRST=     16045.7642231865, 0,            0
##LAST=      -16421.768244346, 0,            0
##MIN=       -16421.768244346, -1356773,     0
##MAX=       16045.7642231865, 365875032,    0
$$ Real data points
##PAGE= N=1
##DATA TABLE= (X++(R..R)), XYDATA
$$ [...]
$$ plain form
39677 10988 -3759 -39876 -34916 34162 106306 114551 69606 33381 40833 79461 120235 138126
39665 138126 122216 92986 93279 138994 193241 208764 182241 150224 143920 161175 173486 154847
39653 154847 112689 84298 85906 81287 33469 -28522 -42895 -6334 27262 40351 74267 140145
39641 140145 179846 154586 110027 102447 110561 78677 11220 -35130 -31448 4190 51677 102700
39629 102700 135946 123292 66774 3174 -31621 -30755 -16505 -21343 -55491 -87221 -73486 -12032
39617 -12032 60754 118764 155800 154024 100424 40232 45850 111574 150094 125318 110194 160397
39605 160397 208431 162017 49594 -23169 -26292 -22654 -48391 -64027 -29951 38546 101565 127708
39593 127708 95523 13475 -58474 -55416 16631 87221 103992 75698 38692 15967 7208 -7500
$$ packed form
39677A0988j4747l6117M960O9078P2144Q245m4945l6225P452L8628M0774J7891
39665A38126j5910k9230K93M5715N4247J5523k6523l2017o304J7255J2311j8639
39653A54847m2158k8391J608m619m7818o1991j4373L6561L3596J3089L3916O5878
39641A40145L9701k5260m4559p580Q114l1884o7457m6350L682L5638M7487N1023
39629A02700L3246j2654n6518o3600l4795Q66J4250m838l4148l1730J3735O1454
39617a2032P2786N8010L7036j776n3600o0192N618O5724L8520k4776j5124N0203
39605A60397M8034m6414j12423p2763l123L638k5737j5636L4076O8497O3019K6143
39593A27708l2185q2048p1949L058P2047P0590J6771k8294l7006k2725q759j4708
$$ plain form
39581 -7500 -46190 -88067 -81814 -16195 50304 64674 48049 48400 64936 69672 61894 41221 -29210
39568 -29210 -157277 -257465 -239940 -139545 -66730 -52486 -43628 -38142 -102966 -236604 -327734
39557 -327734 -296316 -188106 -86794 -16414 21520 -2669 -94151 -189908 -230394 -231070 -233668 -233200
39545 -233200 -204143 -155881 -110153 -59662 3879 56330 80856 104525 149907 188273 189698 180159
39533 180159 192075 195335 145480 73110 48672 69493 60618 -5959 -69703 -83686 -89074 -140283
39521 -140283 -203529 -192266 -89209 23264 64983 48857 44340 76348 100204 75881 27448
39510 27448 6713 23994 47370 57629 67308 84748 92849 74318 35521 -3172 -22841 -10474
39498 -10474 28373 58335 42227 -12595 -60737 -76587 -75628 -69931 -40037 25210 90641 108456
$$ packed form
39581g500l8690m1877O253O5619O6499J4370j6625L51J6536M736p778k0673p0431
39568b9210j28067j00188J7525J00395P2815J4244Q858N486o4824j33638r1130
39557c27734L1418J08210J01312P0380L7934k4189r1482r5757m0486o76k598M68
39545b33200K9057M8262M5728N0491O3541N2451K4526K3669M5382L8366J425r539
39533A80159J1916L260m9855p2370k4438K0821q875o6577o3744j3983n388n1209
39521a40283o3246J1263J03057J12473M1719j6126m517L2008K3856k4323m8433
39510B7448k0735J7281K3376J0259R679J7440Q101j8531l8797l8693j9669J2367
39498a0474L8847K9962j6108n4822m8142j5850R59N697K9894O5247O5431J7815
$$ plain form
39486 108456 74485 24952 -9217 -18041 6195 68468 145451 186942 162143 96472 46102 35658
39474 35658 37118 19100 -1670 14821 62349 81679 35388 -44655 -104196 -127011 -122136 -87746
39462 -87746 -29017 16752 20532 6097 7112 4048 -37172 -83549 -66453 6231 45446 5368
39450 5368 -55457 -63851 -23147 18190 37423 38466 20964 -13817 -50684 -78281 -96564 -96540 -67069
39437 -67069 -31808 -36671 -84875 -127383 -133968 -127385 -129576 -125881 -105678 -84562 -59458 -801 75885
39424 75885 94049 20499 -72942 -109779 -114441 -146500 -179439 -137648 -31899 37370 18594 -29694
39412 -29694 -38700 -25346 -51972 -130282 -203091 -208976 -146206 -76975 -70018 -131774 -201114 -221634
39400 -221634 -203418 -195012 -211878 -222200 -197310 -148359 -108934 -96839 -97095 -79923 -39745 -10416
$$ packed form
39486A08456l3971m9533l4169q824K4236O2273P6983M1491k4799o5671n0370j0444
39474C5658J460j8018k0770J6491M7528J9330m6291q0043n9541k2815M875L4390
39462h7746N8729M5769L780j4435J015l064m1220m6377J7096P2684L9215m0078
39450E368o0825q394M0704M1337J9233J043j7502l4781l6867k7597j8283K4K9471
39437f7069L5261m863m8204m2508o585O583k191L695K0203K1116K5104N8657P6686
39424G5885J8164p3550r3441l6837m662l2059l2939M1791J05749O9269j8776m8288
39412b9694r006J3354k6626p8310p2809n885O2770O9231O957o1756o9340k0520
39400b21634J8216Q406j6866j0322K4890M8951L9425J2095k56J7172M0178K9329
$$ plain form
39388 -10416 -23333 -55957 -52469 5009 82839 153191 214147 245258 210111 133217 105799 163451
39376 163451 218222 179428 92282 75039 151294 234932 269268 288071 326197 354506 338889
39365 338889 301194 277076 253360 191128 91684 4130 -29617 -17939 -4713 -15910 -25055 17321
39353 17321 116886 218656 271657 289827 326005 402976 498572 588695 675991 774885 883780
39342 883780 972932 1001686 963699 908480 882631 851620 735114 535441 365866 313190 331709
39331 331709 322089 256678 166063 60864 -50610 -111566 -78517 -10369 -3629 -52313 -64748
39320 -64748 -13786 28239 15301 -7316 8251 41692 58877 67553 80544 81626 64631 56975
39308 56975 72677 86681 81322 73327 73121 64704 46158 40699 48598 42033 26526 45135 95490
$$ packed form
39388a0416j2917l2624L488N7478P7830P0352O0956L1111l5147p6894k7418N7652
39376A63451N4771l8794q7146j7243P6255Q3638L4336J8803L8126K8309j5617
39365C38889l7695k4118k3716o2232r9444q7554l3747J1678J3226j1197r145M2376
39353A7321R9565J01770N3001J8170L6178P6971R5596R0123Q7296R8894J08895
39342H83780Q9152K8754l7987n5219k5849l1011j16506j99673j69575n2676J8519
39331C31709r620o5411r0615j05199j11474o0956L3049O8148O740m8684j2435
39320f4748N0962M2025j2938k2617J5567L3441J7185Q676J2991J082j6995p656
39308E6975J5702J4004n359p995k06q417j8546n459P899o565j5507J8609N0355
$$ plain form
39295 95490 110774 62012 12862 23122 60025 64503 48362 54220 65144 35596 -16306 -29937
39283 -29937 -2009 14195 6741 22280 72342 99467 70590 40458 71733 134820 145721 83638
39271 83638 12199 -16909 -25462 -51739 -79391 -69513 -38822 -45946 -95331 -112301 -41955 71650
39259 71650 143616 149048 118761 66020 -18139 -108336 -151959 -142266 -126704 -127408 -109120 -50444
39247 -50444 5059 6805 -29804 -47145 -20248 23739 45372 26866 -21911 -73401 -108141 -137273
39235 -137273 -180110 -215591 -189085 -85463 33708 91800 77948 43980 34334 40474 21108
39224 21108 -43127 -115535 -132070 -77996 -21309 -38892 -117924 -170846 -146824 -81402 -28904 48
39212 48 10257 -17367 -95318 -189775 -249332 -255982 -222113 -159416 -79286 -5621 41831 66854
$$ packed form
39295I5490J5284m8762m9150J0260L6903M478j6141N858J0924k9548n1902j3631
39283b9937K7928J6204p454J5539N0062K7125k8877l0132L1275O3087J0901o2083
39271H3638p1439k9108q553k6277k7652R878L0691p124m9385j6970P0346J13605
39259G1650P1966N432l0287n2741q4159r0197m3623R693J5562p04J8288N8676
39247e0444N5503J746l6609j7341K6897M3987K1633j8506m8777n1490l4740k9132
39235a37273m2837l5481K6506J03622J19171N8092j3852l3968r646O140j9366
39224B1108o4235p2408j6535N4074N6687j7583p9032n2922K4022O5422N2498K8952
39212D8J0209k7624p7951r4457n9557o650L3869O2697Q0130P3665M7452K5023
$$ plain form
39200 66854 80831 81036 60515 23288 -25376 -85773 -145048 -170614 -141242 -72672 -180 51297
39188 51297 73368 70347 58903 54252 50686 33609 11171 8734 29618 47792 41569 8943 -44659
39175 -44659 -99389 -110648 -53595 24047 47633 17163 3564 36465 66621 60607 54810 73909
39163 73909 69849 3992 -67332 -61968 7977 53159 26248 -30499 -44311 22796 150065 262216
39151 262216 279405 199480 108151 76787 83577 72368 45942 43660 58280 42645 -10830 -54465
39139 -54465 -48295 3171 71986 128463 151382 149166 156867 182752 183274 128867 64502 52499 77213
39126 77213 67012 2506 -57722 -65150 -42519 -40095 -67601 -90349 -75571 -29670 8213 12427
39114 12427 5612 25484 60489 59424 12151 -32988 -52744 -86359 -149845 -179306 -123704 -40472
$$ packed form
39200F6854J3977K05k0521l7227m8664o0397n9275k5566K9372O8570P2492N1477
39188E1297K2071l021j1444m651l566j7077k2438k437K0884J8174o223l2626n3602
39175d4659n4730j1259N7053P7642K3586l0470j3599L2901L0156o014n797J9099
39163G3909m060o5857p1324N364O9945M5182k6911n6747j3812O7107J27269J12151
39151B62216J7189p9925r1329l1364O790j1209k6426k282J4620j5635n3475m3635
39139e4465O170N1466O8815N6477K2919k216P701K5885N22n4407o4365j2003K4714
39126G7213j0201o4506o0228p428K2631K424k7506k2748J4778M5901L7883M214
39114A2427o815J9872L5005j065m7273m5139j9756l3615o3486k9461N5602Q3232
$$ plain form
39102 -40472 -20470 -54125 -55811 -1422 41520 18564 -48478 -108507 -134473 -127426 -115820 -146707
39090 -146707 -231262 -308111 -306713 -232729 -143560 -62995 20235 90450 111724 88132 54336 17262
39078 17262 -29486 -51091 -9569 51826 46448 -27981 -79819 -55090 -3511 4980 -39136 -106212
39066 -106212 -163938 -174990 -122163 -53767 -42463 -85384 -111132 -96934 -99393 -145219 -176133 -145589
39054 -145589 -95388 -82034 -89614 -76200 -57260 -77992 -133163 -172441 -169136 -138660 -100733 -61244
39042 -61244 -27289 -13267 -28239 -63130 -88845 -77994 -43227 -34476 -70695 -98971 -62128 19689
39030 19689 88229 139474 206432 271915 284643 254204 238081 233435 181524 91701 53172 94161
39018 94161 136868 134647 145021 207147 252911 220343 165152 168056 203260 191079 121340 34922
$$ packed form
39102d0472K0002l3655j686N4389M2942k2956o7042o0029k5966P047J1606l0887
39090a46707q4555p6849J398P3984Q9169Q0565Q3230P0215K1274k3592l3796l7074
39078A7262m6748k1605M1522O1395n378p4429n1838K4729N1579Q491m4116o7076
39066a06212n7726j1052N2827O8396J1304m2921k5748J4198k459m5826l0914L0544
39054a45589N0201J3354p580J3414J8940k0732n5171l9278L305L0476L7927L9489
39042f1244L3955J4022j4972l4891k5715J0851L4767Q751l6219k8276L6843Q1817
39030A9689O8540N1245O6958O5483J2728l0439j6123m646n1911q9823l8529M0989
39018I4161M2707k221J0374O2126M5764l2568n5191K904L5204j2181o9739q6418
$$ plain form
39006 34922 -62399 -175685 -259279 -274748 -270678 -311000 -360476 -340083 -264412 -215165 -196174 -132238
38994 -132238 -17966 46333 -975 -95694 -144420 -130082 -78044 10189 127643 213637 202525
38983 202525 108895 19672 3081 50763 103841 112335 68920 3639 -44655 -57555 -48462 -49227
38971 -49227 -79127 -120387 -133044 -105583 -78378 -95300 -142592 -164406 -131001 -58621 27407 103976
38959 103976 131005 79370 -12813 -67640 -64902 -56451 -71093 -73741 -45331 -30969 -64727 -108551
38947 -108551 -114138 -90395 -63434 -28535 6603 -7041 -81844 -142539 -122645 -61641 -33405 -28181
38935 -28181 9006 62516 63479 2687 -61893 -99408 -126087 -137721 -104077 -38294 -3407 -35565
38923 -35565 -107497 -169260 -185689 -147435 -88638 -72138 -110007 -129129 -71003 11371 25257 -30020
$$ packed form
39006C4922r7321j13286q3594j5469M070m0322m9476K0393P5671M9247J8991O3936
38994a32238J14272O4299m7308r4719m8726J4338N2038Q8233J17454Q5994j1112
38983B02525r3630q9223j6591M7682N3078Q494m3415o5281m8294j2900R093p65
38971d9227k9900m1260j2657K7461K7205j6922m7292k1814L3405P2380Q6028P6569
38959A03976K7029n1635r2183n4827K738Q451j4642k648K8410J4362l3758m3824
38947a08551n587K3743K6961L4899L5138j3644p4803o0695J9894O1004K8236N224
38935b8181L7187N3510R63o0792o4580l7515k6679j1634L3644O5783L4887l2158
38923c5565p1932o1763j6429L8254N8797J6500l7869j9122N8126Q2374J3886n5277
$$ plain form
38911 -30020 -85355 -123948 -182669 -245963 -242605 -157150 -55392 13600 60222 89876 78080 26298
38899 26298 -30547 -84131 -149760 -200891 -189096 -137695 -128225 -178074 -219153 -216134 -211332 -224444
38887 -224444 -206783 -139776 -86972 -92486 -108803 -85059 -53251 -62994 -96699 -115880 -132186 -162463
38875 -162463 -165019 -96134 5409 60051 50118 23318 15982 24821 36029 37302 17782 -9384
38863 -9384 -7818 28302 51863 25554 -28982 -78355 -130626 -195912 -233610 -196033 -102927 -24407
38851 -24407 -5409 -41458 -102670 -143832 -120178 -36644 42685 71425 75823 93621 100179 54268
38839 54268 -15838 -42520 -18906 363 -6346 531 47432 103878 130445 125484 107163 86474
38827 86474 74823 87297 120407 146932 144299 114116 73175 42923 43329 72591 94296 70679
$$ packed form
38911c0020n5335l8593n8721o3294L358Q5455J01758O8992M6622K9654j1796n1782
38899B6298n6845n3584o5629n1131J1795N1401R470m9849m1079L019M802j3112
38887b24444J7661O7007N2804n514j6317K3744L1808r743l3705j9181j6306l0277
38875a62463k556O8885J01543N4642r933k6800p336Q839J1208J273j9520k7166
38863i384J566L6120K3561k6309n4536m9373n2271o5286l7698L7577R3106P8520
38851b4407J8998l6049o1212m1162K3654Q3534P9329K8740M398J7798O558m5911
38839E4268p0106k6682K3614J9269o709O877M6901N6446K6567m961j8321k0689
38827H6474j1651J2474L3110K6525k633l0183m0941l0252M06K9262K1705k3617
$$ plain form
38815 70679 10401 -40952 -58982 -62367 -72847 -83773 -83334 -84073 -104654 -133151 -133079 -87849 -21721
38802 -21721 30342 58754 71643 64375 24294 -33285 -66160 -57866 -39220 -33113 -10031 60315
38790 60315 137242 143808 67031 -29220 -91451 -121778 -129746 -100890 -38999 11912 22339 17113
38778 17113 31039 58302 73683 72238 60897 40476 20597 21438 36988 30525 -7981 -37514
38766 -37514 -30287 -22449 -59597 -120561 -139419 -86282 10535 108385 183110 228434 249718 254010
38754 254010 237070 196008 154528 140297 132373 80562 -6455 -49767 -7916 61301 88403 84616
38742 84616 92739 100218 72217 31615 27630 47887 39017 2829 -4227 32077 59384 44950 25872
38729 25872 50825 115165 175325 198989 187942 171440 179320 205106 206174 160868 105375 84740
$$ packed form
38815G0679o0278n1353j8030l385j0480j0926M39p39k0581k8497P2M5230O6128
38802b1721N2063K8412J2889p268m0081n7579l2875Q294J8646O107K3082P0346
38790F0315P6927O566p6777r6251o2231l0327p968K8856O1891N0911J0427n226
38778A7113J3926K7263J5381j445j1341k0421j9879Q41J5550o463l8506k9533
38766c7514P227P838l7148o0964j8858N3137R6817R7850P4725M5324K1284M292
38754B54010j6940m1062m1480j4231p924n1811q7017m3312M1851O9217K7102l787
38742H4616Q123P479k8001m0602l985K0257q870l6188p056L6304K7307j4434j9078
38729B5872K4953O4340O0160K3664j1047j6502P880K5786J068m5306n5493k0635
$$ plain form
38717 84740 91237 89432 77251 73454 65603 29138 -12598 -9335 36371 72227 85504 123826 203381
38704 203381 255590 208624 87971 -7605 -16834 30843 68769 69227 51520 31153 -4233 -52308
38692 -52308 -63639 -1781 76649 69865 -27110 -100151 -70930 -941 17885 8115 55993 160281
38680 160281 230087 217850 164931 118027 83125 66079 78883 93031 59848 -5857 -29795
38669 -29795 14994 68250 70708 33672 -1732 -19238 -17350 4180 23550 9184 -25701 -26263
38657 -26263 26107 83839 99854 78420 40808 -11129 -71693 -114149 -122588 -107684 -77537 -33547
38645 -33547 -4684 -32504 -101598 -137777 -103236 -45783 -24941 -37221 -48543 -54803 -67479 -72848
38633 -72848 -48299 -178 44010 64017 50774 7481 -37472 -47294 -22469 -2699 -13078 -38527
$$ packed form
38717H4740O497j805j2181l797p851l6465m1736L263M5706L5856J3277L8322P9555
38704B03381N2209m6966j20653r5576r229M7677L7926M58j7707k0367l5386m8075
38692e2308j1331O1858P8430o784r6975p3041K9221O9989J8826r770M7878J04288
38680A60281O9806j2237n2919m6904l4902j7046J2804J4148l3183o5705k3938
38669b9795M4789N3256K458l7036l5404j7506J888K1530J9370j4366l4885n62
38657b6263N2370N7732J6015k1434l7612n1937o0564m2456q439J4904L0147M3990
38645c3547K8863k7820o9094l6179L4541N7453K0842j2280j1322o260j2676n369
38633g2848K4549M8121M4188K0007j3243m3293m4953r822K4825J9770j0379k5449
$$ plain form
38621 -38527 -57135 -62086 -46735 -10701 16941 10414 3157 48472 120376 130909 63971 7393
38609 7393 18347 44137 27621 6328 35885 85665 91910 61040 39321 24239 -12181 -47812
38597 -47812 -40859 -10909 -13029 -50727 -84153 -101633 -112187 -93357 -27697 27737 -3393 -96777
38585 -96777 -147387 -112578 -53574 -25163 -7545 28677 65210 77770 74154 57486 5455 -78603
38573 -78603 -140613 -139564 -101531 -77394 -76667 -74268 -59528 -49035 -61798 -96434 -122608 -95665
38561 -95665 -3131 104095 157484 149315 131459 135194 137261 117199 98743 104089 105724 64628
38549 64628 -3408 -38474 -11029 40209 50812 1000 -62277 -78176 -46977 -33981 -83033 -149737
38537 -149737 -156101 -96290 -39784 -31322 -42743 -38746 -35481 -59837 -92517 -95597 -72215 -56472
$$ packed form
38621c8527j8608m951J5351L6034K7642o527p257M5315P1904J0533o6938n6578
38609G393J0954K5790j6516k1293K9557M9780O245l0870k1719j5082l6420l5631
38597d7812O953K9950k120l7698l3426j7480j0554J8830O5660N5434l1130r3384
38585i6777n0610L4809N9004K8411J7618L6222L6533J2560l616j6668n2031q4058
38573g8603o2010J049L8033K4137P27K399J4740J0493j2763l4636k6174K6943
38561i5665R2534J07226N3389q169j7856L735K067k0062j8456N346J635m1096
38549F4628o8036l5066K7445N1238J0603m9812o3277j5899L1199J2996m9052o6704
38537a49737o364N9811N6506Q462j1421L997L265k4356l2680l080K3382J5743
$$ plain form
38525 -56472 -58097 -57577 -51485 -63467 -101114 -130832 -113967 -55414 434 20553 16009 15559 17803
38512 17803 -6356 -59231 -95170 -78997 -41740 -39269 -69294 -78299 -50079 -30992 -49061 -62795
38500 -62795 -28038 27120 43347 17791 -4121 -11007 -40780 -106958 -162035 -158701 -112554 -75075
38488 -75075 -65233 -55820 -17212 49332 118356 160937 160150 124407 89632 92404 130167 156268 126461
38475 126461 48838 -22827 -47440 -37713 -34667 -49973 -52917 -19569 25508 37959 15775 4043
38463 4043 30284 61656 46814 -18413 -93709 -149933 -189486 -216199 -223403 -218894 -224306 -235206
38451 -235206 -218965 -173547 -149434 -180214 -225916 -226481 -181921 -131949 -84099 -22415 30412 29470
38439 29470 -15119 -43846 -35967 -26356 -28086 -14167 5642 -25506 -107333 -150970 -108315 -56377
$$ packed form
38525e6472j625N20O092j1982l7647k9718J6865N8553N5848K0119m544m50K244
38512A7803k4159n2875l5939J6173L7257K471l0025r005K8220J9087j8069j3734
38500f2795L4757N5158J6227k5556k1912o886k9773o6178n5077L334M6147L7479
38488g5075R842R413L8608O6544O9024M2581p87l5743l4775K772L7763K6101k9807
38475A26461p7623p1665k4613R727L046j5306k944L3348M5077J2451k2184j1732
38463D043K6241L1372j4842o5227p5296n6224l9553k6713p204M509n412j0900
38451b35206J6241M5418K4113l0780m5702n65M4560M9972M7850O1684N2827r42
38439B9470m4589k8727P879R611j730J3919J9809l1148q1827m3637M2655N1938
$$ plain form
38427 -56377 -78990 -131649 -116908 -45841 -17537 -58872 -92674 -71188 -43666 -64552 -113357 -142151
38415 -142151 -143680 -136015 -122734 -98727 -65186 -22957 19098 27538 -20387 -81949 -82547 -15374
38403 -15374 46591 52978 31780 21184 9530 -19921 -42973 -41370 -46993 -86640 -124677 -118140
38391 -118140 -93464 -104274 -138724 -139061 -101785 -86833 -122211 -165128 -175585 -171083 -179078 -180766
38379 -180766 -140662 -65746 397 30096 31989 26314 21398 14906 7720 14996 59877 143786 225229
38366 225229 250615 213668 162538 137764 129438 114570 107078 133132 173374 175824 127316 69088
38354 69088 31200 -4768 -54624 -84747 -57265 2901 32717 14854 -4978 14738 64200 109325
38342 109325 133803 142580 146958 155542 163829 154384 127394 119142 154412 190474 159998 72537 13967
$$ packed form
38427e6377k2613n2659J4741P1067K8304m1335l3802K1486K7522k0886m8805k8794
38415a42151j529P665J3281K4007L3541M2229M2055Q440m7925o1562n98O7173
38403a5374O1965O387k1198j0596j1654k9451k3052J603n623l9647l8037O537
38391a18140K4676j0810l4450l37L7276J4952l5378m2917j0457M502p995j688
38379a80766M0104P4916O6143K9699J893n675m916o492p186P276M4881Q3909Q1443
38366B25229K5386l6947n1130k4774q326j4868p492K6054M0242K450m8508n8228
38354F9088l7888l5968m9856l0123K7482O0166K9816j7863j9832J9716M9462M5125
38342A09325K4478Q777M378Q584Q287r445k6990q252L5270L6062l0476q7461n8570
$$ plain form
38329 13967 27626 58588 49219 27451 45956 83999 79116 27508 -17058 -31494 -45183 -75490
38317 -75490 -100576 -104206 -98843 -93961 -81931 -64582 -57913 -61031 -50431 -13182 36253 72771 76653
38304 76653 45428 12078 28882 99814 154903 135926 80551 64868 88017 87080 51711 36495
38292 36495 53289 41505 -26840 -93639 -105951 -89654 -85689 -77791 -39880 -1129 178 -10498
38280 -10498 19392 83650 124212 109817 62920 21571 12652 47685 108958 153971 164229 170349
38268 170349 198694 220282 193812 137195 108508 126347 152399 147536 106836 44258 -18723 -50035
38256 -50035 -29463 18552 40500 8256 -57597 -114183 -127216 -82916 6041 102631 165563 169429
38244 169429 110560 14925 -58307 -58324 -6384 18553 -16045 -46663 -6171 75699 120949 121209
$$ packed form
38329A3967J3659L0962r369k1768J8505L8043m883n1608m4566j4436j3689l0307
38317g5490k5086l630N363M882J2030J7349O669l118J0600L7249M9435L6518L882
38304G6653l1225l3350J6804P0932N5089j8977n5375j5683K3149r37l5369j5216
38292C6495J6794j1784o8345o6799j2312J6297L965P898L7911L8751J307j0676
38280a0498K9890O4258M0562j4395m6897m1349q919L5033O1273M5013J0258O120
38268A70349K8345K1588k6470n6617k8687J7839K6052m863m0700o2578o2981l1312
38256e0035K0572M8015K1948l2244o5853n6586j3033M4300Q8957R6590O2932L866
38244A69429n8869r5635p3232j7N1940K4937l4598l0618M0492Q1870M5250K60
$$ plain form
38232 121209 135288 180132 201653 168090 124259 122066 149817 168733 178929 203324 229877 218505
38220 218505 163784 113047 109152 135225 131903 64200 -40407 -122952 -152669 -145346 -127522 -103716
38208 -103716 -68495 -31978 -12729 -13022 -19743 -26945 -41907 -69446 -102107 -126412 -133326 -127077 -126275
38195 -126275 -144028 -161606 -140535 -73935 -6809 14655 -912 -6514 23518 73913 117547 137098
38183 137098 123553 80780 32820 5510 154 2000 8433 25330 39567 25267 -15852 -46613
38171 -46613 -41230 -21800 -30647 -75199 -116906 -115033 -70767 -23565 -10089 -34430 -75769 -110758
38159 -110758 -121604 -98459 -51395 -8716 16982 48443 102422 144483 128579 75041 52169
38148 52169 69940 54974 -36937 -140847 -164102 -104389 -31399 14811 44057 56808 34246
$$ packed form
38232A21209J4079M4844K1521l3563m3831k193K7751J8916J0196K4395K6553j1372
38220B18505n4721n0737l895K6073l322o7703j04607q2545k9717P323J7824K3806
38208a03716L5221L6517J9249k93o721p202j4962k7539l2661k4305o914O249Q02
38195a26275j7753j7578K1071O6600O7126K1464j5567n602L0032N0395M3634J9551
38183A37098j3545m2773m7960k7310n356J846O433J6897J4237j4300m1119l0761
38171d6613N383J9430q847m4552m1707J873M4266M7202J3476k4341m1339l4989
38159a10758j0846K3145M7064M2679K5698L1461N3979M2061j5904n3538k2872
38148E2169J7771j4966r1911j03910k3255N9713P2990M6210K9246J2751k2562
$$ plain form
38137 34246 -13131 -45418 -49388 -47926 -49014 -33462 -3040 6727 -19091 -47150 -45759 -31338 -38580
38124 -38580 -64761 -71283 -36590 8634 5438 -69690 -165255 -196474 -138830 -59070 -31873 -50527
38112 -50527 -55222 -26895 216 13048 45847 113712 169529 160141 96606 37569 19061 26416
38100 26416 27307 11803 -1302 10862 46825 79646 85415 61957 13363 -62277 -148804 -197669
38088 -197669 -174694 -112567 -77933 -86759 -91083 -54959 -3114 21387 12866 -6068 -22440 -35517
38076 -35517 -38463 -24046 -3882 -2290 -27803 -60234 -71691 -60582 -58948 -95210 -151095 -175050
38064 -175050 -144337 -88345 -37358 17033 80278 109320 62791 -18686 -43161 15740 85287
38053 85287 92440 49218 15869 19560 43395 68939 91622 103003 89096 51255 12993 -469
$$ packed form
38137C4246m7377l2287l970J462j088J5552L0422R767k5818k8059J391J4421p242
38124c8580k6181o522L4693M5224l196p5128r5565l1219N7644P9760K7197j8654
38112e0527m695K8327K7111J2832L2799O7865N5817r388o3535n9037j8508P355
38100B6416Q91j5504j3105J2164L5963L2821N769k3458m8594p5640q6527m8865
38088a97669K2975O2127L4634q826m324L6124N1845K4501q521j8934j6372j3077
38076c5517k946J4417K0164J592k5513l2431j1457J1109J634l6262n5885k3955
38064a75050L0713N5992N0987N4391O3245K9042m6529q1477k4475N8901O9547
38053H5287P153m3222l3349L691K3835K5544K2683J1381j3907l7841l8262j3462
$$ plain form
38041 -469 14568 39628 55818 62114 65507 58656 26526 -21825 -52156 -45980 -17299 24082 92843
38028 92843 187812 263668 275482 225370 136040 14754 -114463 -182130 -139649 -34853 37681
38017 37681 48340 41076 50247 71687 101189 133630 133851 78909 20984 32467 93958 119626
38005 119626 91889 77331 101400 111976 91555 95672 136392 137580 70491 29889 89807 173906
37993 173906 171288 108163 88493 115076 95875 8923 -58956 -45226 16631 74434 118437 141507
37981 141507 117416 55172 15080 33503 75483 92489 88554 99096 135266 179180 213482 231205
37969 231205 229362 209328 175197 126689 66720 16191 1083 21036 50517 74586 100087 123730
37957 123730 116413 61766 -5209 -27502 2726 26409 -10460 -79138 -91342 -6600 112011
$$ packed form
38041d69J5037K5060J6190O296L393o851l2130m8351l0331O176K8681M1381O8761
38028I2843R4969P5856J1814n0112q9330j21286j29217o7667M2481J04796P2534
38017C7681J0659p264R171K1440K9502L2441K21n4942n7925J1483O1491K5668
38005A19626k7737j4558K4069J0576k0421M117M0720J188o7089m0602N9918Q4099
37993A73906k618o3125j9670K6583j9201q6952o7879J3730O1857N7803M4003K3070
37981A41507k4091o2244m0092J8423M1980J7006l935J0542L6170M3914L4302J7723
37969B31205j843k0034l4131m8508n9969n0529j5108J9953K9481K4069K5501K3643
37957A23730p317n4647o6975k2293L0228K3683l6869o8678j2204Q4742J18611
$$ plain form
37946 112011 170137 145724 89301 43641 12408 600 24858 66736 70512 20452 -20862 11249
37934 11249 100163 178595 216258 234153 247485 240284 199927 145397 111006 114796 145072 171801
37922 171801 174310 158299 137750 108479 61943 18482 12098 39513 61734 63555 70977 98196
37910 98196 122968 133962 154869 192257 205356 166660 113677 95077 95154 60285 -17998 -92912
37898 -92912 -127643 -130696 -124512 -108417 -63972 10589 78258 90097 47601 16461 46042 99042
37886 99042 111393 97326 119187 164644 151303 67553 6609 24495 62855 62161 53266 72942
37874 72942 84214 58004 42876 66130 56232 -32951 -107224 -63707 37074 67478 39349 60540
37862 60540 126156 121681 26771 -48324 -47452 -37152 -57963 -51950 11182 66374 72048 78387 110178
$$ packed form
37946A12011N8126k4413n6423m5660l1233j1808K4258M1878L776n0060m1314L2111
37934A1249Q8914P8432L7663J7895J3332p201m0357n4530l4391L790L0276K6729
37922A71801K509j6011k0549k9271m6536m3461o384K7415K2221J821P422K7219
37910I8196K4772J0994K0907L7388J3099l8696n2983j8600P7l4869p8283p4914
37898i2912l4731l053O184J6095M4445P4561O7669J1839m2496l1140K9581N3000
37886I9042J2351j4067K1861M5457j3341q3750o0944J7886L8360o94q895J9676
37874G2942J1272k6210j5128K3254r898q9183p4273M3517J00781L0404k8129K1191
37862F0540O5616m475r4910p5095Q72J0300k0811O013O3132N5192N674O339L1791
$$ plain form
37849 110178 94235 -11710 -110959 -84662 45180 154006 169706 117441 50643 7087 8527
37838 8527 48452 94888 134852 187916 255335 299235 296949 267257 217036 120072 -14304 -109721
37826 -109721 -108860 -46500 7226 33125 50425 63894 71974 88541 108662 88917 10950 -66901
37814 -66901 -71482 -6407 58979 70128 22099 -58734 -129532 -150158 -122362 -91008 -82713 -71979
37802 -71979 -31858 19463 53949 76602 95813 88943 42182 -6562 -11671 16996 38345 45214
37790 45214 60916 87979 103227 92985 58108 -2156 -76686 -126955 -121787 -80029 -46832 -33107
37778 -33107 -6898 56592 138002 188781 175710 115618 64288 55442 57416 19441 -44573 -61889
37766 -61889 2463 98699 154663 143673 80415 -829 -47202 -19289 53619 98235 96474 103376
$$ packed form
37849A10178j5943j05945r9249K6297J29842J08826J5700n2265o6798m3556J440
37838H527L9925M6436L9964N3064O7419M3900k286k9692n0221r6964j34376r5417
37826a09721Q61O2360N3726K5899J7300J3469Q080J6567K0121j9745p7967p7851
37814f6901m581O5075O5386J1149m8029q0833p0798k0626K7796L1354Q295J0734
37802g1979M0121N1321L4486K2653J9211o870m6761m8744n109K8667K1349O869
37790D5214J5702K7063J5248j0242l4877o0264p4530n0269N168M1758L3197J3725
37778c3107K6209O3490Q1410N0779j3071o0092n1330q846J974l7975o4014j7316
37766f1889O4352R6236N5964j0990o3258q1244m6373K7913P2908M4616j761O902
$$ plain form
37754 103376 143122 155288 85227 -34128 -136062 -194984 -200254 -125295 9181 102321 85385
37743 85385 22775 20260 72493 91204 54909 29552 46201 55808 23838 -9570 4970 55478
37731 55478 92547 89124 59032 39599 58648 97966 101680 48085 -8014 -2425 50280 81056
37719 81056 61364 25467 12294 34642 93145 167938 205392 167271 89777 44519 46911 55100
37707 55100 53168 74832 138005 211319 260897 286966 300835 301972 288182 259396 209425 141167
37695 141167 82319 54660 41555 22602 20280 63462 122506 138333 104685 61487 18107 -46530
37683 -46530 -112214 -126740 -98639 -100502 -154569 -191904 -163283 -119682 -130942 -182367 -211490 -204462
37671 -204462 -193905 -189193 -169725 -134288 -103902 -78967 -38086 18136 59482 69198 64222 61505
$$ packed form
37754A03376L9746J2166p0061j19355j01934n8922n270P4959J34476R3140j6936
37743H5385o2610k515N2233J8711l6295k5357J6649R607l1970l3408J4540N0508
37731E5478L7069l423l0092j9433J9049L9318L714n3595n6099N589N2705L0776
37719H1056j9692l5897j3173K2348N8503P4793L7454l8121p7494m5258K392Q189
37707E5100j932K1664O3173P3314M9578K6069J3869J137j3790k8786m9971o8258
37695A41167n8848k7659j3105j8953k322M3182N9044J5827l3648m3198m3380o4637
37683d6530o5684j4526K8101j863n4067l7335K8621M3601j1260n1425k9123P028
37671b04462J0557M712J9468L5437L0386K4935M0881N6222M1346R716m976k717
$$ plain form
37659 61505 49060 8675 -47122 -84234 -93047 -101368 -124982 -124654 -48672 82238 176379 177875
37647 177875 132750 115581 127349 115766 71531 41778 51810 72210 73260 62024 50991 35235
37635 35235 20132 31449 72361 101192 78526 16510 -38856 -57068 -37965 5033 54922 90637
37623 90637 94067 64629 26957 17007 44984 71340 44341 -30024 -88160 -95937 -93333 -118585
37611 -118585 -134558 -88218 -7273 36625 41738 70940 134750 165880 129190 76518 57552 46819
37599 46819 4964 -46493 -65180 -57121 -51014 -39102 -1668 34717 25717 -11753 -7092 68386
37587 68386 159635 200406 192357 182895 184680 156304 69826 -34581 -89964 -84188 -63106 -53078
37575 -53078 -26994 33768 92625 113982 126241 172610 226818 225936 176181 152103 181462 201471
$$ packed form
37659F1505j2445m0385n5797l7112q813q321k3614L28P5982J30910R4141J496
37647A77875m5125j7169J1768j1583m4235k9753J0032K0400J050j1236j1033j5756
37635C5235j5103J1317M0912K8831k2666o2016n5366j8212J9103M2998M9889L5715
37623I0637L430k9438l7672r950K7977K6356k6999p4365n8136p777K604k5252
37611a18585j5973M6340Q0945M3898N113K9202O3810L1130l6690n2672j8966j0733
37599D6819m1855n1457j8687Q059O107J1912L7434L6385r000l7470M661P5478
37587F8386R1249M0771q049r462J785k8376q6478j04407n5383N776K1082J0028
37575e3078K6084O0762N8857K1357J2259M6369N4208q82m9755k4078K9359K0009
$$ plain form
37563 201471 156452 79818 40437 50541 68875 68383 62698 77691 121551 174566 196909 161051
37551 161051 85007 16957 -17246 -30745 -39608 -40182 -30437 -24297 -30640 -40539 -46728 -56197 -75743
37538 -75743 -103343 -136025 -164224 -158646 -91710 20861 123475 171883 163422 120589 70593 39198
37526 39198 36117 42929 35735 15814 -1453 -14858 -29569 -38988 -43871 -65209 -99492 -91082 -4570
37513 -4570 98457 121551 60794 2093 -3122 13579 17559 24373 52488 82875 88164 59169
37501 59169 -1457 -66006 -73824 -291 77787 62308 -28165 -86357 -75022 -54285 -48142 -7741
37489 -7741 63862 80983 26990 14742 115993 237382 258957 203014 162445 141607 84466
37478 84466 4978 -26520 4317 53998 102692 150188 163814 121400 77355 94282 134070 111881
$$ packed form
37563B01471m5019p6634l9381J0104J8334m92n685J4993M3860N3015K2343l5858
37551A61051p6044o8050l4203j3499q863n74R745O140o343r899o189r469j9546
37538g5743k7600l2682k8199N578O6936J12571J02614M8408q461m2833m9996l1395
37526C9198l081O812p194j9921j7267j3405j4711r419m883k1338l4283Q410Q6512
37513d570J03027K3094o0757n8701n215J6701L980O814K8115L0387N289k8995
37501E9169o0626o4549p818P3533P8078j5479r0473n8192J1335K0737O143M0401
37489g741P1603J7121n3993j2248J01251J21389K1575n5943m0569k0838n7141
37478H4466p9488l1498L0837M9681M8694M7496J3626m2414m4045J6927L9788k2189
$$ plain form
37466 111881 38728 9271 53351 99275 94119 68423 59602 51573 22807 -6540 -7388 19706
37454 19706 56495 81428 66177 -1267 -83546 -121721 -100932 -56422 -19553 4688 13640 3971
37442 3971 -8435 -4771 2388 -12443 -39500 -41363 -5073 47362 93404 121088 116628 78978 39013
37429 39013 28332 37149 36155 27217 36389 69486 110865 152302 186745 190047 148763 91781 56120
37416 56120 37205 9826 -22624 -40691 -47337 -48757 -20293 58091 152243 210025 227041 226734
37404 226734 202417 140795 78896 64169 69146 20728 -85603 -172003 -186039 -156895 -133040
37393 -133040 -125563 -128902 -141053 -143020 -105765 -36374 22138 48334 60137 68504 58649 30670
37381 30670 16240 34603 62582 65607 37922 3321 -8001 16784 58976 85597 89349 88403
$$ packed form
37466A11881p3153k9457M4080M5924n156k5696q821q029k8766k9347q48K7094
37454A9706L6789K4933j5251o7444q2279l8175K0789M4510L6869K4241Q952r669
37442C971j2406L664P159j4831k7057j863L6290N2435M6042K7684m460l7650l9965
37429C9013j0681Q817r94q938R172L3097M1379M1437L4443L302m1284n6982l5661
37416E6120j8915k7379l2450j8067o646j420K8464P8384R4152N7782J7016l07
37404B26734k4317o1622o1899j4727M977m8418j06331q6400j4036K9144K3855
37393a33040P477l339j2151j967L7255O9391N8512K6196J1803Q367r855k7979
37381C0670j4430J8363K7979L025k7685l4601j1322K4785M2192K6621L752r46
$$ plain form
37369 88403 77148 21820 -67688 -116189 -82502 -29905 -34944 -73190 -72459 -39035 -38866 -77267 -93683
37356 -93683 -67419 -36288 -12268 30233 78854 87520 65010 67832 90965 61289 -34276 -107633
37344 -107633 -94697 -37649 510 23751 54173 67393 38699 1119 -1513 18051 18652 -5931
37332 -5931 -33658 -55980 -75030 -79515 -52849 6318 81464 138748 136366 67898 -8692 -26473
37320 -26473 11615 52509 75686 96812 105125 75747 41401 64976 130371 149878 100335 59648
37308 59648 75970 94816 64900 28952 45263 89539 101714 75045 38210 -1009 -37904 -45344
37296 -45344 -21340 -16386 -60046 -104910 -95590 -47725 -5052 33560 83356 115809 101572 76620
37284 76620 92434 122299 89559 -18202 -126753 -169498 -153909 -128561 -124305 -136697 -139519 -109098
$$ packed form
37369H8403j1255n5328q9508m8501L3687N2597n039l8246P31L3424J69l8401j6416
37356i3683K6264L1131K4020M2501M8621Q666k2510K822K3133k9676r5565p3357
37344a07633J2936N7048L8159K3241L0422J3220k8694l7580k632J9564O01k4583
37332e931k7727k2322j9050m485K6666N9167P5146N7284k382o8468p6590j7781
37320b6473L8088M0894K3177K1126Q313k9378l4346K3575O5395J9507m9543m0687
37308E9648J6322J8846k9916l5948J6311M4276J2175k6669l6835l9219l6895p440
37296d5344K4004M954m3660m4864R320M7865M2673L8612M9796L2453j4237k4952
37284G6620J5814K9865l2740j07761j08551m2745J5589K5348M256j2392k822L0421
$$ plain form
37272 -109098 -49829 5776 30607 28690 24436 39825 79724 119328 114802 57554 5444 15297
37260 15297 56654 53476 6040 -6284 43981 83196 53235 1271 4025 63497 128593 167954
37248 167954 171276 126045 45913 -13362 -11277 32675 79858 118585 143382 136182 99603 64133
37236 64133 37833 468 -33616 -15027 50962 90547 72876 52025 53313 13613 -96770 -186205
37224 -186205 -167686 -96390 -80185 -115410 -119948 -80526 -51768 -39768 -2875 43197 31791 -35985
37212 -35985 -75168 -39677 14743 13241 -48983 -117461 -136286 -88241 -10629 32349 19878 -821
37200 -821 14086 44988 58099 69991 107521 142962 133712 96170 76206 75349 72184 86902 148886
37187 148886 219350 222862 149795 62667 7272 -23523 -46034 -62215 -72877 -68327 -22543 58920
$$ packed form
37272a09098N9269N5605K4831j917m254J5389L9899L9604m526n7248n2110R853
37260A5297M1357l178m7436j2324N0265L9215k9961n1964K754N9472O5096L9361
37248A67954L322m5231q0132n9275K085M3952M7183L8727K4797p200l6579l5470
37236F4133k6300l7365l4084J8589O5989L9585j7671k0851J288l9700j10383q9435
37224a86205J8519P1296J6205l5225m538L9422K8758J2000L6893M6072j1406o7776
37212c5985l9183L5491N4420j502o2224o8478j8825M8045P7612M2978j2471k0699
37200h21J4907L0902J3111J1892L7530L5441r250l7542j9964q57l165J4718O1984
37187A48886P0464L512p3067q7128n5395l0795k2511j6181j0662M550M5784Q1463
$$ plain form
37175 58920 113307 94820 43452 23920 32280 28819 26122 63902 120942 134285 93567 43427
37163 43427 5091 -35495 -76320 -102040 -120057 -133359 -109344 -44009 -13480 -73251 -146629 -118203
37151 -118203 -7268 67393 73246 84786 124239 123058 67095 44984 101128 156699 140518 101104
37139 101104 117998 179675 220968 222659 208795 189941 164922 144933 133897 115713 89819 83994
37127 83994 108791 138297 155060 170534 183623 169015 129455 109636 130592 155394 148072 125126
37115 125126 121018 140465 171417 210328 248200 261280 240187 206520 184261 173394 159371 130017
37103 130017 83647 41092 41865 104281 201379 297807 383028 438600 418724 321770 241166 265496
37091 265496 348704 362781 271213 166357 132208 153046 173792 177178 176408 186023 216969 258654
$$ packed form
37175E8920N4387j8487n1368j9532Q360l461k697L7780N7040J3343m0718n0140
37163D3427l8336m0586m0825k5720j8017j3302K4015O5335L0529n9771p3378K8426
37151a18203J10935P4661N853J1540L9453j181n5963k2111N6144N5571j6181l9414
37139A01104J6894O1677M1293J691j3864j8854k5019j9989j1036j8184k5894n825
37127H3994K4797K9506J6763J5474J3089j4608l9560j9819K0956K4802p322k2946
37115A25126m108J9447L0952L8911L7872J3080k1093l3667k2259j0867j4023k9354
37103A30017m6370m2555P73O2416R7098R6428Q5221N5572j9876r6954q0604K4330
37091B65496Q3208J4077r1568j04856l4149K0838K0746L386p70R615L0946M1685
$$ plain form
37079 258654 268579 226750 183856 194708 224553 196899 117345 62429 53805 38845 51 -14030
37067 -14030 14621 35319 11983 -31849 -70322 -103806 -115614 -74804 2931 64602 92546 98735
37055 98735 64582 -18899 -68482 12741 172250 251932 209797 162360 180009 191174 144906
37044 144906 116587 163020 204052 156222 77920 68612 110052 121831 105009 114871 140313 122094
37032 122094 64880 36480 67759 124867 169129 188994 185675 167591 143957 105167 43014 -1397
37020 -1397 31783 125783 190458 182802 148899 122490 72769 -8463 -62905 -61256 -51831 -58763 -27737
37007 -27737 60879 122718 93536 32090 12839 5614 -39173 -70150 -16581 72769 90690 27526
36995 27526 -42102 -88646 -135016 -165874 -139916 -79636 -51517 -62229 -58249 -22842 3867 -788
$$ packed form
37079B58654R925m1829m2894J0852K9845k7654p9554n4916q624j4960l8794j4081
37067a4030K8651K0698k3336m3832l8473l3484j1808M0810P7735O1671K7944O189
37055I8735l4153q3481m9583Q1223J59509P9682m2135m7437J7649J1165m6268
37044A44906k8319M6433M1032m7830p8302r308M1440J1779j6822R862K5442j8219
37032A22094n7214k8400L1279N7108M4262J9865l319j8084k3634l8790o2153m4411
37020a397L3180R4000O4675p656l3903k6409m9721q1232n4442J649R425o932L1026
37007b7737Q8616O1839k9182o1446j9251p225m4787l0977N3569Q9350J7921o3164
36995B7526o9628m6544m6370l0858K5958O0280K8119j0712L980L5407K6709m655
$$ plain form
36983 -788 -14565 -15835 -3465 20483 43908 40126 13268 19151 90999 172075 174569 85733 -25808
36970 -25808 -86226 -67442 4534 62662 59157 35087 77513 187770 264768 249463 201011 185180
36958 185180 179789 152364 138479 164516 177191 135966 97499 117450 142587 98280 17038 -19952
36946 -19952 -10185 -1057 8769 41465 68973 66987 83880 157395 220936 197042 127725 103546
36934 103546 118505 109397 85758 98060 122112 101793 70430 102349 171404 182444 122348 60832
36922 60832 22795 -20226 -50968 -21379 44518 79511 95243 160625 265593 321377 298595
36911 298595 260086 251852 253337 235037 185654 98860 9837 7041 117959 230659 230808 160443
36899 160443 122929 97842 4130 -104409 -88414 47295 151131 158422 157076 199918 220223
$$ packed form
36983g88j3777j270J2370K3948K3425l782k6858N883P1848Q1076K494q8836j11541
36970b5808o0418J8784P1976N8128l505k4070M2426J10257P6998j5305m8452j5831
36958A85180n391k7425j3885K6037J2675m1225l8467J9951K5137m4307q1242l6990
36946a9952R767R128R826L2696K7508j986J6893P3515O3541k3894o9317k4179
36934A03546J4959r108k3639J2302K4052k0319l1363L1919O9055J1040o0096o1516
36922F0832l8037m3021l0742K9589O5897L4993J5732O5382J04968N5784k2782
36911B98595l8509q234J485j8300m9383q6794q9023k796J10918J12700J49p0365
36899A60443l7514k5087r3712j08539J5995J35709J03836P291j346M2842K0305
$$ plain form
36888 220223 176493 130620 130163 141484 143171 163270 186237 147349 60338 29094 88579 149646
36876 149646 145200 118502 121176 131082 118674 99102 80952 54513 53091 124145 221065 235688
36864 235688 160128 100048 106625 122458 120433 156308 237868 278492 240379 198539 201436 191206
36852 191206 129486 83097 108306 156895 173020 184602 225038 257399 247647 226079 212654 171326
36840 171326 101124 79191 144522 225207 247160 231050 219177 194403 139554 93809 81271
36829 81271 61105 12896 -6455 43962 113030 137292 126847 116399 103114 86532 97021 133129
36817 133129 143763 118109 114488 156663 188626 178883 176015 206433 213158 161471 115350 136430
36805 136430 183652 181512 121769 43451 -18603 -21188 71039 210981 291975 285715 270764 291192
$$ packed form
36888B20223m3730m5873m57J1321J687K0099K2967l8888q7011l1244N9485O1067
36876A49646m446k6698K674R906j2408j9572j8150k6439j422P1054R6920J4623
36864B35688p5560o0080O577J5833k025L5875Q1560M0624l8113m1840K897j0230
36852A91206o1720m6389K5209M8589J6125J1582M0436L2361r752k1568j3425m1328
36840A71326p0202k1933O5331Q0685K1953j6110j1873k4774n4849m5745j2538
36829H1271k0166m8209j9351N0417O9068K4262j0445j0448j3285j6582J0489L6108
36817A33129J0634k5654l621M2175L1963r743k868L0418O725n1687m6121K1080
36805A36430M7222k140n9743p8318o2054k585R2227J39942Q0994o260j4951K0428
$$ plain form
36793 291192 293308 246040 207976 216298 222516 201896 211297 268825 295134 254550 236021 302198
36781 302198 371330 349756 275924 226680 181907 99659 37819 75096 172974 229061 219854 197691
36769 197691 195686 217437 268636 326247 332621 283552 257350 298915 350576 354238 335140 324245
36757 324245 294045 240338 229570 290417 353890 371594 390671 440833 461683 422353 393927
36746 393927 415234 410635 337082 283439 315709 354797 327838 306857 358913 388025 286638
36735 286638 137129 97915 175619 263881 323336 369185 362460 273732 188105 198565 259413
36724 259413 279152 277057 306611 316078 244798 171538 197262 259481 238975 175525 189976 257472
36712 257472 257767 204023 217110 296545 315666 240793 171513 155682 132722 75898 40761 55317
$$ packed form
36793B91192K116m7268l8064Q322O218k0620R401N7528K6309m0584j8529O6177
36781C02198O9132k1574p3832m9244m4773q2248o1840L7277R7878N6087r207k2163
36769A97691k005K1751N1199N7611O374m9069k6202M1565N1661L662j9098j0895
36757C24245l0200n3707j0768O0847O3473J7704J9077N0162K0850l9330k8426
36746C93927K1307m599p3553n3643L2270L9088k6959k0981N2056K9112j01387
36735B86638j49509l9214P7704Q8262N9455M5849o725q8728q5627J0460O0848
36724B59413J9739k095K9554R467p1280p3260K5724O2219k0506o3450J4451O7496
36712B57472K95n3744J3087P9435J9121p4873o9280j5831k2960n6824l5137J4556
$$ plain form
36700 55317 90119 141257 224593 296706 297618 254991 235870 228828 189661 157082 191948 246504
36688 246504 231017 167526 141126 148206 136345 138735 209911 278247 231938 113108 58834 86610
36676 86610 107959 114852 170272 244878 252190 226276 274951 369093 371650 275492 220890 264313
36664 264313 312502 305034 288445 285990 257163 210151 204908 231396 228839 223974 298270 424200
36652 424200 491684 487692 487170 482447 400543 279984 240317 271679 243578 134417 64840 85139
36640 85139 113848 109816 125940 168693 177817 164376 198169 249483 222540 150961 168821 278307
36628 278307 343960 330187 337641 384169 365908 272558 230040 283284 336491 348404 383991 435125
36616 435125 401303 292392 239610 262808 244489 175541 191249 307696 366761 317180 305637
$$ packed form
36700E5317L4802N1138Q3336P2113R12m2627j9121p042l9167l2579L4866N4556
36688B46504j5487o3491k6400P080j1861K390P1176O8336m6309j18830n4274K7776
36676H6610K1349O893N5420P4606P312k5914M8675R4142K557r6158n4602M3423
36664B64313M8189p468j6589k455k8827m7012n243K6488k557m865P4296J25930
36652D24200O7484l992n22m723q1904j20559l9667L1362k8101j09161o9577K0299
36640H5139K8709m032J6124M2753R124j3441L3793N1314k6943p1579J7860J09486
36628B78307O5653j3773P454M6528j8261r3350m2518N3244N3207J1913L5587N1134
36616D35125l3822j08911n2782K3198j8319o8948J5708J16447N9065m9581j1543
$$ plain form
36605 305637 399051 460134 406114 354681 390233 409073 329871 250053 258137 284755 270118 289534
36593 289534 381849 436295 379379 299743 268723 217403 110643 56391 113052 167188 131081
36582 131081 87621 115693 149152 132480 135852 190671 195614 115872 88777 194717 308186
36571 308186 316596 301550 357246 413942 394911 369346 394409 381669 276165 193116 220668
36560 220668 263058 236347 236689 346816 457526 458192 428104 458901 465295 363260 262882 282048
36548 282048 330432 284781 224994 283318 399137 437127 423590 458152 507110 485134 434637
36537 434637 434726 437349 371536 300690 304971 322023 272106 221345 254128 306892 293147 265243
36525 265243 289696 299362 236000 196978 268269 355287 352769 334389 397232 470634 461299 434328
$$ packed form
36605C05637R3414O1083n4020n1433L5552J8840p9202p9818Q084K6618j4637J9416
36593B89534R2315N4446n6916p9636l1020n1320j06760n4252N6661N4136l6107
36582A31081m3460K8072L3459j6672L372N4819M943p9742k7095J05940J13469
36571C08186Q410j5046N5696N6696j9031k5565K5063j2740j05504q3049K7552
36560B20668M2390k6711L42J10127J10710O66l0088L0797O394j02035j00378J9166
36548B82048M8384m5651n9787N8324J15819L7990j3537L4562M8958k1976n0497
36537D34637Q9K623o5813p0846M281J7052m9917n0761L2783N2764j3745k7904
36525B65243K4453R666o3362l9022P1291Q7018k518j8380O2843P3402r335k6971
$$ plain form
36513 434328 467223 483611 417578 374754 436699 481438 402954 325652 378939 443481 364888
36502 364888 246235 270839 389257 439463 433657 472988 517970 493539 483156 574440 657971
36491 657971 621993 585894 684988 794937 749132 662946 741573 916853 987881 993496 1134177
36480 1134177 1432695 1759619 2072912 2344401 2387238 2072421 1605349 1289496 1131992 966139
36470 966139 809536 777556 787688 694370 592227 646748 753689 714199 614171 664744 796698
36459 796698 796336 721052 776754 889377 818025 612886 539748 610714 605401 506608 500197 584153
36447 584153 589955 555704 665077 847403 854347 708342 657260 709127 644620 481008 477959
36436 477959 660845 769430 717303 689468 745202 728963 621285 590260 652118 649482 588226
$$ packed form
36513D34328L2895J6388o6033m2824O1945M4739p8484p7302N3287O4542p8593
36502C64888j18653K4604J18418N0206n806L9331M4982k4431j0383R1284Q3531
36491F57971l5978l6099R9094J09949m5805q6186P8627J75280P1028N615J40681
36480A134177K98518L26924L13293K71489M2837l14817m67072l15853j57504j65853
36470I66139j56603l1980J0132r3318j02143N4521J06941l9490j00028N0573J31954
36459G96698l62p5284N5702J12623p1352k05139p3138P0966n313r8793o411Q3956
36447E84153N802l4251J09373J82326O944j46005n1082N1867o4507j63612l049
36436D77959J82886J08585n2127k7835N5734j6239j07678l1025O1858k636o1256
$$ plain form
36425 588226 628878 742395 750493 692572 760168 893692 860532 707156 696203 814946 800845
36414 800845 642944 588742 656827 625633 512680 569236 778353 858701 793938 849169 1030430
36403 1030430 1053850 898962 859006 980203 987859 840192 814318 961564 1018227 938205 967443
36392 967443 1111454 1091712 913726 901434 1080462 1120850 982656 999614 1217394 1290565
36382 1290565 1161488 1182329 1416193 1490772 1318060 1279303 1501275 1628216 1515691 1464915
36372 1464915 1560627 1483347 1204753 1147513 1408413 1550649 1419571 1413931 1679738 1814925
36362 1814925 1677086 1693510 2035387 2272291 2190456 2155899 2317799 2282449 1951496 1829040
36352 1829040 2092251 2224182 1988771 1873815 2120610 2244659 2006895 1908857 2197256 2345764
$$ packed form
36425E88226M0652J13517Q098n7921O7596J33524l3160j53376j0953J18743j4101
36414H00845j57901n4202O8085l1194j12953N6556K09117Q0348o4763N5231J81261
36403A030430K3420j54888l9956J21197P656j47667k5874J47246N6663q0022K9238
36392I67443J44011j9742j77986j2292J79028M0388j38194J6958K17780P3171
36382A290565j29077K0841K33864P4579j72712l8757K21972J26941j12525n0776
36372A464915R5712p7280k78594n7240K60900J42236j31078n640K65807J35187
36362A814925j37839J6424L41877K36904q1835l4557J61900l5350l30953j22456
36352A829040K63211J31931k35411j14956K46795J24049k37764r8038K88399J48508
$$ plain form
36342 2345764 2086857 1972744 2318129 2589435 2461797 2447683 2828303 3036870 2793509 2738614
36332 2738614 3203282 3503634 3237901 3085777 3488227 3787345 3569510 3547866 4144010 4566892
36322 4566892 4345946 4340998 5098486 5719738 5595680 5668419 6617614 7480341 7563515 7951366
36312 7951366 9473382 11051984 11870072 13179844 15981154 19057315 21450260 24407081
36304 24407081 28411300 31193549 31804091 33531442 39039928 46106217 52783592 62751807
36296 62751807 79592393 100815768 126764760 170320700 241851100 322025584 365875032
36289 365875032 344890160 276838199 204775886 154268050 121536836 95574370 74881064
36282 74881064 61316139 51680069 42225490 34228704 29784362 26961147 23180029 19389589
$$ packed form
36342B345764k58907j14113L45385K71306j27638j4114L80620K08567k43361n4895
36332B738614M64668L00352k65733j52124M02450K99118k17835k1644N96144M22882
36322D566892k20946m948P57488O21252j24058P2739R49195Q62727Q3174L87851
36312G951366J522016J578602Q18088J309772K801310L076161K392945K956821
36304B4407081M004219K782249O10542J727351N508486P066289O677375R968215
36296F2751807J6840586K1223375K5948992M3555940P1530400Q0174484M3849448
36289C65875032k0984872o8051961p2062313n0507836l2731214k5962466k0693306
36282G4881064j3564925r636070r454579p996786m444342k823215l781118l790440
$$ plain form
36274 19389589 17332559 15950335 13645392 11333102 10389589 9913211 8575849 7123509
36266 7123509 6703478 6565155 5600955 4504114 4345910 4501718 3917941 3091737 2970828
36257 2970828 3108704 2641812 1992624 1963713 2150524 1806553 1345849 1494642 1819556 1541472
36247 1541472 1018232 1026773 1295081 1093608 636291 598909 820036 708479 422736 486384
36237 486384 711615 599905 355250 457840 675700 503505 151678 127554 258619 88336
36227 88336 -169333 -25045 314704 305142 51153 39100 204971 148496 -25580 58447 249097
36216 249097 137568 -132641 -130486 41513 -20891 -219486 -166014 32109 -24192 -244009
36206 -244009 -229892 -50530 -82359 -257695 -211337 -19206 -60599 -279428 -296319 -138642
$$ packed form
36274A9389589k057030j382224k304943k312290r43513m76378j337362j452340
36266G123509m20031j38323r64200j096841j58204J55808n83777q26204j20909
36257B970828J37876m66892o49188k8911J86811l43971m60704J48793L24914k78084
36247A541472n23240Q541K68308k01473m57317l7382K21127j11557k85743O3648
36237D86384K25231j11710k44655J02590K17860j72195l51827k4124J31065j70283
36227H8336k57669J44288L39749r562k53989j2053J65871n6475j74076Q4027J90650
36216B49097j11529k70209K155J71999o2404j98595N3472J98123n6301k19817
36206b44009J4117J79362l1829j75336M6358J92131m1393k18829j6891J57677
$$ plain form
36196 -138642 -161088 -342683 -348166 -204100 -243538 -442156 -455895 -268727 -185324 -231160 -161399
36185 -161399 -13397 -56156 -234483 -242053 -105207 -128484 -304396 -338665 -220614 -212793 -313415
36174 -313415 -282435 -164505 -229474 -420553 -418522 -239603 -215099 -379568 -432112 -318086 -298374
36163 -298374 -407770 -387887 -214655 -167559 -301109 -347887 -225767 -160179 -221277 -206796 -71264
36152 -71264 -23215 -109978 -135123 -63276 -83964 -205540 -207938 -66517 -6380 -74751 -78817 -4449
36140 -4449 -63034 -253760 -318119 -213774 -197261 -339766 -398906 -288091 -239821 -360132 -434438
36129 -434438 -336297 -242203 -274233 -291200 -199783 -133033 -161311 -148065 -40432 7282 -65226
36118 -65226 -103927 -42037 -16272 -69071 -47743 83147 142953 69867 45130 158848 257198
$$ packed form
36196a38642k2446j81595n483J44066l9438j98618j3739J87168Q3403m5836O9761
36185a61399J48002m2759j78327p570J36846k3277j75912l4269J18051P821j00622
36174c13415L0980J17930o4969j91079K031J78919K4504j64469n2544J14026J9712
36163b98374j09396J9883J73232M7096j33550m6778J22120O5588o1098J4481J35532
36152g1264M8049q6763k5145P1847k0688j21576k398J41421O0137o8371m066P4368
36140d449n8585j90726o4359J04345J6513j42505n9140J10815M8270j20311p4306
36129d34438R8141R4094l2030j6967R1417O6750k8278J3246J07633M7714p2508
36118f5226l8701O1890K5765n2799K1328J30890N9806p3086k4737J13718R8350
$$ plain form
36107 257198 253861 302809 531154 865972 1219629 1563438 1743631 1550867 1079286 697882
36097 697882 555947 436665 201908 25486 40446 102723 80271 59265 90779 43448 -114879
36086 -114879 -193125 -116062 -88852 -234285 -358531 -280665 -120517 -53722 -40295 1496 2925
36075 2925 -72292 -92221 3035 56799 -29705 -117675 -100766 -102355 -215106 -297655 -234916 -157389
36063 -157389 -191210 -225320 -141240 -45399 -55469 -78747 -23151 -8348 -139046 -280184 -290117
36052 -290117 -273218 -364100 -458712 -405487 -281358 -232571 -212461 -120666 -38503 -78952 -151181
36041 -151181 -114337 -27699 -21437 -60290 -59129 -85306 -213188 -321299 -275504 -181735 -214360
36030 -214360 -318086 -325137 -250651 -219237 -201408 -82068 84788 136519 62253 -15476 -62700
$$ packed form
36107B57198l337M8948K28345L34818L53657L43809J80193j92764m71581l81404
36097F97882j41935j19282k34757j76422J4960O2277k2452k1006L1514m7331j58327
36086a14879p8246P7063K7210j45433j24246P7866J60148O6795J3427M1791J429
36075B925p5217j9929R5256N3764q6504q7970J6909j589j12751q2549O2739P7527
36063a57389l3821l4110Q4080R5841j0070k3278N5596J4803j30698j41138r933
36052b90117J6899r0882r4612N3225J24129M8787K0110R1795Q2163m0449p2229
36041a51181L6844Q6638O262l8853J161k6177j27882j08111M5795R3769l2625
36030b14360j03726p051P4486L1414J7829J19340J66856N1731p4266p7729m7224
$$ plain form
36019 -62700 -133875 -210011 -232461 -239999 -292703 -328823 -271533 -195958 -211285 -264236 -242999 -185550
36007 -185550 -194349 -234073 -210737 -166299 -195574 -251746 -234447 -190284 -222884 -283416 -258264 -187871
35995 -187871 -185283 -212030 -158614 -81399 -123576 -245564 -267890 -155760 -39342 26758 104016
35984 104016 183216 175725 97810 64893 91974 80994 8477 -52743 -96499 -185973 -288856
35973 -288856 -289497 -183069 -95226 -92391 -121014 -139403 -159117 -152467 -71056 33592 48444 -35107
35961 -35107 -121261 -165719 -198713 -211071 -164006 -103608 -120188 -195729 -227419 -194712 -168602 -168845
35949 -168845 -151309 -124487 -138695 -171791 -163637 -146252 -195414 -271632 -262798 -175005 -127059 -159175
35937 -159175 -198598 -212602 -241536 -276304 -256745 -203534 -205054 -259871 -273815 -225879 -196430 -216610
$$ packed form
36019f2700p1175p6136k2450p538n2704l6120N7290P5575j5327n2951K1237N7449
36007a85550q799l9724K3336M4438k9275n6172J7299M4163l2600o0532K5152P0393
35995a87871K588k6747N3416P7215m2177j21988k2326J12130J16418O6100P7258
35984A04016P9200p491p7915l2917K7081j0980p2517o1220m3756q9474j02883
35973b88856o41J06428Q7843K835k8623j8389j9714O650Q1411J04648J4852q3551
35961c5107q6154m4458l2994j2358M7065O0398j6580p5541l1690L2707K6110k43
35949a68845J7536K6822j4208l3096Q154J7385m9162p6218Q834Q7793M7946l2116
35937a59175l9423j4004k8934l4768J9559N3211j520n4817j3944M7936K9449k0180
$$ plain form
35925 -216610 -228321 -210357 -209133 -225800 -203778 -148280 -134026 -175907 -208349 -203571 -196118 -188166
35913 -188166 -148732 -105726 -119531 -170553 -191900 -196049 -237963 -275825 -219581 -105237 -61265
35902 -61265 -103441 -125122 -95275 -95683 -143239 -147674 -82504 -37560 -58917 -86254 -89633 -119870
35890 -119870 -179074 -187240 -126509 -80590 -84907 -74745 -26521 -8567 -40073 -40250 22890 66432
35878 66432 35240 -17635 -51191 -105909 -187632 -211282 -138869 -61843 -70011 -137546 -203870 -266422
35866 -266422 -327377 -345823 -309977 -270765 -248212 -191745 -82370 17225 63059 90070 127598
35855 127598 146371 131448 115052 99293 43752 -36005 -65379 -44535 -69743 -171916 -250016
35844 -250016 -226156 -157399 -125664 -118330 -91180 -60117 -56113 -60380 -44166 -12130 27685 65257
$$ packed form
35925b16610j1711J7964J224j6667K2022N5498J4254m1881l2442M778P453P952
35913a88166L9434M3006j3805n1022k1347m149m1914l7862N6244J14344M3972
35902f1265m2176k1681K9847m08m7556m435O5170M4944k1357k7337l379l0237
35890a19870n9204q166O0731M5919m317J0162M8224J7954l1506j77O3140M3542
35878F6432l1192n2875l3556n4718q1723k3650P2413P7026q168o7535o6324o2552
35866b66422o0955j8446L5846L9212K2553N6467J09375R9595M5834K7011L7528
35855A27598J8773j4923j6396j5759n5541p9757k9374K0844k5208j02173p8100
35844b50016K3860O8757L1735P334K7150L1063M004m267J6214L2036L9815L7572
$$ plain form
35832 65257 44513 -83886 -244916 -288784 -192239 -93541 -89092 -123059 -129495 -146865 -213219 -269141
35820 -269141 -255958 -213246 -197820 -195647 -185946 -201020 -251182 -278324 -250025 -212518 -193971 -153808
35808 -153808 -85790 -62483 -109617 -146291 -124230 -115111 -176756 -241129 -225700 -155909 -89827 -23896
35796 -23896 36784 23200 -80222 -165516 -155518 -128797 -178526 -248680 -240258 -189260 -194186 -236782
35784 -236782 -224386 -162352 -138095 -161550 -158602 -112605 -89052 -114967 -136077 -105401 -36612 35849
35772 35849 88492 103664 82026 49587 19014 -26573 -82114 -102604 -74715 -50073 -65366 -92329
35760 -92329 -110885 -156111 -235075 -274911 -223843 -134198 -76444 -43804 -14771 -30648 -120870 -218081
35748 -218081 -240825 -207366 -184568 -180370 -168931 -162866 -174007 -158604 -87714 -17608 -6742 -21165
$$ packed form
35832F5257k0744j28399j61030m3868R6545R8698M449l3967o436j7370o6354n5922
35820b69141J3183M2712J5426K173R701j5074n0162k7142K8299L7507J8547M0163
35808a53808O8018K3307m7134l6674K2061R119o1645o4373J5429O9791O6082O5931
35796b3896O0680j3584j03422q5294R998K6721m9729p0154Q422N0998m926m2596
35784b36782J2396O2034K4257k3455K948M5997K3553k5915k1110L0676O8789P2461
35772C5849N2643J5172k1638l2439l0573m5587n5541k0490K7889K4642j5293k6963
35760i2329j8556m5226p8964l9836N1068Q9645N7754L2640K9033j5877r0222r7211
35748b18081k2744L3459K2798M198J1439O065j1141J5403P0890P0106J0866j4423
$$ plain form
35736 -21165 -8417 -2191 -56195 -129947 -142854 -98756 -62528 -55303 -61591 -92960 -152633 -183447
35724 -183447 -144214 -92626 -99966 -130972 -105192 -32509 12172 9236 -8065 -37335 -91540 -136544
35712 -136544 -137682 -131810 -163900 -195838 -171014 -122141 -116972 -145302 -161882 -189308 -265000 -333471
35700 -333471 -312981 -232172 -180914 -162944 -123373 -87183 -129551 -223096 -252655 -185762 -107249
35689 -107249 -79970 -83373 -93079 -113314 -126969 -113699 -114567 -180145 -265035 -277008 -217161 -163422
35677 -163422 -133366 -83948 -33557 -51095 -122072 -158201 -150414 -179555 -257123 -292806 -255171 -232141
35665 -232141 -279865 -328984 -301412 -219932 -141852 -73417 -11533 6882 -38833 -101855 -120819
35654 -120819 -82547 -10403 57533 66202 -15299 -131911 -183663 -143386 -73646 -22188 26211
$$ packed form
35736b1165J2748O226n4004p3752j2907M4098L6228P225o288l1369n9673l0814
35724a83447L9233N1588p340l1006K5780P2683M4681k936j7301k9270n4205m5004
35712a36544j138N872l2090l1938K4824M8873N169k8330j6580k7426p5692o8471
35700c33471K0490Q0809N1258J7970L9571L6190m2368r3545k9559O6893P8513
35689a07249K7279l403r706k0235j3655J3270q68o5578q4890j1973N9847N3739
35677a63422L0056M9418N0391j7538p0977l6129P787k9141p7568l5683L7635K3030
35665b32141m7724m9119K7572Q1480P8080O8435O1884J8415m5715o3022j8964
35654a20819L8272P2144O7936Q669q1501j16612n1752M0277O9740N1458M8399
$$ plain form
35643 26211 83444 121824 126050 114424 90006 34226 -36300 -70196 -54257 -30807 -35721 -71976
35631 -71976 -138523 -223780 -279620 -268327 -224494 -204208 -194528 -148862 -83129 -47681 -35050 -17787
35619 -17787 -41872 -154905 -266846 -233806 -83302 -339 -63675 -149811 -143775 -92514 -78062
35608 -78062 -76389 -35497 14034 21415 7298 12512 25636 29634 51226 99686 122191 80933
35596 80933 15970 -18718 -21948 -7459 31496 76830 75688 20697 -27422 -35663 -42971 -71001
35584 -71001 -74051 -26060 23735 35616 42802 75294 95477 68079 25474 6608 -4814 -30130
35572 -30130 -48979 -49397 -56280 -67516 -39719 15504 6779 -105976 -235275 -282413 -253872 -203536
35560 -203536 -143991 -84642 -73716 -121283 -153809 -124560 -95915 -129353 -169484 -134009 -53456
$$ packed form
35643B6211N7233L8380M226j1626k4418n5780p0526l3896J5939K3450m914l6255
35631g1976o6547q5257n5840J1293M3833K0286R680M5666O5733L5448J2631J7263
35619a7787k4085j13033j11941L3040J50504Q2963o3336q6136O036N1261J4452
35608g8062J673M0892M9531P381j4117N214J3124L998K1592M8460K2505m1258
35596H0933o4963l4688l230J4489L8955M5334j142n4991m8119q241p308k8030
35584g1001l050M7991M9795J1881P186L2492K0183k7398m2605j8866j1422k5316
35572c0130j8849m18o883j1236K7797N5223q725j12755j29299m7138K8541N0336
35560b03536N9545N9349J0926m7567l2526K9249K8645l3438m0131L5475Q0553
$$ plain form
35549 -53456 -16952 -30018 -31754 -15846 -30351 -77981 -109300 -104447 -86670 -68765 -52603 -63603
35537 -63603 -121646 -193259 -226848 -216337 -186333 -147828 -115215 -124391 -177838 -212836 -182675 -128864
35525 -128864 -114369 -130785 -136891 -142389 -176493 -210888 -195299 -144152 -110137 -90519 -36237 53484
35513 53484 114357 98919 28485 -35599 -42369 11056 66947 59324 -1313 -39608 -32116 -45559
35501 -45559 -118164 -177766 -143138 -44290 29632 47226 27791 -25446 -103056 -149461 -131271 -105179
35489 -105179 -136032 -190679 -200374 -182792 -198957 -222837 -169302 -44351 39525 9870 -87846
35478 -87846 -167849 -185909 -138316 -49744 27147 55057 56774 71343 83664 54786 476 -28281
35466 -28281 -27474 -33683 -49140 -44545 -26840 -31086 -47441 -25497 45603 120663 161341 163076 129460
$$ packed form
35549e3456L6504j3066j736J5908j4505m7630l1319M853J7777J7905J6162j1000
35537f3603n8043p1613l3589J0511L0004L8505L2613r176n3447l4998L0161N3811
35525a28864J4495j6416o106n498l4104l4395J5589N1147L4015J9618N4282Q9721
35513E3484O0873j5438p0434o4084o770N3425N5891p623o0637l8295P492j3443
35501d5559p2605n9602L4628R8848P3922J7594j9435n3237p7610m6405J8190K6092
35489a05179l0853n4647r695J7582j6165k3880N3535J24951Q3876k9655r7716
35478h7846q0003j8060M7593Q8572P6891K7910J717J4569J2321k8878n4310k8757
35466b8281Q07o209j5457M595J7705m246j6355K1944P1100P5060M0678J735l3616
$$ plain form
35453 129460 75467 42859 54394 68542 39061 -2942 4674 48676 58770 17681 -28644 -60728
35441 -60728 -98483 -126347 -96618 -20892 25492 11077 -14542 -12713 -11721 -41575 -78113 -88262
35429 -88262 -81044 -81364 -92285 -107573 -127662 -146399 -153071 -156070 -171870 -187627 -171216 -120967 -69488
35416 -69488 -38147 -23294 -22502 -33667 -32610 3932 52430 61697 21293 -25449 -39144 -23837
35404 -23837 -8356 -13569 -35735 -47596 -30222 -11419 -37943 -97103 -119299 -84413 -59964 -89877
35392 -89877 -117666 -84029 -30047 -21536 -35717 -20243 -8941 -67185 -162030 -203847 -191365 -198075
35380 -198075 -232095 -231497 -194260 -189534 -227761 -234885 -178809 -118855 -103228 -107892 -99439 -75123 -26719
35367 -26719 50006 100907 59129 -44562 -107070 -93058 -53465 -6817 78190 167765 161927 49913
$$ packed form
35453A29460n3993l2608J1535J4148k9481m2003P616M4002J0094m1089m6325l2084
35441f0728l7755k7864K9729P5726M6384j4415k5619J829R92k9854l6538j0149
35429h8262P218l20j0921j5288k0089j8737o672k999j5800j5757J6411N0249N1479
35416f9488L1341J4853P92j1165J057L6542M8498R267m0404m6742j3695J5307
35404b3837J5481n213k2166j1861J7374J8803k6524n9160k2196L4886K4449k9913
35392h9877k7789L3637N3982Q511j4181J5474J1302n8244r4845m1817J2482o710
35380a98075l4020N98L7237M726l8227p124N6076N9954J5627m664Q453K4316M8404
35367b6719P6725N0901m1778j03691o2508J4012L9593M6648Q5007Q9575n838j12014
$$ plain form
35355 49913 -50789 -60016 -31215 -33335 -48585 -49404 -68813 -116966 -120981 -32291 79624 118068
35343 118068 80928 26264 -17871 -43326 -26625 26146 54845 29402 3981 27010 55243
35332 55243 24011 -48229 -93156 -89333 -67548 -59816 -93586 -190744 -320718 -401066 -395466 -362951
35320 -362951 -360650 -354401 -287060 -183254 -115854 -106410 -124113 -149875 -177763 -181286 -141320 -90638
35308 -90638 -80171 -115237 -160901 -187185 -178182 -129199 -68891 -50273 -86578 -130331 -143717 -147405
35296 -147405 -171171 -205606 -236203 -272774 -307195 -296287 -229182 -157886 -117609 -75354 -7887
35285 -7887 31448 -10295 -91386 -126919 -98182 -49509 -11469 11680 8478 -25460 -59812 -62938
35273 -62938 -42048 -18102 4224 11454 -24427 -87891 -110390 -65008 -14080 -10509 -13519 30771
$$ packed form
35355D9913j00702r227K8801k120j5250q19j9409m8153m015Q8690J11915L8444
35343A18068l7140n4664m4135k5455J6701N2771K8699k5443k5421K3029K8233
35332E5243l1232p2240m4927L823K1785P732l3770r7158j29974q0348N600L2515
35320c62951K301O249O7341J03806O7400R444j7703k5762k7888l523L9966N0682
35308i0638J0467l5066m5664k6284R003M8983O0308J8618l6305m3753j3386l688
35296a47405k3766l4435l0597l6571l4421J0908O7105P1296M0277M2255O7467
35285g887L9335m1743q1091l5533K8737M8673L8040K3149l202l3938l4352l126
35273f2938K0890K3946K2326P230l5881o3464k2499M5382N0928L571l010M4290
$$ plain form
35261 30771 81819 58342 -39171 -136897 -190717 -211544 -212924 -199242 -187263 -184635 -167855 -125111
35249 -125111 -87119 -71838 -45154 10553 40907 -1986 -74042 -104147 -99759 -110256 -126315 -101615
35237 -101615 -44872 -4324 18653 58140 100995 94600 30268 -48330 -110732 -154112 -169238 -152959
35225 -152959 -136764 -145148 -148771 -116344 -81019 -88781 -113450 -96775 -44309 -4837 18255 54389
35213 54389 89115 84675 58127 53923 54687 7333 -71860 -106365 -71469 -17114 16501 26917
35201 26917 1644 -70114 -137681 -127927 -53667 -5659 -28257 -76331 -101128 -103967 -96972 -83194
35189 -83194 -85390 -127537 -182307 -201098 -193203 -204536 -223602 -189597 -96167 -5774 46286 83226
35177 83226 114987 115349 82921 50263 22915 -18106 -51382 -33432 16049 33813 19889 28813
$$ packed form
35261C0771N1048k3477r7513r7726n3820k0827j380J3682J1979K628J6780M2744
35249a25111L7992J5281K6684N5707L0354m2893p2056l0105M388j0497j6059K4700
35237a01615N6743M0548K2977L9487M2855o395o4332p8598o2402m3380j5126J6279
35225a52959J6195q384l623L2427L5325p762k4669J6675N2466L9472K3092L6134
35213E4389L4726m440k6548m204P64m7354p9193l4505L4896N4355L3615J0416
35201B6917k5273p1758o7567R754P4260M8008k2598m8074k4797k839O995J3778
35189h3194k196m2147n4770j8791P895j1333j9066L4005R3430R0393N2060L6940
35177H3226L1761L62l2428l2658k7348m1021l3276J7950M9481J7764j3924Q924
$$ plain form
35165 28813 48964 2325 -110460 -178744 -141293 -74698 -67004 -95326 -92187 -52652 -8831 31676
35153 31676 53907 4079 -137174 -292363 -360020 -320458 -228354 -140540 -90944 -93655 -126293
35142 -126293 -142901 -134246 -138355 -169464 -186722 -160320 -114534 -74654 -29115 18494 18897 -52649
35130 -52649 -141717 -176509 -147618 -92150 -41920 -22183 -54931 -121926 -162681 -144906 -101447 -71966
35118 -71966 -53459 -35289 -31176 -42828 -42403 -26062 -34857 -87177 -141250 -159467 -156346 -147540 -111363
35105 -111363 -43661 9795 24351 40202 83276 106370 74864 52772 124040 268034 389700
35094 389700 442433 447212 417051 342814 246041 176039 149655 141283 128437 106561 70674 24270
35082 24270 -5900 -3210 5644 -10439 -31822 -13363 47371 104743 118766 86058 32187 -2862
$$ packed form
35165B8813K0151m6639j12785o8284L7451O6595P694k8322L139L9535M3821M0507
35153C1676K2231m9828j41253j55189o7657L9562R2104Q7814M9596k711l2638
35142a26293j6608Q655m109l1109j7258K6402M5786L9880M5539M7609M03p1546
35130e2649q9068l4792K8891N5468N0230J9737l2748o6995m0755J7775M3459K9481
35118g1966J8507J8170M113j1652M25J6341q795n2320n4073j8217L121Q806L6177
35105a11363O7702N3456J4556J5851M3074K3094l1506k2092P1268J43994J21666
35094C89700N2733M779l0161p4237r6773p0002k6384q372j2846k1876l5887m6404
35082B4270l0170K690Q854j6083k1383J8459O0734N7372J4023l2708n3871l5049
$$ plain form
35070 -2862 5782 29215 5532 -74409 -140031 -134617 -94934 -91612 -126994 -146968 -127431 -92914
35058 -92914 -66661 -53676 -61132 -91578 -128730 -166658 -230097 -323983 -391411 -376996 -312272 -278069
35046 -278069 -291337 -289188 -226193 -131463 -58470 -26334 -28398 -59552 -108249 -142357 -129788 -74553
35034 -74553 -21174 -12521 -40049 -51328 -21893 3919 -20724 -62220 -51101 768 9201 -41936
35022 -41936 -59676 15342 108263 117321 54484 3470 -8553 -14494 -22835 -16442 -10898 -29710 -35688
35009 -35688 29705 139738 192941 143158 57866 32374 95049 207654 312853 366107 354820
34998 354820 300146 225315 132686 34148 -19943 15387 117404 215512 265549 271407 246468
34987 246468 194529 127024 67780 38094 47978 86587 113629 92824 47263 37617 66415 62677
$$ packed form
35070b862Q644K3433k3683p9941o5622N414L9683L322l5382j9974J9537L4517
35058i2914K6253J2985p456l0446l7152l7928o3439r3886o7428J4415O4724L4203
35046b78069j3268K149O2995R4730P2993L2136k064l1154m8697l4108J2569N5235
35034g4553N3379Q653k7528j1279K9435K5812k4643m1496J1119N1869Q433n1137
35022d1936j7740P5018R2921R058o2837n1014j2023n941q341O393N544j8812n978
35009c5688O5393J10033N3203m9783q5292k5492O2675J12605J05199N3254j1287
34998C54820n4674p4831r2629r8538n4091L5330J02017R8108N0037N858k4939
34987B46468n1939o7505n9244k9686R884L8609K7042k0805m5561r646K8798l738
$$ plain form
34975 62677 -4620 -65725 -57621 -26591 -48775 -102853 -109817 -61903 -21894 -19412 -34850 -65219
34963 -65219 -116687 -146146 -101598 -16355 22577 -2036 -27884 -20626 -1678 29222 99034 174893
34951 174893 172132 80412 -4427 -10223 27327 45146 39387 27795 -2075 -52568 -80857 -59304
34939 -59304 -28008 -38557 -81342 -111760 -115530 -106245 -86434 -52978 -22799 -16388 -24018 -14023 26636
34926 26636 69524 61020 -28702 -158830 -239966 -232746 -201966 -227749 -284566 -273216 -167201 -53783
34914 -53783 -13760 -27823 -33050 -17715 -20410 -69434 -155901 -245379 -296466 -286795 -231182 -158851
34902 -158851 -78988 6793 73918 96054 84483 64816 31917 -22319 -59301 -38371 5207
34891 5207 3993 -28311 -13447 59535 112508 104621 84879 88014 72854 11903 -43540 -47408 -36437
$$ packed form
34975F2677o7297o1105Q104L1030k2184n4078o964M7914M0009K482j5438l0369
34963f5219n1468k9459M4548Q5243L8932k4613k5848P258J8948L0900O9812P5859
34951A74893k761r1720q4839n796L7550J7819n759j1592k9870n0493k8289K1553
34939e9304L1296j0549m2785l0418l770R285J9811L3456L0179O411p630R995M0659
34926B6636M2888q504q9722j30128q1136P220L0780k5783n6817J1350J06015J13418
34914e3783M0023j4063n227J5335k695m9024q6467q9478n1087R671N5613P2331
34902a58851P9863Q5781O7125K2136j1571j9667l2899n4236l6982K0930M3578
34891E207j214l2304J4864P2982N2973p887j9742L135j5160o0951n5443l868J0971
$$ plain form
34878 -36437 -62369 -109249 -140875 -173209 -231202 -280459 -272444 -223942 -186068 -161320 -115203 -52790
34866 -52790 -23086 -49238 -97214 -114718 -77547 -6416 46615 46491 20406 27203 74491 107463
34854 107463 92491 60386 43551 25155 -14615 -52852 -65591 -70245 -85006 -89367 -68738 -56339
34842 -56339 -83643 -127005 -149179 -154056 -151316 -110387 -13141 80399 90917 31123 -7068 24486
34830 24486 76685 80843 33646 -13109 -20356 -1770 -2999 -46988 -105275 -132500 -118609 -84183
34818 -84183 -38816 14214 40577 -462 -86261 -141933 -133969 -96548 -55099 4400 66642 66694
34806 66694 -15986 -107985 -134009 -102877 -61629 -26809 -5572 -17786 -45073 -23875 56616 118903
34794 118903 115805 104219 129978 127313 30799 -88834 -117367 -70047 -51328 -83019 -96688 -69453
$$ packed form
34878c6437k5932m6880l1626l2334n7993m9257Q015M8502L7874K4748M6117O2413
34866e2790K9704k6152m7976j7504L7171P1131N3031j24k6085O797M7288L2972
34854A07463j4972l2105j6835j8396l9770l8237j2739m654j4761m361K0629J2399
34842e6339k7304m3362k2174m877K740M0929R7246R3540J0518n9794l8191L1554
34830B4486N2199M158m7197m6755p247J8586j229m3989n8287k7225J3891L4426
34818h4183M5367N3030K6363m1039q5799n5672P964L7421M1449N9499O2242N2
34806F6694q2680r1999k6024L1132M1248L4820K1237j2214k7287K1198Q0491O2287
34794A18903l098j1586K5759k665r6514j19633k8533M7320J8719l1691j3669K7235
$$ plain form
34782 -69453 -40442 -5775 74601 163005 162590 70437 -715 16412 61251 57198 12313 -31558
34770 -31558 -68023 -100251 -112167 -103617 -98436 -92473 -53798 3159 10288 -56576 -131475 -141307 -85542
34757 -85542 -10841 42482 50155 14634 -15911 5803 47330 27164 -60338 -123064 -100896 -44624
34745 -44624 -27732 -48508 -67928 -84588 -115622 -146282 -149849 -126407 -85331 -25803 31925 38296
34733 38296 -23544 -105054 -157622 -190583 -225627 -236339 -184673 -90180 -14537 8083 -8003 -29233
34721 -29233 -24343 20654 81161 108517 86275 45036 5251 -54062 -143254 -221766 -246827 -227454
34709 -227454 -195748 -161357 -129792 -123443 -139751 -130591 -77157 -45149 -97777 -183305 -188401 -94215
34697 -94215 472 21692 11304 44943 116512 150348 100771 1235 -76288 -87341 -44570 4118
$$ packed form
34782f9453K9011L4667Q0376Q8404m15r2153p1152J7127M4839m053m4885m3871
34770c1558l6465l2228j1916Q550N181N963L8675N6957P129o6864p4899r832N5765
34757h5542P4701N3323P673l5521l0545K1714M1527k0166q7502o2726K2168N6272
34745d4624J6892k0776j9420j6660l1034l0660l567K3442M1076N9528N7728O371
34733C8296o1840q1510n2568l2961l5044j0712N1666R4493P5643K2620j6086k1230
34721b9233M890M4997O0507K7356k2242m1239l9785n9313q9192p8512k5061J9373
34709b27454L1706L4391L1565O349j6308R160N3434L2008n2628q5528n096R4186
34697i4215R4687K1220j0388L3639P1569L3836m9577r9536p7523j1053M2771M8688
$$ plain form
34685 4118 24261 20121 10700 -1366 -15856 -4624 66113 176634 250688 231380 140016 41849
34673 41849 -27759 -79084 -123542 -147849 -140671 -119445 -110257 -112146 -103459 -82515 -79685 -118936 -182266
34660 -182266 -226340 -227095 -196510 -161786 -140394 -133059 -131384 -131625 -141170 -163973 -181822 -169406 -133342
34647 -133342 -111901 -122020 -132114 -110143 -75772 -75286 -120835 -183408 -230651 -242501 -208755 -149066
34635 -149066 -119100 -151648 -200610 -191590 -125426 -80297 -104857 -160192 -183669 -163655 -126613 -88915
34623 -88915 -52576 -23955 -7853 5078 28013 64061 108573 150732 169745 147184 87882 15700
34611 15700 -48979 -94935 -115866 -120808 -133177 -154925 -153014 -113407 -79675 -90665 -107767 -67537
34599 -67537 13618 62855 68201 84593 117585 98786 9146 -64242 -47177 18744 50010 36054
$$ packed form
34685D118K0143m140r421j2066j4490J1232P0737J10521P4054j9308r1364r8167
34673D1849o9608n1325m4458k4307P178K1226R188j889Q687K0944K830l9251o3330
34660a82266m4074p55L0585L4724K1392P335J675k41r545k2803j7849J2416L6064
34647a33342K1441j0119j0094K1971L4371M86m5549o2573m7243j1850L3746N9689
34635a49066K9966l2548m8962R020O6164M5129k4560n5335k3477K0014L7042L7698
34623h8915L6339K8621J6102J2931K2935L6048M4512M2159J9013k2561n9302p2182
34611A5700o4679m5956k0931m942j2369k1748J911L9607L3732j0990j7102M0230
34599f7537Q1155M9237N346J6392L2992j8799q9640p3388J7065O5921L1266j3956
$$ plain form
34587 36054 18007 4434 -24048 -61314 -89063 -119062 -170695 -229956 -275505 -318507 -372054 -409314
34575 -409314 -398380 -352343 -299924 -235900 -150893 -82757 -80498 -132269 -180398 -195065 -186783 -162919
34563 -162919 -124391 -95471 -104630 -137364 -150997 -132398 -100867 -61878 -4172 58321 87333 71405
34551 71405 41727 29511 35099 43545 46260 43286 42206 53502 71980 70556 30103 -31348 -73508
34538 -73508 -70831 -29380 16358 21312 -26642 -75775 -60905 7335 52364 43707 34968 60594
34526 60594 69271 15475 -51420 -65027 -53570 -86890 -153704 -185594 -174704 -169549 -170700 -132822
34514 -132822 -67047 -37997 -47993 -24854 51526 106885 91669 52426 39793 29533 -8441 -37896
34502 -37896 -22492 -5479 -47772 -125149 -159990 -132801 -96161 -88377 -90902 -71148 -22739 39508
$$ packed form
34587C6054j8047j3573k8482l7266k7749k9999n1633n9261m5549m3002n3547l7260
34575d09314J0934M6037N2419O4024Q5007O8136K259n1771m8129j4667Q282K3864
34563a62919L8528K8920r159l2734j3633J8599L1531L8989N7706O2493K9012j5928
34551G1405k9678j2216N588Q446K715k974j080J1296J8478j424m0453o1451m2160
34538g3508K677M1451M5738M954m7954m9133J4870O8240M5029q657q739K5626
34526F0594Q677n3796o6895j3607J1457l3320o6814l1890J0890N155j151L7878
34514a32822O5775K9050r996K3139P6380N5359j5216l9243j2633j0260l7974k9455
34502c7896J5404J7013m2293p7377l4841K7189L6640P784k525J9754M8409O2247
$$ plain form
34490 39508 91060 103988 70190 18786 -10601 -8064 10222 34130 63739 89525 96400 88818
34478 88818 88229 98499 92395 47296 -12227 -25716 37382 131047 173905 143018 101887 117941
34466 117941 179259 225008 234424 235770 236136 202957 130305 68867 56949 61510 28696 -31807
34454 -31807 -56638 -15216 50836 79192 51147 -5521 -58922 -99004 -123034 -115360 -61925 17453
34442 17453 76424 93561 94190 102888 99309 52501 -19791 -66529 -70128 -57918 -50802 -43198 -36174
34429 -36174 -45323 -64678 -64616 -40570 -22976 -20074 5519 71690 125143 98528 1750 -84392 -102257
34416 -102257 -74148 -62601 -97033 -148952 -169994 -146313 -112881 -113313 -152233 -195080 -206918 -178382
34404 -178382 -123351 -72309 -60517 -94121 -127759 -105623 -31444 30049 31597 -2993 -18244 3386
$$ packed form
34490C9508N1552J2928l3798n1404k9387K537J8286K3908K9609K5786O875p582
34478H8818n89J0270o104m5099n9523j3489O3098R3665M2858l0887m1131J6054
34466A17941O1318M5749R416J346L66l3179p2652o1438j1918M561l2814o0503
34454c1807k4831M1422O6052K8356k8045n6668n3401m0082k4030P674N3435P9378
34442A7453N8971J7137O29Q698l579m6808p2292m6738l599J2210P116P604P024
34429c6174r149j9355O2K4046J7594K902K5593O6171N3453k6615r6778q6142j7865
34416a02257K8109J1547l4432n1919k1042K3681L3432m32l8920m2847j1838K8536
34404a78382N5031N1042J1792l3604l3638K2136P4179O1493J548l4590j5251K1630
$$ plain form
34392 3386 32079 36876 19502 3058 912 5434 9659 31448 96418 191885 262038 265414 215415
34379 215415 145800 65624 -21390 -84166 -97823 -90290 -104504 -125626 -98812 -15699 67779 100353
34367 100353 76349 13417 -57633 -84403 -34917 46555 83253 69950 71267 111156 137295 113255
34355 113255 70969 42290 10963 -29323 -38198 4058 53595 73052 83676 99729 77685 -6296
34343 -6296 -88288 -99270 -67411 -61707 -76365 -56544 -10156 -3713 -54706 -107602 -119237 -101185
34331 -101185 -74225 -42067 -16043 -10954 -9772 19715 69469 96733 85194 57880 33161 13585
34319 13585 13376 46137 85523 89408 67225 73534 126820 181334 190075 154507 103303 61231 45966
34306 45966 56847 60576 25151 -29985 -56700 -48556 -41761 -47173 -37016 -6676 9387 385 169
$$ packed form
34392C386K8693M797j7374j6444k146M522M225K1789O4970R5467P0153L376m9999
34379B15415o9615q0176q7014o2776j3657P533j4214k1122K6814Q3113Q3478L2574
34367A00353k4004o2932p1050k6770M9486Q1472L6698j3303J317L9889K6139k4040
34355A13255m2286k8679l1327m0286q875M2256M9537J9457J0624J6053k2044q3981
34343f296q1992j0982L1859N704j4658J9821M6388O443n0993n2896j1635J8052
34331a01185K6960L2158K6024N089J182K9487M9754K7264j1539k7314k4719j9576
34319A3585k09L2761L9386L885k2183O309N3286N4514Q741l5568n1204m2072j5265
34306D5966J0881L729l5425n5136k6715Q144O795n412J0157L0340J6063r002k16
$$ plain form
34293 169 21508 25546 -11315 -52393 -60508 -53963 -57751 -44322 19564 99042 127517 100748 72877
34280 72877 63689 33924 -32920 -82554 -60479 4245 29554 -15922 -77511 -88432 -50062 -21113
34268 -21113 -44846 -111510 -184952 -234796 -236251 -173673 -71551 1439 -4503 -62652 -108522 -126601
34256 -126601 -154282 -198298 -202524 -127981 -23472 27005 5880 -32608 -48531 -60077 -92824
34245 -92824 -128089 -130567 -103917 -84888 -88275 -89140 -66066 -35335 -25586 -37114 -47487 -45080 -33009
34232 -33009 -8703 29726 57042 34770 -36022 -102894 -119641 -94670 -66320 -51477 -38265 -12176
34220 -12176 30960 84279 124907 124849 85109 45423 43227 75467 112456 130751 121577 93934 85023
34207 85023 133716 218784 259165 209991 124931 82889 86862 86097 67246 58821 62278 47289 12628
$$ packed form
34293A69K1339M038l6861m1078q115O545l788J3429O3886P9478K8475k6769k7871
34280G2877r188k9765o6844m9634K2075O4724K5309m5476o1589j0921L8370K8949
34268b1113k3733o6664p3442m9844j455O2578J02122P2990n942n8149m5870j8079
34256a26601k7681m4016m226P4543J04509N0477k1125l8488j5923j1546l2747
34245i2824l5265k478K6650J9029l387q65K3074L0731R749j1528j0373K407J2071
34232c3009K4306L8429K7316k2272p0792o6872j6747K4971K8350J4843J3212K6089
34220a2176M3136N3319M0628n8l9740l9686k196L2240L6989J8295r174k7643q911
34207H5023M8693Q5068M0381m9174q5060m2042L973p65j8851q425L457j4989l4661
$$ plain form
34194 12628 -11627 -23882 -49927 -76426 -51373 32628 116549 157000 171251 176216 144987 63697
34182 63697 -20627 -56855 -57915 -68841 -96812 -113417 -100996 -59511 8435 82639 118028 90889
34170 90889 35974 3673 -3722 -21272 -64632 -117839 -162166 -182617 -159107 -87824 -4610 44556
34158 44556 51352 39767 28133 26197 50913 102286 132969 89148 -15754 -110198 -152330 -166276
34146 -166276 -181576 -183609 -148791 -89994 -33822 18682 72451 101491 74008 6150 -49941 -72518
34134 -72518 -86646 -107733 -109871 -72880 -27658 -20527 -50651 -76873 -75917 -59385 -39135 -14170
34122 -14170 5462 418 -21470 -25913 -3422 15666 14558 17913 39357 44083 7292 -25717 3955
34109 3955 70459 83257 5472 -101509 -158452 -145097 -87811 -21121 17017 -5347 -76833 -138200
$$ packed form
34194A2628k4255j2255k6045k6499K5053Q4001Q3921M0451J4251M965l1229q1290
34182F3697q4324l6228j060j0926k7971j6605J2421M1485O7946P4204L5389k7139
34170I0889n4915l2301p395j7550m3360n3207m4327k0451K3510P1283Q3214M9166
34158D4556O796j1585j1634j936K4716N1373L0683m3821j04902r4444m2132j3946
34146a66276j5300k033L4818N8797N6172N2504N3769K9040k7483o7858n6091k2577
34134g2518j4128k1087k138L6991M5222P131l0124k6222R56J6532K0250K4965
34122a4170J9632n044k1888m443K2491J9088j108L355K1444M726l6791l3009K9672
34109C955O6504J2798p7785j06981n6943J3355N7286O6690L8138k2364p1486o1367
$$ plain form
34097 -138200 -140870 -97506 -61949 -73441 -127484 -184196 -200000 -167568 -125256 -111806 -122659 -135827
34085 -135827 -161002 -216751 -270298 -261075 -191688 -135222 -133148 -143611 -117763 -70562 -38201 -16096
34073 -16096 15370 45487 60998 81702 117261 121252 46866 -70881 -144930 -139980 -99440 -76004
34061 -76004 -79741 -91764 -90365 -65052 -34154 -36921 -76141 -88584 -17815 98166 164506 148594
34049 148594 106584 89709 84029 59766 24712 -2343 -28787 -63125 -83904 -71026 -47092 -49627
34037 -49627 -72201 -70070 -26690 17205 16513 -15869 -24111 15062 57690 50038 2178 -28439 -22347
34024 -22347 -22710 -57284 -81223 -40980 33302 55219 -4788 -87183 -130026 -136583 -138118 -136182 -114899
34011 -114899 -78601 -40816 4796 69348 138049 185919 214432 241196 259787 244394 195104
$$ packed form
34097a38200k670M3364L5557j1492n4043n6712j5804L2432M2312J3450j0853j3168
34085a35827k5175n5749n3547R223O9387N6466K074j0463K5848M7201L2361K2105
34073a6096L1466L0117J5511K0704L5559L991p4386j17747p4049M950M0540K3436
34061g6004l737j2023J399K5313L0898k767l9220j2443P0769J15981O6340j5912
34049A48594m2010j6875n680k4263l5054k7055k6444l4338k0779J2878K3934k535
34037d9627k2574K131M3380M3895o92l2382q242L9173M2628p652m7860l0617O092
34024b2347l63l4574k3939M0243P4282K1917o0007q2395m2843o557j535J936K1283
34011a14899L6298L7785M5612O4552O8701M7870K8513K6764J8591j5393m9290
$$ plain form
34000 195104 143712 106400 64910 10169 -30081 -34866 -32733 -62706 -109868 -123339 -92021 -56553
33988 -56553 -43099 -34149 -19338 -24933 -63466 -97819 -94400 -75628 -74420 -68838 -18534 53535 77667
33975 77667 33330 -24381 -37838 -3321 44658 63986 27090 -40744 -56277 31297 154187
33964 154187 197883 154100 121624 150411 179744 156276 112769 80481 19817 -90169 -175737
33953 -175737 -167589 -111431 -91551 -100769 -80623 -40489 -29731 -26801 28048 105122 107605 25984
33941 25984 -40905 -37942 -21301 -41784 -61000 -35502 -794 -7654 -35785 -34142 -4052 14516
33929 14516 7493 -11425 -37481 -70277 -93022 -92618 -82723 -77928 -65634 -31877 4957 13960 -11369
33916 -11369 -57884 -113948 -163292 -180165 -157490 -121772 -95192 -62476 -3815 57493 75845 44907
$$ packed form
34000A95104n1392l7312m1490n4741m0250m785K133k9973m7162j3471L1318L5468
33988e6553J3454Q950J4811n595l8533l4353L419J8772J208N582N0304P2069K4132
33975G7667m4337n7711j3457L4517M7979J9328l6896o7834j5533Q7574J22890
33964A54187M3696m3783l2476K8787K9333k3468m3507l2288o0664j09986q5568
33953a75737Q148N6158J9880r218K0146M0134J0758K930N4849P7074K483q1621
33941B5984o6889K963J6641k0483j9216K5498L4708o860k8131J643L0090J8568
33929A4516p023j8918k6056l2796k2745M04R895M795J2294L3757L6834R003k5329
33916a1369m6515n6064m9344j6873K2675L5718K6580L2716N8661O1308J8352l0938
$$ plain form
33904 44907 5869 -6535 1122 5560 2749 6492 23659 43984 50923 34532 -3604 -47896 -70165
33891 -70165 -48461 3969 42278 43776 46684 101884 189768 230389 187350 111669 57386 7068
33879 7068 -74649 -162731 -210046 -229517 -265563 -303795 -287560 -219775 -168226 -158649 -140495 -85060
33867 -85060 -44363 -67123 -112377 -103920 -40285 2970 -27657 -101334 -144736 -125604 -82427 -68009
33855 -68009 -72943 -34719 64061 147075 133997 46822 -27029 -52138 -60334 -66775 -50132 -17274
33843 -17274 -9164 -29243 -39033 -40150 -82735 -166325 -209559 -157412 -52958 34822 90212 119157
33831 119157 106364 54169 8017 -4994 -12247 -30522 -25221 19315 53075 40196 24065 49811
33819 49811 80416 60628 10984 -19312 -46625 -116016 -204828 -247268 -233154 -207598 -193577 -183459
$$ packed form
33904D4907l9038j2404P657M438k811L743J7167K0325O939j6391l8136m4292k2269
33891g0165K1704N2430L8309J498K908N5200Q7884M0621m3039p5681n4283n0318
33879G068q1717q8082m7315j9471l6046l8232J6235O7785N1549R577J8154N5435
33867h5060M0697k2760m5254Q457O3635M3255l0627p3677m3402J9132M3177J4418
33855f8009m934L8224R8780Q3014j3078q7175p3851k5109q196o441J6643L2858
33843a7274Q110k0079r790j117m2585q3590m3234N2147J04454Q7780N5390K8945
33831A19157j2793n2195m6152j3011p253j8275N301M4536L3760j2879j6131K5746
33819D9811L0605j9788m9644l0296k7313o9391q8812m2440J4114K5556J4021J0118
$$ plain form
33807 -183459 -180778 -179486 -133830 -30335 40890 -18172 -164251 -258560 -254797 -237449 -265899 -289893
33795 -289893 -252941 -183165 -130631 -89656 -38899 -2037 -12439 -53601 -79636 -70695 -38010 2093
33783 2093 35800 54486 64057 71629 61710 15382 -49902 -99178 -136249 -192440 -255942 -268407
33771 -268407 -208274 -126225 -75941 -55532 -40345 -28042 -21462 -4763 31304 66791 78751 66698
33759 66698 38157 -1084 -28503 -11219 49218 107361 126927 117348 105050 97521 88575 71349
33747 71349 37084 -10516 -38730 -22840 -1384 -44128 -153150 -248002 -267849 -235943 -200247
33736 -200247 -167948 -134406 -122713 -146318 -172963 -173633 -173706 -208468 -257103 -269004 -233801 -181627
33724 -181627 -134316 -98046 -83419 -88087 -75720 -17077 58834 95633 82959 62126 68196 102225
$$ packed form
33807a83459K681J292M5656J03495P1225n9062j46079r4309L763J7348k8450k3994
33795b89893L6952O9776N2534M0975N0757L6862j0402m1162k6035Q941L2685M0103
33783B093L3707J8686R571P572r919m6328o5284m9276l7071n6191o3502j2465
33771b68407O0133Q2049N0284K0409J5187J2303O580J6699L6067L5487J1960j2053
33759F6698k8541l9241k7419J7284O0437N8143J9566r579j2298p529q946j7226
33747G1349l4265m7600k8214J5890K1456m2744j09022r4852j9847L1906L5696
33736b00247L2299L3542J1693k3605k6645o70p3l4762m8635j1901L5203N2174
33724a81627M7311L6270J4627m668J2367N8643P5911L6799j2674k0833O070L4029
$$ plain form
33712 102225 149548 186192 175602 100559 -2832 -77541 -107754 -115736 -108939 -78089 -46688 -67378
33700 -67378 -148655 -226612 -236538 -184427 -123352 -84670 -62142 -45892 -35170 -17338 34268 125050
33688 125050 215429 250419 213255 139916 79611 52033 47979 57364 80553 118610 169494 230844
33676 230844 289396 311174 265863 166424 65886 8402 -3089 7125 11609 -8945 -48528
33665 -48528 -63896 -12674 82149 136948 98907 9288 -46505 -31142 24017 69473 81575 68305
33653 68305 54760 57056 58636 25442 -45864 -115165 -146378 -142216 -116211 -64079 6466 47260
33641 47260 15784 -61297 -110759 -98039 -59292 -48366 -78197 -118042 -130586 -109463 -87573 -99448
33629 -99448 -130267 -125409 -64789 2859 27470 29602 63872 130494 171942 153373 103181 69771
$$ packed form
33712A02225M7323L6644j0590p5043j03391p4709l0213p982O797L0850L1401k0690
33700f7378q1277p7957r926N2111O1075L8682K2528J6250J0722J7832N1606R0782
33688A25050R0379L4990l7164p3339o0305k7578m054R385K3189L8057N0884O1350
33676B30844N8552K1778m5311r9439j00538n7484j1491J0214M484k0554l9583
33665d8528j5368N1222R4823N4799l8041q9619n5793J5363N5159M5456J2102j3270
33653F8305j3545K296J580l3194p1306o9301l1213M162K6005N2132P0545M0794
33641D7260l1476p7081m9462J2720L8747J0926k9831l9845j2544K1123K1890j1875
33629i9448l0819M858O0620O7648K4611K132L4270O6622M1448j8569n0192l3410
$$ plain form
33617 69771 71911 94432 103712 68448 -5477 -64341 -62356 -23155 -10158 -40161 -67390 -52799
33605 -52799 -4187 56057 111838 129341 68374 -51653 -144051 -153086 -123421 -128053 -159653 -150232
33593 -150232 -82885 -20263 -12869 -34180 -35489 -26591 -60518 -152197 -251123 -299112 -286682 -240206
33581 -240206 -177681 -102987 -34562 -8200 -38553 -93411 -120139 -92499 -26428 39835 73138
33570 73138 63395 25935 -17038 -58563 -100788 -130754 -128647 -107976 -114331 -159752 -187349 -138808
33558 -138808 -39481 26247 17430 -28482 -63391 -84894 -109199 -126650 -113638 -71165 -28761 -15042
33546 -15042 -31330 -46087 -17865 58346 130595 141407 100031 70961 83358 90178 38501 -52665
33534 -52665 -116095 -116352 -75217 -33218 -17968 -40386 -87409 -117553 -94121 -32968 1432 -41933
$$ packed form
33617F9771K140K2521R280l5264p3925n8864J985L9201J2997l0003k7229J4591
33605e2799M8612O0244N5781J7503o0967j20027r2398r035K9665m632l1600R421
33593a50232O7347O2622P394k1311j309Q898l3927r1679r8926m7989J2430M6476
33581b40206O2525P4694O8425K6362l0353n4858k6728K7640O6071O6263L3303
33570G3138r743l7460m2973m1525m2225k9966K107K0671o355m5421k7597M8541
33558a38808R9327O5728q817m5912l4909k1503k4305j7451J3012M2473M2404J3719
33546a5042j6288j4757K8222P6211P2249J0812m1376k9070J2397O820n1677r1166
33534e2665o3430k57M1135M1999J5250k2418m7023l0144K3432O1153L4400m3365
$$ plain form
33522 -41933 -150021 -257702 -301497 -265459 -188997 -131521 -119210 -126494 -117127 -94520 -92396 -118849
33510 -118849 -136036 -106780 -42017 15426 42360 50119 52144 39285 -3462 -69085 -131496 -173710
33498 -173710 -202226 -230232 -253505 -250740 -209185 -144741 -89669 -59481 -40274 -15464 4215 -5628
33486 -5628 -40842 -62617 -43931 -2331 29760 46838 56096 40079 -24000 -108939 -146540 -107097
33474 -107097 -33838 18811 42827 48190 21097 -43305 -97720 -91310 -49406 -43606 -79768 -79183
33462 -79183 5705 112940 149239 106312 48287 7516 -45158 -122166 -168526 -123771 -7122
33451 -7122 96766 131662 119725 114960 135429 157982 159486 137057 95092 39307 -14478 -48907
33439 -48907 -67348 -86403 -102604 -93175 -58313 -31876 -33529 -41478 -35701 -35460 -60349 -84724 -76614
$$ packed form
33522d1933j08088j07681m3795L6038P6462N7476J2311p284R367K2607K124k6453
33510a18849j7187K9256O4763N7443K6934P759K025j2859m2747o5623o2411m2214
33498a73710k8516k8006k3273K765M1555O4444N5072L0188J9207K4810J9679r843
33486e628l5214k1775J8686M1600L2091J7078R258j6017o4079q4939l7601L9443
33474a07097P3259N2649K4016N363k7093o4402n4415O410M1904N800l6162N85
33462g9183Q4888J07235L6299m2927n8025m0771n2674p7008m6360M4755J16649
33451g122J03888L4896j1937m765K0469K2553J504k2429m1965n5785n3785l4429
33439d8907j8441j9055j6201R429L4862K6437j653p949N777K41k4889k4375Q110
$$ plain form
33426 -76614 -60439 -87125 -150621 -189805 -175813 -143231 -123442 -100708 -57836 -18902 -13532 -31044
33414 -31044 -41642 -39569 -38630 -44874 -56479 -72722 -86021 -86087 -85597 -113225 -163918 -189877 -165817
33401 -165817 -129034 -123674 -139670 -145497 -147304 -165409 -179625 -157667 -120983 -116805 -131029 -101643
33389 -101643 -29838 -3036 -72617 -169895 -192401 -130421 -56652 -23473 -26711 -49728 -81392 -92965
33377 -92965 -54189 15514 56984 47747 29020 38453 56150 47202 24564 28865 63267 89758
33365 89758 85851 68721 60479 61136 62595 60370 41073 -13396 -90732 -138566 -113440 -30785 50396
33352 50396 86336 80755 67452 73500 94715 99856 65120 6051 -38444 -54171 -59877 -62191 -37417
33339 -37417 20843 72050 83709 87496 131845 196100 209214 152899 89690 77200 106951 146921
$$ packed form
33426g6614J6175k6686o3496l9184J3992L2582J9789K2734M2872L8934N370j7512
33414c1044j0598K073R39o244j1605j6243j3299o6M90k7628n0693k5959K4060
33401a65817L6783N360j5996n827j807j8105j4216K1958L6684M178j4224K9386
33389a01643P1805K6802o9581r7278k2506O1980P3769L3179l238k3017l1664j1573
33377i2965L8776O9703M1470r237j8727R433J7697q948k2638M301L4402K6491
33365H9758l907j7130q242O57J459k225j9297n4469p7336m7834K5126Q2655Q1181
33352E0396L5940n581j3303O048K1215N141l4736n9069m4495j5727n706k314K4774
33339c7417N8260N1207J1659L787M4349O4255J3114n6315o3209j2490K9751L9970
$$ plain form
33327 146921 192071 240329 263018 241314 201437 174106 147341 102084 66483 79524 116945
33316 116945 115464 69746 41942 61552 79593 54061 22544 37798 74267 66377 18433 302
33304 302 29129 30810 -48356 -153139 -193433 -164483 -133043 -129073 -118488 -78320 -32118 2829
33292 2829 44485 97857 128719 117257 94370 88869 78898 38281 -5191 -9519 9591 2310 -35602
33279 -35602 -62449 -61730 -57553 -59268 -46295 -17783 -7834 -35670 -80352 -117017 -139901 -140841 -109231
33266 -109231 -68059 -64874 -104034 -127498 -89466 -16631 32421 38171 24009 15958 26252 56453
33254 56453 91139 102048 75695 25013 -30798 -74917 -80226 -25931 60246 114891 114081 101382
33242 101382 120646 157710 175845 177228 199545 272628 394147 519634 567683 480831 302492
$$ packed form
33327A46921M5150M8258K2689k1704l9877k7331k6765m5257l5601J3041L7421
33316A16945j481m5718k7804J9610J8041k5532l1517J5254L6469p890m7944j8131
33304C02K8827J681p9166j04783m0294K8950L1440L970J0585M0168M6202L4947
33292B829M1656N3372L0862j1462k2887n501r971m0617m3472m328J9110p281l7912
33279c5602k6847P19M177j715J2973K8512R949k7836m4682l6665k2884r40L1610
33266a09231M1172L185l9160k3464L8032P2835M9052N750j4162q051J0294L0201
33254E6453L4686J0909k6353n0682n5811m4119n309N4295Q6177N4645q10j2699
33242A01382J9264L7064J8135J383K2317P3083J21519J25487M8049q6852j78339
$$ plain form
33231 302492 147801 75029 36073 -22669 -78086 -92139 -86710 -93439 -87749 -46517 -20433 -65106
33219 -65106 -139409 -159515 -121982 -82794 -45592 22936 84143 53492 -55583 -127485 -108518
33208 -108518 -68209 -62820 -46603 25037 101306 117866 97254 93862 102817 97986 102838 143009
33196 143009 176008 152310 108393 110994 137632 109094 30468 1324 72212 178113 241741
33185 241741 266870 290298 306310 291351 259205 236967 213390 163098 106862 95167 129890
33174 129890 149122 110006 55231 65232 152786 235094 221797 114160 -645 -46751 -29315
33163 -29315 -5027 -8853 -29669 -43439 -42380 -29783 -8759 13720 25400 22181 14347 9543 -2739
33150 -2739 -35794 -76393 -86755 -44970 25235 77994 96215 104596 128430 156630 160702 139597
$$ packed form
33231C02492j54691p2772l8956n8742n5417j4053N429o729N690M1232K6084m4673
33219f5106p4303k0106L7533L9188L7202O8528O1207l0651j09075p1902J8967
33208a08518M0309N389J6217P1640P6269J6560k0612l392Q955m831M852M0171
33196A43009L2999k3698m3917K601K6638k8538p8626k9144P0888J05901O3628
33185B41741K5129K3428J6012j4959l2146k2238k3577n0292n6236j1695L4723
33174A29890J9232l9116n4775J0001Q7554Q2308j3297j07637j14805m6106J7436
33163b9315K4288l826k0816j3770J059J2597K1024K2479J1680l219p834m804j2282
33150b739l3055m0599j0362M1785P0205N2759J8221Q381K3834K8200M072k1105
$$ plain form
33138 139597 122183 122993 118488 82576 31979 13575 45504 90629 100954 76831 63066 88252
33126 88252 130170 150164 139858 114537 80215 39457 17467 37704 67944 40431 -51849 -124559
33114 -124559 -105131 -29540 13046 4773 5586 43988 72001 50469 21408 51953 136422 198013
33102 198013 179451 97955 7914 -63986 -130552 -201310 -250077 -241191 -183134 -131957 -127795 -145410
33090 -145410 -128507 -62165 11960 46534 31582 -10697 -51343 -71436 -68573 -49784 -15037 39154
33078 39154 92495 103649 63475 20717 21998 47532 45307 9268 -24250 -43215 -66473 -88569
33066 -88569 -79412 -47104 -41122 -73389 -90020 -48496 22262 66965 69881 48821 19763 -4630
33054 -4630 -12431 -13044 -32430 -71429 -103128 -124657 -165015 -220984 -239832 -199920 -154160 -147057 -140544
$$ packed form
33138A39597j7414Q10m505l5912n0597j8404L1929M5125J0325k4123j3765K5186
33126H8252M1918J9994j0306k5321l4322m0758k1990K0237L0240k7513r2280p2710
33114a24559J9428P5591M2586q273Q13L8402K8013k1532k9061L0545Q4469O1591
33102A98013j8562q1496r0041p1900o6566p0758m8767Q886N8057N1177M162j7615
33090a45410J6903O6342P4125L4574j4952m2279m0646k0093K863J8789L4747N4191
33078C9154N3341J1154m0174m2758J281K5534k225l6039l3518j8965k3258k2096
33066h8569R157L2308N982l2267j6631M1524P0758M4703K916k1060k9058k4393
33054d630p801o13j9386l8999l1699k1529m0358n5969j8848L9912M5760P103O513
$$ plain form
33041 -140544 -83591 -13195 -9886 -72673 -114178 -79131 -1056 67196 116923 155894 168998 141953
33029 141953 95858 66306 60816 60275 56803 68821 109880 152728 145562 76075 1442 -13859
33017 -13859 19664 36455 17635 19565 80141 149773 157489 106841 57115 36548 26860 18494
33005 18494 27408 55862 77732 70613 39469 10234 15735 72119 147926 177950 134879 63547
32993 63547 14161 -26781 -94928 -167403 -184588 -141248 -96367 -91693 -113496 -138651 -165354 -185843
32981 -185843 -176352 -134470 -93125 -81960 -99621 -127701 -142613 -115322 -38684 39750 52110 -12018
32969 -12018 -96613 -153838 -185716 -199618 -171613 -87939 8822 54111 31235 -19273 -53179 -63778
32957 -63778 -70568 -83715 -89724 -72019 -37186 -8056 8020 25035 48999 67839 79227 97022
$$ packed form
33041a40544N6953P0396L309o2787m1505L5047P8075O8252M9727L8971J3104k7045
33029A41953m6095k9552n490n41l472J2018M1059M2848p166o9487p4633j5301
33017a3859L3523J6791j8820J930O0576O9632P716n0648m9726k0567r688q366
33005A8494Q914K8454K1870p119l1144k9235N501N6384P5807L0024m3071p1332
32993F3547m9386m0942o8147p2475j7185M3340M4881M674k1803k5155k6703k0489
32981a85843R491M1882M1345J1165j7661k8080j4912K7291P6638P8434J2360o4128
32969a2018q4595n7225l1878j3902K8005Q3674R6761M5289k2876n0508l3906j0599
32957f3778o790j3147o009J7705L4833K9130J6076J7015K3964J8840J1388J7795
$$ plain form
32945 97022 114911 101985 59032 35409 53124 61131 16448 -36696 -38173 -20185 -53927 -113983
32933 -113983 -103577 -17830 28042 -34704 -130626 -159264 -131709 -124665 -156836 -178792 -152914 -88573
32921 -88573 -17672 27262 30290 12880 14879 40981 59806 64211 81569 108264 95771 31749
32909 31749 -27280 -42279 -46082 -63563 -46846 39989 130348 136437 83394 70588 118627 147571
32897 147571 107966 47002 25291 39762 58340 74335 91023 90900 54467 -10195 -76377 -121714
32885 -121714 -133819 -112766 -76522 -47660 -29756 -10238 15869 42329 67157 90613 100552 82320
$$ packed form
32945I7022J7889j2926m2953k3623J7715Q007m4683n3144j477J7988l3742o0056
32933a13983J0406Q5747M5872o2746r5922k8638K7555P044l2171k1956K5878O4341
32921h8573P0901M4934L028j7410J999K6102J8825M405J7358K6695j2493o4022
32909C1749n9029j4999l803j7481J6717Q6835R0359O089n3043j2806M8039K8944
32897A47571l9605o0964k1711J4471J8578J5995J6688j23l6433o4662o6182m5337
32885a21714j2105K1053L6244K8862J7904J9518K6107K6460K4828K3456R939j8232
$$ [...]
##END NTUPLES=NMR SPECTRUM
##END=
