##TITLE=31Pdec_104-2025-Bay
CDCl3, 24 sc
 1.9.2025
##JCAMPDX= 6.0         $$ Bruker NMR JCAMP-DX V2.0
##DATA TYPE= NMR SPECTRUM
##DATA CLASS= NTUPLES
##ORIGIN= UXNMR, Bruker Analytische Messtechnik GmbH
##OWNER= root
$$ XWIN-NMR		Version 3.5
$$ Mon Sep  1 14:52:20 2025 Russian Standard Time (UT+4h)  she@DPX200
##.OBSERVE FREQUENCY= 81.013821
##.OBSERVE NUCLEUS= ^31P
##.ACQUISITION MODE= SIMULTANEOUS
##.ACQUISITION SCHEME= undefined
##.AVERAGES= 24
##.DIGITISER RES= 17
##SPECTROMETER/DATA SYSTEM= spect
##.PULSE SEQUENCE= zgpg30
##.SOLVENT NAME= CDCl3
##.SHIFT REFERENCE= (INTERNAL, CDCl3, 0, 198.062)
##AUDIT TRAIL= $$ (NUMBER, WHEN, WHO, WHERE, WHAT)
$$ ##TITLE= Audit trail, XWIN-NMR		Version 3.5
$$ ##JCAMPDX= 5.01
$$ ##ORIGIN= Bruker BioSpin GmbH
$$ ##OWNER= she
$$ F:/spectra/data/she/nmr/P31/2/pdata/1/auditp.txt
$$ ##AUDIT TRAIL=  $$ (NUMBER, WHEN, WHO, WHERE, WHAT)
(   1,<2025-09-01 14:51:07.04 +0400>,<she>,<DPX200>,
      <created by zg, POWCHK disabled, PULCHK disabled
       configuration hash MD5:
       00 E9 B6 7A A2 85 ED C7 34 08 36 98 17 FE 4E 26
       data hash MD5: 32K
       D5 58 CA B8 B9 7D 84 D9 D7 70 20 59 F8 7D 43 96>)
(   2,<2025-09-01 14:51:09.50 +0400>,<she>,<DPX200>,
      <Start of raw data processing
       efp BC_mod = 2 LB = 1.5 FT_mod = 6 PKNL = 1 PHC0 = 1353.123 PHC1 = 162.4999 SI = 64K 
       data hash MD5: 64K
       A7 28 81 29 D9 96 FD 30 56 2E 48 92 79 5F 6A 0C>)
(   3,<2025-09-01 14:51:29.04 +0400>,<she>,<DPX200>,
      <pk PHC0 = 9.430179 PHC1 = -13 
       data hash MD5: 64K
       1A E6 4B 71 1D C1 7A 98 B8 04 FC A0 91 15 18 DA>)
$$ ##END=
$$ 
$$ hash MD5
$$ 25 A6 C1 34 74 1D 47 06 53 FC CE 7C ED A2 08 57
##$RELAX= 
##$RELAX= 
##$RELAX= 
##$RELAX= 
##$RELAX= 
##$RELAX= 
##$RELAX= 
##$RELAX= 
$$ Bruker specific parameters
$$ --------------------------
##$DU= <F:/spectra>
##$EXPNO= 2
##$NAME= <P31>
##$PROCNO= 1
##$TYPE= <nmr>
##$USER= <she>
##$AMP= (0..31)
100 100 100 100 100 100 100 100 100 100 100 100 100 100 100 100 100 100 
100 100 100 100 100 100 100 100 100 100 100 100 100 100 
##$AQSEQ= 0
##$AQ_mod= 1
##$AUNM= <au_zg>
##$AUTOPOS= <>
##$BF1= 81.014009
##$BF2= 200.13
##$BF3= 200.13
##$BF4= 200.13
##$BF5= 200.13
##$BF6= 200.13
##$BF7= 200.13
##$BF8= 200.13
##$BYTORDA= 1
##$CFDGTYP= 0
##$CFRGTYP= 5
##$CHEMSTR= <none>
##$CNST= (0..31)
1 1 145 1 1 1 1 1 1 1 1 1 1 1 1 1 1 1 1 1 1 1 1 1 1 1 1 1 1 1 1 1 
##$CPDPRG= <waltz16>
##$CPDPRG1= <>
##$CPDPRG2= <waltz16>
##$CPDPRG3= <>
##$CPDPRG4= <mlev>
##$CPDPRG5= <mlev>
##$CPDPRG6= <mlev>
##$CPDPRG7= <mlev>
##$CPDPRG8= <mlev>
##$CPDPRGB= <>
##$CPDPRGT= <>
##$D= (0..31)
0 1 0 0 0 0 0 0 0 0.06 0 0.03 2e-05 3e-06 0 0 0.0002 0 0 0 0 0 0 0 0 0 
0 0 0 0 0 0 
##$DATE= 1756723866
##$DBL= (0..7)
120 120 120 11 120 120 24 19 
##$DBP= (0..7)
150 150 150 150 150 150 150 150 
##$DBP07= 0
##$DBPNAM0= <>
##$DBPNAM1= <>
##$DBPNAM2= <>
##$DBPNAM3= <>
##$DBPNAM4= <>
##$DBPNAM5= <>
##$DBPNAM6= <>
##$DBPNAM7= <>
##$DBPOAL= (0..7)
0.5 0.5 0.5 0.5 0.5 0.5 0.5 0.5 
##$DBPOFFS= (0..7)
$$ [...]
##$SUBNAM2= <"">
##$SUBNAM3= <"">
##$SUBNAM4= <"">
##$SUBNAM5= <"">
##$SUBNAM6= <"">
##$SUBNAM7= <"">
##$SUBNAM8= <"">
##$SUBNAM9= <"">
##$SW= 400.765351723535
##$SWIBOX= (0..15)
0 1 3 0 0 0 0 0 0 0 0 0 0 0 0 0 
##$SW_h= 32467.5324675325
##$TD= 32768
##$TD0= 1
##$TE= 0
##$TE2= 300
##$TE3= 300
##$TEG= 300
##$TL= (0..7)
0 120 53 12 22 120 120 120 
##$TP= (0..7)
150 150 150 150 150 150 150 150 
##$TP07= 0
##$TPNAME0= <>
##$TPNAME1= <>
##$TPNAME2= <>
##$TPNAME3= <>
##$TPNAME4= <>
##$TPNAME5= <>
##$TPNAME6= <>
##$TPNAME7= <>
##$TPOAL= (0..7)
0.5 0.5 0.5 0.5 0.5 0.5 0.5 0.5 
##$TPOFFS= (0..7)
0 0 0 0 0 0 0 0 
##$TUNHIN= 0
##$TUNHOUT= 0
##$TUNXOUT= 0
##$USERA1= <user>
##$USERA2= <user>
##$USERA3= <user>
##$USERA4= <user>
##$USERA5= <user>
##$V9= 5
##$VALIST= <valist>
##$VCLIST= <CCCCCCCCCCCCCCC>
##$VD= 0
##$VDLIST= <DDDDDDDDDDDDDDD>
##$VPLIST= <PPPPPPPPPPPPPPP>
##$VTLIST= <TTTTTTTTTTTTTTT>
##$WBST= 1024
##$WBSW= 4
##$XGAIN= (0..3)
0 0 0 0 
##$XL= 0
##$YL= 0
##$YMAX_a= 23443
##$YMIN_a= -24483
##$ZGOPTNS= <>
##$ZL1= 120
##$ZL2= 120
##$ZL3= 120
##$ZL4= 120
##$ABSF1= 0
##$ABSF2= 0
##$ABSG= 0
##$ABSL= 0
##$ALPHA= 0
##$AQORDER= 0
##$ASSFAC= 0
##$ASSFACI= 0
##$ASSFACX= 0
##$ASSWID= 0
##$AUNMP= <proc_1d>
##$AZFE= 0.1
##$AZFW= 0.5
##$BCFW= 0
##$BC_mod= 2
##$BYTORDP= 0
##$COROFFS= 0
##$CY= -3
##$DATMOD= 1
##$DC= 0
##$DFILT= <>
##$DTYPP= 0
##$F1P= 0
##$F2P= 0
##$FCOR= 1
##$FTSIZE= 65536
##$FT_mod= 6
##$GAMMA= 0
##$GB= 0
##$INTBC= 1
##$INTSCL= 9.790993e-09
##$ISEN= 30
##$LB= 1.5
##$LEV0= 0
##$LPBIN= 0
##$MAXI= 10000
##$MC2= 0
##$MEAN= 0
##$ME_mod= 0
##$MI= 50
##$NCOEF= 0
##$NC_proc= -4
##$NLEV= 6
##$NOISF1= 182.463
##$NOISF2= 159.3651
##$NSP= 0
##$NTH_PI= 0
##$NZP= 0
##$OFFSET= 198.0616
##$PC= 4
##$PHC0= 1362.553
##$PHC1= 149.4999
##$PH_mod= 1
##$PKNL= yes
##$PPARMOD= 0
##$PSCAL= 0
##$PSIGN= 0
##$REVERSE= no
##$SF= 81.0140089999434
##$SI= 65536
##$SIGF1= 159.3651
##$SIGF2= -187.1042
##$SINO= 113.3802
##$SIOLD= 16384
##$SREGLST= <1H.CDCl3>
##$SSB= 0
##$STSI= 65536
##$STSR= 0
##$SW_p= 32467.5324675325
##$SYMM= 0
##$S_DEV= 0
##$TDeff= 32768
##$TDoff= 0
##$TI= <>
##$TILT= no
##$TM1= 0
##$TM2= 0
##$TOPLEV= 0
##$USERP1= <user>
##$USERP2= <user>
##$USERP3= <user>
##$USERP4= <user>
##$USERP5= <user>
##$WDW= 1
##$XDIM= 65536
##$YMAX_p= 504753500
##$YMIN_p= -6333673
$$ End of Bruker specific parameters
$$ ---------------------------------
##NTUPLES= NMR SPECTRUM
##VAR_NAME=  FREQUENCY,     SPECTRUM/REAL,   SPECTRUM/IMAG
##SYMBOL=    X,             R,               I
##VAR_TYPE=  INDEPENDENT,   DEPENDENT,       DEPENDENT
##VAR_FORM=  AFFN,          ASDF,            ASDF
##VAR_DIM=   65536,         65536,           65536
##UNITS=     HZ,            ARBITRARY UNITS, ARBITRARY UNITS
##FACTOR=    0.49542278885378, 1,            1
##FIRST=     16045.7642231865, 0,            0
##LAST=      -16421.768244346, 0,            0
##MIN=       -16421.768244346, -6333673,     0
##MAX=       16045.7642231865, 504753500,    0
$$ Real data points
##PAGE= N=1
##DATA TABLE= (X++(R..R)), XYDATA
$$ [...]
39526I2753O6895k2110j15114j09210k5543M9841N8941k1513j60418k34674j30057
39515e50209Q6685K17013J85250J12507R8807Q6353J0467o5260o5790l0880k1423
39504F3520j1643K5006L2474k0657n6240j5841L0107J4501O360Q2729J68741J51038
39492D70095O8833M0600O2865L2541p2701j73317k13475j91015j06920K262M0270
39481c9962j9359m6720O4972K04228J85543K8513q5511r0465p3620o2037J2257
39470G7839J17747J10565k4288j11077m6743M1745N198j04959j39026o7717J8853
39459a21863N7986N5692K8173j2379l9836l7880k0881o595r94j4118l8985k2122
39447a73802O8761J54837J23211j761p9059n8978l6650n9449l4993Q2843J61682
$$ y = [92753, 159648, 137538, 22424, -86786, -112329, -62488, -3547, -25060, -185478, -420152, -550209, -463524, -246511, -61261, 51246, 150053, 236406, 246873, 181613, 115823, 84943, 63520, 51877, 76883, 109357, 88700, 32460, 16619, 46726, 61227, 67587, 150316, 319057, 470095, 538928, 579528, 642393, 674934, 602233, 428916, 215441, 24426, -82494, -80232, -39962, -59321, -106041, -41069, 163159, 348702, 377215, 291704, 201239, 127619, 65582, 77839, 195586, 306151, 281863, 170786, 124043, 165788, 170986, 66027, -72999, -140716, -121863, -63877, -8185, 19988, 7609, -32227, -70107, -90988, -97583, -98577, -112695, -151680, -173802, -105041, 49796, 173007, 171246, 92187, 33209, -3441, -62890, -97883, -15040, 146642]
39436A46642P8215o7747q2974L6313J10529M4373o4397r9990p4164m4176K177
39425a5199R1485J61598J19603o033o5306K3037J45192J24427m9389k05951k15768
39414A07696j34678q5047p9545m5633L3446J02438J29908J24825P6624k2258j04250
39403A03526q5215k903J2759o6225j09768j7900J28444J76342R7461N89j9841
39392B17269J9408M3852K5905O699J4078r05q6425j66011j02593P8606J64275
39381B14158M3139j08471p3771Q7615J56294R6790O1343J00240J08590N2311J2180
39370G50418m271o1343j00892n917J28890Q2286r8035j09451J17796K97836K75804
39359A273121K58164L78040M35743L32351L54596O85580J027920J136255J327797
$$ y = [146642, 224857, 157110, 74136, 110449, 220978, 265351, 200954, 100964, 26800, -17376, -15199, 76286, 237884, 357487, 351454, 286148, 309185, 454377, 578804, 529415, 323464, 107696, -26982, -112029, -191574, -237207, -203761, -101323, 28585, 153410, 230034, 207776, 103526, 18311, 15408, 28167, -38058, -147826, -165726, -37282, 139060, 236521, 237110, 217269, 236677, 280529, 306434, 313133, 327211, 326306, 239881, 73870, -28723, 49883, 214158, 257297, 148826, 75055, 162670, 318964, 415754, 477097, 577337, 685927, 738238, 750418, 746147, 684804, 583912, 577995, 706885, 789171, 691136, 581685, 699481, 997317, 1273121, 1531285, 1909325, 2345068, 2677419, 3032015, 3717595, 4745515, 5881770, 7209567]
39350G209567J908542K432682K233047J483279R39012O68169q5156j564552k853589
39341A2371001l012605k250136j454854j042765q24502o55322n97605n88247m65611
39332A479354k80934j99565j69393l6985J05633N3812j13167j38084k8929k1821
39322F49921j36128j53058m3008k2795j32398j36693M5925J74167Q9819k9357
39312C06395J71P2412L0427m7468k2686M2793K3311l5688l4157k8950j16032k16754
39300b6226j92471q1656j8998Q456J18191K88787L56211K46183N2739j07663j85314
39289D58239j60297n4692K7634M33p1957n5790N1280J16684O0587o4430j71246
39278A36445k07375j41079N267J13953P9172m2767r4878k5753P1388J12099R3639
$$ y = [7209567, 9118109, 11550791, 13783838, 15267117, 16206129, 16874298, 16789142, 15224590, 12371001, 9358396, 7108260, 5653406, 4610641, 3786139, 3130817, 2533212, 1944965, 1479354, 1198420, 998855, 829462, 792477, 898110, 951922, 838755, 700671, 671742, 649921, 513793, 360735, 317727, 294932, 162534, 25841, 71766, 245933, 335752, 306395, 306566, 378978, 409405, 361937, 339251, 382044, 405355, 369667, 335510, 306560, 190528, -26226, -218697, -300353, -319351, -310895, -192704, 96083, 452294, 698477, 751216, 643553, 458239, 297942, 243250, 270884, 271317, 199360, 143570, 194850, 311534, 372121, 307691, 136445, -70930, -212009, -206742, -92789, -13617, -56384, -151262, -177015, -105627, 6472, 100111]
39267A00111K4748q3083j48996q5952M9465J04663N1275J5595N7514P7914R203
39256A72457n8136l5290J2431j3865q0584r2900m6897J016M3562R4650J18562
39245A15006R0583O3956P3512M3344q9607k23644k04401n1444O9277Q1583O4106
39234C2271P6939P1521J5141k0788L1956J24765J54693R1890o318p4252r1729
39223D06089q1501p9325r6873j09349q8513l4175L9993J19595J64711J20255l240
39212C57667j07682j23897r9269j01093r5781k4138N7936M5305l6742o1636q891
39201a98221P775n4000q3502k516J01508J13254N2212M698j6162m1328m7106O416
39189a56972P8407Q5375J8431n0845o8294m5071k1900k6270m7159l0097O4622
$$ y = [100111, 124859, 41776, -107220, -193172, -143707, -39044, 12231, 27826, 85340, 163254, 172457, 114321, 79031, 91462, 77597, -2987, -95887, -142784, -141768, -98206, -3556, 115006, 205589, 269545, 343057, 386401, 296794, 73150, -131251, -182695, -113418, -31835, 32271, 109210, 180731, 195872, 175084, 207040, 331805, 486498, 578388, 572070, 497818, 406089, 324588, 245263, 148390, 39041, -49472, -83647, -43654, 75941, 240652, 360907, 357667, 249985, 126088, 26819, -74274, -170055, -194193, -136257, -90952, -127694, -189330, -198221, -190446, -244446, -327948, -330464, -228956, -115702, -63490, -58792, -74954, -116282, -163388, -156972, -78565, 6810, 25241, -25604, -93898, -138969, -160869, -187139, -234298, -264395, -199773]
39178a99773J80423K01014R8189k6229q2955r6450j12639j04519n1630j6345k9451
39167b40365J1029J80650L33984K52090k6318k09033j30678L8679N2891q0833
39157A82096j61510r7949j233J2563k1743p201N4672P0429m05p9696p5092k722
39145a27791M4660K9310K134K525J597k0859j6497N0645J18169J01085K3761o562
39133B02177N0236J16887J02696R66j19042j70857j11200R049O9926J1589q4241
39122G8186j02845n2844k8980m8802m1862N14m681p6265j06439k2998Q6601J01452
39110b18963M4073L4092J07880J77025J53071M2873p7498j34321j06630m1879
39100b0277j3517l9484o2520l0809L4843Q0510Q8644P5741N6026M0096L3892J1196
$$ y = [-199773, -19350, 181664, 279853, 253624, 170669, 74219, -38420, -142939, -194569, -210914, -240365, -229336, -48686, 285298, 537388, 511070, 302037, 171359, 210038, 262929, 182096, 20586, -77363, -78596, -66033, -87776, -94977, -40305, 30124, 29719, -49977, -125069, -127791, -83131, -53821, -51687, -49162, -47565, -68424, -84921, -34276, 83893, 184978, 208739, 202177, 252413, 369300, 471996, 472962, 353920, 183063, 71863, 80912, 150838, 162427, 78186, -24659, -77503, -106483, -155285, -197147, -196633, -201314, -277579, -384018, -407016, -320415, -218963, -174890, -140798, -32918, 144107, 297178, 340051, 262553, 128232, 21602, -20277, -33794, -73278, -135798, -166607, -131764, -51254, 37390, 113131, 169157, 209253, 243145, 254341]
39088B54341o4130j54675j52812k5585J05264J07393J3820l6322L182N0162M0860
39077A41498J148l4707o7079o7900J8747J64039K34153J49239m337q5401o4843
39066C84557j6659L996k330k6015n2728m4066J2642N3842J4651n9863o2787J5977
39054B21217P0763L9185j2709q912J7550m601n6867o2460j6041Q304k1769m9033
39042A24627k3739J5993L694n3629q2177m0880K5942M8928K3701R752L5573M3545
39030A31330k7054j22730j17693N534R9653M2305q3470r8532J7538J03368N4946
39019E195l9444n7527k5766m6973j13008j07268J5053J46595J57268M8433n7390
39008g4832n8302K2166P3477L1714m4024m7292L9942J27328J28701M5894o4735
$$ y = [254341, 190211, 35536, -117276, -142861, -37597, 69796, 83616, 47294, 50476, 100638, 141498, 142646, 107939, 40860, -27040, -8293, 155746, 389899, 539138, 534801, 449400, 384557, 367898, 371894, 369564, 343549, 290821, 246755, 259397, 313239, 327890, 268027, 205240, 221217, 291980, 331165, 318456, 309544, 327094, 322493, 265626, 203166, 187125, 195429, 173660, 124627, 100888, 116881, 120575, 66946, -15231, -56111, -30169, 18759, 42460, 52212, 87785, 131330, 104276, -18454, -136147, -130613, -30960, 11345, -72125, -170657, -153119, -49751, 5195, -34249, -91776, -117542, -164515, -277523, -384791, -369738, -223143, -65875, -17442, -74832, -133134, -110968, -37491, -5777, -49801, -97093, -57151, 70177, 198878, 244772, 180037]
38997A80037j50436j68227r7520J5947Q2086O9689L5497J9445j4995q3119j03557
38986b15153q019J31560J81392J12304j012j03447j79230j86146r4127K0249L9740
38975c01889k4930m5931K8742J10006J20838R3674O8091P946j05738j92049j65432
38964d06672n2487N5407J10080J06902M1599n7004j01382l6074P2033J04753L6804
38953a26041m9015p3879l5890J7059L9418J9419o062K1590J11761J95250J92776
38942C06386R7664k9582j25492j60394j38531r0694n0364j9896K1428P0764R5966
38931b2745Q3810N5884K8793J044j6927j2352j3112n6511j09152r6115k2178K8815
38919a50746L7145P6294J53430J49423N738j44481j48650m4795K9421N4797J02663
$$ y = [180037, 29601, -138626, -236146, -220199, -138113, -68424, -32927, -13482, -28477, -111596, -215153, -223172, -91612, 89780, 202084, 201072, 97625, -81605, -267751, -361878, -341629, -301889, -326819, -372750, -344008, -234002, -113164, -19490, 48601, 56547, -49191, -241240, -406672, -459159, -403752, -293672, -186770, -145171, -202175, -303557, -339631, -267598, -162845, -126041, -175056, -248935, -284825, -267766, -228348, -208929, -214991, -193401, -81640, 113610, 306386, 404050, 374468, 248976, 88582, -49949, -140643, -191007, -210903, -189475, -118711, -22745, 61065, 116949, 145742, 146786, 129859, 117507, 104395, 47884, -61268, -157383, -179561, -150746, -113601, -37307, 116123, 265546, 271284, 126803, -21847, -66642, -37221, 17576, 120239]
38908A20239J45132P2996r6199j89905j02353P0609J58664R3552o2739j86248
38898B3748j75712m4924P0122P0017K9184P2168J55082J26506n538o1387J3059
38887B72325M0562r2071k20269j47326L7176Q7388k8616j03252k0331R1006Q0758
38876b650p468l5720K1912P2065M8339j8659o0537m5915J757L3841K6055L894
38864C6914M896K1285J3051k1917l6736j0915J1072p261k2287L1361J23528J37221
38852B80212K1540j13962j15170J9843J26111P7562n3032j00773l5065J6728k4320
38841I9674p0523j8531P2840O4805m7106j25053r0777j3261K8941M8868N8516
38830H393j418j37652k09783r8464R0695J46220N0583p272O3907J20426K7237
$$ y = [120239, 265371, 338367, 242168, 52263, -50090, 20519, 179183, 272735, 209996, 23748, -151964, -196888, -126766, -56749, -27565, 44603, 199685, 326191, 320653, 259266, 272325, 312887, 220816, 547, -146779, -109603, -22215, -50831, -154083, -174414, -83408, -2650, -10118, -45838, -23926, 48139, 96478, 77819, 17282, -28633, -26876, 6965, 33020, 36914, 41810, 63095, 76146, 54229, 17493, 6578, 17650, 10389, -11898, 19463, 142991, 280212, 301752, 187790, 72620, 92463, 218574, 296136, 243104, 142331, 107266, 123994, 99674, 29151, 10620, 83460, 148265, 101159, -23894, -114671, -127932, -98991, -50123, 8393, 6975, -130677, -340460, -438924, -348229, -202009, -151426, -158698, -94791, 25635, 52872]
38819E2872j20405j46126m9337L4462N4256O5993P6015K8558m9574m8559M4978
38808e6867J02551M1338n8448q8078o1177n2997p1573p5058n9147m6083k8801
38797d54340K955J8533l778j6490L8098J30824J72209J25062L9095j8284k5303
38786H581r665j7190o1990r5524o0749J2434K5989m6494j12368r6790m6274k8385
38774e28425j0057O6482J50671J44617O2227R061J7311J5185l6780q7123q8405
38763b85236n5322n662O7852J37313J34616M9631l0563k4749M4642R1558P0342
38752A94422J3556j2488K0417O1437K8402p8786j49557r7908J2132M7922j3921
38741B5628p4693o0981L835O7925J02947R0074L8031Q006L4862M4109m5931j62862
$$ y = [52872, -67533, -213659, -262996, -228534, -174278, -108285, -32270, -3712, -53286, -101845, -56867, 45684, 87022, 28574, -59504, -120681, -173678, -245251, -320309, -379456, -425539, -454340, -451385, -432852, -436630, -453120, -415022, -284198, -111989, 13073, 52168, 33884, 8581, -1084, -18274, -80264, -175788, -236537, -224103, -198114, -244608, -356976, -453766, -500040, -528425, -538482, -472000, -321329, -176712, -114485, -105424, -88113, -72928, -109708, -196831, -285236, -340558, -346220, -278368, -141055, -6439, 43192, 12629, -12120, 32522, 124080, 194422, 207978, 195490, 215907, 277344, 305746, 226960, 77403, -20505, -8373, 39549, 25628, -49065, -110046, -106211, -38286, 64661, 154735, 192766, 200772, 235634, 279743, 233812, 70950]
38729G0950j60064n1131K728l6094j3346J38005K41174J34888o4063j29709n1043
38718H2295j296m9166r3486o6938k3075p09L9047R5157Q4803j1113p1065R022
38706f524J52668J90355P4223p8063j43738j22552q3974m9864J0285Q4835R5856
38695A23507Q947q4437o8008L3885P9199R259o7097l7551N2930Q5726M7866K4908
38683B09134M8685O3861M4627L5065M4926O066j07139j92876j44395j5597L3017
38672B5374m8267j28712q0509M6538J05110N7070L168J2280K6635j9527p5525
38661g6365m8952M7082J10995R4908M5435Q538k4908o7063r6105r2015n8373K630
38649a54193Q7539J57407J57954Q4745j1342p9121q8139k3964P1834Q9809k5337
$$ y = [70950, -89114, -140245, -137517, -173611, -186957, -48952, 192222, 327110, 263047, 133338, 82295, 80999, 31833, -61653, -128591, -151666, -152375, -113328, -18171, 66632, 55519, -15546, -6524, 146144, 336499, 410722, 332659, 188921, 66369, -17605, -67469, -57184, 27651, 123507, 132454, 48017, -19991, 13894, 93093, 102352, 35255, -2296, 50634, 136360, 184226, 209134, 257819, 321680, 366307, 401372, 446298, 452364, 345225, 152349, 7954, -7643, 25374, -22893, -151605, -232114, -185576, -80466, -23396, -20228, -7948, 18687, -840, -76365, -125317, -78235, 32760, 127668, 173103, 181641, 156733, 89670, -6435, -98450, -156823, -154193, -66654, 90753, 248707, 333452, 322110, 242989, 154850, 130886, 202720, 292529, 267192]
38638B67192j60430j51824j1376R0436P6196N1791J02747J48577Q5383m5600j31899
38627C21193j42379j13743o4752j3662q437n2680o8681j2462M8349M9175L4524
38616b3555N9120P5659L1923o905L7943J05922Q7988J0390k0829j1509n4032j36119
38604A55996j43838n9256O431K701J0233P5819J17465O5777j2716j7771L7810
38593B38651O2956J8555n2380r1534p5505k4634Q113j7677p6778r8480n3516R576
38581a52653K9124L443j8224j526L2407L6049L422j4867O839O171p6167j61932
38569c07914j06792P3990J84759J16491q0n842N4628N1116L658K2821Q8110P8329
38557B53274j0117o2349n4964q4788j70463j97720j06317J5597P4864Q4756Q4350
$$ y = [267192, 106762, -45062, -56438, 33998, 110194, 161985, 264732, 413309, 498692, 453092, 321193, 178814, 65071, 319, -13343, -21780, -74460, -143141, -155603, -107254, -58079, -23555, 35565, 111224, 143147, 136242, 174185, 280107, 368095, 378485, 357656, 346147, 292115, 155996, 12158, -47098, -40667, -37966, -27733, 48086, 165551, 231328, 218612, 200841, 238651, 301607, 320162, 267782, 176248, 100743, 76109, 84222, 66545, -10233, -108713, -162229, -152653, -123529, -120086, -138310, -139836, -107429, -71380, -67958, -82825, -75986, -69815, -145982, -307914, -414706, -340716, -155957, -39466, -39546, -45388, 9240, 60356, 64014, 86835, 174945, 253274, 243157, 180808, 125844, 41056, -129407, -327127, -433444, -417847, -342983, -258227, -173877]
38546a73877O2008J2407k5253l1716l4099m4919m8817n2033o2825l8113N1396
38535c85841J29725J10878N5028Q0769J45828R6639n9871j32401l3364R9662J31509
38524B38561R7367P1225M4149J8751N2235J10543N1773j37106k57832j78307k6193
38513H5166L1807L5163Q6713J22140K9081j14472j35002l0672N0699N2596M4637
38502B57856M9566J4457n3180p7731m8174k8267l6925l6355k7967m2338m6077
38491g5135K0663J17742J32124L7973p0254j08316p6551r021O1099Q8362N2627
38480A71313O665J1174L8133J9661k8536k8317K4061L9965k9524j22854j50809
38469d9068r5312j0851L7501L3829K2831M1799M6350l0128j36274j28894J5330
$$ y = [-173877, -111869, -99462, -124715, -156431, -190530, -235449, -284266, -336299, -399124, -437237, -385841, -256116, -145238, -90210, -9441, 136387, 233026, 173155, 40754, 7390, 107052, 238561, 335928, 407153, 451302, 470053, 522288, 632831, 684604, 547498, 289666, 111359, 85166, 116973, 152136, 238849, 360989, 390070, 275598, 140596, 109924, 160623, 213219, 257856, 307422, 321879, 268699, 190968, 142794, 114527, 77602, 41247, 13280, -29058, -75135, -54472, 63270, 195394, 233367, 163113, 54797, -21754, -30775, 30324, 118686, 171313, 177978, 189152, 227285, 246946, 218410, 190093, 214154, 254119, 224595, 101741, -49068, -144380, -155231, -117730, -83901, -61070, -19271, 27079, -3049, -139323, -268217, -252887]
38458b52887J33043R9242K354j2829L4342L3263j7210l6132k1662k7916l1622
38447i8014K1126P5247L3796o2245q0197o662M3386K2965M872K8275L6895o679
38435A2765o1375p6602k9471Q5339K04331J87121p629j94999j73947j5245M4927
38424b4785m2204j04872n3116J9603N4001J04611J53754Q4597p9235j34292m408
38413b6346J21257P8463m0240q1373p2663j06101j36401p6800J8525L8280l662
38402b87061j6272J1601L0252L6296N0578N9712O9905J29325K10957J87017K3110
38391E05420j23783j19376m0606k0266l6052j2129l055q5450j67120j10661K4182
38380a88896O9107K3886K8889R1840O8180p2214j67834j05240L1469J04839Q2159
$$ y = [-252887, -119844, -20602, -18248, -31077, 3265, 36528, 19318, -16814, -38476, -66392, -98014, -76888, -1641, 32155, -30090, -110287, -116949, -73563, -50598, -45726, -17451, 19444, 12765, -48610, -125212, -154683, -69344, 134987, 322108, 314479, 119480, -54467, -69712, -24785, -66989, -171861, -224977, -205374, -151373, -46762, 106992, 191589, 112354, -21938, -26346, 94911, 173374, 133134, 51761, -20902, -127003, -263404, -340204, -321679, -283399, -287061, -303333, -291732, -261480, -225184, -174606, -114894, -44989, 84336, 295293, 482310, 505420, 381637, 262261, 221655, 201389, 165337, 153208, 150153, 64703, -102417, -213078, -188896, -119789, -95903, -67014, 24826, 93006, 20792, -147042, -252282, -220813, -115974, -33815]
38369c3815O925o6996p8930p190P0658O7579L1781P5918J70513J63242K1010j08815
38357C11880j19530p1749m3529q651N5933Q3078L7223O635O5164J35637J02243
38346E54334j2481r0425q5991n4371m9514p8312j26920j60717j26698k1148P4144
38335a78099Q7008N8360Q2601J61820J91301R9071n3474j36007r2892N00L0183
38324B50372k1431o4769l4867J9820K3527q957j8196j6150m9661p9616k9237N4373
38312B5208L9673o6493j01954j0664N5552o161o9346l679Q1027J9752j00108o3353
38300b00546J01310J43075r069j33185p7314J2471l4817j21734n6428J20336J99224
38289e6677J22180K7243n615n0131j43530j82058q9003M5888R6126P5306P8930
$$ y = [-33815, -26890, -93886, -172816, -180006, -109348, -41769, -9988, 65930, 236443, 399685, 420695, 311880, 192350, 120601, 77072, 68421, 124354, 207432, 244655, 251290, 316454, 452091, 554334, 541853, 451428, 365437, 311066, 261552, 183240, 56320, -104397, -231095, -252243, -178099, -91091, -32731, 49870, 211690, 402991, 502062, 448588, 312581, 219689, 220189, 250372, 228941, 164172, 129305, 149125, 172652, 163695, 145499, 129349, 79688, 72, -29165, 25208, 64881, -1612, -103566, -114230, -58678, -64839, -134185, -137864, -56837, -37085, -137193, -200546, -99236, 43839, 34770, -98415, -175729, -163258, -198075, -319809, -376237, -255901, -56677, 65503, 92746, 87131, 37000, -106530, -288588, -377591, -331703, -235577, -160271, -81341]
38278h1341J13694J00024J9857m5330l1719L5793J05937J59072J76128J22625
38268F74740J2649o7723o3762m0658r5950k02322k22234r4428P0422J24480N9907
38257A55121o311N667N7355P1663L5139n793j8657k1372m8281r9389j34654j19748
38245a29260o7392j7986J5661N5519J04712J26042R9141O1363N2813N4729L2737
38234C88079P184J1782J1224m7312j12196p2437N5530J12677K5634p5270n8992
38223B45903M289j9749q6107m3941R1559J39492L7900o1330l7923K6810J2662
38212C09565n4463r0280j01337j21327r9692Q405J17572J19805N8890N3094Q9922
38201B90154N6716m5246q6393k4855K2383k7959r9927r3247k9779J4354L4002
$$ y = [-81341, 32353, 132377, 152234, 106904, 75185, 110978, 216915, 375987, 552115, 674740, 687389, 619666, 555904, 515246, 419296, 216974, -5260, -99688, -29266, 95214, 155121, 148810, 154477, 211832, 283495, 318634, 312841, 294184, 272812, 224531, 125142, -9512, -129260, -196652, -214638, -198977, -143458, -38746, 87296, 186437, 247800, 300613, 355342, 388079, 395263, 407045, 418269, 370957, 258761, 186324, 241854, 354531, 380165, 304895, 245903, 250192, 230443, 144336, 100395, 191954, 331446, 369346, 308016, 270093, 296903, 309565, 255102, 164822, 63485, -57842, -157534, -149129, -31557, 88248, 147138, 200232, 290154, 346870, 301624, 215231, 190376, 212759, 184800, 84873, -8374, -38153, -23799, 10203]
38190A0203O8161J09205J14626P0899n664r1442j41530j06896r324N3713K5968
38179I7919l5749n1364k2956N224L7607J04772J81377J97422J23719J416j00838
38168E38549j30144q1274k0223l6451j28207j77659r4034N9841J49027J37285
38158B16710R6486P0224K5671n0696j02828r0441n6452n7779p5629n2448Q730
38147f8452M5457L5251L2660P9465J25465R3153P08m8387r351M1516K8156j0004
38135C45637K899L7659K270r2623j29631o7756j4846n8864j23667q2521M5827
38124a35616J16130N3087o0000j02585o4678l8659q5288j43539j00757M7362J58097
38113c56446J14593l512j5387J05145J86576J04748m9002j18210r5047p4470o8156
$$ y = [10203, 78364, 187569, 302195, 373094, 367430, 275988, 134458, 27562, 18238, 71951, 97919, 62170, 10806, -12150, -6926, 30681, 135453, 316830, 514252, 637971, 639387, 538549, 408405, 327131, 306908, 270457, 142250, -35409, -129443, -69602, 79425, 216710, 313196, 383420, 409091, 358395, 255567, 165126, 108674, 50895, -24734, -77182, -68452, -22995, 12256, 44916, 124381, 249846, 342999, 343707, 295320, 285969, 327485, 355641, 345637, 348536, 386195, 388465, 295842, 166211, 98455, 83609, 24745, -98922, -181443, -135616, -19486, 33601, -26399, -128984, -193662, -232321, -317609, -461148, -561905, -514543, -356446, -241853, -245365, -260752, -155607, 30969, 135717, 86715, -31495, -126542, -201012, -269168]
38102b69168P5J31320K09106J49159J1223p6755o2096n006P831l2561m8635J7235
38090C1728J06317J03361o700j08590j04680k4878M3191O0697L0181m2776j20594
38079c2743j33266o9821p285J0203M3197J32867J88767J04473p3925j97905j88280
38068b23718o8330J08759K57967K56726P7727j15008j39284l1916K3864k4786
38058A22001n3829J4790J05251J24800O8195l7898j61223k13375j14295N8160
38048h7423J19960K3506q4063q4053k2683K7411Q3577J47603J35245K3546o1497
38037B21129l0286J2567o2335j80605j70488l4248O2326M8733K5175O0845P6727
38026B9540m147j09054j12412j4331P0999Q0540P0206J03822J44208J09222M777
$$ y = [-269168, -269093, -137773, 71333, 220492, 231715, 154960, 92864, 87858, 95689, 63128, 14493, 31728, 138045, 241406, 234706, 126116, 21436, -3442, 39749, 100446, 130627, 87851, -32743, -166009, -235830, -243115, -232912, -189715, -56848, 131919, 236392, 162467, -35438, -223718, -292048, -183289, 74678, 331404, 409131, 294123, 154839, 122923, 146787, 122001, 68172, 82962, 188213, 313013, 381208, 343310, 182087, -31288, -145583, -87423, 32537, 56043, -28020, -112073, -134756, -107345, -23768, 123835, 259080, 282626, 221129, 190843, 203410, 141075, -39530, -210018, -244266, -181940, -133207, -108032, -47187, 29540, 25393, -83661, -196073, -210404, -139405, -58865, 11341, 115163, 259371, 368593, 373370]
38015C73370p1960p2842o5795j12223j46515o9899P2363J22672K6672r2244j08169
38004a44570m4106O136J9919L0425K9694k0146r7562j21908n4239M8487R7939
37993b49931P3177L8436N8312J06308R1479j0090j00329q2863N128N7014N3234
37982C9875N6094P1229L7138l4975l9113N5514J20518L2598j50947k59784k09757
37971b81610o9423M3896P9693P2865P5849Q2851M5966k0946k1452P4217J34030
37960B15936L9360j01343q0765Q4464J55038K3281j36771j52088q8964q4385j07860
37949b34097n5234L9225N7283o428n1961l3138J2478N0114O3148L1612j7714o151
37937a50863O7196P9239l2175j37368r7225J9142N1438K079M87O8028R9013N4010
$$ y = [373370, 301410, 228568, 162773, 50550, -95965, -165864, -93501, 29171, 55843, -36401, -144570, -188676, -182540, -162621, -132196, -102502, -122648, -220210, -342118, -396357, -347870, -249931, -176754, -138318, -80006, 26302, 117781, 107691, 7362, -75501, -70373, -13359, 39875, 95969, 167198, 204336, 169361, 130248, 185762, 306280, 338878, 187931, -71853, -281610, -351033, -307137, -227444, -154579, -78730, 4121, 50087, 29141, 7689, 81906, 215936, 255296, 153953, 73188, 157652, 312690, 335971, 199200, 47112, -41852, -126237, -234097, -289331, -250106, -192823, -199251, -251212, -284350, -271872, -221758, -158610, -126998, -144712, -150863, -83667, -4428, -36603, -173971, -271196, -252054, -200616, -198537, -198050, -130022, -31009, 23001]
37925B3001M523j0576k3952l7592j9125N498j3664l8395K035O7350O4620K1172
37913D4895L1735N9317j1247j24142q7669R7372J83241M7516j06001o8295M9541
37902A16263J2022j59357k28811j05323N7352J13245R0228P0508N8245L2055K1915
37891G8342N4982Q6019N2806k8675q2064p3901m9876n7155p1389l9578K0292K0281
37879h9916p2766j63997j37467j0572Q4833P2786J7392J8040P9287J23713R8843
37868B0176K9135k6836l8920k0068N532L1660N8081O4546L0680j6810k2047J6257
37856A31386K7385l0964j01014j00322l0866L8112O3457N1518J8049k0199l6391
37845A0151k3209n927R919N5579J16903J02802k5194j52591j43751l1965L5045
$$ y = [23001, 27524, 16948, -7004, -44596, -63721, -58223, -71887, -110282, -108247, -40897, 23723, 44895, 76630, 135947, 124700, 558, -87111, 10261, 193502, 241018, 135017, 66722, 116263, 128285, -31072, -259883, -365206, -307854, -194609, -104381, -33873, 24372, 56427, 78342, 133324, 219343, 272149, 243474, 161410, 87509, 37633, -19522, -90911, -130489, -110197, -89916, -162682, -326679, -464146, -474718, -389885, -317099, -299707, -281667, -202380, -78667, 20176, 49311, 22475, -16445, -36513, -30981, 679, 58760, 123306, 153986, 137176, 115129, 131386, 158771, 127807, 26793, -73529, -104395, -66283, -2826, 48692, 66741, 46542, 10151, -13058, -18985, -9066, 46513, 163416, 266218, 241024, 88433, -55318, -87283, -52238]
37834e2238J2261o104L3361N7058o99p8342o8509L3930J22622J07686K5621L128
37822A89775R1921J69084Q2447j11626j88369p4431L5048k0101j18642q2579J4033
37811a3440m316p8975k1050J15350Q7275j07014j86502m6559O8276j3995j07470
37800c08420q618J42648J04197n7708q6226N0396J39704P5922j8133k2883K7175
37789C8054N2864L6347j0914o9220q6017k7336M9461O4948M0510N3837R4571P5857
37777C12962j7933j04606j30028j19374r1755k3551P3438J22062P5468r440l7801
37766D9442R369N9164L9286l1816o3258m540Q9667J37149J29392R3075N48j65722
37754C41756k85963k02629K4710J35672J5852j36898j05095M4617J04685M7149
$$ y = [-52238, -39977, -46081, -12720, 44338, 43639, -34703, -103212, -69282, 53340, 161026, 186647, 189775, 281696, 450780, 533227, 421601, 233232, 158801, 193849, 173748, 55106, -27473, -13440, -17756, -96731, -117781, -2431, 84844, -22170, -208672, -255231, -186955, -200950, -308420, -317038, -174390, -70193, -127901, -214127, -163731, -24027, 51895, 33762, 10879, 38054, 90918, 127265, 116351, 47131, -38886, -66222, -16761, 48187, 88697, 142534, 237105, 312962, 295029, 190423, 60395, -58979, -150734, -174285, -100847, 21215, 96683, 87243, 49442, 58811, 117975, 157261, 125445, 62187, 57647, 147314, 284463, 413855, 506930, 507478, 341756, 55793, -146836, -122126, 13546, 29398, -107500, -212595, -167978, -63293, -16144]
37744a6144J2658N5874R3788P7341M5333J6395k8251o2206m4370j7847n0696r9722
37732a7847p3135j0575m1065j54081j76328j9379J89111K76465K12692P7677n1364
37721B12171j23524j17239p6421p5043j11658j10414m6374J6807L6690M3591N2157
37710b99257K4223l5063m5654K1983Q1228N8799P288R337M1757K7811k5888m2945
37698a76381m550K7141J4552l03L1560Q5554Q8061J0052q4486r6703j958J17626
37686A0165J65952J34457Q0881L7295n406m1268n0383n5961j03423j65823j46498
37675a40012j1853J41765J96447J38228L5896n4645j16826j43660j33400r6860
37665a84920m0514L1005P9509N3759j8823k3439R3548K17280J94402M4934n8490
$$ y = [-16144, -3486, 52388, 146176, 223517, 268850, 285245, 256994, 194788, 150418, 132571, 81875, -17847, -90982, -101557, -142622, -296703, -473031, -492410, -303299, -26834, 185858, 263535, 212171, 88647, -28592, -105013, -180056, -291714, -402128, -448502, -431695, -395005, -351414, -299257, -275034, -310097, -355751, -333768, -252540, -193741, -186453, -177116, -135359, -107548, -133436, -176381, -180931, -153790, -139238, -139541, -107981, -22427, 65634, 75686, -8800, -105503, -107461, 10165, 176117, 310574, 391455, 428750, 423344, 382076, 331693, 275732, 172309, 6486, -140012, -151865, -10100, 186347, 324575, 360471, 305826, 189000, 45340, -88060, -184920, -225434, -194429, -114920, -61161, -79984, -103423, -9875, 207405, 401807, 446741, 388251]
37654C88251k9146K4058k8205j46103j93186j37966p2779m9850j7375N4288R4089
37643a13924M7958j0077J7595R0153Q4886o040n7912o357O0337M7271j1044k8186
37631A14660K377L1671M7843N9726L6816m2134j10978q3466P361K9074p0815j80027
37619a57892j57071p598J22214J19221L1518j043O9364J35387Q5936l2907q5696
37608A21433m4437p843k3799k3780K4114L3332m2782r0747J331J47380J67171
37597B61373L6789r7015j23710o6543P672N5219L8014m6023j10493o1518O2055
37586d4180J24560P3051j4302o1020p0160n7160j0520N0396O8820L5100J136j2383
37574H3338m1895q9235r1039k0036N8679P8682N7300M6552N4679O0403N8917N1102
$$ y = [388251, 359105, 383163, 354958, 208855, 15669, -122297, -195076, -244926, -262301, -208013, -113924, -65966, -76043, -58448, 31705, 116591, 110551, 52639, 46282, 106619, 153890, 142846, 114660, 117037, 148708, 196551, 256277, 293093, 250959, 139981, 56515, 63876, 92950, 22135, -157892, -314963, -322561, -200347, -81126, -49608, -50651, 18713, 154100, 240036, 207129, 121433, 76996, 69153, 45354, 21574, 45688, 79020, 36238, -54509, -53178, 94202, 261373, 298162, 201147, 77437, 10894, 18566, 73785, 111799, 65776, -44717, -106235, -44180, 80380, 153431, 139129, 78109, 7949, -49211, -59731, -9335, 59485, 94585, 95721, 83338, 41443, -47792, -138831, -158867, -100188, -21506, 35794, 82346, 137025, 197428, 256345, 307447]
37562C07447K3501k2807n1492l3229P808J4840l8297j12387j32653o7138K3158
37551h1249M6386J659j6576L6323P9353L5817l3065j6891P2338J22464Q5426J5489
37539C47474l7754p0921p1843k7923J0002k7306j10014j30504n4876L3778N8163
37528h1724L2909J2243K1949N6209Q5150O7782R557j6631L2177R0193P7271K1379
37516D08464q502l3968j07908j73094j28710j1985M1672J0535J312M9067O3421
37505A10304k584p9401j06417r5931n3505K8701Q9370N5912j1291N253O3003J4912
37493A8326j05092q5591J13253K53979J73313J7857j1363M9421N4987J284l1380
37482D48994n0622r3965j09721n7101k2381p8913j29252m7732J02338J50717N4168
$$ y = [307447, 330948, 308141, 256649, 223420, 231228, 246068, 207771, 95384, -37269, -104407, -81249, -34863, -33204, -49780, -13457, 65896, 101713, 68648, 51757, 124095, 246559, 331985, 347474, 309720, 238799, 166956, 139033, 149035, 121729, 11715, -118789, -173665, -139887, -81724, -48815, -36572, -14623, 41586, 126736, 194518, 204075, 187444, 219621, 309814, 387085, 408464, 399962, 365994, 258086, 84992, -43718, -55703, -14031, -3496, -2184, 46883, 110304, 107720, 28319, -78098, -174029, -227534, -198833, -109463, -53551, -64842, -59589, 3414, 18326, -86766, -172357, -59104, 194875, 368188, 386045, 374682, 424103, 479090, 480374, 448994, 398372, 304407, 194686, 137585, 115204, 36291, -92961, -140693, -38355, 112362, 166530]
37471A66530q6560j72860j49323R998K20984K90788J48642j9339k4875L8792l4717
37460C88060k03245k28423o1525P5691L4801n8679l6352O1932R1479L6041M31
37449A00211K4755L1023l6922j07377o9118O4209J50686J05902J9021R850L7444
37438C29684k0014j32612j40612k2835M8164j6669p9805j7941P0635M3568m9224
37427A2339p0881k1337J0903K3668O3128R2456N6295M206L605P904m3929q6103
37415E2254m1896J1648l2037j08221r0534j7721q917l0047K9846J08356M3935
37404h3334j22665j72267m4609Q6320J06112R6681J22746J04920j646q9162o4229
37393f1133J0785L5784J1939j2304k4864j9003J9808N4063K7841j2284M3097J69981
$$ y = [166530, 79970, -92890, -242213, -232215, -11231, 279557, 428199, 408860, 383985, 422777, 388060, 184815, -43608, -105133, -29442, 5359, -53320, -89672, -27740, 63739, 99780, 100211, 124966, 155989, 119067, 11690, -57428, 6781, 157467, 263369, 282390, 292240, 329684, 309670, 177058, 36446, 13611, 61775, 45106, -34699, -52640, 17995, 61563, 12339, -58542, -79879, -68976, -45308, 17820, 110276, 166571, 170777, 174382, 182286, 138357, 52254, 10358, 22006, -10031, -118252, -208786, -226507, -235424, -265471, -235625, -127269, -83334, -205999, -378266, -422875, -336555, -230443, -133762, -11016, 93904, 92258, 3096, -61133, -50348, -14564, -2625, -14929, -39793, -58796, -38988, 15075, 42916, 30632, 73729, 243710]
37381B43710J95237L9607j52893k08768j40572p9016p0539m0985O7115J89473
37371D2369J90759K7706j48925j31622O6768J85022N7218j41495j50270o629M7202
37360C8103l3788n8502M6436J21760O5853j7867n0033j09288k19024k26126m9366
37349d91842J37743J45484M0568O062N2854N5064j3838o2994n5832l8175j5356
37338b40262N7560J58854J87802R5287m4181j14891p7673N305M6798K9164R107
37327A12870J8562R858m7746p6110N638J21536J16538j3127j05340o5835J8637
37316I5481L6464p682n7252r3590j05202o6851n80K9389J7232K1071M8234M1801
37304d1485J904j728L2107J6558o1402r2801j9316P0981Q7437O0070M7614L0613
$$ y = [243710, 438947, 478554, 325661, 116893, -23679, -102695, -173234, -214219, -147104, 42369, 233128, 260834, 111909, -19713, 47055, 232077, 289295, 147800, -2470, -9099, 38103, 4315, -54187, -7751, 114009, 179862, 161995, 111962, 2674, -216350, -442476, -491842, -354099, -208615, -168047, -161985, -109131, -54067, -67905, -130899, -186731, -224906, -240262, -182702, -23848, 163954, 259241, 215060, 100169, 22496, 27801, 74599, 103763, 112870, 131432, 141290, 93544, 17434, 23072, 144608, 261146, 248019, 142679, 76844, 95481, 131945, 124263, 67011, -26579, -131781, -198632, -199212, -169823, -152591, -131520, -83286, -41485, -39581, -41309, -9202, 7356, -54046, -146847, -166163, -95182, -7745, 52325, 99939, 130552]
37292A30552k3591p5525o6759K403Q9110J40779J03907j6056j08402p4124K3990
37281A26284M9719N844L994M7312L4227k7145k4542K4937j4837j19132r7126O0231
37269F9766J09290m5729j61225l8220J59050J81376O5176j3919o0885j66572k43079
37258a44971j35846Q4803J94244J23294q206j05927j54654j22066l749Q6917N2172
37247a33989k0196J4466J26146J76432J42329R6406M1908l9668n4133P4093J94561
37236F18355R2786j62446k72908j26924O3857Q9433k879n6308l7734j6707k1092
37225A67433j6062J7869M5552R976r2282j62552q5851R8555J97320J01683o4054
37214B17587j18204m7785M3872J06238J24367L7957j54493k87460k02765J5426
$$ y = [130552, 106961, 31436, -35323, -32920, 56190, 196969, 300876, 284820, 176418, 102294, 126284, 176003, 181847, 185841, 233153, 267380, 240235, 215693, 240630, 225793, 106661, 9535, 69766, 179056, 133327, -27898, -66118, 92932, 274308, 339484, 325565, 264680, 98108, -144971, -280817, -196014, -1770, 121524, 113318, 7391, -147263, -269329, -273078, -186161, -133989, -154185, -139719, -13573, 162859, 305188, 401594, 443502, 403834, 349701, 423794, 618355, 711141, 548695, 275787, 148863, 212720, 302153, 299274, 242966, 205232, 188525, 167433, 151371, 169240, 214792, 224768, 132486, -30066, -115917, -17362, 179958, 281641, 217587, 99383, 51598, 95470, 201708, 326075, 364032, 209539, -77921, -280686, -265260]
37204b65260J46109J27645P8934O3322J9838p0049j21326q4965j9461P987j106
37193a18332r079J6388P7418J12228M5878o9203o5962R5034K18954J38654l9331
37182D02647j05154m5440L699l647k4711p4340j63802j77731k7566J46330J45633
37171G5918J5357n1488k9153k4937q166J28992K81518K23099o631j23310m2089
37160D39110J6218o9797j30138l1822R4262J03993O2077N6584K5464o5022q7010
37149D13919J9491P9850m9603k14249j77619J7446J25269N9273l2397k4784L2419
37138B49015L6916k2438p8055p1012p493M5775L5412j961J8152J00371J50009
37127D54691J05058J9615j9664m016P718k6907q4685r4737j3776J00552J32343
$$ y = [-265260, -119151, 8494, 87428, 150750, 170588, 100539, -20787, -105752, -125213, -117226, -118332, -127411, -111023, -33605, 78623, 124501, 55298, -10664, 84370, 303324, 441978, 402647, 297493, 252053, 255752, 252105, 227394, 153054, -10748, -188479, -216045, -69715, 75918, 91275, 39787, 10634, -14303, -22469, 106523, 388041, 611140, 604509, 481199, 439110, 455328, 385531, 255393, 223571, 317833, 421826, 483903, 540487, 565951, 500929, 413919, 433410, 513260, 463657, 249408, 71789, 89235, 214504, 273777, 241380, 216596, 249015, 285931, 263493, 185438, 114426, 106933, 152708, 188120, 186159, 204311, 304682, 454691, 559749, 579364, 559700, 555684, 563402, 536495, 451810, 357073, 343297, 443849, 576192]
37116E76192N4440k7860k3249L5032P9720J09119J28358J20037J57181L68343
37106A577313O51798O34929J49050m35357o33118m59859l03583l09389k82708
37097E89076j49805q5139j33163j00557O9684J68059Q5818j1009p827l0394j54635
37086B40108k20474j09390M8803J10786J19762J23129M4413j03323j31775J8885
37076A40924J34197O2151m6498k1281M9223K7478j8388J0194L1665k6969m3197
37065B99499O7528J38769J9792j38303j19762Q460M5391j0559l6867m3297r2391
37054A38260j07207j8597L6778o7934j76003p1513J47855K16119J10099J7352
37044B25209j2657p4742j34264o3892P8606J07891L0170K1883J00151R8257j9099
$$ y = [576192, 630632, 602772, 579523, 614555, 694275, 803394, 931752, 1051789, 1208970, 1577313, 2229111, 2864040, 3013090, 2577733, 1944615, 1484756, 1181173, 871784, 589076, 439271, 354132, 220969, 120412, 190096, 358155, 443973, 432964, 425137, 394743, 240108, 19634, -89756, -40953, 69833, 189595, 312724, 357137, 253814, 122039, 140924, 275121, 337272, 290774, 269493, 318716, 346194, 327806, 338000, 369665, 342696, 299499, 367027, 505796, 525588, 387285, 267523, 275983, 321374, 310815, 273948, 230651, 138260, 31053, 12456, 49234, -18700, -194703, -266216, -118361, 97758, 207857, 225209, 212552, 137810, 3546, -60346, 18260, 126151, 156321, 178204, 278355, 376612, 357513]
37033C57513q9593l5665L3644M0549L1770K0838m5372j28017j10299l087N7776
37022A30057M0773M6313Q7117N3427o6683j41358j18313r4293j08079o8372L7276
37011b02135O2279o0471j69088r3759R3842J82598R7269m0020q3165j1031Q7152
37000a36529J24486R9410O6162M2409L000l0489Q367R6446J03001j4961j16118
36989B45184q0008P700O535n4205n9642k1439l0973p4936p4355m6900n6723n9760
36977b99522K2559J26015J22670L7903R188O1015R4855P1985L6661p345p3243
36966B02741q7268J2356J15744P0853o5642j06218k9956R259m1536o5681L129
36955A7781Q8488J22337J17759P9113j348o0187l2713J3167k5987r6086p0643
$$ y = [357513, 267920, 232255, 265899, 306448, 338218, 359056, 313684, 185667, 75368, 72281, 130057, 170830, 217143, 304260, 357687, 291004, 149646, 31333, -62960, -171039, -239411, -202135, -139856, -200327, -369415, -463174, -369332, -186734, -89465, -129485, -212650, -223681, -136529, -12043, 87367, 153529, 195938, 198938, 168449, 176816, 273262, 376263, 361302, 245184, 165176, 172876, 179411, 125206, 65564, 44125, 13152, -61784, -136139, -183039, -239762, -299522, -276963, -150948, -28278, 9625, 18813, 79828, 174683, 246668, 283329, 275984, 202741, 115473, 127829, 243573, 314426, 248784, 142566, 112610, 121869, 80333, 14652, 17781, 106269, 228606, 346365, 425478, 424130, 363943, 331230, 344397, 318410, 222324, 151681]
36944A51681J4370J5869n9331p1694k424L5116K4323N2565R3268K4686j18095
36933A60334j52357l9461O4894Q1272Q9738J08256L7820j11091j75969r8610l878
36922c9052L9070J04117J88506J48808m1994j92945j62242l6400M9526Q0818O9537
36911B07749q044r0494m6078R8460J42018J6443r4963n2910K9500J190r4131j38802
36899c0062j29236j07804n4125K9867N8406m342p0414p1202m4699j6659N3095
36888c87175J42073J48161O8700K7414O1055O1931o542l9592n485j2377p9158
36877b0995p1409L3852O2062n5811j37713n5248N4915N0611J9783O7581R4454
36866D2082K795p8408q058J03692Q3268q265l816P2581P3674q586o7118p7847
$$ y = [151681, 166051, 181920, 122589, 50895, 48471, 83587, 107910, 160475, 253743, 278429, 160334, 7977, -31484, 33410, 114682, 204420, 312676, 350496, 239405, 63436, -35174, -39052, 18, 104135, 292641, 441449, 399455, 206510, 44268, 7868, 57394, 138212, 207749, 199705, 109211, 63133, 161593, 303611, 320054, 225091, 172181, 201681, 202871, 108740, -30062, -159298, -267102, -321227, -291360, -232954, -237296, -307710, -378912, -423611, -440270, -387175, -245102, -96941, -28241, -827, 60228, 122159, 115617, 76025, 70540, 58163, -20995, -92404, -58552, 3510, -52301, -190014, -245262, -190347, -139736, -119953, -52372, 42082, 44877, -33531, -41589, 62103, 145371, 137106, 133290, 205871, 279545, 270959, 203841, 125994]
36854A25994p8194m0546M7188P5311k6764j26543p4631N0724Q1756L6876M4425
36843A15596Q6297M9063l5650l4865L8856M3482m6404j11469j01509r0493j07813
36832a94909q3362J1304J00489J10398M4464m7514r9096n4795N3848J04445L5188
36821a9540n9372o6442j1932J9922M0590J07039J82087J74434Q0029k3166q3846
36810C39803r3664m8299K0712L3967l0230q0402m3405K0286J9309k4729l0291
36799H3057J1949N0646O2347N1604J5889k8957m4676l2979l2874l3769J4140Q5312
36787B01689R2089L3282j081R376k700l8517l4199k5666j07775k11354j60762
36776b45618R061O4951l0818m1379J23097K24893J01709n9786n5137K2203J8799
$$ y = [125994, 47800, 7254, 54442, 129753, 102989, -23554, -98185, -47461, 34295, 71171, 115596, 201893, 250956, 215306, 180441, 219297, 262779, 216375, 104906, 3397, -87096, -194909, -278271, -266967, -166478, -56080, -11616, -59130, -158226, -213021, -159173, -54728, -19540, -78912, -145354, -157286, -137364, -96774, 10265, 192352, 366786, 446815, 423649, 339803, 246139, 197840, 218552, 252519, 222289, 141887, 98482, 118768, 138077, 113348, 83057, 95006, 145652, 207999, 259603, 275492, 246535, 201859, 168880, 136006, 102237, 116377, 201689, 293778, 327060, 325979, 335355, 332655, 294138, 259939, 234273, 126498, -84856, -245618, -236557, -171606, -202424, -243803, -120706, 104187, 205896, 146110, 90973, 113176, 131975]
36765A31975k319L6365J8133j14482j59932P322J57249O4646r7687o0111Q1360
36754F2519P2606k9664N755J33214J22266l427j5349R5693J16518l965j05769
36743D50397j23282j29119j10805k587J02118N7758o4027q7227l9184n9788r4734
36732a00480N988J64192J74682O0996O218O542o5948j36529l3873J41024J37197
36721C60009l127k1317P7294M6063j11888j27705K2101M6780j29538k14600n5578
36710a11506J15945J06333M0903M5429J0166j27859j95415q5988L7732M1407M2857
36699g9996J43094K03359J02745k5015l0151n731q8591j90093j49227r599O2739
36688f6466L2693m478M585L5066N7332N7773M3231N6894J11271J18772J0674j08973
$$ y = [131975, 129656, 166021, 184154, 69672, -90260, -82938, 74311, 138957, 41270, -18841, 62519, 135125, 105461, 111216, 244430, 366696, 363269, 347920, 443613, 560131, 556166, 450397, 327115, 197996, 87191, 84604, 186722, 244480, 180453, 93226, 54042, -5746, -100480, -94492, 69700, 244382, 305378, 311596, 318138, 252190, 115661, 81788, 222812, 360009, 356882, 335565, 412859, 458922, 347034, 219329, 241430, 288210, 158672, -55928, -111506, 4439, 110772, 151675, 197104, 207270, 79411, -116004, -201992, -164260, -122853, -79996, 63098, 266457, 369202, 344187, 314036, 308305, 219714, 29621, -119606, -129205, -66466, -33773, -38251, -33666, 1400, 58732, 116505, 159736, 216630, 327901, 446673, 457347, 348374]
36676C48374r3277J388J349q5423r5389k0142k2714j23904j48024l1047Q3622
36665a85187J17436J58701K20244J65395k3139j50082r7072J3337M3036J8187
36655B80856o043n2508j03361o9504L8597Q8333L2140l7356o7393r0497q2627
36644f9363J0661J05260O5166m7490n2142L9426N8740j048r25L6876l2467j48610
36632c5916j14468J5939L969j17671p9845J06556J33528l6146p5594J10043J99095
36621A09490M4372n4268R1735K10601P3999r2443l5941P9365J1755j12806n7308
36610B68551J00508J34805L4559p9901j76598k15483q7179J37326J78624k0786
36600B74426j50503k8272J08413M5123n2585o355L3922o1696r0574Q9127K16157
$$ y = [348374, 255097, 256485, 257834, 172411, 77022, 56880, 34166, -89738, -237762, -268809, -185187, -67751, 90950, 311194, 476589, 453450, 303368, 206296, 219633, 262669, 280856, 274813, 222305, 118944, 49440, 88037, 176370, 208510, 171154, 103761, 13264, -69363, -58702, 46558, 111724, 64234, 12092, 51518, 110258, 109210, 108285, 145161, 112694, -35916, -150384, -134445, -130476, -248147, -327992, -221436, -87908, -124054, -199648, -89605, 109490, 153862, 99594, 191329, 401930, 475929, 383486, 347545, 426910, 438665, 325859, 268551, 369059, 503864, 538423, 458522, 281924, 66441, -20738, 116588, 295212, 274426, 123923, 95651, 204064, 249187, 196602, 190247, 224169, 162473, 71899, 161026, 377183]
36589C77183O7441j05897o983J68405Q2728j39916j49654K0351P3151k372J8538
36578D02975J28090J20320m79n3706l8211q3160j39773p4197L5824L2235j5958
36567C13960L4986Q7607j5544j45046q6333N1610J4068j32437j08717Q5734J80975
36556B80863Q9480r079r015J5161J7740J8587k4105j31445j74916o4108N5587
36545F4750L2522j8676O2202J62061R3229n7425r0092m0005m7757n2194N4014
36534A62629J32514J6943j35081p1500J16278J50601K7931m4294m2780r2240j51507
36523F9494r7205j0719l8018q7568o631Q9061J7151r8391l2421J20006J19707
36512D4466K8058O6765J75045J28276k5512o7413k7762q7043j76510j02689M4816
$$ y = [377183, 444624, 338727, 331744, 500149, 582877, 442961, 293307, 313658, 386809, 384437, 402975, 531065, 651385, 650906, 597200, 558989, 475829, 336056, 261859, 297683, 329918, 313960, 348946, 436553, 421009, 275963, 189630, 241240, 255308, 122871, 14154, 99888, 280863, 370343, 361264, 352249, 367410, 385150, 403737, 379632, 248187, 73271, 9163, 64750, 97272, 78596, 140798, 302859, 396088, 338663, 248571, 208566, 160809, 108615, 162629, 295143, 312086, 177005, 105505, 221783, 372384, 400315, 356021, 313241, 221001, 69494, -27711, -38430, -76448, -164016, -170647, -81586, -64435, -162826, -195247, -75241, 44466, 72524, 139289, 314334, 442610, 417098, 349685, 321923, 234880, 58370, -44319, 497]
36501D97M0286l7527M8019K12667J74041l2848j13472j7210N1618N4220J18647
36490D98938J91054J11915j9651M0160K69839M51972N31710N38778L35660j30981
36480B819394n19844n00011k78303k46745l28161k12842j9161r1536l05063k32769
36470H4959Q9111K12488L7266j06437r2210r9727j22592J7348J96824J28911p1136
36459B74805n1405J20116Q7880r1311n1020J58282J53512k4439K0409K39612J83389
36448A019830j37865k24000J6412J23519n5170j42632m067K7291j37051j46517
36438C39750Q5326J96456P2508K7463J28124N0807k21771k80182m0826R1021k6180
36427D22496p3231K7693l2256k34901j59608J94652L04788M2161j04318O6992
$$ y = [497, 40783, 3256, 51275, 263942, 437983, 405135, 291663, 274453, 326071, 380291, 498938, 689992, 801907, 782256, 822416, 1092255, 1544227, 2075937, 2614715, 2950375, 2819394, 2299550, 1799539, 1521236, 1274491, 946330, 733488, 714327, 622791, 317728, 84959, 174070, 386558, 423824, 317387, 225177, 125450, 2858, 20206, 217030, 345941, 274805, 223400, 343516, 431396, 340085, 289065, 447347, 600859, 576420, 596829, 836441, 1019830, 881965, 657965, 674377, 797896, 742726, 600094, 596027, 623318, 486267, 339750, 425076, 621532, 694040, 721503, 849627, 900434, 678663, 398481, 357655, 448676, 422496, 349265, 376958, 344702, 109801, -49807, 144845, 449633, 491794, 387476, 454468]
36417D54468J60544M967m8115J06266R6408j29103j24640J68708K35835m1640
36407H83698j33295J24093K02219q5597j96406R8061K50526k7524k28652l4252
36397H52871J06870r8453k13880L6488K11316L2991p1149J44684K21014q6732
36387A136020k73351l6962J45544l5320j31619J28537K73503M7926m1427K45928
36377A458779L23077j05575l96180j23517J55052N488q0583K57778M75084K02090
36367B171493L4444M18569Q07100P23728N69701N84805K08226o71527j094378
36358C752161n91482r0770k95604n09636j21209J68537k18615n03421l3877M00918
36348A957002P9025k51355J26625M49058K566l78883Q3400N21850Q8480l32464
$$ y = [454468, 615012, 619979, 571864, 678130, 774538, 645435, 520795, 689503, 925338, 883698, 750403, 874496, 1076715, 991118, 794712, 892773, 1143299, 1115775, 887123, 852871, 959741, 861288, 647408, 683896, 895212, 928203, 857054, 1001738, 1222752, 1136020, 862669, 825707, 971251, 935931, 804312, 932849, 1206352, 1254278, 1212851, 1458779, 1781856, 1676281, 1280101, 1156584, 1311636, 1317124, 1236541, 1494319, 1969403, 2171493, 2205937, 2624506, 3431606, 4155334, 4725035, 5309840, 5518066, 4846539, 3752161, 3160679, 3069909, 2774305, 2264669, 2143460, 2311997, 2093382, 1589961, 1556084, 1957002, 2036027, 1784672, 1911297, 2360355, 2362921, 1984038, 2067438, 2589288, 2677768, 2345304]
36338B345304J71633P09806L17211j15117L80326Q26636J92530m28913J69703
36329D569119Q86296L66619l20357K67684J065643N65901j03706O90884J767176
36320I755259J350447P27935J937109L661246L539159K823499M271949O907484
36312C4974087P483259N743310L663233J339441j348207j394752L053846P773524
36304F1287741Q751543J0132813J7280756K6143433L1896653M4190411P4483784
36297B74167134J05400789R5575205K9610372n2695114r5530497q6251164n7807807
36290B12468918m0433277l3718104k6019606j7584206j4238786j3670911j0375253
36283E6428775o005818n110720o233464n198564k840703k550290l604494l057210
$$ y = [2345304, 2516937, 3226743, 3543954, 3428837, 3809163, 4635799, 4828329, 4399416, 4569119, 5455415, 5822034, 5501677, 5769361, 6835004, 7400905, 7297199, 7988083, 9755259, 11105706, 11833641, 13770750, 17431996, 20971155, 23794654, 28066603, 34974087, 42457346, 48200656, 51863889, 53203330, 51855123, 50460371, 53514217, 61287741, 70039284, 80172097, 97452853, 123596286, 155492939, 199683350, 274167134, 379567923, 475143128, 504753500, 452058386, 356527889, 270276725, 212468918, 172035641, 138317537, 112297931, 94713725, 80474939, 66804028, 56428775, 50422957, 45312237, 39078773, 33880209, 31039506, 28489216, 24884722, 21827512]
36275B1827512j489208j431147k317586j870369o10878o15990j418059j132840
36267A0941435k19836m25005j256909r67202O6239J54207m75846k70733O57372
36258H203722R04479M05296J50981J0994p59034j549520j247998l95060l10566
36249E413294p45467n33018J01832L6766n34412n01184L0300L6437m04696l53637
36239B546215Q8285J3490m54469l88127J25769J57158k79774l06286J15532J90512
36229A808305j22619j05927K28407J59677k84724l40792N2180J91739l7848o8002
36219A480396J38396M8227k92665k97015R334M8964j52219m2171K95888K37934
36209A475069j70752k62527K0131P6148j83194k30983P674P2983m5465Q6305L64496
$$ y = [21827512, 20338304, 18907157, 16589571, 14719202, 14108324, 13492334, 12074275, 10941435, 10721599, 10296594, 9039685, 8072483, 8138722, 8292929, 7817083, 7546350, 8203722, 9108201, 9513497, 9664478, 9675472, 8916438, 7366918, 6118920, 5723860, 5413294, 4667827, 4134809, 4236641, 4273407, 3738995, 3237811, 3268111, 3304548, 2899852, 2546215, 2634500, 2647990, 2193521, 1805394, 1931163, 2088321, 1808547, 1502261, 1617793, 1808305, 1685686, 1579759, 1808166, 1967843, 1683119, 1342327, 1394507, 1586246, 1548398, 1480396, 1618792, 1667019, 1374354, 1077339, 1086673, 1135637, 983418, 941247, 1237135, 1475069, 1304317, 1041790, 1061921, 1138069, 954875, 723892, 731566, 804549, 759084, 845389, 1209885]
36198A209885K45557j67859k11654J48537K80449O7841M0443K54919J52757l18379
36188A702496n11830k16466J6971r4188j58667L1561J38607J3478m0821N2022
36178I33163l757j85871j18153J50258J49932j16685j43627J04478Q8712k73643
36168E84807l99894r0574J23554l3072j30299R8130K71262J22798k5369O4652
36158E85995J17600l6920r8512Q0447J53699o7316k32646q4358J07531P8480r900
36147E94100N622k0114j37716j17523O8041J01848r8665j97054n2272M6332k5962
36136A66637K105J95607J99770r3178k75695j26208K2964o3660j10371Q3134K31146
36125B32251J20242J8327J30825J88591r017j60357o219J78617Q7231p6814j4341
$$ y = [1209885, 1455442, 1287583, 1075929, 1224466, 1504915, 1572756, 1613199, 1868118, 2020875, 1702496, 1190666, 974200, 991171, 896983, 738316, 769877, 908484, 921962, 881141, 933163, 929406, 743535, 625382, 775640, 925572, 808887, 665260, 769738, 858450, 584807, 184913, 94339, 217893, 184821, 54522, 152652, 423914, 546712, 521343, 585995, 703595, 666675, 568163, 648610, 802309, 734993, 502347, 417989, 525520, 604000, 594100, 599722, 579608, 441892, 324369, 392410, 494258, 395593, 198539, 146267, 192599, 166637, 168742, 364349, 564119, 470941, 195246, 69038, 92002, 28342, -82029, 1105, 232251, 352493, 370820, 501645, 690236, 681219, 520862, 514643, 693260, 780491, 703677, 689336]
36114F89336J26733Q7154R593J59646M36594N68171N17177L51768J7359m27489
36104B536042o63028n31648l10243k60600k40300o9326P5227j1881j63502j33479
36094B27262q072J4686j6165J2821J0488r3322j22674M0064J89601J28109p653
36083C75145k8044j6804r1572j26556j2364Q2157L149r7535m6705M2886K3626
36072A07383n084N9620Q1588l4934j08118l22J09902N3775k9429j316j3127j79237
36060D0701k81212j30964P1951Q3387J8554P0839J28035L3989n6002L8708J55049
36049A73035Q4661k7512K6427J00099j7009j52347m2466J55014J09667j07847
36039C01722j69688n7540j8768p3308k5529J06628J11620p801m1664M5091R4268
$$ y = [689336, 816069, 903223, 912816, 1072462, 1509056, 2077227, 2594404, 2946172, 2963531, 2536042, 1873014, 1341366, 1031123, 770523, 530223, 460897, 536124, 524243, 360741, 227262, 219190, 233876, 217711, 230532, 241020, 147698, 25024, 65088, 254689, 382798, 375145, 347101, 330297, 238725, 112169, 99805, 181962, 185111, 87576, 40871, 83757, 107383, 102299, 161919, 243507, 208573, 100455, 100133, 210035, 263810, 234381, 233065, 219938, 40701, -240511, -371475, -299524, -216137, -197583, -126744, 1291, 35280, -20722, 17986, 173035, 257696, 230184, 256611, 356710, 339701, 187354, 144888, 299902, 409569, 301722, 132034, 74494, 55726, -17582, -43111, 63517, 175137, 167336, 125672, 170763, 265031]
36028B65031P2391O8060L3630j27359k74780j82299O7681J72073N7950o6674p5722
36017I982l5256J1532P5256P4263o0536j82198j07058O0833P1313o4580j09437
36006b55886o62Q5623N8738K0828M5337Q9001J19942J28805N3799j08622j97501
35995C9402j02888J6640l4236j58335j35280j718L7545j9086o575P0053O1350
35984b33128r659K0761J32015J40228L6070m340M9603M1669n8983r2750kQ4778
35972A06262P7607M7521L1241l1897j32826j60630q3557M380L9584M3156K7349
35961c1810n111J781P3352J09298K5631q0020o8652K1053O7309P5306J02459R0394
35949C80990j5212r6751m6361J1156p1173j63238n8844J42054J71271K4940o9414
$$ y = [265031, 337422, 405482, 439112, 311753, 36973, -145326, -77645, 94428, 152378, 85704, 9982, -25274, -13742, 61514, 135777, 75241, -106957, -214015, -153182, -81869, -146449, -255886, -256548, -170925, -112187, -91359, -46022, 42979, 162921, 291726, 345525, 236903, 39402, -63486, -46846, -81082, -239417, -374697, -376415, -338870, -357956, -364531, -294478, -233128, -242787, -222026, -90011, 50217, 86287, 81947, 131550, 173219, 114236, 21486, 21484, 106262, 183869, 231390, 262631, 230734, 97908, -62722, -146279, -141899, -102315, -59159, -31810, -36921, -35140, 38212, 147510, 173141, 93121, 24469, 45522, 112831, 188137, 290596, 380990, 365778, 269027, 222666, 233822, 162649, -589, -59433, 82621, 253892, 278832, 209418]
35938B09418n1292n6201r0987k5357J02086J01905k7472q5083p363O6529P5449
35927B11632R2790R9024o266j52145j47878n019P2077K4669j4651r311m9437r7765
35915A7720k5609Q8678L3110j42678j56468L5498J56414P2385k3562N846L3859
35904I5193j9941j6196R8795J33203j2955j36391o0057P8139P2658l2904p8003
35893A21541m6482r765K8047O6001L9099m5153n3610O6109J78195J65753Q5415
35882E95150J7358o2404j53782j59793o3139l727n6537r7627j8966Q2140O6948
35871A45621k6618o6304k1714L5603M4098j3553j05431j37460m4468Q7366J08954
35860F094K2296l6393j9837m994j0830K2858O6528J9326q3260r0758J0795Q1436
$$ y = [209418, 158126, 101925, 10938, -14419, 87667, 189572, 162100, 77017, 69654, 136183, 211632, 304422, 403446, 397180, 245035, 97157, 92138, 164215, 188884, 174233, 164922, 115485, 17720, -7889, 80789, 113899, -28779, -185247, -149749, 6665, 79050, 55488, 61334, 95193, 75252, 59056, 157851, 291054, 278099, 141708, 81651, 159790, 232448, 199544, 121541, 75059, 65294, 93341, 159342, 198441, 153288, 99678, 165787, 343982, 509735, 595150, 612508, 550104, 396322, 236529, 173390, 169663, 113126, 15499, -3467, 78673, 145621, 119003, 52699, 30985, 66588, 110686, 97133, -8298, -145758, -190226, -102860, 6094, 28390, -8003, -27840, -32834, -43664, -20806, 45722, 65048, -18212, -108970, -98175, -16739]
35848a6739P4365P1227O4022l8060j65242j35182J7078N7830m2695n2171R4522
35837g1045J55154O393j29249o4722N5627M8311p447J6847M5224r899l7645N2898
35825F0447J20144K9609r4481q7065j9946l1511o3007j818P8177N3992j6984k2658
35813D899l255k5780j1888R3553J46436K6803j18673r9349L735N49o7535k8544
35801g9049Q4978R0461j5459n6313J7521O3993n937j19046j82442j75031j02016
35790d78340Q474Q3099Q6603Q5103J35733J88439J87867J69034J50884O0576j15993
35779E61479k41689k20206j44621j16562p1174N5504J43633O8252p6167j28291
35769a69842j08002j10614q6782M4991J79961J61628M9338J9276P1394O6229o237
$$ y = [-16739, 57626, 128853, 192875, 154815, -10427, -145609, -128531, -70701, -113396, -165567, -71045, 84109, 90502, -38747, -103469, -47842, 469, -6978, 9869, 55093, 45194, 7549, 60447, 180591, 210200, 115719, 28654, 8708, -22803, -85810, -87628, -9451, 44541, 27557, 4899, 1644, -24136, -36024, 57529, 203965, 230768, 112095, 12746, 16481, 17030, -50505, -79049, 5929, 96390, 80931, 24618, 42139, 106132, 100195, -18851, -201293, -376324, -478340, -469866, -386767, -300164, -215061, -79328, 109111, 296978, 466012, 616896, 677472, 561479, 319790, 99584, -45037, -161599, -232773, -177269, -33636, 34616, -41551, -169842, -277844, -388458, -475240, -430249, -250288, -88660, -39322, -20046, 51348, 117577, 111340]
35758A11340k7163J9632L6385J0186K2714P4882Q1376K8799j6515l6873o1017
35747B43746p3040n3495n3967j03406j18673m2468K7956K036k3759P4410K09792
35736H9132K05715P3973k6178m1666m6747o8458p2134o8309p3921l6571N2614
35725a2550P1558m0545j22209j5322J63791J91586O8947l3824n8723n9565k5122
35714A28022O0205Q3984k2055r2367K7600J74650J07301p0445p3546O9533P7525
35703D70407p0132r5047P8805J90022Q9933m3883o0553n8752j13605r8010M8521
35692C37706J44731M9469j03154j27763n8867l4047o6655q5839p5025m9894p623
35681g6961K2550p924n8123l5847L0000J6807p0545r2700j9995K0712j3410j0302
$$ y = [111340, 84177, 103809, 140194, 150380, 173094, 247976, 329352, 358151, 341636, 304763, 243746, 170706, 117211, 63244, -40162, -158835, -201303, -173347, -171311, -195070, -120660, 89132, 294847, 368820, 342642, 300976, 254229, 185771, 113637, 45328, -28593, -65164, -12550, 59008, 18463, -103746, -119068, 44723, 236309, 305256, 271432, 212709, 153144, 128022, 188227, 272211, 250156, 157789, 185389, 360039, 467340, 396895, 323349, 392882, 470407, 400275, 305228, 384033, 574055, 663988, 620105, 559552, 500800, 387195, 289185, 337706, 482437, 531906, 428752, 300989, 242122, 208075, 141420, 55581, -19444, -69338, -76961, -54411, -62335, -120458, -156305, -126305, -109498, -180043, -272743, -292738, -272026, -285436, -295738]
35669b95738O4597Q3439j4096j10796j16291q3277m3102O2379J97700K04125N9708
35658H648m7429j9220L062p9342j26667k0162R9515O3455l5317j0614R8971J19521
35646E4421N2509N5198J52154J87548P8121o0825q8454k1525J2340n1234j34987
35635B35266j19508m359P9042M6365k0970j7417R339l9857j06705n5729P1220
35624G6687R4801m519n2290K3135Q6845N3715K3264O4230P5948j5434j08199j00602
35612B17581n2875m9175m7227R598O3431M3699j6614o0471q6222p6131J7392J42502
35600A05488J53942K4464j00660j27020j20014j24357p1575M2348R1313M0063
35590h6008K6044J02317J17664l969r1686j5524P0602j0309j44453j16484L6400
$$ y = [-295738, -231141, -147702, -161798, -272594, -388885, -472162, -515264, -452885, -255185, -51060, 8648, -38781, -58001, -54939, -134281, -260948, -281110, -181595, -118140, -153457, -164071, -65100, 54421, 106930, 162128, 314282, 501830, 579951, 519126, 430672, 409147, 421487, 370253, 235266, 115758, 111399, 190441, 236806, 215836, 198419, 207758, 167901, 61196, 5467, 76687, 171488, 166969, 114679, 137814, 224659, 278374, 301638, 365868, 441816, 426382, 318183, 217581, 164706, 115531, 68304, 77902, 141333, 185032, 168418, 107947, 21725, -54406, -37014, 105488, 259430, 283894, 183234, 56214, -63800, -188157, -259732, -217384, -126071, -86008, -59964, 42353, 160017, 156048, 64362, 48838, 119440, 109131, -35322, -151806, -115406]
35579a15406J09002N9924K0811M6300O8814N5849L6399J3851j1678Q1L8327Q490
35567C30764r5810j21989P549J41496J32877O2338M9045J4697j36598k60425j63565
35556c9621N3460J18052j5125j39768j26652l8342N0433J23160J37652P4043L2642
35545B29934R4577J43462L2297j40109j56168k9265L0625k8825n4708M54j035
35534A21239r9834j35994j9437J11469J09125K2730j9694N97J9520N663k4856
35523I0528m2021j7909L2159L4267m4935j18975r2540j357O2663R6155J28439
35512A26474J07250N38p2454j405J00777N7267p0207q4818o125l1668j58272j52703
35500a85346M7815K05912J56157L5249Q711J4177n7652j32287q9304J6124M3745
$$ y = [-115406, -6404, 53520, 74331, 120631, 189445, 245294, 281693, 295544, 283866, 283947, 322274, 330764, 234954, 112965, 120514, 262010, 394887, 457225, 506270, 520967, 384369, 123944, -39621, 13839, 131891, 116766, -23002, -149654, -187996, -137563, -14403, 123249, 197292, 229934, 324511, 467973, 500270, 360161, 203993, 174728, 205353, 176528, 121820, 122274, 121239, 21405, -114589, -134026, -22557, 86568, 109298, 89604, 90201, 109721, 115384, 90528, 48507, 30598, 62757, 97024, 52089, -66886, -159426, -160783, -98120, -1965, 126474, 233724, 234262, 161808, 160403, 261180, 318447, 248240, 163422, 157297, 125629, -32643, -185346, -137531, 68381, 224538, 259787, 268498, 282675, 225023, 92736, 3432, 19556, 63301]
35489F3301j9944p6925o2241K3808J37963J78307N9406j31718j88071o1678O1088
35478a6704M6687L911O3081J36428P2236p8202j39441q3576m3991r2807j56848
35467b89226j46394n4197O6438J42678J25022N0832K1725O5899R4375N4084K5238
35456A56474P2423J01193l394j70305k25452j37811l2435J8790O3337J19734J19886
35445H2440M7531M772O5378J52531J42281K9047q4923j24006r5163l7798J3851
35434A95941K7571n559m2563l4392p501m0196j35920j86827j14006J3704P4912
35423b54836O4924P2592J13136J06019L1654j6793J4973N6360M6082M0979R7368
35412C72458J41891P8239m7886j12614r2617o1425m8051k2023N974j0275n5147
$$ y = [63301, 43357, -33568, -95809, -72001, 65962, 244269, 303675, 171957, -16114, -77792, -16704, 29983, 33894, 96975, 233403, 305639, 227437, 87996, 4420, -39571, -132378, -289226, -435620, -489817, -423379, -280701, -155679, -104847, -83122, -17223, 77152, 131236, 156474, 228897, 330090, 326696, 156391, -69061, -206872, -239307, -220517, -157180, -37446, 82440, 129971, 134743, 200121, 352652, 494933, 523980, 439057, 315051, 219888, 182090, 195941, 223512, 217953, 175390, 140998, 133497, 93301, -42619, -229446, -343452, -329748, -254836, -189912, -117320, -4184, 101835, 133489, 116696, 131669, 188029, 234111, 275090, 372458, 514349, 592588, 544702, 432088, 339471, 278046, 229995, 207972, 213946, 203671, 148524]
35401A48524o7327m7061m6280n8725k3390N8147J03542O3887j7442o8782n6461
35390a1368N319O1738N6428L232k5859j7879l9100q7965n3048Q5830J54727L2970
35378A65025j25351j06684L3244P7409J741k7999L2284N9537K2811K7111P5639
35367B34767M1991p5159j14512k9437L3947K762j8697J1487j6877j10203q4278
35356a24209J19881K75488K02696M2869K909K8754l4659j26720p7354P5003J27428
35345E12086K6724p8865q0604j9779L0018L8686r189r2379j27029p3653k5666
35334A00350p5454j47260r6725O5591J87045J81502R6028p426j05937j58710j20593
35323h1589k6203L5516M0786M4805P4357Q5878M3128k4618n9182l6710Q097J0972
$$ y = [148524, 81197, 34136, -12144, -70869, -94259, -36112, 67430, 131317, 113875, 45093, -11368, -6049, 55689, 112117, 115349, 89490, 71611, 32511, -55454, -108502, -22672, 132055, 165025, 39674, -67010, -33766, 43643, 45384, 17385, 49669, 109206, 132017, 159128, 234767, 276758, 201599, 87087, 57650, 91597, 94359, 75662, 87149, 70272, -39931, -124209, -4328, 271160, 473856, 516725, 519634, 548388, 513729, 387009, 309655, 384658, 512086, 538810, 459945, 379341, 359562, 389580, 428266, 419077, 326698, 199669, 126016, 100350, 24896, -122364, -219089, -153498, 33547, 215049, 311077, 303651, 197714, 39004, -81589, -107792, -72276, -31490, 13315, 87672, 173550, 216678, 192060, 132878, 96168, 104265, 115237]
35311A15237m7154r5301n1839N1282R8171N2756O36M736K5199K1988K4575M5348
35299B45634L7714L155J9681Q8399Q0185o5204k07811j93191o4561L4351P1100
35288D9452J01120J10963L5642j01301j86384j44586l939J31023J36185j7692
35278A10483j71728j23962Q1071J68869K4005j30372p9222O0944O9172q685J9142
35267A9717J20466Q7958q8566j84901r0921M9702Q6407L7971k3347p7243r4611
35256a57368l4031N3852O0220j1528m6596r433J4435q329P37P3482J20297P2163
35244A27901j8596o8250n2062K2963J28333J75395Q3484q4425j68458j22366n9891
35233c5972o0157n6028K5996J29137J48136P1254k6688q1019p9400m6886j8720
$$ y = [115237, 68083, -27218, -79057, -27775, 70396, 123152, 123788, 128524, 153723, 175711, 200286, 245634, 283348, 286503, 306184, 394583, 474768, 409564, 201753, 8562, -55999, -21648, 49452, 150572, 261535, 297177, 195876, 9492, -135094, -139033, -8010, 128175, 110483, -61245, -185207, -104136, 64733, 88738, -41634, -120856, -59912, 9260, 575, 19717, 140183, 228141, 139575, -45326, -136247, -86545, -138, 37833, 14486, -62757, -157368, -191399, -137547, -77327, -88855, -135451, -144884, -130449, -138778, -138041, -64559, 55738, 127901, 109305, 41055, -11007, 11956, 140289, 315684, 399168, 314743, 146285, 23919, -35972, -96129, -152157, -126161, 2976, 151112, 222366, 195678, 114659, 35259, -11627, -30347]
35222c0347m137J9086M8148L4613k5803m0845N2911J64417J56655M0583n4896
35211C60385o9699m4355k016N9120Q0738M492r4143q7708o259K378p3494q2470
35199D6969K5677R8587K3178r6507j08809l2185J1864q333k1262J8079P2282P6976
35187A06516R575q3032j22006q5952l4147k718N4765J46987J57570J2499j45030
35176A5027j24403K1001P4350l114l9922L1619P5496J8265k2336L6658J05017
35165A87658J09850J19458J60993J18762m2579j45665o3196N3939M711j41656
35155C62275j64687m0799M2798j3411r7738p2822M8858J38417Q8473p8130k04124
35144I110j52313Q696O5868m7394j46350o1606J20382K03301J54591Q8929O1988
$$ y = [-30347, -34484, -15398, 32750, 67363, 41560, 715, 53626, 218043, 374698, 415281, 360385, 290686, 246331, 244315, 303435, 384173, 388665, 294522, 206814, 200555, 202933, 129439, 46969, 72646, 171233, 194411, 97904, -10905, -43090, -31226, -39559, -60821, -42742, 29540, 106516, 116091, 33059, -88947, -174899, -209046, -211764, -156999, -10012, 147558, 160057, 15027, -109376, -88375, -14025, -17139, -57061, -25442, 50054, 68319, 45983, 82641, 187658, 297508, 416966, 577959, 696721, 654142, 508477, 445281, 499220, 503931, 362275, 197588, 156789, 199587, 186176, 88438, 15616, 64474, 202891, 291364, 213234, 9110, -143203, -134507, -68639, -116033, -262383, -323989, -203607, -306, 154285, 243214, 305202]
35133C05202L5202k77n137J9732L0453P644m4615j22509j79838j32223J5477J22579
35121E1690Q4933k2306o9043n2660m6941n3998l5404j9908m5484n3479K2653J14578
35109a25369J04760J3560l7902j6434J2412L2679Q8032J53390J41917N2275j4408
35098D04912K326O9034J49839K39863L00247K68050J47994O757j24013k47716
35088A217293l17820k67248j34239n1382q2005j52976j68804j12284j8535P0617
35078a7383J11517R0858O1685P9505J08030O7651l0811r5018r5057r6562j33108
35067E1307j48020j00907m4149m2309p7725q1886j8562R0937J86134J98860J11885
35056A25565m807n9814m2089j0535L915J9248L4033J9228j2947j1113K6272L9844
$$ y = [305202, 340404, 340127, 334990, 354722, 385175, 392819, 348204, 225695, 45857, -86366, -70889, 51690, 136623, 114317, 45274, -7386, -54327, -108325, -143729, -163637, -209121, -262600, -239947, -125369, -20609, -7049, -44951, -61385, -48973, -16294, 71738, 225128, 367045, 419320, 404912, 407238, 476272, 626111, 865974, 1166221, 1434271, 1582265, 1589022, 1465009, 1217293, 899473, 632225, 497986, 446604, 364599, 211623, 42819, -69465, -88000, -17383, 94134, 184992, 246677, 326182, 434212, 501863, 471052, 376034, 280977, 184415, 51307, -96713, -197620, -241769, -284078, -361803, -443689, -462251, -371314, -185180, 13680, 125565, 120758, 60944, 18855, 8320, 12235, 31483, 65516, 84744, 71797, 60684, 86956, 126800]
35044A26800J0161q379J1587J4001m1230q7340l5002Q3457J30250K9661j30864
35033A03102j92784j00884M0182Q8970K5564m2157k4169M6574P5817L0954l8250
35022A2919p2213n0505J0983O7818O7448M337n7791n8622k1458j5578m9084n3419
35010b15165J5697J06966J30440O5628j5788l7810o174K0804L2020P1391J26968
34999B94977R9730m1187j52005q9520N7547P3440o2180j42499n4961O2258O5467
34988A11067J8076L3443P0972M4973J811J6976K5181o5427j75430j57301l4630
34977a10289M3587L8289K8809K8455j6500o6322k3222P0298N9314p2338j56138
34966a76057q5308N1855J32257J44944J22791N9444l8704j14656j25040p3118
$$ y = [126800, 136961, 128582, 140169, 154170, 112940, 25600, -9402, 74055, 204305, 233966, 103102, -89682, -190566, -150384, -61414, -35850, -78007, -102176, -55602, 20215, 51169, 12919, -59294, -109799, -98816, -30998, 36450, 40787, -17004, -75626, -97084, -112662, -161746, -215165, -199468, -92502, 37938, 103566, 87778, 49968, 43794, 64598, 96618, 168009, 294977, 394707, 353520, 201515, 111995, 169542, 242982, 180802, 38303, -16658, 45600, 111067, 129143, 162586, 233558, 278531, 280342, 297318, 322499, 257072, 81642, -75659, -110289, -66702, -28413, 396, 28851, 12351, -53971, -77193, -6895, 52419, -19919, -176057, -261365, -209510, -77253, 67691, 190482, 249926, 211222, 96566, -28474, -101592]
34956a01592K4938J21143J12031l8080j74092j09603R5898J97964J20445M6924
34946B95976J04396J63038O3797j24786k18809j70332p4952j4208l604k9444m5096
34935e4024P158J00498J24123M2572l4565j4338M2096L1175k9356m7222j265N2995
34923B19847P4246N5466K239m5103k5421M5734N9017m0874j57863j68391p8231
34912e9334J9883P9457J05641Q6170J3544n9251p1151l7146j1580J462L1835O5664
34900A65194N5183p249p9104j17234r8392j8906Q2320J30180R0750K1013nK8902
34888B52652L7835j8390r8882j12040j2823J27568J73542P5850o3559j22365j04753
34877A34635q6428p0682j0466O5546Q0952M5299K3752m682r9201j84097j18217
$$ y = [-101592, -76654, 44489, 156520, 118440, -55652, -165255, -69357, 128607, 249052, 295976, 400372, 563410, 627207, 502421, 283612, 113280, 38328, 24120, 20516, -8928, -54024, -46866, 53632, 177755, 220327, 185762, 171424, 213520, 244695, 215339, 168117, 166852, 219847, 294093, 349559, 351798, 306695, 281274, 327008, 386025, 345151, 187288, 18897, -59334, -39451, 40006, 145647, 231817, 245361, 186110, 114959, 77813, 66233, 67695, 99530, 165194, 220377, 213128, 134024, 16790, -81602, -100508, -18188, 111992, 202742, 223755, 223750, 252652, 290487, 272097, 173215, 61175, 48352, 175920, 349462, 425312, 361753, 239388, 134635, 48207, -22475, -32941, 32605, 113557, 158856, 182608, 177926, 78725, -105372, -223589]
34866b23589M9540J09296J8775k8821N4927R5260k7532j44559p8792M9721L5460
34855i0314o1658m0815Q0680J09355J3878m7698k1369k6402j09333j49181n9258
34844d02115Q8780J87376J98979J19745k0038j05109l2554J18119J52941K2943
34834C29067j22959j62380j27415p8103m625Q5489J20196P4304J6405j3935o2564
34823E3480j33244j24876J3962J65964J84888Q8973J4337J7098K1481m1355j25076
34812A35632j29216l3698O3425N3872n0065j26023q7500K6830J27898J78345J79518
34801C39018J26188M0322j2225j4613m4585j39816j92580r9367M7892P0369l2295
34790H8308q6944j2958P8486P5111M036o1261j01990j09767n7311K9796O8082
$$ y = [-223589, -174049, -64753, -45978, -74799, -19872, 75388, 47856, -96703, -175495, -125774, -90314, -151972, -192787, -112107, -2752, 11126, -36572, -57941, -84343, -193676, -342857, -402115, -313335, -125959, 73020, 192765, 172727, 67618, 35064, 153183, 306124, 329067, 206108, 43728, -83687, -161790, -166415, -80926, 39270, 113574, 129979, 116044, 53480, -79764, -204640, -190678, -24714, 160174, 249147, 263484, 280582, 302063, 260708, 135632, 6416, -27282, 36143, 90015, 39950, -86073, -173573, -146743, -18845, 159500, 339018, 465206, 505528, 493303, 478690, 434105, 294289, 101709, 2342, 50234, 120603, 88308, 1364, -11594, 66892, 142003, 146039, 84778, -17212, -126979, -184290, -154494, -86412]
34779h6412L0332j9953l6307l6524k1045M2447J19204J12167J6547m5646n367
34768F9443N0348K5071m2097o1718l6219k7668m7393n7020l4793J4248P0845R4186
34756A7233N9328J5357K6291N0320p055j05722q9006O0764J52023O2859p1417
34745A70975p8583q262n683n1066k1974O5194Q2987K2578m831J4569k5499j37094
34733B3311j87487j14702l0065l2730o1858k1851O0477J02464J01122J00675Q7833
34722B7189K0485p4268j19541r1153l2759J8571O1596R4263J02703Q5824M8662
34711A41572j9197j10703j57739q7134O5364J61853J20444J5534k8590K033K7281
34700A30718J6962K0443M7826K8930n9804j19791o2764M7164P9217J9905l1676
$$ y = [-86412, -56080, -76033, -112340, -148864, -169909, -127462, -8258, 103909, 120456, 74810, 69443, 119791, 144862, 102765, 41047, 4828, -22840, -70233, -127253, -162046, -147798, -76953, 17233, 76561, 91918, 118209, 168529, 161474, 55752, -33254, 27510, 179533, 242392, 170975, 92392, 84130, 78447, 27381, 5407, 70601, 153588, 176166, 171335, 185904, 160405, 23311, -164176, -278878, -308943, -341673, -403531, -425382, -364905, -262441, -161319, -60644, 27189, 47674, -26594, -146135, -237288, -270047, -251476, -189880, -95617, 7086, 92910, 141572, 122375, 11672, -146067, -233201, -167837, -5984, 114460, 129994, 101404, 103437, 130718, 147680, 168123, 215949, 244879, 185075, 65284, 2520, 49684, 128901, 148806, 117130]
34689A17130k5829p949p032Q764M7699O6346M9210K3248k2306j20983k11394j67412
34677b50508N62J12305O9213K353N3446J40194J02080k1509n7035J3834M4946
34666B09881L07J5931J33381J80422L4780j55516j70326l0721N2917p046q4736
34655A79274o4658l565j0733p4109r3982l8428K2966L4204K7888N4827Q5829M2640
34643A62153p4133j45018o2037J24269K41654J88993M8712k0715K5595P9191K3900
34632E92564j19494k17037j72920k8208R4497J17433N6390l5069j20136j65813
34622B207j28482l481J31383J76770J17968K6570m2419r7896j44465j38006n7677
34611a57528L3618O9010P8731J27913J77547J16399n3108j74595j41919m7404
$$ y = [117130, 91301, 83352, 76320, 85084, 132783, 199129, 248339, 271587, 249281, 128298, -83096, -250508, -249946, -137641, -68428, -66075, -12629, 127565, 229645, 208136, 151101, 164935, 209881, 210188, 226119, 359500, 539922, 574702, 419186, 248860, 218139, 271056, 264010, 179274, 114616, 111051, 100318, 26209, -67773, -106201, -83235, -49031, -21143, 33684, 119513, 162153, 88020, -56998, -119035, 5234, 246888, 435881, 484593, 463878, 489473, 568664, 592564, 473070, 256033, 83113, 54905, 149402, 266835, 323225, 288156, 168020, 2207, -126275, -129756, 1627, 178397, 296365, 322935, 280516, 182620, 38155, -99851, -157528, -123910, -54900, 23831, 151744, 329291, 445690, 392582, 217987, 76068, 28664]
34601B8664l6585r0133o9912N4635J58423J45429O2575j632k6433k0731K6223
34590B30523Q9948Q7496j2587j16932j21367m9836l114j1234j8825J0778N4648
34579A39498P6974N4603j9738j02270j05296r208P7186N4416j4127M853R9692
34568B56583J23529J9946r3391r8601k0887M6114N9403K2370m9864j09162r6074
34557E9966l0083k099l3862l3335N0376J18394N5364r5016j82694j39205k6801
34546b58995P0195J17770J10359N7748Q71j7519o434q658k9614k8916J0947M9828
34534F7582M3636N602j2693P836L1120K5493J7916M9700R1236O4012l7347j17130
34522B36963j12218p6619o8584l8019O9862J70112J37524J2692m4279M178L6241
$$ y = [28664, -7921, -98054, -167966, -113331, 45092, 190521, 253096, 251464, 225031, 204300, 230523, 320471, 407967, 395380, 278448, 157081, 107245, 104131, 92897, 74072, 84850, 139498, 216472, 271075, 251337, 149067, 43771, 34563, 111749, 166165, 152038, 156891, 256583, 380112, 400058, 306667, 208066, 187179, 233293, 292696, 315066, 265202, 156040, 59966, 29883, 27784, -6078, -39413, 10963, 129357, 184721, 89705, -92989, -232194, -258995, -188800, -71030, 39329, 97077, 97948, 80429, 73995, 65337, 35723, 6807, 17754, 67582, 111218, 116820, 104127, 111963, 143083, 168576, 186492, 236192, 327428, 391440, 354093, 236963, 124745, 48126, -20458, -58477, 11385, 181497, 319021, 331713, 287434, 291612, 327853]
34511C27853j1570n6250m0230k7634n6274m4416N5751J37311Q3818n8478j57049
34500A52832j63727j17549n2318Q925L2594K7018N4898J30629J77150J40531O2273
34489D53256j4067j01859j77362j53537l1015N3081K3274j9052J7003N7876K9440
34478A37038J6908R1832J29092L514j56119j41576L317P1878L9008M7859R6334
34467C39085K9170j43719k05797p6454N5648L2584n9807q3523n5868m4857k3384
34456b36922M3480R2879O1521r253n1874o3293n4845j2811L8582M2424J9201N1698
34444g9213J26495J32942N8034J5683K8501k6412j65716k02253m1010J19328O9016
34433C5395q2288p5624J01546K18206J48647N822o6599n4465r683K7729K1952
$$ y = [327853, 316283, 260033, 219803, 192169, 135895, 91479, 147230, 284541, 368359, 309881, 152832, -10895, -128444, -180762, -171837, -139243, -112225, -57327, 73302, 250452, 390983, 453256, 439189, 337330, 159968, 6431, -24584, 28497, 51771, 32719, 49722, 107598, 137038, 153946, 245778, 374870, 378384, 222265, 80689, 84006, 155884, 194892, 242751, 339085, 368255, 224536, 18739, -57715, -2067, 30517, -29290, -112813, -168681, -213538, -236922, -193442, -100563, -39042, -48295, -100169, -163462, -218307, -231118, -192536, -150112, -130911, -79213, 47282, 180224, 238258, 253941, 282442, 256030, 90314, -111939, -152949, -33621, 35395, -46893, -122517, -20971, 197235, 345882, 351704, 285105, 230640, 220957, 248686, 270638]
34422B70638l3017p1673l2941L8296O1862O0587J07372J62365J08849m4956j46673
34411D80709j15377m4698m0445p5628p8245o1745p5612r3392m7039N7316J37712
34400D3556J37749O8048l8372j43202j78033q6627O9742J21002j9768k09198k16164
34389d51267j3909J75403J67935M2388p462M9658Q4936L7914j2959r411K026k0749
34377D4503m3646l9283l5925m0426j5839K2337N94p0421p1101L7149J20518O8158
34365b3382l4163m2773K8643O5891N0832N6404R1076Q9351L8036j0822m2362q5171
34353A81560j25001j16026p2874n4574o0737l6430K1668N4397L7678P998j0854
34342a73195k7367k9635O429N3700N5929J7864J383L0135O9560R9563J28185J29717
$$ y = [270638, 237621, 165948, 133007, 171303, 233165, 293752, 401124, 563489, 672338, 627382, 480709, 365332, 320634, 280189, 204561, 126316, 64571, -11041, -104433, -151472, -94156, 43556, 181305, 249353, 210981, 67779, -110254, -196881, -127139, -6137, -25905, -235103, -451267, -465176, -289773, -121838, -79450, -86912, -37254, 47682, 85596, 72637, 63226, 65252, 44503, 857, -38426, -74351, -114777, -130616, -108279, -107685, -178106, -249207, -212058, -91540, -23382, -57545, -100318, -71675, -5784, 45048, 101452, 192528, 281879, 319915, 309093, 266731, 181560, 56559, -59467, -132341, -186915, -247652, -284082, -262414, -208017, -170339, -162341, -173195, -200562, -230197, -223768, -170068, -114139, -96275, -94892, -64757, 4803, 104366, 232551, 362268]
34330C62268N4815p5611j58938j24414j0293Q8459J07319M5646l7543o0553l91
34319A90764O6282N1901k4720o7772l8300R702K2438L545k7695o6148r2317p2088
34307d4408o378N8270P9796N4261Q294j3319K1635P7827O8391k3595r1452m4952
34295A44370M9302O1821j1722o8368o7214n2311k9655L3243Q7565L9900o8561
34284A18370q0681L0732R7490J3457r9087r0662j3656r192p1262q3474k4737K2897
34272a89805L8760P9911J35831J11972j3555j36272j69068j41408j11540p1349
34262d66523J149O8948Q9665R2570J26731J63867J32705L9422k8704l3751l9748
34251A46331r1367j13988j8598J32854J74317N7768p2503p3578J3851N0031k679
$$ y = [362268, 417083, 341472, 182534, 58120, 47827, 136286, 243605, 289251, 251708, 191155, 190764, 257046, 308947, 284227, 216455, 178155, 187857, 210295, 213840, 186145, 119997, 27680, -44408, -50786, 7484, 87280, 141541, 149835, 136516, 158151, 235978, 304369, 280774, 189322, 144370, 193672, 255493, 243771, 175403, 108189, 55878, 26223, 59466, 147031, 186931, 118370, 37689, 68421, 165911, 179368, 80281, -10381, -24037, -33229, -104491, -187965, -212702, -189805, -151045, -71134, 64697, 176669, 163114, 26842, -142226, -283634, -395174, -466523, -465374, -396426, -306761, -214191, -87460, 76407, 209112, 248534, 219830, 186079, 146331, 54964, -59024, -77622, 55232, 229549, 287317, 214814, 141236, 155087, 205118, 202439]
34240B02439o0192o5151n0796n5225o4282o1849o1573o0154k5581L3315M6144
34229b22905k4686j15441j36847q5097k5468J1869N8822J29092J68169J21494
34219a20998K6619j4495L5070R3836P5783J4870N005M0732K3622n7581p8289K1667
34207F5841J05731K7911j30390j61869l4449O9283K2286q6191j06468k4714O2506
34196a90523Q4923M5755j1591l7361j5280J3832J1667J3564O4886J04596K9919
34185A14387j12735j42025j720J28626P7787p1418j01890M1562K01141K20863
34175C54578J02547m7469j37612j41136q3875m749Q0787J64266J96254J15466
34165E99057m7551j63538j53266q6779p4292j10338j01619j5984P6080R9927N2353
$$ y = [202439, 142247, 77096, 26300, -28925, -93207, -155056, -216629, -276783, -302364, -269049, -222905, -247591, -363032, -499879, -584976, -610444, -598575, -539753, -410661, -242492, -120998, -94379, -108874, -73804, 20032, 95815, 110685, 115690, 156422, 180044, 122463, 44174, 65841, 171572, 199483, 69093, -92776, -127225, -57942, -35656, -121847, -228315, -253029, -190523, -105600, -59845, -71436, -108797, -124077, -110245, -98578, -85014, -20128, 84468, 114387, 1652, -140373, -142093, -13467, 64320, -7098, -108988, -67426, 133715, 354578, 457125, 409656, 272044, 130908, 47033, 42284, 123071, 287337, 483591, 599057, 551506, 387968, 234702, 147923, 73631, -36707, -138326, -154310, -78230, 21697, 74050]
34154G4050k4001r3210j40231j55750j20578j9806J09011J69978J07897l057m5344
34143a41041k0586k3660n5310k858J46254K25353J23492l1507n7762J7170L2670
34132B12215m0261q3785m8625j3156k2748k2267K2322O1050N5638L4971K1602
34121A76956n549m3532m3836R400O8168Q7707O1669j0298j10379j59868q8171
34110e7733M2204Q4773Q875n9691l6755K030k7902o4737o623J02228J18680P114
34098A12463j12318j25544m8870K5632M4318K5470J7084M2226P0926M9518k3304
34087G7601o9624k2952O5765P2116l6304j38066j08809P437N2009k9157j06830
34076b36814m9481R2412J64937J27357P9553P9187N7585l6341j21306r9247n967
$$ y = [74050, 50049, -43161, -183392, -339142, -459720, -479526, -370515, -200537, -92640, -95697, -141041, -161627, -185287, -240597, -243455, -97201, 128152, 251644, 220137, 162375, 179545, 212215, 171954, 88169, 39544, 26388, 3640, -18627, 3695, 64745, 120383, 155354, 176956, 171407, 127875, 84039, 93439, 161607, 249314, 310983, 300685, 190306, 30438, -57733, -15529, 69244, 78119, 18428, -18327, -16297, -44199, -108936, -115559, -13331, 105349, 112463, 145, -125399, -174269, -148637, -104319, -78849, -61765, -19539, 51387, 100905, 77601, 7977, -14975, 50790, 122906, 86602, -51464, -160273, -152836, -100827, -129984, -236814, -286295, -193883, -28946, 98411, 177964, 257151, 314736, 278395, 157089, 57842, 51875]
34065E1875N3172O2099Q1546J14654J00236L0481l1966n9696q4846j07285p7751
34054A32519L563O3994O4563M2791K0222l5974j13949j22892l2942L9769j2457
34043D9207j13863j01249L4737J26118N8411p8503j16681j9020R6478J09217J9015
34032F3867q0068j09657p1541j4731L5599R4357J64219J98960J49679M0960l5075
34021D36569k0654L2415K2723o7273j39511j06444j0554L4096k560m3192l7171
34010I8444k7009m2541k3753O7057J30928N1259j06427j50384k9725Q7188N2657
33999A07694o0167q7342j7453J8418l2835o5292J6501J44526J75219Q3524j3976
33988B68817k9127j4113n7030j27489j17538k1006L8290n901n0812J6654J30118
$$ y = [51875, 105047, 167146, 248692, 363346, 463582, 494063, 462097, 402401, 317555, 210270, 132519, 136082, 200076, 264639, 307430, 327652, 291678, 177729, 54837, 21895, 61664, 49207, -64656, -165905, -131168, -5050, 53361, -25142, -141823, -160843, -64365, 44852, 63867, -16201, -125858, -197399, -212130, -176531, -82174, 82045, 281005, 430684, 471644, 436569, 415915, 448330, 471053, 403780, 264269, 157825, 147271, 181367, 178807, 135615, 98444, 71435, 28894, 5141, 72198, 203126, 254385, 147958, -2426, -32151, 55037, 107694, 47527, -39815, -57268, -38850, -71685, -136977, -120476, 24050, 199269, 282793, 268817, 239690, 225577, 168547, 41058, -76480, -97486, -59196, -65097, -115909, -99255, 30863]
33977C0863J31266Q916q0438l6633O0268Q7254L7995j4854m4135q3462j51031
33966e3991k11737k08937j19246J0317R0109Q6240O8116J03486J41090R0420o447
33955a0580j5248O5780P4567n8865j74489j12534M0360Q3160l181n8733p731N2824
33943a24670M0822J0991L5800Q3784Q9773O2982M9293M1673J170o6541j19889
33932A05188j45646j55383j30616l7339R3490J61266J11942K0517K281N8219P7608
33921A61527P517n6690o348J11223J44323L7695j07912j81218j75744j33745o3922
33910b63294K6758Q3288N7972j2220m1648K430P1877R9005O0074r478n0364m6705
33898b2305m9934r6323j21046l5738J07893J43349K0845r8871o2219O2987R9722
$$ y = [30863, 162129, 171045, 90607, 53974, 114242, 201496, 239491, 224637, 180502, 97040, -53991, -265728, -474665, -593911, -583594, -493485, -407245, -339129, -235643, -94553, -4133, -10580, -25828, 39952, 114519, 55654, -118835, -231369, -191009, -107849, -111030, -169763, -177494, -124670, -83848, -72857, -37057, 46727, 136500, 199482, 248775, 290448, 291618, 225077, 105188, -40458, -195841, -326457, -363796, -270306, -109040, 2902, 23419, 25700, 83919, 161527, 169044, 112354, 106006, 217229, 361552, 399247, 291335, 110117, -65627, -199372, -263294, -236536, -153248, -95276, -107496, -149144, -146714, -74837, 24168, 84242, 74764, 24400, -22305, -72239, -168562, -289608, -325346, -217453, -74104, -53259, -152130, -214349, -151362, -51640]
33887e1640J6656n5872k8791N1495J06328J14526Q7208L8749j129r745j1681m4661
33875B11443r5885j25771j32193j29834r7459k0973M3141L5613k084J0737N3872
33864b49393L9300k9937n7822j5427K4051K6961M4383Q1965N9040m2892j13160
33853b32931p0135J6682M3501J9102R780K0556K3515L5744P4579Q9194K8633o1159
33841b939q8355l0793O2754J44253J78139J32602K7514n5888p4018p2309q0226
33830A40734m1544O2062J11925Q124j44333j57324k8511O9485N0724N67j0223
33819F1686k4776o6550o1522K8738J16940J12973L9547m2030j19959j71666j22200
33808b48819L5062J60241J24217j0253p2570j0641P0202P0611J607o7244q2167
$$ y = [-51640, -34984, -90856, -119647, -68152, 38176, 152702, 239910, 278659, 277530, 267785, 256104, 211443, 115558, -10213, -142406, -272240, -369699, -390672, -347531, -311918, -314002, -303265, -249393, -210093, -240030, -297852, -313279, -289228, -262267, -217884, -135919, -76879, -119771, -232931, -303066, -286384, -242883, -223781, -214001, -193445, -169930, -134186, -59607, 29587, 58220, -2939, -91294, -122087, -59333, 84920, 263059, 395661, 423175, 367287, 293269, 220960, 140734, 99190, 161252, 273177, 281301, 136968, -20356, -48867, 20618, 71342, 71909, 61686, 36910, -29640, -91162, -62424, 54516, 167489, 207036, 165006, 45047, -126619, -248819, -213757, -53516, 70701, 60448, -12122, -22763, 47439, 118050, 119657, 52413, -29754]
33797b9754k9246M9902P2156o37j02462j42360j15646p5078k8171N0781J29113
33786b21402J35889P6236L3367M1379M1162j2364p6725q9410m7343J0784M9739
33775e8688M7496J4405J1394Q1573J56208J16222k9548j27199q5136K208Q392
33764A37327m3951n4606j9585j0220k4720Q130Q7782J24714P6451l62m8971o7510
33752A64479m8578K9529J13597Q5037p3786k11417j89266o1075K4015L7050O5670
33741f4745J24150J12636k684r8283o1246M2697O9222M980l9017j9830j8822q0663
33729c1605j16640m0537Q4025J24172N6406k5714n2314l5879n670K4969K6088
33718G301k7401r2228r3429l3387J4660K4837L6303M6352K184p1842o6377L7649
$$ y = [-29754, -59000, -9098, 63058, 62421, -40041, -182401, -298047, -373125, -401296, -350515, -221402, -85513, -9277, 24090, 65469, 106631, 94267, 17542, -71868, -119211, -108427, -58688, -11192, 3213, 14607, 96180, 252388, 368610, 339062, 211863, 126727, 128935, 137327, 93376, 38770, 19185, 8965, -15755, -7625, 80157, 204871, 281322, 280960, 231989, 164479, 115901, 145430, 259027, 344064, 270278, 58861, -130405, -191480, -167465, -130415, -64745, 59405, 172041, 169357, 71074, 9828, 52525, 121747, 126727, 87710, 67880, 49058, -31605, -148245, -188782, -104757, 19415, 75821, 50107, -2207, -38086, -43756, -18787, 7301, -20100, -112328, -205757, -239144, -224484, -199647, -163344, -116992, -114808, -186650, -253027, -215378]
33706b15378J12156P5428J5031K1075K9235l7642r3178k2381R8482J06893J8405
33695A08126j4991K3504Q15j04310j40708l3040J01397J50170J47243J43156R9803
33684D81165N129n8085n5695p3981j47887j61537m1890Q2519O1379m7139p8284
33673c4306o764O4460R4816J25255J43721Q3571m7488j53109j62709p9933N4219
33662H1733J66207J63535L7940q5384r1743k4680k982n1344j13303j63471j90076
33651b73568j36676K405R4487K9454r0069q8331P068K5057m5814m0745Q3849J69860
33639b63023J32198R2023J38023J55343K8722j41305j76176o3346P0978J42442
33629A15879J40808O6238m2602q3593j1682O8596L6466p1199j23844q7140l8127
$$ y = [-215378, -103222, -27794, -12763, 8312, 37547, -95, -93273, -115654, -17172, 89721, 108126, 93135, 116639, 117454, 13144, -127564, -160604, -59207, 90963, 238206, 381362, 481165, 486294, 428209, 372514, 298533, 150646, -10891, -52781, 29738, 91117, 43978, -34306, -41070, 23390, 118206, 243461, 387182, 470753, 423265, 270156, 107447, 27514, 81733, 247940, 411475, 449415, 364031, 272288, 247608, 244626, 193282, 79979, -83492, -273568, -410244, -407839, -313352, -283898, -373967, -462298, -455230, -430173, -475987, -516732, -432883, -263023, -130825, -38802, 99221, 254564, 283286, 141981, -34195, -97541, -26563, 115879, 256687, 322925, 280323, 196730, 185048, 253644, 290110, 218911, 95067, 7927, -30200]
33618c0200k2296o308L3512O7524O5718L2671j1129m1205l6577q513N601K825
33606E1623K1109N5919M1059l5759p6090p248R1266R1887n8o8886n8827k4048
33594H1947k7555p7118j46032j80498j12400N2051J86875J83940J05044Q4528
33584A50782J07543L2545j53659k65260j72318O208O8896j142n2953M738J12451
33573a62169J75169J60050P7320l8748j11111p1197L6545Q1536K3807k0084L9045
33562A90163R7212L17j93510k59331j31033q784n6718j49819p2204J41538K53745
33551a88424J65892J7636n6506p6027p9141k6122P6268J14048M1091j6507M8594
33540B0802J46243J34692M2956m668n012m7083j15311r8897J0484R1100P6191
$$ y = [-30200, -52496, -58804, -25292, 42232, 107950, 140621, 129492, 88287, 51710, 43197, 48798, 51623, 72732, 128651, 169710, 133951, 57861, 50613, 141879, 233766, 233708, 164822, 105995, 81947, 54392, -22726, -168758, -349256, -461656, -409605, -222730, -38790, 66254, 150782, 258325, 290870, 137211, -128049, -300367, -294159, -225263, -226405, -279358, -274620, -162169, 13000, 173050, 250370, 211622, 100511, 29314, 65859, 147395, 171202, 151118, 190163, 287375, 287692, 94182, -165149, -296182, -304966, -361684, -511503, -583707, -442169, -188424, -22532, -4896, -61402, -137429, -216570, -242692, -166424, -52376, -11285, -27792, 20802, 167045, 301737, 344693, 340025, 335013, 287930, 172619, 73722, 84206, 175306, 251497]
33529B51497K5888o992m8183j04177j19565q2162o0414q0601o9841J1259P3376
33518b09915K4092p8406r6481q191O3181K5007n0694j7678J40710K58988J83531
33507B34144j5864j16532l3968P3258N1888k1604J319O6254J793j61722j95496
33496a16530l0437J15440O5953n6824m8994O5617J17991O5973n851p3866j62739
33485f4267j93715n5097J77196K84446J98873P3790J8903m4964j79019k53282
33475c7136j30031R4860J97418J16093p051m6608k1978o828k5655o1702q5182
33464a3800n7875K4423R2640P5639M040l4291l0555m7467p8237m0710N5166P2448
33452B1421m1278j31755m7495J19706J50729J1151j03603l8480J33193K22534
$$ y = [251497, 277385, 270393, 222210, 118033, -1532, -83694, -144108, -224709, -294550, -283291, -209915, -185823, -264229, -360710, -368901, -305720, -280713, -331407, -349085, -208375, 50613, 234144, 218280, 101748, 67780, 141038, 192926, 171322, 172641, 238895, 240688, 78966, -116530, -146967, -31527, 34426, -22398, -71392, -5775, 112216, 178189, 172338, 98472, -64267, -257982, -313079, -135883, 148563, 347436, 421226, 440129, 395165, 216146, -37136, -167167, -72307, 125111, 241204, 234153, 187545, 165567, 158739, 133084, 71382, -13800, -71675, -47252, 45388, 121027, 125067, 90776, 60221, 12754, -65483, -106193, -51027, 21421, -19857, -151612, -199107, -79401, 71328, 82479, -21124, -59604, 73589, 296123]
33442B96123J33974o7546k27426k22182p2582N9061M6238m2151m1307P3731J68970
33431A04903J64362J23298R6614K7475j10295k09550j72949o2395L912K3500O3495
33420E2370J08389Q2172q829p0650n0676J4859O9686Q1360L9051k3557l3531K4581
33408B85225N8420p431j01628r4165K1420J30524J52203R5633m983j06074j33009
33397B96135n5874L1587K0029n0156n2231K1424N9003K5695J999J0960k5035j09442
33385A74094j19292n878R8761P3621j8212n5072m4454o3319r7973p5346k002M7057
33373h8015M7504L5403K5877J0267Q254M0333P1589N8115K2537Q019j0192p7467
33361A52224j47132j19442K038R3015P8303L3200O0218J27219J08818k5268j42306
$$ y = [296123, 430097, 362551, 135125, -87057, -159639, -100578, -54340, -96491, -137798, -64067, 104903, 269265, 392563, 489177, 516652, 406357, 196807, 23858, -38537, -34625, -11125, 52370, 160759, 242931, 234102, 163452, 112776, 127635, 197321, 278681, 317732, 294175, 260644, 285225, 343645, 336214, 234586, 140421, 161841, 292365, 444568, 540201, 535218, 429144, 296135, 240261, 271848, 291877, 241721, 189490, 210914, 269917, 295612, 297611, 308571, 283536, 174094, 54802, 48924, 147685, 221306, 203094, 148022, 103568, 40249, -57724, -133070, -135072, -88015, -40511, -5108, 20769, 31036, 39290, 79623, 151212, 209327, 231864, 239883, 229691, 152224, 5092, -114350, -112312, -19297, 59006, 92206, 152424, 279643, 388461, 363193, 220887]
33350B20887j05079M5270J30342N7547o9262r9249k8148L1820K8927J5845K8248
33339B57148K8991n791m1300n6162p0865p1719n213J02569J24420P195j20144
33328A49129j09345L366O0650O607o1759m9728K3789P8095O6715R069l4838k0810
33316A20940K7545M2028l30m9426o1403n0441l5966o719K5860J6614k2196o965
33304d59P5469J10856L3154m3420P749J12675J05543r355p7825n0852l5377p8004
33292A50154p9559J9415J23607J32280P8563L6225k478o0764q1617j0071Q5267
33281C91022Q1237l2055j38445j41993n9587K7904O1095L5027j3039l8996l0292
33270A41878o047K1481N7293Q5958O4539j6102r3229r3755k0451N2431O1733J4133
$$ y = [220887, 115808, 161078, 291420, 348967, 279705, 180456, 152308, 184128, 213055, 228900, 257148, 286139, 280348, 239048, 182886, 112021, 40302, 35089, 137658, 262078, 269273, 149129, 39784, 43150, 103800, 110407, 48648, -1080, 22709, 100804, 167519, 176588, 141750, 120940, 148485, 190513, 190183, 140757, 79354, 28913, -7053, -13772, 12088, 28702, 6506, -459, 75010, 185866, 219020, 175600, 183349, 296024, 401567, 392212, 314387, 263535, 228158, 150154, 70595, 90010, 213617, 345897, 424460, 460685, 458207, 397443, 315826, 305755, 391022, 472259, 440204, 301759, 159766, 100179, 128083, 189178, 224205, 211166, 172170, 141878, 135831, 157312, 214605, 300563, 365102, 349000, 255771, 162016, 141565, 193996, 255729, 269862]
33258B69862k8274p429P4408J50170J56157J06274O8439O1927K6288p8066j86077
33247F13679k03416j41038j02286j31049j47612p3513M3532R8946Q6891R3376
33237A37510J37661J29364K7477o2457m2760L241p5933k48174l08568j58619O4190
33226c97068J82945J78715J21882L2605q0321j36922p5058K9929N5268M867k0404
33215a03562M562J0420k2178k5719K6921O8600N0206J9040L5913P6149O5643j3594
33203A92401r1566q3418R905Q5232N6093j9738j0536P5790P2134q1247j92495
33192A2555q6716J00522J06926m8856r4777N9444J81083Q8376p5379q4809L9891
33181A98260J21599J04162N8769Q483o9526j22156p3573K4775M9336m279k9003
$$ y = [269862, 241588, 234159, 308567, 458737, 614894, 721168, 789607, 851534, 877822, 799756, 613679, 410263, 269225, 166939, 35890, -111722, -185235, -141703, -42757, 44134, 137510, 275171, 404535, 432012, 369555, 326795, 330036, 254103, 5929, -302639, -461258, -397068, -214123, -35408, 86474, 119079, 38758, -98164, -173222, -143293, -88025, -83158, -103562, -99000, -88580, -110758, -136477, -109556, -40956, 9250, 28290, 64203, 140352, 205995, 192401, 100835, 17417, 27322, 112554, 168647, 148909, 138373, 214163, 286297, 205050, 12555, -74161, 26361, 133287, 84431, -10346, 49098, 230181, 318557, 243178, 158369, 198260, 319859, 424021, 482790, 491273, 421747, 299591, 226018, 250793, 300129, 295850, 266847]
33170B66847P7j0747r5368j57457j31476q9018j06436j27795o2892M3192N7471
33159d13602l9989j14099o0707N5948J10563R5658J03438J55836J61804P0032
33149A24882l4880n4579j9566k0769n3117l7443K5835M3923j7439p7201o0787
33138a81141J2752R3021J55084J60796O4983q3349j39685l9306R9767J27244N0083
33127C20249j1892m262K4862L3956L5469L5108L637p0812j48498j73356j26020
33116h1559m6439j0148n5736j26291j22667k8662O7598R5531Q0575O9327N1691
33105a06780J2925o489K3496N1731K0332l3395l2557J4903L4217O801j0416J5651
33093i581N2673O6554O0960M2488J661n3414q1669m4522N4804J61816J97289J25371
$$ y = [266847, 266924, 256177, 160809, 3352, -128124, -217142, -323578, -451373, -514265, -471073, -413602, -453591, -567690, -628397, -572449, -461886, -366228, -262790, -106954, 54850, 124882, 90002, 35423, 15857, -4912, -58029, -95472, -69637, -25714, -43153, -120354, -181141, -168389, -75368, 79716, 240512, 305495, 222146, 82461, 43155, 142922, 270166, 320249, 308357, 304095, 328957, 362913, 398382, 433490, 437127, 366315, 217817, 44461, -81559, -127998, -138146, -193882, -320173, -442840, -471502, -403904, -308373, -227798, -158471, -106780, -93855, -100344, -76848, -25117, -4785, -38180, -70737, -55834, -21617, -14816, -25232, -9581, 43092, 109646, 170606, 213094, 214755, 161341, 79672, 35150, 89954, 251770, 449059, 574430]
33081E74430Q981m7073k8517k8208r8458j62148j30651l6704L2128O6917J03413
33070B54110J08805K4751j01956j56605j22152r0404r9933q3539n862O2881O2055
33059a47849L0040J6627n559o4261r3675j3823J31104K06458J55392N8132J0453
33048B83039P192j7162p2612r3979l8406M4274P3264M6895L9666Q3165J06798
$$ y = [574430, 583411, 536338, 507821, 479613, 381155, 219007, 88356, 51652, 83780, 150697, 254110, 362915, 387666, 285710, 129105, 6953, -83451, -183384, -266923, -272785, -209904, -147849, -117809, -101182, -106741, -171002, -264677, -278500, -147396, 59062, 214454, 272586, 283039, 290231, 273069, 200457, 106478, 68072, 112346, 185610, 232505, 272171, 355336, 462134]
$$ [...]
##END NTUPLES=NMR SPECTRUM
##END=
