##TITLE=31Pdec_104-2024
 CDCl3, 24 sc
 5.12.2024
##JCAMPDX= 6.0         $$ Bruker NMR JCAMP-DX V2.0
##DATA TYPE= NMR SPECTRUM
##DATA CLASS= NTUPLES
##ORIGIN= UXNMR, Bruker Analytische Messtechnik GmbH
##OWNER= root
$$ XWIN-NMR		Version 3.5
$$ Thu Dec  5 13:48:52 2024 Russian Standard Time (UT+4h)  she@DPX200
##.OBSERVE FREQUENCY= 81.013821
##.OBSERVE NUCLEUS= ^31P
##.ACQUISITION MODE= SIMULTANEOUS
##.ACQUISITION SCHEME= undefined
##.AVERAGES= 24
##.DIGITISER RES= 17
##SPECTROMETER/DATA SYSTEM= spect
##.PULSE SEQUENCE= zgpg30
##.SOLVENT NAME= CDCl3
##.SHIFT REFERENCE= (INTERNAL, CDCl3, 0, 198.062)
##AUDIT TRAIL= $$ (NUMBER, WHEN, WHO, WHERE, WHAT)
$$ ##TITLE= Audit trail, XWIN-NMR		Version 3.5
$$ ##JCAMPDX= 5.01
$$ ##ORIGIN= Bruker BioSpin GmbH
$$ ##OWNER= she
$$ F:/spectra/data/she/nmr/P31/2/pdata/1/auditp.txt
$$ ##AUDIT TRAIL=  $$ (NUMBER, WHEN, WHO, WHERE, WHAT)
(   1,<2024-12-05 13:47:50.39 +0400>,<she>,<DPX200>,
      <created by zg, POWCHK disabled, PULCHK disabled
       configuration hash MD5:
       00 E9 B6 7A A2 85 ED C7 34 08 36 98 17 FE 4E 26
       data hash MD5: 32K
       67 16 69 FB 53 A1 64 A1 33 80 E4 6C F5 DB 83 A6>)
(   2,<2024-12-05 13:47:52.92 +0400>,<she>,<DPX200>,
      <Start of raw data processing
       efp BC_mod = 2 LB = 1.5 FT_mod = 6 PKNL = 1 PHC0 = 2423.516 PHC1 = 133.6883 SI = 64K 
       data hash MD5: 64K
       7F AD DA 1F 26 1D 30 5A A0 64 5C 3B 84 A6 BF 08>)
(   3,<2024-12-05 13:48:16.03 +0400>,<she>,<DPX200>,
      <pk PHC0 = -138.6279 PHC1 = -60.8 
       data hash MD5: 64K
       C8 F1 34 B1 61 BE B2 6F A2 5B 1B 17 7D 43 43 4D>)
(   4,<2024-12-05 13:48:22.21 +0400>,<she>,<DPX200>,
      <abs ABSG = 5 
       data hash MD5: 64K
       3B 4D AC 40 14 60 FC 75 3E DF A0 23 27 29 CE 5D>)
$$ ##END=
$$ 
$$ hash MD5
$$ 22 92 B5 2E 90 EB 7A 3D 9E C2 B0 73 9C 53 29 FD
##$RELAX= 
##$RELAX= 
##$RELAX= 
##$RELAX= 
##$RELAX= 
##$RELAX= 
##$RELAX= 
##$RELAX= 
$$ Bruker specific parameters
$$ --------------------------
##$DU= <F:/spectra>
##$EXPNO= 2
##$NAME= <P31>
##$PROCNO= 1
##$TYPE= <nmr>
##$USER= <she>
##$AMP= (0..31)
100 100 100 100 100 100 100 100 100 100 100 100 100 100 100 100 100 100 
100 100 100 100 100 100 100 100 100 100 100 100 100 100 
##$AQSEQ= 0
##$AQ_mod= 1
##$AUNM= <au_zg>
##$AUTOPOS= <>
##$BF1= 81.014009
##$BF2= 200.13
##$BF3= 200.13
##$BF4= 200.13
##$BF5= 200.13
##$BF6= 200.13
##$BF7= 200.13
##$BF8= 200.13
##$BYTORDA= 1
##$CFDGTYP= 0
##$CFRGTYP= 5
##$CHEMSTR= <none>
##$CNST= (0..31)
1 1 145 1 1 1 1 1 1 1 1 1 1 1 1 1 1 1 1 1 1 1 1 1 1 1 1 1 1 1 1 1 
##$CPDPRG= <waltz16>
##$CPDPRG1= <>
##$CPDPRG2= <waltz16>
##$CPDPRG3= <>
##$CPDPRG4= <mlev>
##$CPDPRG5= <mlev>
##$CPDPRG6= <mlev>
##$CPDPRG7= <mlev>
##$CPDPRG8= <mlev>
##$CPDPRGB= <>
##$CPDPRGT= <>
##$D= (0..31)
0 1 0 0 0 0 0 0 0 0.06 0 0.03 2e-05 3e-06 0 0 0.0002 0 0 0 0 0 0 0 0 0 
0 0 0 0 0 0 
##$DATE= 1733392069
##$DBL= (0..7)
120 120 120 11 120 120 24 19 
##$DBP= (0..7)
150 150 150 150 150 150 150 150 
##$DBP07= 0
##$DBPNAM0= <>
##$DBPNAM1= <>
$$ [...]
##$SUBNAM3= <"">
##$SUBNAM4= <"">
##$SUBNAM5= <"">
##$SUBNAM6= <"">
##$SUBNAM7= <"">
##$SUBNAM8= <"">
##$SUBNAM9= <"">
##$SW= 400.765351723535
##$SWIBOX= (0..15)
0 1 3 0 0 0 0 0 0 0 0 0 0 0 0 0 
##$SW_h= 32467.5324675325
##$TD= 32768
##$TD0= 1
##$TE= 0
##$TE2= 300
##$TE3= 300
##$TEG= 300
##$TL= (0..7)
0 120 53 12 22 120 120 120 
##$TP= (0..7)
150 150 150 150 150 150 150 150 
##$TP07= 0
##$TPNAME0= <>
##$TPNAME1= <>
##$TPNAME2= <>
##$TPNAME3= <>
##$TPNAME4= <>
##$TPNAME5= <>
##$TPNAME6= <>
##$TPNAME7= <>
##$TPOAL= (0..7)
0.5 0.5 0.5 0.5 0.5 0.5 0.5 0.5 
##$TPOFFS= (0..7)
0 0 0 0 0 0 0 0 
##$TUNHIN= 0
##$TUNHOUT= 0
##$TUNXOUT= 0
##$USERA1= <user>
##$USERA2= <user>
##$USERA3= <user>
##$USERA4= <user>
##$USERA5= <user>
##$V9= 5
##$VALIST= <valist>
##$VCLIST= <CCCCCCCCCCCCCCC>
##$VD= 0
##$VDLIST= <DDDDDDDDDDDDDDD>
##$VPLIST= <PPPPPPPPPPPPPPP>
##$VTLIST= <TTTTTTTTTTTTTTT>
##$WBST= 1024
##$WBSW= 4
##$XGAIN= (0..3)
0 0 0 0 
##$XL= 0
##$YL= 0
##$YMAX_a= 2595
##$YMIN_a= -4875
##$ZGOPTNS= <>
##$ZL1= 120
##$ZL2= 120
##$ZL3= 120
##$ZL4= 120
##$ABSF1= 198.0616
##$ABSF2= -202.7028
##$ABSG= 5
##$ABSL= 3
##$ALPHA= 0
##$AQORDER= 0
##$ASSFAC= 0
##$ASSFACI= 0
##$ASSFACX= 0
##$ASSWID= 0
##$AUNMP= <proc_1d>
##$AZFE= 0.1
##$AZFW= 0.5
##$BCFW= 0
##$BC_mod= 2
##$BYTORDP= 0
##$COROFFS= 0
##$CY= -3
##$DATMOD= 1
##$DC= 0
##$DFILT= <>
##$DTYPP= 0
##$F1P= 0
##$F2P= 0
##$FCOR= 1
##$FTSIZE= 65536
##$FT_mod= 6
##$GAMMA= 0
##$GB= 0
##$INTBC= 1
##$INTSCL= 9.790993e-09
##$ISEN= 30
##$LB= 1.5
##$LEV0= 0
##$LPBIN= 0
##$MAXI= 10000
##$MC2= 0
##$MEAN= 0
##$ME_mod= 0
##$MI= 50
##$NCOEF= 0
##$NC_proc= -9
##$NLEV= 6
##$NOISF1= 182.463
##$NOISF2= 159.3651
##$NSP= 0
##$NTH_PI= 0
##$NZP= 0
##$OFFSET= 198.0616
##$PC= 4
##$PHC0= 2284.888
##$PHC1= 72.88829
##$PH_mod= 1
##$PKNL= yes
##$PPARMOD= 0
##$PSCAL= 0
##$PSIGN= 0
##$REVERSE= no
##$SF= 81.0140089999434
##$SI= 65536
##$SIGF1= 159.3651
##$SIGF2= -187.1042
##$SINO= 113.3802
##$SIOLD= 16384
##$SREGLST= <1H.CDCl3>
##$SSB= 0
##$STSI= 65536
##$STSR= 0
##$SW_p= 32467.5324675325
##$SYMM= 0
##$S_DEV= 0
##$TDeff= 32768
##$TDoff= 0
##$TI= <>
##$TILT= no
##$TM1= 0
##$TM2= 0
##$TOPLEV= 0
##$USERP1= <user>
##$USERP2= <user>
##$USERP3= <user>
##$USERP4= <user>
##$USERP5= <user>
##$WDW= 1
##$XDIM= 65536
##$YMAX_p= 504937387
##$YMIN_p= -281383820
$$ End of Bruker specific parameters
$$ ---------------------------------
##NTUPLES= NMR SPECTRUM
##VAR_NAME=  FREQUENCY,     SPECTRUM/REAL,   SPECTRUM/IMAG
##SYMBOL=    X,             R,               I
##VAR_TYPE=  INDEPENDENT,   DEPENDENT,       DEPENDENT
##VAR_FORM=  AFFN,          ASDF,            ASDF
##VAR_DIM=   65536,         65536,           65536
##UNITS=     HZ,            ARBITRARY UNITS, ARBITRARY UNITS
##FACTOR=    0.49542278885378, 1,            1
##FIRST=     16045.7642231865, 0,            0
##LAST=      -16421.768244346, 0,            0
##MIN=       -16421.768244346, -281383820,   0
##MAX=       16045.7642231865, 504937387,    0
$$ Real data points
##PAGE= N=1
##DATA TABLE= (X++(R..R)), XYDATA
$$ [...]
$$ plain form
38828 3437558 2081215 5373143 8624158 8732159 7216938 5299083 1376861 -4366756
38820 -4366756 -7671759 -5857630 -2179916 -1125783 -2359865 -2887497 -2569126 -3399338 -5039867
38811 -5039867 -5135297 -3218548 -873928 1162404 2797191 2479493 -874083 -4244365 -2850116
38802 -2850116 3299001 8744753 9500700 7500138 6795173 8166412 9493389 9544313 9265205
38793 9265205 10057158 12099677 14072246 14151434 11847454 8760784 6669926 5321690 3354138
38784 3354138 712694 -1605385 -3477374 -5088285 -5202666 -3010852 -1353485 -4310592
38776 -4310592 -10809579 -14420224 -11237401 -4682823 -338737 931227 1989067 4124676
38768 4124676 5984345 6224072 4366928 304992 -4359342 -5765367 -1647515 4848282
$$ packed form
38828C437558j356343L291928L251015J08001j515221j917855l922222n743617
38820d366756l305003J814129L677714J054133j234082n27632L18371q30212j640529
38811e039867r5430J916749K344620K036332J634787l17698l353576l370282J394249
38802b850116O149117N445752P55947k000562p04965J371239J326977N0924k79108
38793I265205P91953K042519J972569P9188k303980l086670k090858j348236j967552
38784C354138k641444k318079j871989j610911j14381K191814J657367k957107
38776d310592o498987l610645L182823O554578M344086J269964J057840K135609
38768D124676J859669K39727j857144m061936m664334j406025M117852O495797
$$ plain form
38760 4848282 7908359 5331755 -63065 -4527494 -6360445 -5522738 -3334371 -2596291
38752 -2596291 -5112040 -8478268 -7815753 -1630202 5935659 9573273 8109488 4786272
38744 4786272 3543233 5424842 7648588 6311055 1114352 -3302890 -2577894 1578819
38736 1578819 3411727 611298 -3507085 -5777968 -7358153 -10195092 -12573361 -11347322
38728 -11347322 -6854617 -2500747 -297708 395393 114885 -1831496 -5181484 -7665140
38720 -7665140 -7308721 -4656547 -1923775 -723171 -1061588 -1749178 -1384459 190244 903272
38711 903272 -2047089 -8627979 -14539179 -14857445 -9345968 -2899377 -91749 -426252 -120664
38702 -120664 2412930 4922603 5170771 4259401 4948224 8034338 11731502 13756370 12895671
$$ packed form
38760D848282L060077k576604n394820m464429j832951Q37707K188367P38080
38752b596291k515749l366228O62515O185551P565861L637614j463785l323216
38744D786272j243039J881609K223746j337533n196703m417242P24996M156713
38736A578819J832908k800429m118383k270883j580185k836939k378269J226039
38728a1347322M492705M353870K203039O93101k80508j946381l349988k483656
38720g665140L56419K652174K732772J200604l38417o87590L64719J574703P13028
38711I03272k950361o580890n911200l18266N511477O446591K807628l34503L05588
38702a20664K533594K509673K48168r11370O88823L086114L697164K024868q60699
$$ plain form
38693 12895671 9464324 5513716 3662649 4254179 4594362 2645820 292994 558352
38685 558352 2532691 2341995 -876208 -3589775 -3469844 -2763559 -3951298 -5245176 -3702837
38676 -3702837 -645819 76042 -1443564 -401438 6260716 15635193 22221723 23155045
38668 23155045 18975451 11815701 4940928 2098321 4350495 8147076 9120210 7559249
38660 7559249 7369076 9423245 9532933 4958523 -242562 -62731 4821819 7575810 4440675
38651 4440675 -764439 -2752949 -1532682 -503438 -931240 -1816555 -3179232 -5465791
38643 -5465791 -6652179 -4081608 603486 2096341 -1962631 -7971940 -11190500 -10974728
38635 -10974728 -9732271 -8933856 -8103666 -6426486 -3774739 -950459 278228 -1482714
$$ packed form
38693A2895671l431347l950608j851067N91530L40183j948542k352826K65358
38685E58352J974339j90696l218203k713567J19931P06285j187739j293878J542339
38676c702837L057018P21861j519606J042126O662154R374477O586530R33322
38668B3155045m179594p159750o874773k842607K252174L796581R73134j560961
38660G559249j90173K054169J09688m574410n201085J79831M884550K753991l135135
38651D440675n205114j988510J220267J029244m27802q85315j362677k286559
38643e465791j186388K570571M685094J492855m058972o009309l218560K15772
38635a0974728J242457P98415Q30190J677180K651747K824280J228687j760942
$$ plain form
38627 -1482714 -5189299 -7915339 -8045531 -6455545 -4132980 -768836 3294195 5981977
38619 5981977 6051595 4943153 4261133 3015078 -545602 -5569939 -9273891 -10255874 -9261906
38610 -9261906 -7322845 -5072099 -3546518 -3825007 -5789764 -8404884 -10972901 -13109322
38602 -13109322 -14049984 -13245381 -11286074 -9214340 -7352397 -5583710 -3955236 -2109591
38594 -2109591 709254 3802699 4382052 536958 -5876577 -10808832 -11718764 -8464754
38586 -8464754 -2007511 5516734 10468674 10321515 6753338 4033128 4152338 5279436
38578 5279436 4942059 2819835 238575 -1331536 -973088 1065048 3321419 4802001
38570 4802001 6284853 8610728 10483910 9868901 6813151 2624666 -2941415 -10687631
$$ packed form
38627a482714l706585k726040j30192J589986K322565L364144M063031K687782
38619E981977O9618j108442o82020j246055l560680n024337l703952r81983R93968
38610i261906J939061K250746J525581k78489j964757k615120k568017k136421
38602a3109322r40662Q04603J959307K071734J861943J768687J628474J845645
38594b109591K818845L093445N79353l845094o413535m932255r09932L254010
38586h464754O457243P524245M951940j47159l568177k720210J19210J127098
38578E279436l37377k122224k581260j570111L58448K038136K256371J480582
38570D802001J482852K325875J873182o15009l055750m188485n566081p746216
$$ plain form
38562 -10687631 -18458300 -22031437 -20099494 -15331516 -9994341 -4129918 839750 1051956
38554 1051956 -4324838 -9990615 -10852913 -9317165 -11860077 -19255382 -24895893 -23635119
38546 -23635119 -18210855 -14615947 -13940387 -12134482 -6876303 -1143076 1152446 555743
38538 555743 604174 1994737 1488937 -2493790 -6359888 -6176174 -3988241 -5364049 -11046837
38529 -11046837 -15358827 -14137142 -10328987 -9187593 -11093091 -12654170 -12800646 -13527817
38521 -13527817 -15136482 -14796165 -10688235 -4623512 488735 3378173 3728962 1358027
38513 1358027 -2383994 -4631844 -4402394 -4182042 -5950261 -7345649 -4806153 421195
38505 421195 3017387 665918 -3041092 -4040345 -2990494 -2870747 -4108813 -5209227 -6362009
$$ packed form
38562a0687631p770669l573137J931943M767978N337175N864423M969668K12206
38554A051956n376794n665777q62298J535748k542912p395305n640511J260774
38546b3635119N424264L594908O75560J805905N258179N733227K295522n96703
38538E55743M8431J390563n05800l982727l866098J83714K187933j375808n682788
38529a1046837m311990J221685L808155J141394j905498j561079j46476p27171
38521a3527817j608665L40317M107930O064723N112247K889438L50789k370935
38513A358027l742021k247850K29450K20352j768219j395388K539496N227348
38505D21195K596192k351469l707010r99253J049851J19747j238066j100414j152782
$$ plain form
38496 -6362009 -8634954 -10328745 -8208372 -2905276 527236 -1257211 -6200355 -10603945
38488 -10603945 -13460636 -15071663 -14461123 -11225457 -7886136 -7235542 -8672617 -9927461
38480 -9927461 -10879601 -12456436 -13139047 -10576430 -6270011 -4506878 -5975380 -6141955 -1391930
38471 -1391930 6125054 11387269 11977621 9152655 5368047 2454562 1128353 902151
38463 902151 744455 31670 -1567245 -4313996 -7230334 -7898654 -5558633 -3200893 -3735992
38454 -3735992 -5313071 -4317872 -2120285 -3597017 -8455127 -9976472 -4925236 596084
38446 596084 -887082 -8433421 -15209883 -17580730 -16837142 -14126144 -9053642 -2923200
38438 -2923200 1098415 1652434 239047 -1270628 -1691480 214581 4582273 8822414
$$ packed form
38496f362009k272945j693791K120373N303096L432512j784447m943144m403590
38488a0603945k856691j611027O10540L235666L339321O50594j437075j254844
38480i927461r52140j576835o82611K562617M306419J763133j468502j66575M750025
38471a391930P516984N262215N90352k824966l784608k913485j326209k26202
38463I02151j57696p12785j598915k746751k916338o68320K340021K357740n35099
38454c735992j577079R95199K197587j476732m858110j521345N051236N521320
38446E96084j483166p546339o776462k370847P43588K710998N072502O130442
38438b923200M021615N54019j413387j509675m20852J906061M367692M240141
$$ plain form
38430 8822414 9890471 8048353 5990063 4676856 2680214 -660763 -4240765 -7376415
38422 -7376415 -10332676 -12410962 -12000348 -9085354 -5752777 -3856355 -3796014 -5395091 -7916768
38413 -7916768 -9225789 -7085552 -1687488 4574740 9646496 12630232 12936278 10985565
38405 10985565 9265486 10013052 11862065 11318024 7618431 3522737 1069191 -681566
38397 -681566 -3034335 -5411792 -6799995 -7431091 -7974968 -8402776 -8088882 -5973674 -1304835
38388 -1304835 3951522 4798270 -1273466 -9080352 -10390069 -4332682 1255432 306576
38380 306576 -4222423 -6095578 -4424364 -2593668 -1847117 -863646 -143231 -1814181 -4943708
38371 -4943708 -5214645 -558940 5679496 8620186 7064937 3720791 1713677 2183046
$$ packed form
38430H822414J068057j842118k058290j313207j996642l340977l580002l135650
38422g376415k956261k078286M10614K914994L332577J896422O0341j599077k521677
38413g916768j309021K140237N398064O262228N071756K983736L06046j950713
38405A0985565j720079P47566J849013n44041l699593m095694k453546j750757
38397f81566k352769k377457j388203o31096n43877m27808L13894K115208M668839
38388a304835N256357Q46748o071736p806886j309717O057387N588114r48856
38380C06576m528999j873155J671214J830696P46551R83471P20415j670950l129527
38371d943708k70937M655705O238436K940690j555249l344146k007114M69369
$$ plain form
38363 2183046 4422416 6939744 8303243 7860206 6293120 5407681 6801701 10312917
38355 10312917 13968355 15732411 15010787 12380451 8855026 6062361 5867196 8404064
38347 8404064 11407133 12991298 13990715 15634419 16341384 13911046 10144720 9456820 12420679
38338 12420679 14313175 11286880 4890570 -808340 -3486192 -2560551 1497211 5457288
38330 5457288 4177940 -3488617 -11641502 -13319157 -8191300 -1681208 1999006 2911557
38322 2911557 2616041 1722318 497567 -254272 494410 3338835 7383984 9659501 7732136
38313 7732136 3741291 2777438 5332362 4974001 -2860305 -12826812 -15425629 -9125116
38305 -9125116 -1345347 2141074 3033741 4719872 6198472 4720286 783738 -2771759
$$ packed form
38363B183046K239370K517328J363499m43037j567086q85439J394020L511216
38355A0312917L655438J764056p21624k630336l525425k792665j95165K536868
38347H404064L003069J584165R99417J643704P06965k430338l766326o87900K963859
38338A2420679J892496l026295o396310n698910k677852R25641M057762L960077
38330E457288j279348p666557q152885j677655N127857O510092L680214R12551
38322B911557k95516q93723j224751p51839P48682K844425M045149K275517j927365
38313G732136l990845r63853K554924l58361p834306r966507k598817O300513
38305i125116P779769L486421Q92667J686131J478600j478186l936548l555497
$$ plain form
38297 -2771759 -4469993 -4334272 -2109436 1923093 5352135 5455997 2701654 806415
38289 806415 2842951 7792229 11034802 8346619 25510 -8859254 -12999804 -11660206
38281 -11660206 -8319097 -5996827 -4467575 -2233388 561131 2350666 2347596 1283007
38273 1283007 97705 -1262052 -3359475 -5823057 -7120659 -6478677 -5542550 -6656473
38265 -6656473 -9321152 -10133636 -7027464 -1778734 2805165 6105412 8357353 8352206 5365131
38256 5365131 1949569 1472098 3294868 3392720 -338729 -6081318 -11207699 -14529662 -15448271
38247 -15448271 -13993788 -12249810 -12702096 -14164333 -12122102 -4557415 4807216 10561573
38239 10561573 11148399 9079875 7233283 6369111 5419400 3244546 404922 -1072602
$$ packed form
38297b771759j698234J35721K224836M032529L429042J03862k754343j895239
38289H06415K036536M949278L242573k688183q321109q884764m140550J339598
38281a1660206L341109K322270J529252K234187K794519J789535l070j064589
38273A283007j185302j359757k097423k463582j297602O41982R36127j113923
38265f656473k664679q12484L106172N248730M583899L300247K251941n147k987075
38256E365131l415562m77471J822770R7852l731449n742589n126381l321963r18609
38247a5448271J454483J743978m52286j462237K042231P564687R364631N754357
38239A0561573N86826k068524j846592q64172r49711k174854k839624j477524
$$ plain form
38231 -1072602 -571572 -588624 -3681952 -8507409 -11312096 -10768326 -8563506 -5847987 -2600527
38222 -2600527 -240983 -688432 -2302085 -1133199 2648350 4154776 1450169 -925699
38214 -925699 948651 4077455 3239675 -1384470 -5466862 -6864378 -6577513 -5450924 -4052100
38205 -4052100 -4258533 -6927346 -9165541 -7724335 -4020247 -1995743 -2097788 -1595442 -231170
38196 -231170 -955537 -4632325 -8167013 -9021251 -8236254 -7694821 -7153348 -5437184 -2666166
38187 -2666166 -178208 616234 -836057 -3294814 -4420077 -3993199 -5111574 -9721388
38179 -9721388 -14475347 -14581915 -10828536 -8599565 -10146132 -12388270 -12956657 -13580752 -15714206
38170 -15714206 -17176753 -15798892 -12929121 -10496692 -7595191 -3144863 429185 -324915
$$ packed form
38231a072602N01030j7052l093328m825457k804687N43770K204820K715519L247460
38222b600527K359544m47449j613653J168886L781549J506426k704607k375868
38214i25699J874350L128804q37780m624145m082392j397516K86865J126589J398824
38205d052100k06433k668813k238195J441206L704088K024504j02045N02346J364272
38196b31170p24367l676788l534688q54238P84997N41433N41473J716164K771018
38187b666166K487958P94442j452291k458757j125263M26878j118375m609814
38179i721388m753959j06568L753379K228971j546567k242138n68387o24095k133454
38170a5714206j462547J377861K869771K432429K901501M450328L574048p54100
$$ plain form
38162 -324915 -4922332 -9277498 -10303114 -8180339 -5006367 -3040876 -3401780 -4949464
38154 -4949464 -5395474 -4509719 -4521224 -6196234 -7040514 -5461969 -4023395 -5358266 -7034176
38145 -7034176 -4643480 997636 4140412 1825188 -2587190 -4462458 -2964903 232561
38137 232561 3987577 7268371 8202564 6135575 3173645 1447891 107918 -2559218
38129 -2559218 -4988480 -3357339 2908934 9265296 10959624 8084464 4239129 1525750
38121 1525750 -1005784 -4405233 -7750570 -9844246 -11164008 -12619703 -13425894 -11977491
38113 -11977491 -8501954 -5186651 -3561830 -3175928 -3076299 -3080002 -2984945 -1980905 46149
38104 46149 1534461 700018 -2430367 -6107286 -8512399 -8943075 -8190547 -8235989 -10423969
$$ packed form
38162c24915m597417m355166j025616K122775L173972J965491l60904j547684
38154d949464m46010Q85755j1505j675010q44280J578545J438574j334871j675910
38145g034176K390696N641116L142776k315224m412378j875268J497555L197464
38137B32561L755016L280794R34193k066989k961930j725754j339973k667136
38129b559218k429262J631141O266273O356362J694328k875160l845335k713379
38121A525750k531534l399449l345337k093676j319762j455695q06191J448403
38113a1977491L475537L315303J624821L85902R9629l703R5057J004040K027054
38104D6149J488312q34443l130385l676919k405113m30676P52528m5442k187980
$$ plain form
38095 -10423969 -13080451 -12273641 -6474269 534128 3406339 1530539 -556689 754088
38087 754088 3889699 4961365 2994377 425221 -571503 48546 1976456 5771759 10961635
38078 10961635 14594750 14018256 10795875 9561552 12354514 16171889 17396504 16592432
38070 16592432 16632085 17577155 16661503 13085269 9419579 7414037 5537085 2333683 -470952
38061 -470952 -515214 1596737 3710978 5388529 6887276 6303141 1348853 -6224500 -11377466
38052 -11377466 -11515128 -8633880 -5189380 -1031570 4113358 8183727 9338842 8873153
38044 8873153 8709638 7412283 2115127 -5799639 -10466035 -8321541 -2628191 883897
38036 883897 1414133 3528270 10284920 18363156 21441690 17320579 10098618 5477903
$$ packed form
38095a0423969k656482Q06810N799372P008397K872211j875800k087228J310777
38087G54088L135611J071666j966988k569156r96724O20049J927910L795303N189876
38078A0961635L633115n76494l222381j234323K792962L817375J224615q04072
38070A6592432L9653R45070r15652l576234l665690k005542j876952l203402k804635
38061d70952m4262K111951K114241J677551J498747n84135m954288p573353n152966
38052a1377466j37662K881248L444500M157810N144928M070369J155115m65689
38044H873153j63515j297355n297156p914766m666396K144494N693350L512088
38036H83897N30236K114137O756650Q078236L078534m121111p221961m620715
$$ plain form
38028 5477903 5315813 7180482 7975370 6778297 4490912 1986260 -743578 -3873510
38020 -3873510 -6659115 -7493011 -5496174 -2050949 -26570 -944724 -3400387 -4934286
38012 -4934286 -4948079 -4714998 -4765615 -3832762 -1110494 1670640 1907203 -455951 -2746518
38003 -2746518 -3290720 -3849382 -6886008 -11197733 -12488426 -8866977 -3800498 -2047359
37995 -2047359 -4000447 -6128597 -6210912 -5507349 -5637067 -6041489 -5635697 -4743999 -3904318
37986 -3904318 -2626872 -1059003 -1142735 -3946696 -7177135 -7724061 -5654467 -3110329 -216001
37977 -216001 4543970 10007687 12276588 10262692 7843871 8113686 8277897 3799766 -3759410
37968 -3759410 -7188049 -2673361 4789572 7080582 2318665 -3743080 -4949407 -890549
$$ packed form
38028E477903j62090J864669P94888j197073k287385k504652k729838l129932
38020c873510k785605q33896J996837L445225K024379r18154k455663j533899
38012d934286j3793K33081n0617R32853K722268K781134K36563k363154k290567
38003b746518n44202n58662l036626m311725j290693L621449N066479J753139
37995b047359j953088k128150q2315P03563j29718m04422M05792Q91698Q39681
37986c904318J277446J567869q3732k803961l230439n46926K069594K544138K894328
37977b16001M759971N463717K268901k013896k418821K69815J64211m478131p559176
37968c759410l428639M514688P462933K291010m761917o061745j206327M058858
$$ plain form
37960 -890549 4487856 7874116 8466309 6700127 3980681 3248942 6649695 11709989 12620704
37951 12620704 7152757 129175 -2240316 322734 3212368 3806102 3764230 4836947
37943 4836947 5981318 5500041 3325066 181427 -3281753 -5693111 -5535244 -3511288
37935 -3511288 -2320489 -3220792 -4891832 -6372239 -8425679 -10799261 -11135809 -8672488
37927 -8672488 -6304603 -6345885 -6580215 -3616112 1733472 5895370 7954695 9747936 11163516
37918 11163516 9465052 3877024 -2581378 -6857557 -8728104 -9121153 -8456281 -7802107
37910 -7802107 -8848098 -11031497 -11137237 -7674603 -3385232 -1116312 635503 4942363
37902 4942363 10636687 13144973 11237847 9315628 11428357 15620264 16485902 11991848
$$ packed form
37960h90549N378405L386260N92193j766182k719446p31739L400753N060294R10715
37951A2620704n467947p023582k369491K563050K889634N93734m1872J072717
37943D836947J144371m81277k174975l143639l463180k411358J57867K023956
37935c511288J190799r00303j671040j480407k053440k373582l36548K463321
37927h672488K367885m1282k34330K964103N349584M161898K059325J793241J415580
37918A1163516j698464n588028o458402m276179j870547l93049O64872O54174
37910g802107j045991k183399j05740L462634M289371K268920J751815M306860
37902D942363N694324K508286j907126j922219K112729M191907Q65638m494054
$$ plain form
37894 11991848 5511763 1575622 1624361 4044043 6409623 6736344 3949627 -1167615
37886 -1167615 -5652656 -6353939 -2932267 1502756 3243494 1559713 -702080 -313088
37878 -313088 2458975 3683644 198833 -6207669 -10479768 -10315896 -8613215 -8897533 -10442700
37869 -10442700 -10198997 -8034094 -6843767 -7815149 -8884070 -8407620 -7250386 -6154711
37861 -6154711 -4053401 -714426 1564927 1041773 -768849 -1516346 -1158156 -665605 150050
37852 150050 1046131 -4476 -3274162 -4475766 359786 8403159 12861633 11880268 10024516
37843 10024516 10514159 10792346 7598524 2434887 -678232 -303841 1829203 3382951
37835 3382951 2793148 -44362 -2989998 -3400740 -1766464 -1342817 -3055633 -3751453 -1394261
$$ packed form
37894A1991848o480085l936141M8739K419682K365580L26721k786717n117242
37886a167615m485041p01283L421672M435023J740738j683781k261793L88992
37878c13088K772063J224669l484811o406502m272099J63872J702681k84318j545167
37869a0442700K43703K164903J190327r71382j068921M76450J157234J095675
37861f154711K101310L338975K279353n23154j810622p47497L58190M92551Q15655
37852A50050Q96081j050607l269686j201604M835552Q043373M458474r81365j855752
37843A0024516M89643K78187l193822n163637l113119L74391K133044J553748
37835C382951n89803k837510k945636m10742J634276M23647j712816o95820K357192
$$ plain form
37826 -1394261 1199045 751032 -1079064 -439463 2449609 3994600 3389396 3827588 7234230
37817 7234230 11496045 13964531 14650357 14544264 13355454 10808475 8440334 8103798 9475493
37808 9475493 10530088 10025625 8390161 6489143 4623450 2908523 1958657 2659619 5099516
37799 5099516 7859770 8883171 7493996 5300123 4509276 5328881 5497952 2654061 -2868641
37790 -2868641 -7727148 -8432012 -4882922 -638228 1003591 583872 805656 1755817 184742
37781 184742 -5635493 -12585028 -16066570 -15305092 -13270279 -12191909 -11371683 -9375083 -6466401
37772 -6466401 -4239496 -3851886 -5146387 -7112033 -9011251 -10992927 -13277294 -15131775
37764 -15131775 -15804666 -16195693 -17635361 -18809216 -16579556 -10943599 -6118895 -4526306
$$ packed form
37826a394261K593306m48013j830096O39601K889072J544991o05204M38192L406642
37817G234230M261815K468486O85826j06093j188810k546979k368141l36536J371695
37808I475493J054595n04463j635464j901018j865693j714927r49866P00962K439897
37799E099516K760254J023401j389175k193873p90847Q19605J69071k843891n522702
37790b868641m858507p04864L549090M244694J641819m19719K21784R50161j571075
37781A84742n820235o949535l481542P61478K034813J078370Q20226J996600K908682
37772f466401K226905L87610j294501j965646j899218j981676k284367j854481
37764a5131775o72891l91027j439668j173855K229660N635957M824704J592589
$$ plain form
37756 -4526306 -2736094 3192479 10806618 14175395 12397156 10270596 10624339 11040052
37748 11040052 9309391 7341204 7229829 7217505 4567248 -209403 -4858643 -8929765
37740 -8929765 -12812720 -14830733 -12495158 -6174747 885731 5912675 8173562 7908466
37732 7908466 5877064 3793611 3245444 3987100 4811475 6170788 10259674 17827285 26003416
37723 26003416 30203545 28040215 21209468 13883915 9424372 8314960 8734913 8603104
37715 8603104 6981432 4195315 1314794 -736882 -2078116 -3436353 -4445002 -3555101
37707 -3555101 -689374 1561954 1422875 1213267 4171668 8836035 10364230 7548283
37699 7548283 4347559 3375532 2256912 -1222042 -4411547 -3722364 -199407 2600288
$$ packed form
37756d526306J790212N928573P614139L368777j778239k126560L53743M15713
37748A1040052j730661j968187j11375j2324k650257m776651m649240m071122
37740h929765l882955k018013K335575O320411P060478N026944K260887k65096
37732G908466k031402k083453n48167P41656Q24375J359313M088886P567611Q176131
37723B6003416M200129k163330o830747p325553m459543j109412M19953j31809
37715H603104j621672k786117k880521k051676j341234j358237j008649Q89901
37707c555101K865727K251328j39079k09608K958401M664367J528195k815947
37699G548283l200724r72027j118620l478954l189505O89183L522957K799695
$$ plain form
37691 2600288 3906719 5035088 5545951 4535941 4196834 7171820 11060994 10669386 5888516
37682 5888516 2163154 2066854 1637501 -2641993 -8024511 -10160080 -9821589 -10704620 -12999019
37673 -12999019 -13730214 -12228446 -10631234 -9073440 -5000524 1370766 4940960 1972137
37665 1972137 -4023095 -6169757 -3175331 -846420 -4016397 -10141323 -13102031 -11230993
37657 -11230993 -8297187 -7108257 -5783579 -1643232 4002719 7208900 6061098 2089167
37649 2089167 -1729285 -2593357 958349 7067815 10921372 9898247 7474303 8798274
37641 8798274 13069500 14449024 10908026 7500726 8896045 12984913 15241556 15931737
37633 15931737 18418378 22298454 23334753 20037070 15734487 13194344 11175536 8035463
$$ packed form
37691B600288J306431J128369N10863j010010l39107K974986L889174l91608m780870
37682E888516l725362r6300m29353m279494n382518k135569L38491q83031k294399
37673a2999019p31195J501768J597212J557794M072916O371290L570194k968823
37665A972137n995232k146662K994426K328911l169977o124926k960708J871038
37657a1230993K933806J188930J324678M140347N645951L206181j147802l971931
37649B089167l818452q64072L551706O109466L853557j023125k423944J323971
37641H798274M271226J379524l540998l407300J395319M088868K256643O90181
37633A5931737K486641L880076J036299l297683m302583k540143k018808l140073
$$ plain form
37625 8035463 5270315 4822014 5337152 4146757 1443429 -599964 -1890336 -4079913
37617 -4079913 -6208050 -4509612 1902675 8332789 10024750 8137611 7097515 7590041
37609 7590041 6262951 2300227 -103087 2329634 6916019 8773034 7564218 7359991
37601 7359991 10646198 15328454 17665535 16029915 11661769 7439084 5957978 7319545
37593 7319545 8821918 8049225 5778738 4419586 4453172 4484604 4068736 3849646 3218908
37584 3218908 870049 -1948497 -1762735 2501676 7715272 10396227 10037434 7738481
37576 7738481 4279692 950708 -364563 293598 653586 -53836 197092 1902919 1687869
37567 1687869 -2635724 -7453853 -7650391 -3535237 575178 3088164 5808853 8676399
$$ packed form
37625H035463k765148m48301N15138j190395k703328k043393j290372k189577
37617d079913k128137J698438O412287O430114J691961j887139j040096M92526
37609G590041j327090l962724k403314K432721M586385J857015j208816k04227
37601G359991L286207M682256K337081j635620m368146m222685j481106J361567
37593G319545J502373p72693k270487j359152L3586L1432m15868k19090o30738
37584C218908k348859k818546J85762M264411N213596K680955l58793k298953
37576G738481l458789l328984j315271O58161L59988p07422K50928J705827k15050
37567A687869m323593m818129j96538M115154M110415K512986K720689K867546
$$ plain form
37559 8676399 8896921 5956364 3090352 2539168 3127349 3826934 5859696 9332033 11276303
37550 11276303 9518472 5748225 2430359 -617423 -4010802 -5936814 -4830318 -2785536
37542 -2785536 -2615267 -3024569 -692527 3705411 5872954 4401995 2626173 2869479 2890077
37533 2890077 315071 -2653575 -2176260 1438718 4101211 3302389 288365 -2834847
37525 -2834847 -5342135 -6667239 -5437227 -1340093 3286333 5374684 4455685 3102839
37517 3102839 3981657 7016099 9716881 10117325 8989066 8711128 10027110 10857918 8985184
37508 8985184 5035388 1512433 -601982 -2482041 -4607368 -5380704 -3702059 -1319624
37500 -1319624 -924715 -2667588 -4108527 -3315460 -814734 1254140 942386 -2032557 -5451430
$$ packed form
37559H676399K20522k940557k866012n51184N88181O99585K032762L472337J944270
37550A1276303j757831l770247l317866l047782l393379j926012J106496K044782
37542b785536J70269m09302K332042M397938K167543j470959j775822K43306K0598
37533B890077k575006k968646M77315L614978K662493p98822l014024l123212
37525b834847k507288j325104J230012M097134M626426K088351r18999j352846
37517C102839Q78818L034442K700782M00444j128259k77938J315982Q30808j872734
37508H985184l949796l522955k114415j880059k125327p73336J678645K382435
37500a319624L94909j742873j440939P93067K500726K068874l11754k974943l418873
$$ plain form
37491 -5451430 -5781135 -1668596 3967239 6708671 5369409 2696755 1697345 2826760
37483 2826760 4593959 5134109 3157147 -771282 -3705642 -3027296 91508 2084129
37475 2084129 2059830 2622783 4773358 5428728 2295690 -1766980 -2611238 -1052276 -1406249
37466 -1406249 -4687366 -7294380 -6755489 -5042973 -4802146 -5246430 -3926598 -787233 1741875
37457 1741875 1969776 560518 -827349 -1196761 -386422 1405758 3650080 5314092 5335967
37448 5335967 3652292 1392325 -557189 -2800431 -6127932 -9157217 -9102014 -5572547
37440 -5572547 -1817901 -925549 -2332045 -3552015 -3660829 -3031237 -1264832 1764578 3831411
37431 3831411 2641855 28375 496166 4913543 8687355 7490629 2317800 -2614860
$$ packed form
37491e451430l29705M112539N635835K741432j339262k672654r99410J129415
37483B826760J767199N40150j976962l928429k934360O78346L118804J992621
37475B084129k4299N62953K150575O55370l133038m062670q44258J558962l53973
37466a406249l281117k607014N38891J712516K40827m44284J319832L139365K529108
37457A741875K27901j409258j387867l69412Q10339J792180K244322J664012K1875
37448E335967j683675k259967j949514k243242l327501l029285N5203L529467
37440e572547L754646Q92352j406496j219970j08814O29592J766405L029410K066833
37431C831411j189556k613480M67791M417377L773812j196726n172829m932660
$$ plain form
37423 -2614860 -4822436 -4687115 -3429089 -1999580 -1151081 -1047057 -1182848 -1417665 -2303020
37414 -2303020 -3845434 -5041153 -5242525 -4779818 -3717023 -1610940 675899 838451 -1682209
37405 -1682209 -3967475 -2995054 337515 2539155 2130560 807297 230158 -177680 -1560869
37396 -1560869 -3226875 -3051094 15710 4462594 7443796 7508432 5937295 5142673 6112068
37387 6112068 8012783 9767013 10794717 10486133 8575876 6184032 4769971 3736753
37379 3736753 1063958 -3029169 -5355221 -4027363 -1274698 -94883 -43327 1132505
37371 1132505 3067038 2963033 -238299 -4566502 -7932107 -9907451 -10349476 -8738228
37363 -8738228 -5841158 -3985668 -4211576 -4477748 -2271185 1736060 4288038 3810853 2589244
$$ packed form
37423b614860k207576J35321J258026J429509Q48499J04024j35791k34817q85355
37414b303020j542414j195719k01372M62707J062795K106083K286839J62552k520660
37405a682209k285266R72421L332569K201640m08595j323263n77139m07838j383189
37396a560869j666006J75781L066804M446884K981202O4636j571137p94622R69395
37387F112068J900715J754230J027704l08584j910257k391844j414061j033218
37379C736753k672795m093127k326052J327858K752665J179815N1556J175832
37371A132505J934533j04005l201332m328203l365605j975344m42025J611248
37363h738228K897070J855490k25908k66172K206563M007245K551978m77185j221609
$$ plain form
37354 2589244 3850625 7628192 11002098 12214497 12416672 12327440 9552512 2140249 -6411681
37345 -6411681 -9695183 -6518804 -2759616 -3533826 -7134224 -9387538 -10655055 -14256124
37337 -14256124 -19658995 -21868817 -17752951 -9569971 -1783689 2890572 4038355 3015899
37329 3015899 2582782 4641656 7515964 7533494 4051217 903104 1912903 6612583 11296116
37320 11296116 12898837 10989179 7127627 3222142 100217 -2491575 -4332495 -4215454
37312 -4215454 -2034286 -32772 -92740 -964463 -492280 684351 651274 266374 1775664
37303 1775664 3935041 3150613 -57677 -676275 3188080 7198898 7819280 7766236 10736675
37294 10736675 14620967 14676154 10927032 7640745 6853904 6741189 5521703 3049024 -740011
$$ packed form
37354B589244J261381L777567L373906J212399K02175q9232k774928p412263q551930
37345f411681l283502L176379L759188p74210l600398k253314j267517l601069
37337a4256124n402871k209822M115866Q182980P786282M674261J147783j022456
37329C015899m33117K058874K874308J7530l482277l148113J009799M699680M683533
37320A1296116J602721j909658l861552l905485l121925k591792j840920J17041
37312d215454K181168K001514n9968q71723M72183J176631l3077l84900J509290
37303A775664K159377p84428l208290o18598L864355M010818O20382n3044K970439
37294A0736675L884292N5187l749122l286287p86841j12715j219486k472679l789035
$$ plain form
37285 -740011 -5092843 -6793828 -3377632 2136090 3918572 1205404 -628447 2086599
37277 2086599 6445296 7853976 6244654 4683761 4301332 3693535 2155177 852867
37269 852867 1061255 2881938 5421820 7119817 6425790 3256755 -607723 -3441990 -5474482
37260 -5474482 -8086688 -11417115 -13500594 -11969327 -6670566 -687538 1901948 92502
37252 92502 -2889553 -3720224 -3384321 -5264059 -9273708 -11058528 -8014546 -3159357 -996787
37243 -996787 -1786458 -2453534 -1592180 -630890 -703245 -1177811 -1339116 -1139607 -12307 2738498
37233 2738498 5626938 5209067 77897 -6577803 -9793103 -7710066 -2920757 340283
37225 340283 -439367 -4702153 -9579663 -11987315 -10728362 -6859714 -2214975 1732412
$$ packed form
37285g40011m352832j700985L416196N513722J782482k713168j833851K715046
37277B086599M358697J408680j609322j560893l82429o07797j538358j302310
37269H52867K08388J820683K539882J697997o94027l169035l864478k834267k032492
37260e474482k612206l330427k083479J531267N298761N983028K589486j809446
37252I2502k982055q30671L35903j879738m009649j784820L043982M855189K162570
37243i96787p89671o67076Q61354R61290p2355m74566j61305J99509J127300K750805
37233B738498K888440m17871n131170o655700l215300K083037M789309L261040
37225C40283p79650m262786m877510k407652J258953L868648M644739L947387
$$ plain form
37217 1732412 3432017 1139742 -5181973 -12213550 -15278761 -12709754 -7352417 -3247262
37209 -3247262 -1758296 -1670817 -1969539 -2923439 -4705253 -6580117 -7842801 -8265750 -7183536
37200 -7183536 -3687531 1213630 4115592 2787223 -508734 -1349275 1336193 4216888
37192 4216888 4307216 2402900 683161 -889266 -3697025 -7327584 -9644780 -9591747 -8021577
37183 -8021577 -5990948 -4058754 -3149053 -4156934 -6471100 -8653357 -10727339 -13702381
37175 -13702381 -16455912 -15749413 -10764077 -5295717 -3364094 -4477850 -5709332 -6858505
37167 -6858505 -10163690 -15280792 -18138745 -15928806 -10742249 -6775667 -5632948 -5873275
37159 -5873275 -5977880 -6089994 -7022642 -8482412 -8625728 -5871776 -1643836 -154060 -3638396
$$ packed form
37217A732412J699605k292275o321715p031577l065211K569007N357337M105155
37209c247262J488966Q7479k98722r53900j781814j874864j262684m22949J082214
37200g183536L496005M901161K901962j328369l295957q40541K685468K880695
37192D216888R0328j904316j719739j572427k807759l630559k317196N3033J570170
37183h021577K030629J932194R09701j007881k314166k182257k073982k975042
37175a3702381k753531P06499M985336N468360J931623j113756j231482j149173
37167f858505l305185n117102k857953K209939N186557L966582J142719k40327
37159e873275j04605j12114r32648j459770j43316K753952M227940J489776l484336
$$ plain form
37150 -3638396 -8571119 -9302500 -5340847 -1732557 -1586446 -2193733 -599346 1011750 -756684
37141 -756684 -4181105 -4752640 -2236620 -416440 -318561 1161999 5210405 8601582 9037779
37132 9037779 8654084 9667830 10296947 8361406 6026655 6811704 9268473 7795841 72049
37123 72049 -9258450 -13342500 -10137503 -4162043 -2066272 -6500783 -13710042 -17208262
37115 -17208262 -13977457 -6614090 185332 3598414 3143644 -228646 -4116795 -5738173
37107 -5738173 -4751276 -3567036 -3599469 -3268616 -1442891 -405345 -2601505 -6283660 -7579212
37098 -7579212 -5655390 -2742544 -296300 1347368 664837 -3299481 -7105752 -5650880
37090 -5650880 262967 3630148 491097 -4612514 -5331911 -2275511 -1248264 -4753149
$$ packed form
37150c638396m932723p31381L961653L608290J46111o07287J594387J611096j768434
37141g56684l424421n71535K516020J820180R7879J480560M048406L391177M36197
37132I037779l83695J013746O29117j935541k334751P85049K456769j472632p723792
37123G2049r330499m084050L204997N975460K095771m434511p209259l498220
37115a7208262L230805P363367O799422L413082m54770l372290l888149j621378
37107e738173R86897J184240l2433L30853J825725J037546k196160l682155j295552
37098g579212J923822K912846K446244J643668o82531l964318l806271J454872
37090e650880N913847L367181l139051n103611p19397L056400J027247l504885
$$ plain form
37082 -4753149 -9352530 -11014890 -9496005 -6769525 -3919025 -1172213 504706 -182447
37074 -182447 -2746718 -4465999 -3041503 565183 3145160 3331885 3090803 4070238 4234665
37065 4234665 372901 -7062666 -14187518 -18176180 -18823257 -16222379 -10529421 -4446842
37057 -4446842 -2057796 -3594520 -4615218 -2277334 624903 157338 -3157778 -6171577
37049 -6171577 -8108042 -10230164 -11973115 -10933429 -6305727 302025 7012343 12339168
37041 12339168 14440359 12369076 7977453 4430585 2856238 2105350 1319313 833925
37033 833925 906683 1356736 2176035 2983259 2477429 57172 -2652165 -3417173 -1752329
37024 -1752329 1643778 6301365 10952672 12802889 10392664 5895416 2110707 -1154714
$$ packed form
37082d753149m599381j662360J518885K726480K850500K746812J676919o87153
37074a82447k564271j719281J424496L606686K579977J86725k41082R79435J64427
37065D234665l861764p435567p124852l988662o47077K600878N692958O082579
37057d446842K389046j536724j020698K337884K902237m67565l315116l013799
37049f171577j936465k122122j742951J039686M627702O607752O710318N326825
37041A2339168K101191k071283m391623l546868j574347p50888p86037m85388
37033H33925P2758M50053Q19299Q07224n05830k420257k709337p65008J664844
37024a752329L396107M657587M651307J850217k410225m497248l784709l265421
$$ plain form
37016 -1154714 -4786395 -6525153 -3664774 1581289 4015980 2429673 266936 -394268
37008 -394268 -771221 -1205284 -303952 881378 -896014 -5182473 -7420956 -6266541 -5702430
36999 -5702430 -7318391 -6650566 -1436407 2255183 -1835330 -9954152 -12876939 -8300292
36991 -8300292 -2419598 -490354 -1845725 -3944556 -5836136 -7031198 -7292001 -8009082
36983 -8009082 -10205689 -11507149 -9071195 -5076863 -4674002 -8257320 -10433775 -7520948
36975 -7520948 -1800031 2702546 4540983 3823242 1025975 -1620458 -1434614 397282
36967 397282 -416653 -4521175 -6936527 -4028783 1397141 4535701 4433299 2562415 -721749
36958 -721749 -4656253 -6129446 -3388272 451569 1302965 -466504 -2020962 -3172264
$$ packed form
37016a154714l631681j738758K860379N246063K434691j586307k162737o61204
37008c94268l76953m34063R01332J185330j777392m286459k238483J154415N64111
36999e702430j615961O67825N214159L691590m090513q118822k922787M576647
36991h300292N880694J929244j355371k098831j891580j195062k60803p17081
36983h009082k196607j301460K435954L994332M02861l583318k176455K912827
36975g520948N720917M502577J838437p17741k797267k646433J85844J831896
36967C97282q13935m104522k415352K907744N425924L138560j02402j870884l284164
36958g21749l934504j473193K741174L839841Q51396j769469j554458j151302
$$ plain form
36950 -3172264 -5320648 -7216409 -6591323 -4939799 -5735222 -8218500 -7902915 -3662849 514644
36941 514644 2013585 3241454 6766890 10738765 11913248 10418235 8716723 7818168
36933 7818168 7049420 6123738 5200520 4018306 2850270 3193577 5691352 8499444 9668542
36924 9668542 10060109 11509732 12802654 10542608 4686265 427601 2434656 8515559
36916 8515559 11475028 7292021 -725681 -6735870 -9049590 -9813166 -9602246 -6153241
36908 -6153241 931245 7891738 11418940 12752531 14305274 14605328 10631455 3995082
36900 3995082 244340 1670701 4816737 6109574 6198452 7037326 8089058 7881011 6865377
36891 6865377 6290669 6073095 5903887 6680758 8680684 9964176 8839975 6481587 4934432
$$ packed form
36950c172264k148384j895761O25086J651524p95423k483278L15585M240066M177493
36941E14644J498941J227869L525436L971875J174483j495013j701512q98555
36933G818168p68748r25682r23218j182214j168036L43307K497775K808092J169098
36924I668542L91567J449623J292922k260046n856343m258664K007055O080903
36916H515559K959469m183007q017702o010189k313720p63576K10920L449005
36908f153241P084486O960493L527202J333591J552743L00054l973873o636373
36900C995082l750742J426361L146036J292837Q8878Q38874J051732k08047j015634
36891F865377n74708k17574j69208P76871J999926J283492j124201k358388j547155
$$ plain form
36882 4934432 4042183 2806472 2488299 5656220 12961623 23159131 35091260 46800347
36874 46800347 53877122 52612178 45036793 37448686 33211069 30031270 25213724 20238491
36866 20238491 18063533 18363419 18115326 15787447 12730343 10871030 10755192 11798214
36858 11798214 13159080 14035999 13734691 11927571 9170004 7244684 8064978 11065635
36850 11065635 12349585 8455831 1227895 -3162542 -1073204 4439235 7686067 7117373
36842 7117373 6153952 8172410 12884663 17637850 20125661 18999316 13628761 5146243
36834 5146243 -2734305 -5792665 -3005372 2518268 6777790 8345350 8132161 7016269
36826 7016269 5397513 4510792 5868493 8905413 11211968 11968540 13024486 15108853
$$ packed form
36882D934432q92249j235711l18173L167921P305403J0197508J1932129J1709087
36874D6800347P076775j264944p575385p588107m237617l179799m817546m975233
36866B0238491k174958K99886k48093k327879l057104j859313j15838J043022
36858A1798214J360866Q76919l01308j807120k757567j925320Q20294L000657
36850A1065635J283950l893754p227936m390437K089338N512439L246832n68694
36842G117373r63421K018458M712253M753187K487811j126345n370555q482518
36834E146243p880548l058360K787293N523640M259522J567560k13189j115892
36826G016269j618756q86721J357701L036920K306555P56572J055946K084367
$$ plain form
36818 15108853 15122021 9707868 410289 -7174364 -8924685 -5121662 1094761 5993120
36810 5993120 7079382 5429856 5514079 9894892 14912689 14938301 10074964 5384985 2840712
36801 2840712 -512175 -5367419 -7275164 -4105398 -948175 -2769377 -6292645 -4894085
36793 -4894085 1118573 5187779 4081046 768830 -1847993 -3931769 -4600969 -899508
36785 -899508 6596862 11996655 11283327 7837203 7449882 10579496 13068268 12504697 10055780
36776 10055780 6905476 2513355 -3235166 -8621620 -11460769 -10610829 -6415497 -1116258
36768 -1116258 1745176 406327 -2590643 -2876298 412543 3636857 3660132 1952092 2190236
36759 2190236 4983858 7065981 5778085 2584646 1067104 2317418 3856646 3308896
$$ packed form
36818A5108853J3168n414153r297579p584653j750321L803023O216423M898359
36810E993120J086262j649526Q4223M380813N017797K5612m863337m689979k544273
36801B840712l352887m855244j907745L169766L157223j821202l523268J398560
36793d894085O012658M069206j106733l312216k616823k083776o69200L701461
36785h99508P496370N399793p13328l446124l87321L129614K488772n63571k448917
36776A0055780l150304m392121n748521n386454k839149Q49940M195332N299239
36768a116258K861434j338849k996970k85655L288841L224314K3275j708040K38144
36759B190236K793622K082123j287896l193439j517542J250314J539228n47750
$$ plain form
36751 3308896 1698165 1834045 4074211 5469897 3570255 -409028 -3285182 -3670122
36743 -3670122 -2457669 -156965 4037060 9749554 13759566 12670431 6927863 682603
36735 682603 -2656144 -3658580 -5178285 -8395415 -11553591 -12294130 -10309384 -7591440
36727 -7591440 -6568651 -7899300 -9617254 -8835333 -5172664 -2087024 -3252390 -7407420
36719 -7407420 -8687553 -3291711 5564859 11004112 9934296 5355674 1807681 804991
36711 804991 1133491 1436000 1061134 -425572 -2904768 -5063063 -5193654 -2871815 577627
36702 577627 3334897 4666587 5399313 6886041 9296294 11028458 10261148 7068216 3501904
36693 3501904 1599465 1811851 3197541 4358106 4374778 4003060 5941525 12318364 21408663
$$ packed form
36751C308896j610731J35880K240166J395686j899642l979283k876154l84940
36743c670122J212453K300704M194025N712494M010012j089135n742568o245260
36735F82603l338747j002436j519705l217130l158176p40539J984746K717944
36727g591440J022789j330649j717954P81921L662669L085640j165366m155030
36719g407420j280133N395842Q856570N439253j069816m578622l547993j002690
36711H04991L28500L02509l74866j486706k479196k158295j30591K321839L449442
36702E77627K757270J331690P32726J486728K410253J732164p67310l192932l566312
36693C501904j902439K12386J385690J160565J6672l71718J938465O376839R090299
$$ plain form
36684 21408663 28683802 32368604 36263077 45113206 58533386 72138433 83870672 95619832
36676 95619832 107865137 116342067 116531843 109202549 98630923 86881347 73257399 58746593
36668 58746593 46931043 39342672 33197123 25762959 18559922 14856424 14867202 16157994
36660 16157994 17516602 19326533 20615989 19008534 14167806 8665860 4564273 1345175
36652 1345175 -1831317 -3969189 -3674992 -1129078 2559098 6464836 9281432 9358408 6710734
36643 6710734 3615201 1989053 1606597 1885190 3280728 5266034 5307594 2449929 4508
36634 4508 1531214 5443004 6923839 4317366 146419 -3457754 -6156538 -6232909 -875623
36625 -875623 8577078 15719544 16176516 12781290 10895088 11003862 9285372 3970791 -2480545
$$ packed form
36684B1408663P275139L684802L894473Q850129J3420180J3605047J1732239J1749160
36676I5619832J2245305Q476930J89776p329294j0571626j1749576j3623948j4510806
36668E8746593j1815550p588371o145549p434164p203037l703498J0778J290792
36660A6157994J358608J809931J289456j607455m840728n501946m101587l219098
36652A345175l176492k137872K94197K545914L688176L905738K816596P6976k647674
36643F710734l095533j626148l82456K78593J395538J985306M1560k857665k445421
36634D508J526706L911790J480835k606473m170947l604173k698784p6371N357286
36625h75623R452701P142466M56972l395226j886202J08774j718490n314581o451336
$$ plain form
36616 -2480545 -7226756 -9892937 -11042637 -10323739 -7428156 -3545221 -534588 1118987
36608 1118987 2900463 6578066 11742177 15192925 13623915 7397138 960642 -1179985
36600 -1179985 1507436 5998023 9387326 11260766 12825173 14760879 16282286 16099043
36592 16099043 14228889 12662978 13696766 17448466 21481809 23041128 21341220 17801507
36584 17801507 14590714 12790616 11406962 8559978 4360461 1766544 3140077 6699593
36576 6699593 8497456 7547583 6385276 6447704 6121181 4510634 3874116 5978646 8560930
36567 8560930 8303777 5626228 3551093 3047654 2615175 1694668 1087750 79141 -3241580
36558 -3241580 -7748990 -8586822 -2951398 5229462 8771421 4867453 -2386999 -6830869
$$ packed form
36616b480545m746211k666181j149700P18898K895583L882935L010633J653575
36608A118987J781476L677603N164111L450748j569010o226777o436496k140627
36600a179985K687421M490587L389303J873440J564407J935706J521407j83243
36592A6099043j870154j565911J033788L751700M033343J559319j699908l539713
36584A7801507l210793j800098j383654k846984m199517k593917J373533L559516
36576F699593J797863r49873j162307O2428l26523j610547o36518K104530K582284
36567H560930k57153k677549k075135n03439m32479r20507o06918j008609l320721
36558c241580m507410q37832N635424Q180860L541959l903968p254452m443870
$$ plain form
36550 -6830869 -6097853 -2444675 821695 2446921 3034170 3289396 3643949 5036288 8342524
36541 8342524 12433983 14121612 11314249 5832414 2058831 2693905 6218336 8456332
36533 8456332 6524294 1507725 -2795811 -4049051 -3643432 -3920070 -4262025 -2290565 1425005
36524 1425005 3118767 1280746 -869173 -388517 886730 -95721 -1941437 -810008
36516 -810008 3038907 5200401 4003943 3229569 6143655 10020537 9425232 3440968 -3088346
36507 -3088346 -5361973 -3621021 -1632955 -1439325 -1187386 1505105 5428752 6754224
36499 6754224 3950800 -180003 -2013754 -906752 1428334 3453703 4193690 2835578
36491 2835578 55685 -1390868 471569 4095465 6267204 5823538 3809719 1164269
$$ packed form
36550f830869P33016L653178L266370J625226N87249K55226L54553J392339L306236
36541H342524M091459J687629k807363n481835l773583O35074L524431K237996
36533H456332j932038n016569m303536j253240M05619k76638l41955J971460L715570
36524A425005J693762j838021k149919M80656J275247r82451j845716J131429
36516h10008L848915K161494j196458p74374K914086L876882n95305n984264o529314
36507c088346k273627J740952J988066J93630K51939K692491L923647J325472
36499F754224k803424m130803j833751J107002K335086K025369P39987j358112
36491B835578k779893j446553J862437L623896K171739m43666k013819k645450
$$ plain form
36483 1164269 -1536055 -3045838 -2653434 -1785778 -2134298 -2891186 -2161217 -238244 1111829
36474 1111829 1682709 2178166 1494151 -1722233 -5256817 -5116694 -1452644 1253642 695280
36465 695280 -501320 210782 1507305 1604796 2109242 5537792 10978648 14714384 14137171
36456 14137171 9752604 4622072 2541149 4869874 8379733 8259103 3827447 -1073446
36448 -1073446 -3622402 -4617363 -4723054 -2189568 3481098 9043285 11341730 10784044 8572779
36439 8572779 3766508 -3683793 -10045421 -12056881 -11963276 -14106551 -17985384 -19104380
36431 -19104380 -16064127 -12429261 -11140620 -10758252 -8320594 -3217712 2934176 8299475
36423 8299475 11530239 11590976 7885937 786916 -7388501 -12127091 -9635371 -1460417
$$ packed form
36483A164269k700324j509783L92404Q67656l48520p56888P29969J922973J350073
36474A111829N70880M95457o84015l216384l534584J40123L664050K706286n58362
36465F95280j196600P12102J296523R7491N04446L428550N440856L735736n77213
36456A4137171m384567n130532k080923K328725L509859j20630m431656m900893
36448a073446k548956r94961j05691K533486N670666N562187K298445n57686k211265
36439H572779m806271p450301o361628k011460R3605k143275l878833j118996
36431a9104380L040253L634866J288641L82368K437658N102882O151888N365299
36423H299475L230764O0737l705039p099021q175417m738590K491720Q174954
$$ plain form
36415 -1460417 5538518 5839122 876416 -3371504 -2897274 1785195 7607061 11142531
36407 11142531 10457072 7235031 5753585 7567469 8994190 6412464 1891048 64554
36399 64554 1212191 1671496 123538 -1110164 -965029 -1320510 -2914571 -3517136 -1744948
36390 -1744948 324594 82606 -2077103 -3385349 -1447844 4018968 10649554 14650266
36382 14650266 14295755 12011286 11388659 13102792 15898328 19909834 25362446 29077082
36374 29077082 26951970 20303640 15452982 16000679 19290948 21468051 21959356 21441928
36366 21441928 19477153 16600584 15486063 17401944 19939704 20423189 19309852 18311299
36358 18311299 17419358 15677067 12868137 9036771 4674655 2492740 5806661 13393008
$$ packed form
36415a460417O998935L00604m962706m247920M74230M682469N821866L535470
36407A1142531o85459l222041j481446J813884J426721k581726m521416j826494
36399F4554J147637M59305j547958j233702J45135l55481j594061o02565J772188
36390a744948K069542k41988k159709j308246J937505N466812O630586M000712
36382A4650266l54511k284469o22627J714133K795536M011506N452612L714636
36374B9077082k125112o648330m850658N47697L290269K177103M91305n17428
36366B1441928j964775k876569j114521J915881K537760M83485j113337r98553
36358A8311299q91941j742291k808930l831366m362116k181915L313921P586347
$$ plain form
36350 13393008 19339982 20363350 19832404 21586388 23403487 20985450 15770382 13429790
36342 13429790 15421032 17184278 15615141 14281909 19115253 30923840 43968494 51371234
36334 51371234 51173825 47340791 45423175 48106930 55370925 66911622 81385723 94275797
36326 94275797 101224941 104729934 113216432 131340600 155306080 180345099 208114483
36319 208114483 242596535 283156580 327254440 376129251 429977008 478612868 504937387
36312 504937387 499791583 468663780 423275454 372280519 321360020 275519611 236660661
36305 236660661 202432091 171194702 145543263 127965610 115743161 103721936 90498203
36298 90498203 78625932 69761079 62660343 55649143 48403838 40875220 32396038 22987999
$$ packed form
36350A3393008N946974J023368n30946J753984J817099k418037n215068k340592
36342A3429790J991242J763246j569137j333232M833344J1808587J3044654P402740
36334E1371234j97409l833034j917616K683755P263995J1540697J4474101J2890074
36326I4275797O949144L504993Q486498J8124168K3965480K5039019K7769384
36319B08114483L4482052M0560045M4097860M8874811N3847757M8635860K6324519
36312E04937387n145804l1127803m5388326n0994935n0920499m5840409l8858950
36305B36660661l4228570l1237389k5651439j7577653j2222449j2021225j3223733
36298I0498203j1872271q864853p100736p011200p245305p528618q479182r408039
$$ plain form
36290 22987999 14990606 12266138 16619247 24606806 29321307 26962217 20717067 16239456
36282 16239456 14534549 12379729 8947519 7578403 10014540 13032417 12962066 10310158
36274 10310158 7643813 5976887 5869430 9033849 15344351 20526396 20601576 17120895
36266 17120895 14427502 13258825 11268296 8947768 9967755 14747421 18122035 15691492
36258 15691492 9649202 5900536 6998470 9904178 9936568 5642560 149049 -1857458
36250 -1857458 1036361 5453312 7480274 7462518 8408169 10411583 10149712 6529476 3158774
36241 3158774 3223352 4892532 4400575 1280156 -2408195 -5947591 -9462537 -10991343 -8287957
36232 -8287957 -3345729 -1096146 -3031065 -5847617 -7249497 -8837265 -11255422 -10896537
$$ packed form
36290B2987999p997393k724468M353109P987559M714501k359090o245150m477611
36282A6239456j704907k154820l432210j369116K436137L017877p0351k651908
36274A0310158k666345j666926j07457L164419O310502N182045P5180l480681
36266A7120895k693393j168677j990529k320528J019987M779666L374614k430543
36258A5691492o042290l748666J097934K905708L2390m294008n493511k006507
36250a857458K893819M416951K026962j7756R45651K003414k61871l620236l370702
36241C158774O4578J669180m91957l120419l688351l539396l514946j528806K703386
36232h287957M942228K249583j934919k816552j401880j587768k418157L58885
$$ plain form
36224 -10896537 -5359524 963157 1841022 -1613060 -2076609 3359516 8880120 8218377
36216 8218377 2860874 -1247177 -1884908 -1158679 182913 3881181 9224583 11699626
36208 11699626 9031695 5399043 6164348 9933782 9762074 2584750 -6060275 -8630388
36200 -8630388 -4470353 698610 2841134 3484946 5114093 6419294 4685060 705350
36192 705350 -1964144 -1994880 -1536483 -2466522 -4332090 -6726373 -10734985 -16180449 -19645299
36183 -19645299 -17804514 -11860314 -6540695 -4952360 -5981347 -6584742 -5245596 -3020853
36175 -3020853 -2007453 -2875579 -3838246 -2787989 -460669 219485 -1401386 -2202971 26346
36166 26346 2737498 2380819 270689 732486 3930662 4966848 1158264 -3693081 -4399825
$$ packed form
36224a0896537N537013O322681Q77865l454082m63549N436125N520604o61743
36216H218377n357503m108051o37731P26229J341592L698268N343402K475043
36208A1699626k667931l632652P65305L769434j71708p177324q645025k570113
36200h630388M160035N168963K142524O43812J629147J305201j734234l979710
36192G05350k669494l0736M58397r30039j865568k394283m008612n445464l464850
36183a9645299J840785N944200N319619J588335j028987o03395J339146K224743
36175c020853J013400q68126r62667J050257K327320O80154j620871q01585K229317
36166B6346K711152l56679k110130M61797L198176J036186l808584m851345p06744
$$ plain form
36157 -4399825 -862946 2843957 3531042 650034 -4862649 -10528173 -12471590 -8814872
36149 -8814872 -2606086 1173472 1309285 718812 1406688 1866566 54077 -3574052 -7047588
36140 -7047588 -8865979 -7878921 -3292357 3364036 7781912 6719477 1912520 -1706705
36132 -1706705 -1669212 -299591 -1253828 -5243665 -9802306 -12114321 -11121976 -7479367 -2571031
36123 -2571031 2185414 5612177 6999781 6545209 5522177 5217149 5107282 2921416 -2197346
36114 -2197346 -7098251 -7212391 -2227207 2812503 3347805 557388 -1097425 -178434 629795
36105 629795 -600028 -2083460 -1364410 810227 1326010 -1565054 -6529038 -10461937 -10655281
36096 -10655281 -6441149 240188 6076405 8661439 7540916 3638483 -1072515 -3666752
$$ packed form
36157d399825L536879L706903O87085k881008n512683n665524j943417L656718
36149h814872O208786L779558J35813n90473O87876M59878j812489l628129l473536
36140g047588j818391R87058M586564O656393M417876j062435m806957l619225
36132a706705L7493J369621r54237l989837m558641k312015R92345L642609M908336
36123b571031M756445L426763J387604m54572j023032l05028j09867k185866n118762
36114b197346m900905j14140M985184N039710N35302k790417j654813R18991Q08229
36105F29795j229823j483432P19050K174637N15783k891064m963984l932899j93344
36096a0655281M214132O681337N836217K585034j120523l902433m710998k594237
$$ plain form
36088 -3666752 -2201306 1703064 4021418 3024056 1149097 1300173 3368756 5774335
36080 5774335 8052748 9720876 8825534 4749809 1010323 1771039 6153164 9299767
36072 9299767 8848220 6995465 6001552 5208657 3493772 1499411 -64888 -1759590 -3539079
36063 -3539079 -3853221 -2226911 -666591 -842675 -1765050 -1911191 -1686071 -1726330 -587354
36054 -587354 3177896 7525706 8144217 3283588 -4245358 -9856537 -10842692 -7762607 -3640533
36045 -3640533 -1657106 -2501243 -4025008 -4062963 -2934716 -2396777 -3101135 -4408601 -6023781
36036 -6023781 -8234153 -10631243 -11824575 -10588969 -6775097 -1532913 2741853 3552677
36028 3552677 626815 -3370434 -5588451 -5994189 -6402204 -7046976 -5927307 -1895720 3011127
$$ packed form
36088c666752J465446L904370K318354r97362j874959J51076K068583K405579
36080E774335K278413J668128q95342m075725l739486P60716M382125L146603
36072I299767m51547j852755r93913p92895j714885j994361j564299j694702j779489
36063c539079l14142J626310J560320j76084r22375j46141K25120m0259J138976
36054e87354L765250M347810O18511m860629p528946n611179r86155L080085M122074
36045c640533J983427q44137j523765l7955J128247N37939p04358j307466j615180
36036f023781k210372k397090j193332J235606L813872N242184M274766Q10824
36028C552677k925862l997249k218017m05738m08015o44772J119669M031587M906847
$$ plain form
36019 3011127 5141620 2614325 -3096451 -8343596 -9971210 -7752319 -4899817 -5671360
36011 -5671360 -11432898 -18724899 -21889192 -18478362 -11921902 -7827821 -7646894 -7675238 -5009436
36002 -5009436 -2027410 -2444964 -4776919 -3840429 1257649 5004776 3065821 -1607339
35994 -1607339 -2940675 558236 5249099 7686695 7339641 5045320 1897520 -437240
35986 -437240 -720417 302605 846152 348537 -413176 -773986 -578212 -248988 -1627051
35977 -1627051 -6796504 -14093988 -17556412 -13536199 -6222713 -2855086 -4594011 -6395647
35969 -6395647 -5342039 -4029211 -4834744 -5789709 -4461762 -2040713 -743334 -168246 820136
35960 820136 1015606 -1144108 -4186074 -5324200 -4645896 -4802744 -6960629 -9412089 -10101377
$$ packed form
36019C011127K130493k527295n710776n247145j627614K218891K852502p71543
36011e671360n761538p292001l164293L410830O556460M094081J80927k8344K665802
36002e009436K982026m17554k331955R36490N098078L747127j938955m673160
35994a607339j333336L498911M690863K437596l47054k294321l147800k334760
35986d37240k83177J023022N43547m97615p61713l60810J95774L29224j378063
35977a627051n169453p297484l462424M020213P313486L367627j738925j801636
35969f395647J053608J312828q05533r54965J327947K421049J297379N75088R88382
35960H20136J95470k159714l041966j138126O78304j56848k157885k451460o89288
$$ plain form
35951 -10101377 -8708261 -6376337 -4857054 -5575666 -8105616 -9980037 -9433555 -7799934
35943 -7799934 -7590837 -8743083 -8823707 -6912681 -5032236 -4942128 -5387940 -3946701 -462256
35934 -462256 2995264 5101863 6367041 6813619 4347344 -2708622 -11862121 -17377401
35926 -17377401 -16008712 -10580834 -6617411 -6392457 -7886458 -8754373 -8878261 -8679495 -7196416
35917 -7196416 -3250461 2540425 8000295 11070568 10718627 7035972 1282502 -4438833
35909 -4438833 -7979475 -7799744 -3730359 1930881 5011718 3152875 -1196179 -3397922
35901 -3397922 -2253519 -839195 -1604092 -3407230 -4280420 -4185166 -3361264 -756866 3352154
35892 3352154 5339316 1894100 -5357285 -11447572 -13362078 -11439910 -6783148 -416760
$$ packed form
35951a0101377J393116K331924J519283p18612k529950j874421N46482J633621
35943g799934K09097j152246q0624J911026J880445R0108m45812J441239L484445
35934d62256L457520K106599J265178M46578k466275p055966r153499n515280
35926a7377401J368689N427878L963423K24954j494001q67915j23888J98766J483079
35917g196416L945955N790886N459870L070273l51941l682655n753470n721335
35909d438833l540642J79731M069385N661240L080837j858843m349054k201743
35901c397922J144403J414324p64897j803138q73190R5254Q23902K604398M109020
35892C352154J987162l445216p251385o090287j914506J922168M656762O366388
$$ plain form
35884 -416760 5329145 7655357 6083569 2587607 -824995 -2708879 -1253895 4034263
35876 4034263 9653069 10459250 5680394 -266223 -3982208 -6984329 -11599223 -16036831
35868 -16036831 -16624301 -13143659 -8692404 -5083201 -1632829 1399852 1345316 -3386781
35860 -3386781 -10116960 -13988172 -12887772 -9296368 -7270709 -8134143 -9384410 -7872631
35852 -7872631 -3815870 -930038 -2100439 -5651043 -7106453 -4533489 -711643 607627
35844 607627 -690494 -1648472 -851819 -493858 -3009197 -7135201 -9182539 -7948151 -6375190
35835 -6375190 -7495338 -10240356 -10846637 -7697667 -3057514 -106988 98562 -1520346
35827 -1520346 -3511071 -4352312 -3035818 -596886 -10267 -2900399 -6944452 -8279520
$$ packed form
35884d16760N745905K326212j571788l495962l412602j883884J454984N288158
35876D034263N618806Q06181m778856n946617l715985l002121m614894m437608
35868a6036831n87470L480642M451255L609203L450372L032681n4536m732097
35860c386781o730179l871212J100400L591404K025659q63434j250267J511779
35852g872631M056761K885832j170401l550604j455410K572964L821846J319270
35844F07627j298121r57978P96653L57961k515339m126004k047338J234388J572961
35835f375190j120148k745018o06281L148970M640153K950526K05550j618908
35827a520346j990725q41241J316494K438932N86619k890132m044053j335068
$$ plain form
35819 -8279520 -6191533 -3501191 -2299357 -1659372 -395905 421178 -273848 -693938 1385949
35810 1385949 4115384 2917555 -2877427 -7690206 -5821149 1965194 9930785 13995783
35802 13995783 14609880 13872159 12483757 10036692 6534489 2835173 384476 487232
35794 487232 2746043 4460744 3298424 894502 1952298 8594071 16811348 20015214
35786 20015214 15796186 8092183 2670553 1381671 1470809 203563 -1186837 440440
35778 440440 4658143 6716737 3660995 -1203429 -2774905 -1496826 -2428001 -7383360
35770 -7383360 -12282317 -13266543 -11329167 -8954721 -6161292 -2911436 -1866424 -4398927
35762 -4398927 -6239530 -2151285 5934753 10513189 8608401 5492760 6756118 10960237
$$ packed form
35819h279520K087987K690342J201834O39985J263467Q17083o95026m20090K079887
35810A385949K729435j197829n794982m812779J869057P786343P965591M064998
35802A3995783O14097p37721j388402k447065l502203l699316k450697J02756
35794D87232K258811J714701j162320k403922J057796O641773Q217277L203866
35786B0015214m219028p704003n421630j288882Q9138j267246j390400J627277
35778D40440M217703K058594l055742m864424j571476J278079r31175m955359
35770g383360m898957r84226J937376K374446K793429L249856J045012k532503
35762d398927j840603M088245Q086038M578436j904788l115641J263358M204119
$$ plain form
35754 10960237 13016445 11691966 10026364 9788537 9280402 6780592 3204802 175233
35746 175233 -2632466 -6453586 -10457265 -11678576 -8545549 -3300749 339089 1417493
35738 1417493 2052498 3535335 4216548 2372606 -694668 -2401022 -2578949 -3201848 -5003699
35729 -5003699 -6690940 -7368496 -7394659 -6583154 -3966999 -117303 2572129 3175561 3825015
35720 3825015 6263744 8350132 6357228 363993 -4842093 -4993170 -1302506 846044
35712 846044 -2078859 -8045737 -12342933 -13292975 -13274138 -13831333 -12421517 -6365756 1642811
35703 1642811 5507766 3133357 -1564389 -4844010 -7792394 -12706146 -17830567 -19111357
35695 -19111357 -15861663 -11414547 -8408384 -6262603 -3718456 -1404014 -657461 -1207589
$$ packed form
35754A0960237K056208j324479j665602k37827n08135k499810l575790l029569
35746A75233k807699l821120m003679j221311L133027N244800L639838J078404
35738A417493O35005J482837O81213j843942l067274j706354j77927o22899j801851
35729e003699j687241o77556k6163Q11505K616155L849696K689432O03432O49454
35720C825015K438729K086388j992904n993235n206086j51077L690664K148550
35712H46044k924903n966878m297196r50042J8837n57195J409816O055761Q008567
35703A642811L864955k374409m697746l279621k948384m913752n124421j280790
35695a9111357L249694M447116L006163K145781K544147K314442P46553n50128
$$ plain form
35687 -1207589 -1253053 582876 3835655 6305086 5487602 648530 -6085050 -10964074 -11201959
35678 -11201959 -6595585 577162 6637263 8323837 5064928 -305327 -4021592 -4860691
35670 -4860691 -4532907 -4757169 -5180688 -4645935 -3238205 -1867886 -519183 1504207 3529640
35661 3529640 3379449 317101 -2998836 -3155733 -213272 2575029 3473168 4422302 7185598
35652 7185598 9572631 8300514 4522974 2962203 5145445 7062222 5368203 2910643
35644 2910643 4899037 11120064 15530159 13578117 6943353 354775 -3558940 -4809475
35636 -4809475 -3800662 -1121831 1255767 1154208 -955984 -2048568 -448320 1592916
35628 1592916 667211 -2913064 -4674505 -975945 6706243 13489868 16378841 16495440
$$ packed form
35687a207589m5464J835929L252779K469431q17484m839072o733580m879024k37885
35678a1201959M606374P172747O060101J686574l258909n370255l716265q39099
35670d860691L27784k24262m23519N34753J407730J370319J348703K023390K025433
35661C529640j50191l062348l315937j56897K942461K788301Q98139R49134K763296
35652G185598K387033j272117l777540j560771K183242J916777j694019k457560
35644B910643J988394O221027M410095j952042o634764o588578l913715j250535
35636d809475J008813K678831K377598j01559k110192j092584J600248K041236
35628A592916r25705l580275j761441L698560P682188O783625K888973J16599
$$ plain form
35620 16495440 16202668 15705982 13505698 9274594 4888824 2576216 2926794 4884102
35612 4884102 6901731 7646847 6143476 2114823 -3540748 -8956540 -12360471 -13113728
35604 -13113728 -11918861 -10332681 -10016769 -11701238 -14172045 -14674264 -11390415 -5700124
35596 -5700124 -1089296 465961 111564 -147702 91078 398173 1310598 3437372 5332834
35587 5332834 4422601 438120 -3755868 -5502248 -5213946 -4959220 -5257952 -4743233 -2820427
35578 -2820427 -1202206 -1830483 -3765238 -3589371 321480 5068344 6448980 4370956
35570 4370956 2695950 3499143 4480542 3438374 2086205 2601867 3073873 390963 -3958249
35561 -3958249 -5545710 -3878812 -2792196 -3554907 -2555939 2398877 7843469 9313026
$$ packed form
35620A6495440k92772m96686k200284m231104m385770k312608L50578J957308
35612D884102K017629P45116j503371m028653n655571n415792l403931p53257
35604a3113728J194867J586180L15912j684469k470807n02219L283849N690291
35596e700124M610828J555257l54397k59266K38780L07095R12425K126774J895462
35587E332834r10233l984481m193988j746380K88302K54726k98732N14719J922806
35578b820427J618221o28277j934755J75867L910851M746864J380636k078024
35570D370956j675006Q03193R81399j042168j352169N15662M72006k682910m349212
35561c958249j587461J666898J086616p62711R98968M954816N444592J469557
$$ plain form
35553 9313026 6967220 4070880 2737347 3497212 6149038 8518709 7348611 3185616
35545 3185616 1214560 3901176 6197493 2636004 -3606855 -4493144 1381739 7216692
35537 7216692 8151165 7047418 8311808 10945808 10904995 7247869 2796268 270525 68077
35528 68077 998663 1720750 1819036 1772541 1325788 -1075507 -5319423 -7386420 -3579738
35519 -3579738 3340561 6591918 4819264 4401457 9943503 16991188 18355791 14420944
35511 14420944 11832839 13287760 14192145 10201048 3294078 -1979881 -4958345 -8270843
35503 -8270843 -12275900 -13562253 -9737604 -3617146 -817428 -3361234 -7105883 -6502780
35495 -6502780 -1342544 2694914 607968 -6147968 -11613775 -12220443 -10005215 -8878980
$$ packed form
35553I313026k345806k896340j333533P59865K651826K369671j170098m162995
35545C185616j971056K686616K296317l561489o242859q86289N874883N834953
35537G216692R34473j103747J264390K634000m0813l657126m451601k525743k02448
35528F8077R30586P22087R8286m6495m46753k401295m243916k066997L806682
35519c579738O920299L251357j772654m17807N542046P047685J364603l934847
35511A4420944k588105J454921R04385l991097o906970n273959k978464l312498
35503h270843m005057j286353L824649O120458K799718k543806l744649O03103
35495f502780N160236M037458k086946o755936n465807o06668K215228J126235
$$ plain form
35487 -8878980 -9537901 -9492183 -7394511 -5445026 -6678568 -10813268 -14118129 -13533967 -10030138
35478 -10030138 -7372726 -8022816 -10782540 -12410571 -11249782 -9002838 -8497567 -9645506
35470 -9645506 -8809047 -3436014 3668691 7037794 5429248 3234888 4158369 6474704
35462 6474704 6520677 4112268 1471532 -1109212 -4674390 -7787590 -7602452 -4946599 -4299366
35453 -4299366 -7463958 -10655744 -9761199 -5813230 -2917475 -2511145 -2168111 454814 4320469
35444 4320469 5906894 2843140 -3380913 -8619602 -10481634 -10760195 -12356720 -14978378
35436 -14978378 -16069453 -15123731 -14062514 -13476764 -11794502 -8695374 -6024562 -4335018
35428 -4335018 -1876950 1608139 3598021 3204159 3210541 4902016 4388412 -1854092 -10233178
$$ packed form
35487h878980o58921M5718K097672J949485j233542m134700l304861N84162L503829
35478a0030138K657412o50090k759724j628031J160789K246944N05271j147939
35470i645506Q36459N373033P104705L369103j608546k194360R23481K316335
35462F474704M5973k408409k640736k580744l565178l113200J85138K655853O47233
35453d299366l164592l191786Q94545L947969K895755M06330L43034K622925L865655
35444D320469J586425l063754o224053n238689j862032k78561j596525k621658
35436a4978378j091075R45722J061217N85750J682262L099128K670812J689544
35428d335018K458068L485089J989882l93862O382J691475n13604o242504q379086
$$ plain form
35419 -10233178 -13503988 -9934993 -4659890 -2206312 -1991596 -1899275 -2256459 -4199728 -6678929
35410 -6678929 -7390550 -5560291 -2307078 936384 3206516 3889552 3079351 2063148 2554194
35401 2554194 4861852 7072148 6891166 4726074 3969186 6965304 11362453 12373415
35393 12373415 8585018 3391040 317476 -731419 -1748817 -3567430 -5889884 -8272767
35385 -8272767 -9604240 -8576048 -6135998 -5363768 -7307060 -9156706 -8235172 -5261994
35377 -5261994 -1799116 2294026 6008226 5288550 -1644042 -9524434 -11392720 -7042662
35369 -7042662 -1347197 4054539 11308384 19131335 21926314 17864504 12168425 9739663
35361 9739663 9193269 7056680 3609449 999990 -1039857 -3609669 -5011045 -2623713
$$ packed form
35419a0233178l270810L568995N275103K453578K14716R2321l57184j943269k479201
35410f678929p11621J830259L253213L243462K270132O83036q10201j016203M91046
35401B554194K307658K210296j80982k165092p56888K996118M397149J010962
35393A2373415l788397n193978l073564j048895j017398j818613k322454k382883
35385h272767j331473J028192K440050P72230j943292j849646R21534K973178
35377e261994L462878M093142L714200p19676o932592p880392j868286M350058
35369g042662N695465N401736P253845P822951K794979m061810n696079k428762
35361I739663n46394k136589l447231k609459k039847k569812j401376K387332
$$ plain form
35353 -2623713 2619024 6809830 7733621 6672274 5873906 5964304 5701129 3346945 -1224514
35344 -1224514 -5503928 -6776495 -5919231 -6711128 -10459369 -13612346 -12298842 -7287407
35336 -7287407 -2645517 -1111146 -2529886 -5255673 -7105872 -6138829 -2384696 1888545
35328 1888545 4652863 5663084 5010449 2599881 396970 2141114 8138199 12867280
35320 12867280 11172535 4991937 251396 -1408099 -3388325 -7187188 -9578383 -7895138
35312 -7895138 -4145819 -1809994 -1319486 -791178 858250 3543565 7044982 10265299
35304 10265299 10626856 6512952 35243 -4515673 -5251602 -4395359 -5010437 -7227833 -8705559
35295 -8705559 -8098123 -6403175 -4504192 -1230603 4319881 9642871 10883232 8262043
$$ packed form
35353b623713N242737M190806R23791j061347p98368R0398k63175k354184m571459
35344a224514m279414j272567Q57264p91897l748241l152977J313504N011435
35336g287407M641890J534371j418740k725787j850199R67043L754133M273241
35328A888545K764318J010221o52635k410568k202911J744144N997085M729081
35320A2867280j694745o180598m740541j659495j980226l798863k391195J683245
35312g895138L749319K335825M90508N28308J649428K685315L501417L220317
35304A0265299L61557m113904o477709m550916p35929Q56243o15078k217396j477726
35295h705559O07436J694948J898983L273589N550484N322990J240361k621189
$$ plain form
35287 8262043 6371039 7661498 8677849 5434682 32327 -1995161 248544 1952171
35279 1952171 -151235 -3533323 -4223171 -2004918 702969 2389099 2508019 228457
35271 228457 -4068657 -7400931 -7094279 -4488115 -3329655 -4794787 -6320971 -5233198
35263 -5233198 -1328069 4200287 10079245 14662900 16496647 16139737 15642162 15349541 13330719
35254 13330719 9332218 6894084 8885828 12495879 12023127 6352018 435810 -1093215
35246 -1093215 1284294 4540259 7261206 9186545 9204077 6716312 3587604 2062412
35238 2062412 1751864 1167496 1096991 3348503 6712489 7604472 4984485 1455783 -1085211
35229 -1085211 -3553672 -6259043 -6791110 -3651293 425725 1410025 -1186160 -4556498
$$ packed form
35287H262043j891004J290459J016351l243167n402355k027488K243705J703627
35279A952171k103406l382088o89848K218253K707887J686130J18920k279562
35271B28457m297114l332274L06652K606164J158460j465132j526184J087773
35263e233198L905129N528356N878958M583655J833747l56910m97575k92621k018822
35254A3330719l998501k438134J991744L610051m72752n671109n916208j529025
35246a093215K377509L255965K720947J925339J7532k487765l128708j525192
35238B062412l10548n84368p0505K251512L363986Q91983k619987l528702k540994
35229a085211k468461k705371n32067L139817M077018R84300k596185l370338
$$ plain form
35221 -4556498 -6412061 -6439978 -5033355 -2835421 -1130594 -880629 -1534258 -1983122 -2221151
35212 -2221151 -3001221 -4530444 -6548878 -8918554 -11159966 -12365390 -12524554 -12714497 -12945642
35203 -12945642 -11464512 -7763704 -4605789 -4822705 -7194686 -7815190 -4991610 -868927
35195 -868927 1340611 236247 -2827713 -4288529 -1242163 4539753 7274701 4179276
35187 4179276 -201203 121124 4217225 6032117 3481427 682975 746963 1497811 307281
35178 307281 -1140740 88317 3224793 4951192 3910649 1716076 548506 1384344
35170 1384344 3566327 5014099 4101907 2124491 2279725 5433378 8850131 10018840
35162 10018840 9409803 8139679 5476040 780339 -4115003 -6847985 -7379852 -6842253
$$ packed form
35221d556498j855563k7917J406623K197934J704827K49965o53629m48864k38029
35212b221151p80070j529223k018434k369676k241412j205424j59164j89943k31145
35203a2945642J481130L700808L157915k16916k371981o20504K823580M122683
35195h68927K209538j104364l063960j460816L046366N781916K734948l095425
35187D179276m380479L22327M096101J814892k550690k798452O3988P50848j190530
35178C07281j448021J229057L136476J726399j040543k194573j167570Q35838
35170A384344K181983J447772r12192j977416J55234L153653L416753J168709
35162A0018840o09037j270124k663639m695701m895342k732982n31867N37599
$$ plain form
35154 -6842253 -5176155 -2383711 -733676 -2724997 -7272888 -10488281 -10233449 -7829726
35146 -7829726 -5369670 -3577116 -2743754 -3793272 -7264752 -12025356 -15699517 -16263743
35138 -16263743 -13438641 -9012487 -5575042 -4445843 -4959028 -5727072 -5827675 -4712196
35130 -4712196 -2308217 157969 711463 -1162113 -3958066 -6444442 -9029726 -11913633
35122 -11913633 -13578356 -12627199 -9772935 -6461761 -2868776 983007 3413874 2630369
35114 2630369 -511042 -3135982 -3338019 -1174671 2431854 6159011 8468519 8909665
35106 8909665 8357102 6678442 2039518 -5185882 -9907686 -7534968 -885000 2243772
35098 2243772 -1257920 -6366417 -7106395 -3524051 295342 2021215 2298627 2215042 2241464
$$ packed form
35154f842253J666098K792444J650035j991321m547891l215393K54832K403723
35146g829726K460056J792554Q33362j049518l471480m760604l674161n64226
35138a6263743K825102M426154L437445J129199n13185p68044j00603J115479
35130d712196K403979K466186N53494j873576k795953k486376k585284k883907
35122a1913633j664723R51157K854264L311174L592985L851783K430867p83505
35114B630369l141411k624940k02037K163348L606525L727157K309508M41146
35106H909665n52563j678660m638924p225400m721804K372718O649968L128772
35098B243772l501692n108497p39978L582344L819393J725873K77412q3585K6422
$$ plain form
35089 2241464 2854116 4316834 6359333 9114717 13271757 18122660 20860189 19601287
35081 19601287 16180697 14025392 13762761 12883720 9672403 5451481 2270854 946
35073 946 -2943731 -6744210 -9487119 -9442279 -7016895 -4063365 -2115582 -1965408 -4078296
35064 -4078296 -8108515 -12388040 -15375740 -17484828 -19824756 -21285849 -19334352 -14305263
35056 -14305263 -10051582 -8833059 -8560876 -7544262 -8732969 -15006697 -22367351 -23285177
35048 -23285177 -16710894 -9594253 -7434105 -8209955 -7644037 -5694367 -4368387 -2836477
35040 -2836477 754635 4683422 5502777 3891699 4470373 9176817 14223976 15092107 12129961
35031 12129961 9184679 7886871 5574932 -640445 -9170104 -14843952 -14555153 -10481071
$$ packed form
35089B241464O12652J462718K042499K755384M157040M850903K737529j258902
35081A9601287l420590k155305k62631q79041l211317m220922l180627k269908
35073I46k944677l800479k742909M4840K425384K953530J947783J50174k112888
35064d078296m030219m279525k987700k109088k339928j461093J951497N029089
35056a4305263M253681J218523K72183J016614j188707o273728p360654r17826
35048b3285177O574283P116641K160148p75850N65918J949670J325980J531910
35040b836477L591112L928787Q19355j611078N78674M706444N047159Q68131k962146
35031A2129961k945282j297808k311939o215377q529659n673848K88799M074082
$$ plain form
35023 -10481071 -6756440 -4560397 -2587662 -1099918 -2002291 -4642700 -5218642 -1965109
35015 -1965109 2132569 3831324 3856795 3963194 2779033 -1354209 -5419736 -4709443 -533117
35006 -533117 191049 -5428541 -11390977 -10475766 -3831495 700583 -1419497 -6503862 -7762043
34997 -7762043 -2682326 5489342 11610611 12591944 8722211 2883866 -1489361 -2819046
34989 -2819046 -2249482 -1892358 -2546376 -3828089 -5824376 -8702709 -10494765 -7724412 113258
34980 113258 8427282 12009796 10582601 7932768 6786232 6963056 7380631 6809006 3568294
34971 3568294 -1952961 -5229453 -2431009 2901273 3312358 -1610838 -3773582 1523579
34963 1523579 8386280 9293515 5823172 4635777 6821513 7859864 5674441 2109872
$$ packed form
35023a0481071L724631K196043J972735J487744r02373k640409n75942L253533
35015a965109M097678J698755K5471J06399j184161m133242m065527P10293M176326
35006e33117P24166n619590n962436R15211O644271M532078k120080n084365j258181
34997g762043N079717Q171668O121269R81333l869733n838345m373227j329685
34989b819046N69564L57124o54018j281713j996287k878333j792056K770353P837670
34980A13258Q314024L582514j427195k649833j146536J76824M17575n71625l240712
34971C568294n521255l276492K798444N332282M11085m923196k162744N297161
34963A523579O862701R07235l470343j187395K185736J038351k185423l564569
$$ plain form
34955 2109872 -2143745 -7667599 -12203539 -12759524 -11381807 -12357943 -13871309 -9847131
34947 -9847131 -1180594 2853764 -2392261 -9636179 -10035598 -5073080 -2524520 -4928868
34939 -4928868 -8204245 -9178961 -8659089 -8005369 -7395362 -7158622 -7274331 -6030706 -2152827
34930 -2152827 2538830 5350390 6480727 7722536 8763034 8206347 7361210 9243922
34922 9243922 13798472 17326400 17020600 13519296 8957389 5106979 3468616 4354733
34914 4354733 5330227 3082321 -2348629 -7252746 -8831901 -8108255 -7454339 -7191434 -6085577
34905 -6085577 -4098644 -3118146 -4901761 -8820510 -11904120 -11471227 -7796594 -3583644
34897 -3583644 -789575 846539 1944963 2116967 1526939 1898068 4261928 7226190 9126884
$$ packed form
34955B109872m253617n523854m535940n55985J377717r76136j513366M024178
34947i847131Q666537M034358n246025p243918l99419M962518K548560k404348
34939d928868l275377r74716N19872O53720O10007K36740j15709J243625L877879
34930b152827M691657K811560J130337J241809J040498n56687q45137J882712
34922I243922M554550L527928l05800l501304m561907l850410j638363Q86117
34914D354733R75494k247906n430950m904117j579155P23646O53916K62905J105857
34905f085577J986933R80498j783615l918749l083610M32893L674633M212950
34897c583644K794069J636114J098424J72004n90028L71129K363860K964262J900694
$$ plain form
34888 9126884 10158018 10432957 8057644 2030564 -4609374 -7952242 -8457247 -9467255
34880 -9467255 -11312732 -11030437 -8025267 -5763659 -6623905 -8528084 -8257167 -5388455 -1576473
34871 -1576473 1574772 2661044 983359 -1719358 -2306563 -261375 1612892 1661362 1765415
34862 1765415 3500676 4726350 2717107 -1275602 -3539870 -2844142 -1161448 -186621
34854 -186621 171569 -106923 -2070380 -5986020 -10070754 -11969659 -10999918 -8499809 -6219075
34845 -6219075 -4664370 -3129365 -1205652 325124 400426 -1275890 -4546940 -8846088
34837 -8846088 -11913346 -10460904 -4589227 81980 -1642210 -7120580 -8716434 -4385314
34829 -4385314 -562726 -2644969 -7365693 -8211270 -4798894 -2293341 -3495178 -6154659
$$ packed form
34888I126884J031134K74939k375313o027080o639938l342868n05005j010008
34880i467255j845477K82295L005170K261608q60246j904179K70917K868712L811982
34871a576473L151245J086272j677685k702717n87205K045188J874267M8470J04053
34862A765415J735261J225674k009243l992709k264268O95728J682694R74827
34854a86621L58190k78492j963457l915640m084734j898905R69741K500109K280734
34845f219075J554705J535005J923713J530776P5302j676316l271050m299148
34837h846088l067258J452442N871677M671207j724190n478370j595854M331120
34829d385314L822588k082243m720724q45577L412376K505553j201837k659481
$$ plain form
34821 -6154659 -7605785 -8012650 -8506817 -9073955 -9119105 -8294148 -6464779 -4299252 -3624286
34812 -3624286 -5553516 -8586152 -10288212 -10564770 -11452447 -13782668 -15838614 -15518513 -12440248
34803 -12440248 -7762604 -3060048 581315 3225169 5648278 7581775 7127946 2999560
34795 2999560 -3301304 -8614889 -10816682 -9597157 -5859438 -1860002 -842534 -4438443
34787 -4438443 -10536748 -15032143 -15489537 -12442335 -8189746 -5462641 -5998029 -8793087
34779 -8793087 -10644613 -9779925 -7904502 -7442804 -8342828 -9242034 -9992815 -10897447 -11190273
34770 -11190273 -10775367 -11756322 -15301814 -18512083 -17735726 -13810206 -10466470 -8601696
34762 -8601696 -6244895 -3676170 -3926729 -7490074 -10705096 -10783266 -8998204 -7369038 -5260940
$$ packed form
34821f154659j451126m06865m94167n67138m5150Q24957J829369K165527O74966
34812c624286j929230l032636j702060k76558q87677k330221k055946L20101L078265
34803a2440248M677644M702556L641363K643854K423109J933497m53829m128386
34795B999560o300864n313585k201793J219525L737719L999436J017468l595909
34787d438443o098305m495395m57394L047202M252589K727105n35388k795058
34779h793087j851526Q64688J875423M61698r00024q99206p50781r04632k92826
34770a1190273M14906r80955l545492l210269P76357L925520L343736J864774
34762h601696K356801K568725k50559l563345l215022p8170J785062J629166K108098
$$ plain form
34753 -5260940 -1186980 4183288 8432593 9472200 6763141 2224718 -84531 2477816
34745 2477816 7789829 11485099 12450233 12857818 13260284 11709901 8043066 4584297 1489599
34736 1489599 -4025095 -11826044 -16625943 -14572126 -8647876 -4444637 -3410761 -3353692
34728 -3353692 -3091805 -3182340 -3552349 -3307563 -2120822 -213850 1790222 2179333 -386846
34719 -386846 -3788558 -3812989 62737 3669254 4567669 5401411 8261664 9965380 6776987
34710 6776987 452740 -4458839 -6479560 -6516329 -4431234 -707712 1340425 -121815
34702 -121815 -1484325 848206 3547558 858730 -5827871 -9424025 -7370269 -3900939
34694 -3900939 -2199968 -982412 259162 -710470 -3473550 -3541342 691629 4423167 3077641
$$ packed form
34753e260940M073960N370268M249305J039607k709059m538423k309249K562347
34745B477816N312013L695270R65134M07585M02466j550383l666835l458769l094698
34736A489599n514694p800949m799899K053817N924250M203239J033876N7069
34728c353692K61887r0535l70009K44786J186741J906972K004072L89111k566179
34719c86846l401712k4431L875726L606517Q98415Q33742K860253J703716l188393
34710F776987o324247m911579k020721l6769K085095L723522K048137j462240
34702a21815j362510K332531K699352k688828o686601l596154K053756L469330
34694c900939J700971J217556J241574r69632k763080o7792M232971L731538j345526
$$ plain form
34685 3077641 -1499311 -4661279 -5461999 -6316524 -8636645 -11691636 -14095492 -14331601 -11399578
34676 -11399578 -6460126 -2220056 214231 1878976 2949632 2109271 -196262 -1057775
34668 -1057775 892223 3615110 5111418 5708851 5548190 3231118 -929618 -3393369
34660 -3393369 -1548055 3015843 7251274 10034374 11097161 9778916 7108589 6012766
34652 6012766 6912048 6234230 2135383 -1559453 -632470 3204005 5204245 4418824 3453026
34643 3453026 3342148 3110670 3175387 4732083 6275374 4797485 416647 -3606597 -5347802
34634 -5347802 -5606994 -5160788 -3828358 -2154219 -1108806 -352858 524760 -92169 -3328569
34625 -3328569 -5941092 -3110651 4573742 10707619 10405043 4805737 -2192711 -8027301
$$ packed form
34685C077641m576952l161968q00720q54525k320121l054991k403856k36109K932023
34676a1399578M939452M240070K434287J664745J070656q40361k305533q61513
34668a057775J949998K722887J496308N97433j60661k317072m160736k463751
34660c393369J845314M563898M235431K783100J062787j318245k670327j095823
34652F012766Q99282o77818m098847l694836R26983L836475K000240p85421r65798
34643C453026j10878k31478O4717J556696J543291j477889m380838m023244j741205
34634e347802k59192M46206J332430J674139J045413P55948Q77618o16929l236400
34625c328569k612523K830441P684393O133877l02576n599306o998448n834590
$$ plain form
34617 -8027301 -11228412 -10717667 -7423202 -4330779 -3375909 -3911383 -4734156 -5383060 -5096609
34608 -5096609 -3251381 -1412693 -1998784 -4210339 -4523587 -2126715 -169185 -100571 1222961
34599 1222961 6170220 11522976 12294065 7890024 1555734 -3859101 -6520961 -4613229
34591 -4613229 1394358 7240104 9450111 9964667 12377466 15196144 13691895 7806594
34583 7806594 2926286 2136536 2765221 2262362 2679845 6294893 10525921 11103154 8286469
34574 8286469 6414597 8239006 12443907 16035445 16793545 14006450 9115519 5351620
34566 5351620 4782526 5962103 6046608 4461563 2541928 519517 -2327779 -4792864 -4097817
34557 -4097817 199215 5237422 8546976 10111061 9895125 6599346 1004232 -2343789
$$ packed form
34617h027301l201111N10745L294465L092423R54870n35474q22773o48904K86451
34608e096609J845228J838688n86091k211555l13248K396872J957530O8614J323532
34599A222961M947259N352756P71089m404041o334290n414835k661860J907732
34591d613229O007587N845746K210007N14556K412799K818678j504249n885301
34583G806594m880308p89750O28685n02859M17483L615048M231028N77233k816685
34574H286469j871872J824409M204901L591538P58100k787095m890931l763899
34566E351620n69094J179577Q4505j585045j919635k022411k847296k465085O95047
34557d097817M297032N038207L309554J564085k15936l295779n595114l348021
$$ plain form
34549 -2343789 -15911 5505322 9231650 10525843 12685471 16209107 16982828 12418650
34541 12418650 5675963 1612686 1252046 2532824 4098701 5435723 5026902 1870014
34533 1870014 -1735885 -2249457 -60358 329452 -3698229 -9118299 -10963883 -7901511
34525 -7901511 -2345638 3487807 9253903 14676163 18499975 19996279 20052609 19895413 19648305
34516 19648305 18847147 17404193 15091823 10964053 4733325 -1704022 -5772084 -7364287
34508 -7364287 -8903128 -11777192 -14264594 -13889874 -10510310 -5928400 -1556455 2263037
34500 2263037 5494816 8162494 10067415 9951546 6454019 1091993 -1886843 -862337
34492 -862337 176060 -2671350 -6535623 -5559035 -490098 1300833 -3559907 -9523402
$$ packed form
34549b343789K327878N521233L726328J294193K159628L523636P73721m564178
34541A2418650o742687m063277l60640J280778J565877J337022m08821l156888
34533A870014l605899n13572K189099L89810m027681n420070j845584L062372
34525g901511N555873N833445N766096N422260L823812J496304N6330j57196k47108
34516A9648305q01158j442954k312370m127770o230728o437347m068062j592203
34508g364287j538841k874064k487402L74720L379564M581910M371945L819492
34500B263037L231779K667678J904921j15869l497527n362026k978836J024506
34492h62337J038397k847410l864273R76588N068937J790931m860740n963495
$$ plain form
34484 -9523402 -10454244 -7801241 -6485478 -6741020 -5125527 -1227558 1807480 2504954 2395543
34475 2395543 2495056 2342085 2498134 4428876 7487644 8928211 7307092 3549747 -1160130
34466 -1160130 -5951697 -8992957 -8605341 -5967486 -4265658 -4971508 -7057528 -9424786
34458 -9424786 -11488671 -11892987 -9755446 -6962182 -6085910 -6445321 -5886884 -5932534 -10196681
34449 -10196681 -17069303 -19544424 -14704421 -8468383 -7539282 -10810938 -12900112 -12737618
34441 -12737618 -13469091 -15599286 -15490643 -10782092 -3393150 3400749 7903986 9563652
34433 9563652 8385603 5777754 3928671 3156232 1132710 -4118574 -10972012 -14897743
34425 -14897743 -12845087 -6765738 -1799309 -172273 1795319 8435970 17356355 20865653
$$ packed form
34484i523402r30842K653003J315763k55542J615493L897969L035038O97474j09411
34475B395543R9513j52971J56049J930742L058768J440567j621119l757345m709877
34466a160130m791567l041260L87616K637855J701828p05850k086020k367258
34458i424786k063885m04316K137541K793264Q76272l59411N58437m5650m264147
34449a0196681o872622k475121M840003O236038R29101l271656k089174J62494
34441a2737618p31473k130195J08643M708551P388942O793899M503237J659666
34433I563652j178049k607849j849083p72439k023522n251284o853438l925731
34425a4897743K052656O079349M966429J627036J967592O640651Q920385L509298
$$ plain form
34417 20865653 15517021 6647007 1552404 1431321 2735064 3401311 3871694 3874620 2492959
34408 2492959 826362 902951 2152262 2260380 1308585 1568043 3084776 3254780 1587448
34399 1587448 1026815 2785764 3467137 213743 -3979388 -3880610 259147 2547537 -665957
34390 -665957 -6243446 -9134863 -8929849 -8749040 -9352589 -8230920 -4622036 -1304132 486069
34381 486069 4065271 11457964 17329503 14224799 3220431 -6385794 -9034614 -8939226
34373 -8939226 -11795703 -16029564 -16671760 -13739343 -11283170 -10558527 -9583786 -8128695 -7903343
34364 -7903343 -8350432 -7150552 -4758933 -3684719 -3171401 356634 6712721 10862563
34356 10862563 10166815 8157903 8780183 10968477 11800005 11453928 11636532 11788220 10394411
$$ packed form
34417B0865653n348632q870014n094603j21083J303743O66247M70383K926j381661
34408B492959j666597P6589J249311J08118r51795K59458J516733J70004j667332
34399A587448n60633J758949O81373l253394m193131R8778M139757K288390l213494
34390f65957n577489k891417K05014J80809o03549J121669L608884L317904J790201
34381D86069L579202P392693N871539l104704j1004368r606225k648820R5388
34373h939226k856477m233861o42196K932417K456173P24643R74741J455091K25352
34364g903343m47089J199880K391619J074214N13318L528035O356087M149842
34356A0862563o95748k008912O22280K188294Q31528l46077J82604J51688j393809
$$ plain form
34347 10394411 8209349 6909007 5949809 3877406 1700979 1839009 4130594 5716152
34339 5716152 5037613 3766235 4388149 7390822 11018367 12669369 10638002 5559827
34331 5559827 63171 -3723624 -5882035 -7360751 -8023948 -7305715 -5895340 -5024747 -4360536
34322 -4360536 -2293613 1359661 4191531 3501455 -493213 -4117028 -3315402 2208531
34314 2208531 8211778 10233773 8487503 6911493 7355207 7142303 3650387 -1031419
34306 -1031419 -2486583 179581 3424051 3838926 1447952 -1515658 -3095276 -2586256
34298 -2586256 -793830 118270 -1641471 -5394221 -8584683 -9572713 -8643218 -6299978 -2439040
34289 -2439040 2057716 4795300 4625572 3948660 6362540 12060538 16973426 16767727 10797937
$$ packed form
34347A0394411k185062j300342r59198k072403k176427J38030K291585J585558
34339E716152o78539j271378O21914L002673L627545J651002k031367n078175
34331E559827n496656l786795k158411j478716o63197P18233J410375Q70593O64211
34322d360536K066923L653274K831870o90076l994668l623815Q01626N523933
34314B208531O003247K021995j746270j576010M43714k12904l491916m681806
34306a031419j455164K666164L244470M14875k390974k963610j579618N09020
34298b586256J792426R12100j759741l752750l190462r88030R29495K343240L860938
34289b439040M496756K737584j69728o76912K413880N697998M912888k05699n969790
$$ plain form
34280 10797937 2137248 -5011719 -7604192 -5097652 9006 3622540 3496481 1217815
34272 1217815 -103919 353661 913798 429781 -574650 -1885925 -4180682 -6581966 -6151891
34263 -6151891 -1880853 2692566 3381821 683919 -1324917 -464827 1957101 4301256
34255 4301256 6018181 5897255 2451565 -2836387 -5666466 -4029448 -937938 -365474
34247 -365474 -2304717 -3573305 -2005726 1875042 6159667 8853559 8684520 6040455
34239 6040455 2742725 266637 -1111200 -1293423 -106138 1360980 1061178 -1152949
34231 -1152949 -2558050 -866530 2632441 4430781 2361146 -2892477 -8463379 -10713915
34223 -10713915 -7609333 -806273 5773790 9881548 11897540 12139628 10342237 8355273
$$ packed form
34280A0797937q660689p148967k592473K506540N106658L613534j26059k278666
34272A217815j321734M57580N60137m84017j004431j311275k294757k401284M30075
34263f151891M271038M573419O89255k697902k008836Q60090K421928K344155
34255D301256J716925j20926l445690n287952k830079J637018L091510N72464
34247c65474j939243j268588J567579L880768M284625K693892j69039k644065
34239F040455l297730k476088j377837j82223J187285J467118k99802k214127
34231a152949j405101J691520L498971J798340k069635n253623n570902k250536
34223a0713915L104582O803060O580063M107758K015992K42088j797391j986964
$$ plain form
34215 8355273 9304379 12162709 11339008 4807289 -1321016 -730317 3869523 4885323 1004189
34206 1004189 -2029614 -1060256 642128 249510 -6958 2219791 4591388 3774052 758746
34197 758746 -1040562 -1032310 -1569430 -3830732 -6231465 -6701142 -4839272 -1932970 207747
34188 207747 798004 995223 2525237 4961903 5506928 2278150 -3163620 -7550532 -9501931
34179 -9501931 -10350536 -11621089 -12766133 -12141165 -9963429 -8878072 -10270447 -11092325 -7107715
34170 -7107715 597880 5774907 4973667 1608075 -358091 -2577810 -7852577 -13206423
34162 -13206423 -13659048 -10834932 -10671811 -13005500 -11104175 -3011265 4127345 4283195
34154 4283195 616986 -849421 5690 -3964 -709724 -247209 55458 -1710921 -3004495
$$ packed form
34215H355273R49106K858330q23701o531719o128305N90699M599840J015800l881134
34206A004189l033803R69358J702384l92618k56468K226749K371597q17336l015306
34197G58746j799308Q252n37120k261302k400733m69677J861870K906302K140717
34188B07747N90257J97219J530014K436666N45025l228778n441770m386912j951399
34179i501931q48605j270553j145044O24968K177736J085357j392375q21878L984610
34170g107715P705595N177027q01240l365592j966166k219719n274767n353846
34162a3206423m52625K824116J63121k333689J901325Q092910P138610J55850
34154D283195l666209j466407Q55111r654p05760M62515L02667j766379j293574
$$ plain form
34145 -3004495 -217813 4581369 6057634 3887453 3064638 6027845 9637691 10512060
34137 10512060 8821060 6077239 3303868 2096155 3424052 4531905 1119466 -6215497
34129 -6215497 -11655818 -11611514 -8487043 -5482891 -2210871 1745717 3263794 -44735
34121 -44735 -4857022 -6003740 -3577673 -1669634 -1109983 1430799 6702736 10338190 9373733
34112 9373733 7368447 9343153 13843783 14341943 8269653 633684 -2726534 -2200638
34104 -2200638 -2062348 -3241607 -2257183 2798330 8799006 11495517 10410424 8104301
34096 8104301 6407552 5272500 4022678 1963088 -1041204 -3009160 -653073 5840338
34088 5840338 10527955 7649042 -878189 -7530543 -8618559 -7671752 -8725597 -10658796
$$ packed form
34145c004495K786682M799182J476265k170181q22815K963207L609846Q74369
34137A0512060j691000k743821k773371j207713J327897J107853l412439p334963
34129f215497n440321M4304L124471L004152L272020L956588J518077l308529
34121d4735m812287j146718K426067J908039N59651K540782N271937L635454r64457
34112I373733k005286J974706M500630M98160o072290p635969l360218N25896
34104b200638J38290j179259R84424N055513O000676K696511j085093k306123
34096H104301j696749j135052j249822k059590l004292j967956K356087O493411
34088E840338M687617k878913q527231o652354j088016R46807j053845j933199
$$ plain form
34080 -10658796 -10547553 -8944046 -8221366 -7921388 -5674032 -1878763 159603 -997446
34072 -997446 -2824420 -2161592 1411515 6042437 9483686 9800865 6156046 282726 -3969271
34063 -3969271 -3970405 -764419 2574312 4272851 4545133 3779081 1828271 -716089 -2198725
34054 -2198725 -1822653 -859166 -741068 -719140 931693 3652550 4720215 3407098 2959336
34045 2959336 6548933 12512523 16000135 14985468 12194184 10774927 10565022 9776184
34037 9776184 8133543 6386093 4265897 1361155 -768250 -15215 2636457 3477400
34029 3477400 1002238 -1794497 -1726038 -204722 -1184070 -5048917 -7445228 -4809726 1275694
34020 1275694 6483750 8578614 8182565 6406818 4231473 3447710 5359899 8244376
$$ packed form
34080a0658796J11243J603507P22680K99978K247356L795269K038366j157049
34072i97446j826974O62828L573107M630922L441249L17179l644819n873320m251997
34063c969271j134L205986L338731J698539K72282p66052j950810k544360j482636
34054b198725L76072R63487J18098K1928J650833K720857J067665j313117m47762
34045B959336L589597N963590L487612j014667k791284j419257k09905p88838
34037I776184j642641j747450k120196k904742k129405P53035K651672Q40943
34029C477400k475162k796735O8459J521316r79348l864847k396311K635502O085420
34020A275694N208056K094864l96049j775747k175345p83763J912189K884477
$$ plain form
34012 8244376 8491375 4943179 4347 -4176870 -8081832 -12036984 -13644914 -10417862
34004 -10417862 -3426868 3879002 9039799 10567778 6610544 -2631219 -12004352 -15206458
33996 -15206458 -12231102 -9504222 -11474048 -15454908 -16614953 -14821772 -13534246 -13944138
33988 -13944138 -13666446 -10828343 -6843018 -4754061 -6129032 -9445522 -10686626 -6458044
33980 -6458044 2048716 9037030 9865917 6423283 4938598 8602393 14246533 16583662
33972 16583662 13881999 8649400 4168262 1613574 -17716 -2187173 -5064707 -7138322
33964 -7138322 -6646118 -3454591 760104 4201861 6440046 8203448 10203044 12368375
33956 12368375 13894192 13840470 12021612 9623983 8728739 10674349 14555022 17556406
$$ packed form
34012H244376K46999l548196m938832m181217l904962l955152j607930L227052
34004a0417862O990994P305870N160797J527979l957234r241763r373133l202106
33996a5206458K975356K726880j969826l980860j160045J793181J287526m09892
33988a3944138K77692K838103L985325K088957j374971l316490j241104M228582
33980f458044Q506760O988314Q28887l442634j484685L663795N644140K337129
33972A6583662k701663n232599m481138k554688j631290k169457k877534k073615
33964g138322M92204L191527M214695L441757K238185J763402J999596K165331
33956A2368375J525817n3722j818858k397629q95244J945610L880673L001384
$$ plain form
33948 17556406 17357692 14435970 11503442 10229867 9056141 5079964 -2166813 -9784079
33940 -9784079 -14280900 -14357329 -11072021 -6610868 -3252517 -2312459 -3454800 -5782322 -9504644
33931 -9504644 -14895903 -19458508 -18847612 -12459620 -6015819 -5788611 -11162793 -15661540
33923 -15661540 -14984116 -11141042 -8285101 -7405148 -6623490 -4590545 -1554056 1841334
33915 1841334 4952038 6739571 6440252 4607709 2530258 705575 -1250633 -3251376
33907 -3251376 -4249066 -3461529 -1517552 126360 790547 1236630 2587364 4713594 5933504
33898 5933504 4414035 -184252 -6291438 -11223727 -12462700 -9079026 -2647628 3652505
33890 3652505 7596560 9427792 10466965 11042920 10945318 11236493 13554688 17143585 18440655
$$ packed form
33948A7556406j98714k921722k932528j273575j173726l976177p246777p617266
33940i784079m496821p6429L285308M461153L358351R40058j142341k327522l722322
33931i504644n391259m562605O10896O387992O443801K27208n374182m498747
33923a5661540O77424L843074K855941Q79953P81658K032945L036489L395390
33915A841334L110704J787533k99319j832543k077451j824683j956208k000743
33907c251376r97690P87537J943977J643912O64187M46083J350734K126230J219910
33898E933504j519469m598287o107186m932289j238973L383674O431398O300133
33890C652505L944055J831232J039173N75955r7602K91175K318195L588897J297070
$$ plain form
33881 18440655 14980297 8655635 3663950 1841586 1585741 1171312 1315082 3669112
33873 3669112 7909759 11487360 12035677 9375001 5366047 2443620 2169218 4411530
33865 4411530 7535194 9655737 9911532 8444628 5510472 1444428 -2418080 -3976401
33857 -3976401 -2472344 249521 1639910 1230961 374840 -502765 -2717519 -6882217 -11099023
33848 -11099023 -12720986 -11181216 -8082654 -5007556 -2291836 185069 1951752 2066565
33840 2066565 113597 -2987554 -5319027 -5464155 -3557403 -453877 3535556 7883076
33832 7883076 10318374 8235738 2234423 -3711133 -6584559 -6831146 -5369463 -915629
33824 -915629 6807339 13221675 12533194 5331378 -1051697 -862255 4158457 8425529 9417469
$$ packed form
33881A8440655l460358o324662m991685j822364k55845m14429J43770K354030
33873C669112M240647L577601N48317k660676m008954k922427k74402K242312
33865D411530L123664K120543K55795j466904k934156m066044l862508j558321
33857c976401J504057K721865J390389m08949q56121q77605k214754m164698m216806
33848a1099023j621963J539770L098562L075098K715720K476905J766683J14813
33840B066565j952968l101151k331473j45128J906752L103526L989433M347520
33832G883076K435298k082636o001315n945556k873426k46587J461683M453834
33824i15629P722968O414336o88481p201816o383075J89442N020712M267072R91940
$$ plain form
33815 9417469 8808991 8503145 8296780 7409646 6338323 6206611 6788174 6085364 2570381
33806 2570381 -2272760 -4836585 -3514748 -705739 529754 441960 1221386 2825081 2983437
33797 2983437 958496 -1689607 -4103877 -6682629 -8214446 -6136333 -1090979 2175575
33789 2175575 616809 -3213312 -5271842 -5308780 -5506547 -6510633 -7890180 -10186455 -12893562
$$ packed form
33815I417469o08478l05846k06365q87134j071323j31712N81563p02810l514983
33806B570381m843141k563825J321837K809009J235493q7794P79426J603695J58356
33797B983437k024941k648103k414270k578752j531817K078113N045354L266554
33789B175575j558766l830121k058530l6938j97767j004086j379547k296275k707107
$$ [...]
##END NTUPLES=NMR SPECTRUM
##END=
