##TITLE=31Pdec_103-2025
CDCl3, 64 sc
 22.8.2025
##JCAMPDX= 6.0         $$ Bruker NMR JCAMP-DX V2.0
##DATA TYPE= NMR SPECTRUM
##DATA CLASS= NTUPLES
##ORIGIN= UXNMR, Bruker Analytische Messtechnik GmbH
##OWNER= root
$$ XWIN-NMR		Version 3.5
$$ Fri Aug 22 15:24:43 2025 Russian Standard Time (UT+4h)  she@DPX200
##.OBSERVE FREQUENCY= 81.013821
##.OBSERVE NUCLEUS= ^31P
##.ACQUISITION MODE= SIMULTANEOUS
##.ACQUISITION SCHEME= undefined
##.AVERAGES= 64
##.DIGITISER RES= 17
##SPECTROMETER/DATA SYSTEM= spect
##.PULSE SEQUENCE= zgpg30
##.SOLVENT NAME= DMSO
##.SHIFT REFERENCE= (INTERNAL, DMSO, 0, 198.062)
##AUDIT TRAIL= $$ (NUMBER, WHEN, WHO, WHERE, WHAT)
$$ ##TITLE= Audit trail, XWIN-NMR		Version 3.5
$$ ##JCAMPDX= 5.01
$$ ##ORIGIN= Bruker BioSpin GmbH
$$ ##OWNER= she
$$ F:/spectra/data/she/nmr/P31/2/pdata/1/auditp.txt
$$ ##AUDIT TRAIL=  $$ (NUMBER, WHEN, WHO, WHERE, WHAT)
(   1,<2025-08-22 15:21:54.18 +0400>,<she>,<DPX200>,
      <created by zg, POWCHK disabled, PULCHK disabled
       configuration hash MD5:
       00 E9 B6 7A A2 85 ED C7 34 08 36 98 17 FE 4E 26
       data hash MD5: 32K
       A9 30 76 0F 2A EE 2C 7A 9E AD 4F 0C A4 D7 C3 36>)
(   2,<2025-08-22 15:23:46.96 +0400>,<she>,<DPX200>,
      <Start of raw data processing
       efp BC_mod = 2 LB = 1.5 FT_mod = 6 PKNL = 1 PHC0 = 1572.821 PHC1 = -437.5005 SI = 64K 
       data hash MD5: 64K
       BF 6A B1 9D 1D CD 83 D5 69 BF 31 ED EF 9B B8 4F>)
(   3,<2025-08-22 15:24:10.39 +0400>,<she>,<DPX200>,
      <pk PHC0 = 28.63955 PHC1 = 0 
       data hash MD5: 64K
       EC D9 04 C7 D7 B4 80 59 45 57 94 54 BE 89 1D E2>)
(   4,<2025-08-22 15:24:14.01 +0400>,<she>,<DPX200>,
      <abs ABSG = 5 
       data hash MD5: 64K
       E9 27 99 36 D5 8B 3A A7 FE CF 90 9F B4 92 F1 A3>)
$$ ##END=
$$ 
$$ hash MD5
$$ 17 64 E3 AA 7B CF 1A 87 F9 1C B5 2E 41 8F 86 86
##$RELAX= 
##$RELAX= 
##$RELAX= 
##$RELAX= 
##$RELAX= 
##$RELAX= 
##$RELAX= 
##$RELAX= 
$$ Bruker specific parameters
$$ --------------------------
##$DU= <F:/spectra>
##$EXPNO= 2
##$NAME= <P31>
##$PROCNO= 1
##$TYPE= <nmr>
##$USER= <she>
##$AMP= (0..31)
100 100 100 100 100 100 100 100 100 100 100 100 100 100 100 100 100 100 
100 100 100 100 100 100 100 100 100 100 100 100 100 100 
##$AQSEQ= 0
##$AQ_mod= 1
##$AUNM= <au_zg>
##$AUTOPOS= <>
##$BF1= 81.014009
##$BF2= 200.13
##$BF3= 200.13
##$BF4= 200.13
##$BF5= 200.13
##$BF6= 200.13
##$BF7= 200.13
##$BF8= 200.13
##$BYTORDA= 1
##$CFDGTYP= 0
##$CFRGTYP= 5
##$CHEMSTR= <none>
##$CNST= (0..31)
1 1 145 1 1 1 1 1 1 1 1 1 1 1 1 1 1 1 1 1 1 1 1 1 1 1 1 1 1 1 1 1 
##$CPDPRG= <waltz16>
##$CPDPRG1= <>
##$CPDPRG2= <waltz16>
##$CPDPRG3= <>
##$CPDPRG4= <mlev>
##$CPDPRG5= <mlev>
##$CPDPRG6= <mlev>
##$CPDPRG7= <mlev>
##$CPDPRG8= <mlev>
##$CPDPRGB= <>
##$CPDPRGT= <>
##$D= (0..31)
0 1 0 0 0 0 0 0 0 0.06 0 0.03 2e-05 3e-06 0 0 0.0002 0 0 0 0 0 0 0 0 0 
0 0 0 0 0 0 
##$DATE= 1755861713
##$DBL= (0..7)
120 120 120 11 120 120 24 19 
##$DBP= (0..7)
150 150 150 150 150 150 150 150 
##$DBP07= 0
##$DBPNAM0= <>
##$DBPNAM1= <>
##$DBPNAM2= <>
$$ [...]
##$SUBNAM3= <"">
##$SUBNAM4= <"">
##$SUBNAM5= <"">
##$SUBNAM6= <"">
##$SUBNAM7= <"">
##$SUBNAM8= <"">
##$SUBNAM9= <"">
##$SW= 400.765351723535
##$SWIBOX= (0..15)
0 1 3 0 0 0 0 0 0 0 0 0 0 0 0 0 
##$SW_h= 32467.5324675325
##$TD= 32768
##$TD0= 1
##$TE= 0
##$TE2= 300
##$TE3= 300
##$TEG= 300
##$TL= (0..7)
0 120 53 12 22 120 120 120 
##$TP= (0..7)
150 150 150 150 150 150 150 150 
##$TP07= 0
##$TPNAME0= <>
##$TPNAME1= <>
##$TPNAME2= <>
##$TPNAME3= <>
##$TPNAME4= <>
##$TPNAME5= <>
##$TPNAME6= <>
##$TPNAME7= <>
##$TPOAL= (0..7)
0.5 0.5 0.5 0.5 0.5 0.5 0.5 0.5 
##$TPOFFS= (0..7)
0 0 0 0 0 0 0 0 
##$TUNHIN= 0
##$TUNHOUT= 0
##$TUNXOUT= 0
##$USERA1= <user>
##$USERA2= <user>
##$USERA3= <user>
##$USERA4= <user>
##$USERA5= <user>
##$V9= 5
##$VALIST= <valist>
##$VCLIST= <CCCCCCCCCCCCCCC>
##$VD= 0
##$VDLIST= <DDDDDDDDDDDDDDD>
##$VPLIST= <PPPPPPPPPPPPPPP>
##$VTLIST= <TTTTTTTTTTTTTTT>
##$WBST= 1024
##$WBSW= 4
##$XGAIN= (0..3)
0 0 0 0 
##$XL= 0
##$YL= 0
##$YMAX_a= 55529
##$YMIN_a= -55335
##$ZGOPTNS= <>
##$ZL1= 120
##$ZL2= 120
##$ZL3= 120
##$ZL4= 120
##$ABSF1= 198.0616
##$ABSF2= -202.7028
##$ABSG= 5
##$ABSL= 3
##$ALPHA= 0
##$AQORDER= 0
##$ASSFAC= 0
##$ASSFACI= 0
##$ASSFACX= 0
##$ASSWID= 0
##$AUNMP= <proc_1d>
##$AZFE= 0.1
##$AZFW= 0.5
##$BCFW= 0
##$BC_mod= 2
##$BYTORDP= 0
##$COROFFS= 0
##$CY= -3
##$DATMOD= 1
##$DC= 0
##$DFILT= <>
##$DTYPP= 0
##$F1P= 0
##$F2P= 0
##$FCOR= 1
##$FTSIZE= 65536
##$FT_mod= 6
##$GAMMA= 0
##$GB= 0
##$INTBC= 1
##$INTSCL= 9.790993e-09
##$ISEN= 30
##$LB= 1.5
##$LEV0= 0
##$LPBIN= 0
##$MAXI= 10000
##$MC2= 0
##$MEAN= 0
##$ME_mod= 0
##$MI= 50
##$NCOEF= 0
##$NC_proc= -2
##$NLEV= 6
##$NOISF1= 182.463
##$NOISF2= 159.3651
##$NSP= 0
##$NTH_PI= 0
##$NZP= 0
##$OFFSET= 198.0616
##$PC= 4
##$PHC0= 1601.461
##$PHC1= -437.5005
##$PH_mod= 1
##$PKNL= yes
##$PPARMOD= 0
##$PSCAL= 0
##$PSIGN= 0
##$REVERSE= no
##$SF= 81.0140089999434
##$SI= 65536
##$SIGF1= 159.3651
##$SIGF2= -187.1042
##$SINO= 113.3802
##$SIOLD= 16384
##$SREGLST= <1H.CDCl3>
##$SSB= 0
##$STSI= 65536
##$STSR= 0
##$SW_p= 32467.5324675325
##$SYMM= 0
##$S_DEV= 0
##$TDeff= 32768
##$TDoff= 0
##$TI= <>
##$TILT= no
##$TM1= 0
##$TM2= 0
##$TOPLEV= 0
##$USERP1= <user>
##$USERP2= <user>
##$USERP3= <user>
##$USERP4= <user>
##$USERP5= <user>
##$WDW= 1
##$XDIM= 65536
##$YMAX_p= 303975865
##$YMIN_p= -4003856
$$ End of Bruker specific parameters
$$ ---------------------------------
##NTUPLES= NMR SPECTRUM
##VAR_NAME=  FREQUENCY,     SPECTRUM/REAL,   SPECTRUM/IMAG
##SYMBOL=    X,             R,               I
##VAR_TYPE=  INDEPENDENT,   DEPENDENT,       DEPENDENT
##VAR_FORM=  AFFN,          ASDF,            ASDF
##VAR_DIM=   65536,         65536,           65536
##UNITS=     HZ,            ARBITRARY UNITS, ARBITRARY UNITS
##FACTOR=    0.49542278885378, 1,            1
##FIRST=     16045.7642231865, 0,            0
##LAST=      -16421.768244346, 0,            0
##MIN=       -16421.768244346, -4003856,     0
##MAX=       16045.7642231865, 303975865,    0
$$ Real data points
##PAGE= N=1
##DATA TABLE= (X++(R..R)), XYDATA
$$ [...]
42872A58637q9248l6557O332j8106m6422j0714M5671L8223k8091p0669m3486K1136
42860g3294O9350P5214M2279m211l0585k6776j6363j6953j3004P492J8806j845
42848C0110k3794k108M5459N3686L557m9187n0921j2134K4987M1152L7636J4114
42836A12557j8009k4660J1161N1837M4234p878m6090l6310j1122j7784n0912o2841
42824e5817k9299K0099L8472J3997j9549k0292J4875M3373K5706k0659l6617L31
42812b5380L9133K2393l0278m7327p520L2447K5765J785J0470L8674L1999j6916
42800G5245n5286m7905k1183j3994k2058j6779M640J6910O103j0573o145K3905
42788f7120N1727M1030j1895o5507p5900m8518k5428k2917j3447K1271N5300O0159
$$ y = [158637, 69389, 32832, 39164, 21058, -25364, -36078, 9593, 47816, 19725, -50944, -94430, -73294, -3944, 71270, 113549, 109338, 78753, 51977, 35614, 18661, 5657, 13149, 31955, 30110, 6316, 4208, 49667, 103353, 106910, 57723, 6802, -5332, 19655, 60807, 98443, 112557, 94548, 69888, 81049, 132886, 177120, 169242, 123152, 86842, 75720, 57936, 7024, -55817, -85116, -65017, -26545, -12548, -32097, -52389, -37514, 5859, 31565, 10906, -25711, -25380, 13753, 36146, 5868, -41459, -48979, -16532, 9233, 11018, 21488, 60162, 92161, 75245, 19959, -27946, -49129, -63123, -85181, -101960, -97320, -80410, -74307, -84880, -91025, -67120, -15393, 25637, 13742, -51765, -127665, -176183, -201611, -224528, -237975, -216704, -161404, -101245]
42776a01245N0523N3659N5884K2803l6004o7951m8686j2861K29j496J2858M5031
42764b7256O5637N3555J7033j9738l6992k9772r037P604R705l126k7076n0829
42752e0292n1305j5134L1930M3378J2614j1229R393M1408K4963l5878o9864l3784
42740a03800K7730M2276N052k0314Q513N6030N8201P270m1128m3354j9374j2633
42728c5531k3364j5402J9204M2375K6264p365k3765k2809k3822k5651j4531J426
42716a02971r4j6993k1532L77L1627M7346L8096J2195q514k949K0136K0730j8677
42703a223n4082l2839K5316M8169J1759l1197l4861j8687j7976k5081j6326O24
42691a46404O622R416K2234K8096P078j9421j4375J6604L3791K3130P926L723
$$ y = [-101245, -50722, 2937, 58821, 81624, 45620, -22331, -71017, -83878, -83649, -85145, -72287, -27256, 38381, 91936, 108969, 89231, 52239, 22467, 13430, 21034, 30739, 27613, 537, -50292, -101597, -116731, -84801, -41423, -28809, -40038, -30645, 10763, 35726, -152, -70016, -103800, -76070, -33794, -28742, -49056, -40543, 15487, 73688, 80958, 39830, -3524, -22898, -35531, -58895, -74297, -55093, -12718, 13546, 6181, -17584, -40393, -64215, -89866, -104397, -102971, -103065, -120058, -141590, -141213, -109586, -62240, -24144, -11949, -20463, -23412, -3276, 17454, -1223, -55305, -88144, -62828, -14659, -2900, -34097, -68958, -87645, -105621, -130702, -147028, -146404, -139782, -130366, -108132, -80036, -72958, -92379, -106754, -90150, -56359, -33229, -25303, -21580]
42679b1580j56j0676j5790o158J2323L0315L8298K2339j7445m8974l9861n595
42667f2960P284j1041j9053J2102N3739N8535K0529k4029m0533k5079j239J274
42655c0471k4244m6795k6348L5050Q6077Q1072L0371j5556k3220m946O101k391
42643F4700j3117j0993q840k2703l0096J0322Q6237J20958O7528k0953n8907l7485
42631A46651j2270n975O261K2624O017l6777m5486n589J6884j7414n0232k2499
42619B195K0423l46o3962p8232k3250K4654J7570o62J7248M1832K0904l2367n5708
42606a09701k2412K9188M6209J7877j8310j8331J8370M3953J8549l6518o3623
42595i4749m0208L983L7217N4744N2531J7404l5298n4099j4111M1400N6154L3471
$$ y = [-21580, -21736, -32412, -48202, -54360, -42037, -11722, 26576, 48915, 31470, -17504, -57365, -62960, -55676, -66717, -85770, -73668, -19929, 38606, 59135, 35106, -5427, -30506, -31745, -30471, -54715, -101510, -127858, -92808, -6731, 74341, 104712, 89156, 65936, 60990, 67091, 64700, 51583, 40590, 31750, 9047, -21049, -10727, 75510, 196468, 263996, 243043, 184136, 146651, 134381, 128406, 134667, 157291, 163308, 126531, 81045, 75456, 92340, 74926, 24694, 2195, 22618, 22272, -41690, -119922, -143172, -118518, -100948, -101610, -84362, -42530, -21626, -53993, -109701, -132113, -102925, -56716, -38839, -57149, -75480, -57110, -13157, 5392, -31126, -94749, -134957, -130974, -93757, -39013, 13518, 30922, -4376, -58475, -72586, -31186, 24968, 58439]
42583E8439J6346J5910O369j6827k3185M71K5026K2473K358j2795k0605k6508
42571D7472k1955k13K1444K0175p52j9066k3795j8779m796J9056M1032M5400L2700
42558A37923J2402j6749n3899p1786m1906J3549L4579K486l1359j8771J7772K4089
42546H330n620k8615j9867K152J3674J4266J2530R915M799n814k8221n7975o9412
42533a49858m1884Q010M3450N1125M3273K5309n250l2284l1923j2942q810k3497
42521a35281k3638N150L3563L5476K2177J1958K549n547L572K4749K0718k0565
42509b5119n3179l5999L889J4765N9K564K6579L3441J2841L246K7806N4210M0895
42496A05998n876m3206m2870j4539J2205J7240N088m942m298m719j7091l1583
$$ y = [58439, 74785, 90695, 97064, 80237, 57052, 57523, 82549, 105022, 107380, 94585, 73980, 47472, 25517, 25304, 46748, 66923, 66171, 47105, 23310, 4531, -265, 18791, 59823, 105223, 137923, 150325, 133576, 79677, 7891, -34015, -20466, 14113, 16599, -14760, -33531, -15759, 8330, 2710, -25905, -45772, -43620, -29946, -15680, -3150, 6765, 11564, 5750, -22471, -80446, -149858, -191742, -183732, -140282, -89157, -45884, -20575, -25825, -58109, -90032, -102974, -111784, -135281, -158919, -153769, -120206, -84730, -62553, -50595, -48046, -53593, -50021, -25272, -4554, -25119, -78298, -114297, -110408, -95643, -95584, -93020, -66441, -33000, -20159, -16913, 10893, 65103, 105998, 100122, 56916, 14046, -493, 11712, 28952, 34040, 29098, 24800, 20081, 2990, -28593]
42484b8593l0160j0148J5395L1259K4946p570m8530o6400n0737k2550R65K6392
42472a65731N2607N3334K1252k867J4135M0358K5755j5703k8063n059L620k1475
42460b7837m0177k2325J0491L2013M7304N8036M2120j412l1533k2941n158r116
42448B9465j4192Q749L6686K9004p48m455J8892J8236k6407o6323n1164Q93K7368
42435F004m91m6439n2533j822O3501Q5180M9741pj7936n877J526r834k0320j3980
42421C6713r64O129J3520K6504K7628m99l9763n1561k7564J186J2332K0263L8859
42408F2783M5127J2805l5098m8085j8692R280O691q709j6519k5229l7759k9792
42396h3197M514K4417J480k7178j2595K7226L7740J6443R016K6293L0263O594
$$ y = [-28593, -58753, -68901, -53506, -22247, 2699, -4871, -53401, -119801, -170538, -193088, -192123, -165731, -113124, -59790, -38538, -41405, -27270, 13088, 38843, 23140, -4923, -9982, -6362, -27837, -68014, -90339, -79848, -47835, -531, 57505, 99625, 98213, 66680, 43739, 38581, 29465, 15273, 24022, 60708, 89712, 88964, 84509, 103401, 121637, 95230, 28907, -22257, -21364, 6004, 5513, -40926, -93459, -95281, -31780, 53400, 103141, 103134, 85198, 79321, 80847, 71013, 50693, 36713, 35749, 41878, 55398, 81902, 109530, 109031, 69268, 17707, -9857, -8671, 3661, 23924, 62783, 107910, 120715, 85617, 37532, 18840, 28120, 34811, 26102, 9583, -15646, -53405, -83197, -78683, -54266, -52786, -79964, -92559, -65333, -27593, -11150, -2134, 24159, 54422, 61016]
42384F1016j0889j744R559Q28j7776l5883n6049o0333j9037M5335O1358Q529m1800
42371e6886k6223K2296L5703J2649k440m520k1130m1366k5697J5139J9763l0627
42359a03339p5109n4147J2503N6538M3802K016j8659N818N5846Q7204P1388K1639
42347A05500k3150l6805k2454J207J7631J9271P739j0974l2339m9109m5216j1051
42335g9750L3151N0627L1997M680p791r054m060J4580L6536K8817j0203k9465
42323F0065K820L9714J7912m5286p4153m0927P876K8351K5282J5226j505j5594
42311A9781l666K8578L7398Mm9057o3907m2038j0153J7928M2164N5442N0956L9037
42298A22467L1827J9064j6080n8707o5033j6208M3426M2478l5667j20393j22424
$$ y = [61016, 50127, 48383, 57942, 58770, 40994, 5111, -50938, -111271, -130308, -84973, -23615, -15086, -56886, -83109, -60813, -25110, -12461, -14901, -19421, -40551, -81917, -107614, -92475, -72712, -103339, -178448, -232595, -220092, -163554, -119752, -117736, -136395, -130577, -74731, 12473, 83861, 105500, 82350, 45545, 23091, 24298, 41929, 61200, 68939, 57965, 25626, -23483, -68699, -79750, -46599, 4028, 36025, 40705, 32914, 23860, 19800, 34380, 70916, 99733, 89530, 60065, 62885, 102599, 120511, 75225, 1072, -39855, -31979, -3628, 21654, 36880, 35375, 19781, 16115, 44693, 82091, 82095, 33038, -30869, -72907, -83060, -65132, -22968, 32474, 83430, 122467, 154294, 173358, 157278, 98571, 33538, 17330, 60756, 103234, 67567, -52826, -175250]
42287a75250l2624O9984J11250R2934N9519L2930J1568J947O502J40l3698n8935
42275H6267l1512K2109L1449j2858m5410k9223n059j1244k0522k16K0596O6m0580
42262c6137m9130k3247j719N874K2272M5210M4877J9398p7o149k6351o3545p3482
42249a42206k8003L6030O1450L9751P255q423q557j751Q007J3032M810j1243j9863
42236d9711j7440j5060j6570r196J4314L6280L2192L632k3376l3922m0027n2357
42224a71241n5138k9651Q527K3659J1413P726L6025P1979P9386N9574L9657K6907
42212A08823O681j9496k7407q742J1772J1526J167M277K1648L3287K5179j670
42200A67045l8353o6851o2610k1865J8872J7302j8770l7133j0568K7580L3676
$$ y = [-175250, -207874, -137890, -26640, 66294, 125813, 158743, 170311, 172258, 178760, 178900, 145202, 86267, 54755, 76864, 108313, 95455, 50045, 20822, 15763, 4519, -16003, -16219, 4377, 4443, -36137, -85267, -108514, -110233, -104359, -82087, -36877, 8000, 27398, 27321, 21172, -5179, -68724, -142206, -170209, -134179, -72729, -32978, -25723, -34146, -42703, -44454, -36447, -23415, -18605, -29848, -49711, -67151, -82211, -98781, -107977, -93663, -57383, -25191, -21559, -44935, -78857, -118884, -171241, -226379, -256030, -247503, -223844, -212431, -204705, -168680, -96701, -17315, 42259, 81916, 108823, 115504, 96008, 68601, 59859, 71631, 83157, 84324, 88601, 110249, 143536, 168715, 167045, 128692, 61841, -769, -22634, -3762, 13540, -5230, -42363, -52931, -25351, 8325]
42189H325J3179K815J1787J5099R9j3889q526O107O435j8197n7902q6056p3380
42176a94104k0030K8105K3062k2874m9620k9292M021J7676K9463O3323R4355Q1446
42164B5531L1608j1537k8648l2907k9472j0522J3416J8992Q094L898Q406J97k4082
42151b7026m2520m4365l7540k0117J4193M2161L2980R944L0774Q8127R6274J6020
42139A58905p0381o9349j0555O300l1178l6107L0303Q9323N8250l3239r1107p8098
42127g6933l2800N378L1167L9621J4851l1055n0434j8848K5772L2538P533J02
42115e3108K7003M7328K1034l6792p5658o5348j9341K2404K5220q559l2375k247
42103a50439O0144Q0677K5682n1481q1917o3002l2215K363M8898P7158M8984m458
$$ y = [8325, 21504, 24319, 36106, 51205, 51304, 37415, 28889, 34996, 41431, 23234, -34668, -120724, -194104, -214134, -186029, -162967, -185841, -235461, -264753, -260732, -243056, -213593, -150270, -55915, 25531, 57139, 45602, 16954, -15953, -45425, -55947, -42531, -23539, -15445, -11547, -3141, -2944, -27026, -69546, -113911, -151451, -171568, -157375, -115214, -82234, -72290, -41516, 46611, 142885, 158905, 88524, 19175, 8620, 14920, -16258, -52365, -22062, 67261, 125511, 92272, 1165, -76933, -109733, -104355, -73188, -33567, -18716, -49771, -100205, -119053, -93281, -60743, -53210, -53108, -26105, 21223, 42257, 5465, -70193, -135541, -154882, -132478, -107258, -115817, -148192, -150439, -90295, -9618, 16064, -35417, -117334, -180336, -212551, -210188, -161290, -84132, -35148, -39606]
42091c9606j0794L0868M1858q426m4297O74P4697P8189J562p2994q4119m5342
42079g7730P83K6604J9889j1991l5000k2165N692O136k2481m1761l3315j6945
42067b02284o041J1464L5138L6291L054l0913l0232o317P658J1981L3687O9230
42055f7284P3766K4252l5416m2490J976L2456N823m4069n7739k7518Q149K6724
42043a01370L4918K9771k193m0293l6098J4084M9359K7674j1821r074K8950M8466
42031C2373L2555J1519J911j0222k3894j2442K6101M7627J4819n1381r3430p8251
42019a02715k3662K7487M8262M2911K6793K510l0019m8710k7376J4958K2520j7266
42007f4307m2283n92O8806Q8244M7093r20k6258m4757n7599l9567K590K2812N480
$$ y = [-39606, -50400, -19532, 22326, 13900, -30397, -29723, 44974, 123163, 124725, 51731, -32388, -77730, -76947, -50343, -30454, -42445, -77445, -99610, -93918, -87782, -110263, -152024, -185339, -202284, -208325, -196861, -161723, -125432, -122378, -153291, -183523, -189840, -182182, -170201, -136514, -67284, 6482, 30734, -4682, -47172, -45196, -12740, -6917, -50986, -108725, -136243, -128094, -101370, -66452, -36681, -38874, -79167, -115265, -101181, -51822, -24148, -35969, -45043, -16093, 32373, 64928, 76447, 78358, 68136, 44242, 31800, 57901, 105528, 120347, 68966, -24464, -102715, -126377, -98890, -50628, -7717, 19076, 21586, -8433, -57143, -84519, -69561, -47041, -64307, -106590, -107182, -38376, 49868, 96961, 96041, 69783, 25026, -32573, -72140, -69550, -46738, -41258]
41994d1258j2314p479m453j7354j5706J6448L8982J7204j9121k6394j7278k5105
41982a13828l1876K406N6976O6815K1468j7458j0025R642j577k9450l6694k5606
41970a09207k3420k7285q710L1896N4190L0416j6718m1182k2946J9671N3607N4973
41958d715J9657l2955o7037n5181m838M3658N1985J9870j3509p523L5509O6557
41946E1478M1743k0514n2507j9481L1451L0760k0019n3723l4496j275K297o629
41934e0915Q092L1455K1561j3651k0198J9857N9663N4678J8516p939j1806r059
41922A00254j1302j4928j3209m234O527O329j0348k5530j4509J6491L0896R246
41910G5683k5211m0538l4858k5260j6999m552R091J4816J3049J1565J2268J1398
$$ y = [-41258, -53572, -61051, -65504, -82858, -98564, -82116, -43134, -25930, -45051, -71445, -88723, -113828, -145704, -143298, -86322, -19507, 1961, -15497, -25522, -15880, -17457, -46907, -83601, -109207, -132627, -159912, -168622, -136726, -82536, -52120, -68838, -110020, -132966, -113295, -59688, -4715, 14942, -18013, -85050, -140231, -145069, -101411, -49426, -29556, -43065, -50588, -15079, 51478, 93221, 72707, 20200, 719, 32170, 62930, 42911, -10812, -45308, -46583, -44286, -50915, -42823, -11368, 10193, -3458, -23656, -3799, 55864, 110542, 129058, 121119, 109313, 100254, 88952, 74024, 60815, 56581, 63108, 69437, 59089, 33559, 19050, 35541, 66437, 75683, 50472, 9934, -24924, -50184, -67183, -71735, -62644, -47828, -34779, -23214, -10946, 452]
41898D52P057j610j3365j5521R935N7979R2369Q2702L9310m564l2307m5606m1305
41885A35526j7959l54k0660o6405q1396l8364J6982K2811j7906m8432l9506j7553
41873a73216q435J939K9859N5335N5596M7843N5850N5482P672o2262q0598l1982
41861d6917J1368m104l4720j3627M1760N7555J4607l0683l1377j398K2413K4102
41849H979N975k0160l0332q713K3547K9204O593j1296j0139j0222k3979l5401
41837g5944l2537k6335k4312j5475P055L5027O1706P9847O4948L331o0359n8401
41825d1449J262L0093j6656o8790m2644L5218O9425L0277k2710m0085l5468l0530
41813a32057j0133L6807P3848N6102k281l5254l714N5211P2455L0935j6643j9282
$$ y = [452, 7509, 5899, -7466, -22987, -13052, 44927, 137296, 219998, 259308, 254744, 222437, 176831, 135526, 117567, 117213, 96553, 30148, -51248, -89612, -72630, -49819, -67725, -116157, -155663, -173216, -181651, -179712, -149853, -94518, -38922, 8921, 64771, 120253, 127925, 65663, -14935, -46917, -35549, -39653, -74373, -88000, -46240, 11315, 25922, -4761, -36138, -37536, -15123, 8979, 14954, -5206, -35538, -44251, -20704, 8500, 15093, 3797, -6342, -16564, -40543, -75944, -108481, -134816, -159128, -174603, -167548, -132521, -70815, 9032, 73980, 77311, 16952, -41449, -40187, -10094, -26750, -95540, -138184, -102966, -33541, -3264, -25974, -66059, -101527, -132057, -142190, -105383, -31535, 24567, 22286, -12968, -16682, 38529, 110984, 141919, 125276, 105994]
41801A05994P849J4431q003k0002k621J3754L390j3711j1296l663j9350n1130
41789A5642o6437n3609k8056l555J6149K7091L0492L8682N3973N3941K1639k1007
41777H4945l6104j8446K864N581n496j5380j6017q780l665j0300k0251j1695J6324
41764c6420L2706J4621j9189l4714k3661J830L3163N8614N5301J8966j7288k5558
41752E8371k3671l7565m7301j8967K6601L5129N260p295J8353L2803j352m4574
41740d208l8540O987L2149J4019r306l21K9202M3078L1152J6115J6416J9298o22
41727A55419m1577o7689m9168p46L2707K7225N047N085L4629N8449M0242r294
41715A90329m0310k6858k482j0744l8202l5388K646K6569J1992n057M599J3233
$$ y = [105994, 113843, 128274, 120271, 100269, 97648, 111402, 114792, 101081, 89785, 86122, 66772, 15642, -50795, -104404, -132460, -136015, -119866, -92775, -62283, -23601, 30372, 84313, 105952, 84945, 48841, 30395, 33259, 38840, 33344, 17964, 1947, -6833, -10498, -20798, -41049, -52744, -36420, -3714, 10907, -8282, -42996, -66657, -64827, -31664, 26950, 82251, 101217, 83929, 58371, 34700, -2865, -50166, -69133, -42532, -7403, -2143, -9438, 8915, 41718, 40366, -4208, -42748, -35761, -3612, 10407, 1101, 780, 29982, 73060, 104212, 120327, 136743, 156041, 155419, 113842, 46153, -3015, -3761, 28946, 56171, 61218, 66303, 100932, 159381, 199623, 190329, 150019, 123161, 120679, 109935, 71733, 36345, 38991, 65560, 77552, 72495, 77094, 90327]
41703I0327q123l0991j7547R772O105j5166n239L1273L9580O824j6631k021J2879
41690A01042r776m5965m8926j7283R652O135j6239k9188j5979J5256M0057M3864
41678C2650L4569K0865n228m3763o4400m2079j948J0129o127r872J4345L8530
41666b2329M0511K8122J1322o821r232J8119M4422K1493l7847o5039l4952n59
41654a2790m684j9214r111K262j7308m2543l2549l105L428o054Q043M2013N2265
41641c9347K9480R620O500r664m9925p1712l4736L9110Q9027Q1277L2675j7300
41629F5005l9640l0045p303K497j1117l3069l7242j2371K3836L7364J1368l1951
41617f2668n1947l4282l309J3682J7633K2845K8106K1001J086j9828l4861m2799
$$ y = [90327, 82204, 51213, 33666, 43438, 49543, 34377, 29138, 60411, 99991, 106815, 90184, 88163, 101042, 91266, 45301, -3625, -20908, -11256, -5121, -21360, -50548, -66527, -51271, -11214, 32650, 67219, 88084, 82856, 39093, -25307, -67386, -69334, -59205, -65332, -75204, -60859, -22329, 18182, 46304, 57626, 50805, 41573, 59692, 104114, 125607, 87760, 22721, -12231, -12790, -17474, -36688, -45799, -43537, -60845, -103388, -135937, -139042, -135614, -141668, -133625, -91612, -39347, -9867, -247, 6253, -3411, -53336, -125048, -159784, -120674, -31647, 49630, 82305, 65005, 25365, -4680, -11983, -9486, -20603, -53672, -90914, -103285, -79449, -42085, -30717, -62668, -114615, -148897, -152206, -138524, -120891, -98046, -69940, -48939, -47853, -67681, -102542, -145341]
41605a45341l6878j1879J8480L0139J9485J0442K3203M7022N4293L5440Q501n626
41593D7281p033j0056j9227k3014j2615K829N878r079k9363l3881j0261K8456
41581g0085M5715J8237k5066k6144K5254O5203L5341l3004n6436j2750L2174K0540
41569A8979k0416k6279J1316L9451K2461j2264j7872P428K2167R21l3010m3338
41557c0456k8659j4230j0601r711j3693k9824l7522o014M5317N5118J0508k3976
41545i3743k017L4026K6490n361r422O826L058p551J7417N8610N5605J0641j5883
41532G8696j2614k7752o3489n7534L859M8413L3472J2314L4353N9126L2489j7749
41520A23584l0958q077Q516Q902Q635K786j6415k6746j2456k303k1429l9162j8542
$$ y = [-145341, -182219, -194098, -175618, -145479, -125994, -115552, -92349, -45327, 8966, 44406, 52907, 47281, 40248, 30192, 10965, -12049, -24664, -21835, -15957, -25036, -54399, -88280, -98541, -70085, -24370, -6133, -31199, -57343, -32089, 33114, 68455, 35451, -20985, -33735, -1561, 18979, -1437, -27716, -16400, 23051, 45512, 33248, 15376, 22804, 44971, 45892, 12882, -30456, -59115, -73345, -83946, -93657, -107350, -137174, -174696, -180710, -135393, -80275, -69767, -93743, -95760, -61734, -35244, -40605, -50027, -43201, -40143, -47694, -30277, 28333, 83938, 94579, 78696, 66082, 38330, -25159, -82693, -78834, -30421, 3051, 15365, 49718, 108844, 141333, 123584, 92626, 84549, 93065, 101967, 110602, 113388, 96973, 70227, 57771, 55468, 34039, -5123, -23665]
41507b3665J4556J1396j6193j5062K2239N0224M3837K4113J0501m250k5215l9426
41495E3055l7576k5653j0320Q171K6507L4282K0407j6138n3903n7482k1281Q797
41483g1134n722l0758p742M5275N4607J3462n458K1937K8869j6604m4188k092
41471a9548M7870L4433o046m574K2243K4384K0400M2101M0025l5903j10156o8730
41459a3501N4015J09402M8849k5280l2983j6210l4935p2129q6344p6501n4816
41448b00433k0836R901J0400p382m158J8060K1179N492Q637K9242K7858P438J2108
41435h2494L8888L5296l854k4161j1124j1904l7579l7234J389J9016r329k6243
41423a49333M605L3363J5283j2825n438J4719J3301J2031L6410N3329K5413j9655
$$ y = [-23665, -9109, 2287, -13906, -28968, -6729, 43495, 87332, 111445, 121946, 117696, 92481, 53055, 15479, -10174, -20494, -12323, 14184, 48466, 68873, 52735, -1168, -58650, -79931, -71134, -76856, -107614, -115356, -70081, -15474, -2012, -7470, 14467, 43336, 26732, -17456, -19548, 28322, 62755, 56709, 52135, 74378, 98762, 119162, 161263, 201288, 165385, 55229, -13501, 40514, 149916, 198765, 173485, 140502, 124292, 89357, 17228, -69116, -145617, -200433, -221269, -211368, -200968, -208350, -212508, -194448, -173269, -167777, -159140, -129898, -102040, -94602, -82494, -43606, -8310, -12164, -36325, -47449, -59353, -96932, -134166, -132777, -113761, -123090, -149333, -144728, -111365, -96082, -108907, -114345, -99626, -86325, -74294, -37884, 15445, 40858, 21203]
41411B1203l3444j9136p074J519J7406K8778K8338L5450N1547L8373j7344o4610
41399H1006n8988k7419j6104j9066q717M546l274j9470j7220J90J6984L4223M6854
41386A3545L0210j4433m1643k5868j010o17o207O173J8827J5349J9546M5076N7287
41373A16235L3523Q687R811J668m3793p9728n3886K867K6602J4764K313j1172
41361B7891l7117m3375k977L8287K2289k4309l1681L049K5482J6949l57k4075
41349b9944n7374o1602r158M1897J8240m4899m9605R159M1386J5156J1L8077P7283
41336a1373O8892M0287K7242J2613k0000l8432j8213O410l648k8311k2500J4626
41324B7593M1610K8692j3009m4185l2832Q534K9013L662k8840k6272j0308k1235
$$ y = [21203, -12241, -31377, -38451, -36932, -19526, 9252, 37590, 73040, 124587, 162960, 145616, 81006, 22018, -5401, -21505, -40571, -49288, -44742, -48016, -67486, -84706, -84516, -67532, -33309, 13545, 43755, 29322, -12321, -38189, -39199, -39816, -46023, -39850, -21023, -5674, 13872, 58948, 116235, 149758, 158445, 168256, 169924, 126131, 46403, -7483, -4616, 21986, 36750, 39063, 27891, -9226, -52601, -55578, -17291, 4998, -19311, -50992, -47943, -22461, -5512, -5869, -29944, -87318, -148920, -158078, -116181, -97941, -142840, -192445, -183286, -141900, -126744, -126733, -88656, -11373, 57519, 97806, 125048, 137661, 117661, 79229, 61016, 67426, 63778, 35467, 12967, 27593, 69203, 97895, 84886, 40701, 7869, 16403, 45416, 49078, 20238, -6034, -16342, -37577]
41312c7577l5709l952M8423M3799k0257n6883k2295K2298J3605k4812l7928k0148
41300a31436L456K5128M2352M0457K1476J1781J6550R872j0685j2199R067J1363
41288C7182j5006j8622K4021N4856K3515k6588k5322J5882L1569O152j9306k4947
41276F3386l0410m2567m3874l3253k8601k5334K705N3166Q4633O9039K6755l439
41264I2206r485r150j9821l6339l8641j8497P563J8721J5323R447l77k0754l6927
41251d6731k7022j955M405j2909k6180k5715k7822k5423J1789O7843P4401J2317
41239b3002m0062j3489M8755N9549J8023q495n906k5012p2134q0675k0314M3045
41227a19717M2814P300K877K6228K2028j3645k2252J8251M9978K1173l3799m5106
$$ y = [-37577, -73286, -77238, -28815, 14984, -5273, -62156, -84451, -62153, -48548, -73360, -111288, -131436, -127980, -102852, -60500, -20043, 1433, 13214, 29764, 39636, 28951, 16752, 25819, 37182, 22176, 3554, 27575, 82431, 105946, 79358, 54036, 69918, 101487, 107639, 88333, 63386, 32976, -9591, -53465, -86718, -115319, -140653, -137948, -84782, -149, 68890, 95645, 92206, 82721, 73571, 53750, 17411, -21230, -39727, -32164, -13443, 1880, 11327, 10950, -9804, -46731, -73753, -75708, -71303, -84212, -110392, -136107, -163929, -189352, -177563, -109720, -35319, -23002, -63064, -76553, -27798, 31751, 49774, 41279, 35373, 10361, -61773, -142448, -162762, -119717, -76903, -69603, -66726, -40498, -18470, -32115, -54367, -36116, 13862, 35035, 1236, -43870]
41215d3870p865J9903Q458p336Q871M1084N2219L6622J5716K564o041j7081l6630
41202F6614o1931o9936l9782M412J0879k2562l5202K843L6206J1977k9029j6897
41190a42408L1002M1532J0427L280L5773M7278R872k4316j4833O384M044j516
41178F519J1289J5224j1004l2163j4204J3106N729k1066k4065n393J871k059J0268
41165d5948L6502M4538K5619N836M578J2714J2487k974k6919m1266l0567l556
41153h956J4378J6410J7967J9788K497k9395l9261j5245O815L943M064K7261L5732
41140E5998o073n7724n0913P910M4096K0083k0013k0130J5111L5798J3988k0758
41128A7373j5041L7335P1618K7096o2785j03383o6562k2788k2318j7232M4772
$$ y = [-43870, -51735, -31832, -23374, -30710, -21839, 19245, 71464, 108086, 123802, 126366, 120325, 103244, 66614, 4683, -65253, -105035, -100623, -89744, -112306, -147508, -144665, -108459, -96482, -125511, -142408, -111406, -69874, -59447, -56167, -20394, 26884, 36756, 12440, -2393, 3991, 8035, 6519, 17808, 33032, 22028, -10135, -24339, -11233, -5504, -26570, -50635, -56028, -54157, -56216, -45948, -9446, 35092, 60711, 66547, 71125, 83839, 96326, 93352, 66433, 25167, -5400, -8956, 5422, 21832, 39799, 59587, 62084, 32689, -6572, -21817, -15002, -11059, -6995, 20266, 55998, 49925, -7799, -58712, -50802, -6706, 13377, -6636, -26766, -11655, 24143, 38131, 17373, 2332, 39667, 111285, 138381, 75596, -27787, -94349, -117137, -139455, -156687, -111915]
41117a11915J13373J00828J5193n4202o3858m8493l5621r719K9149M3760J9400
41106b105r890j5825j0338q326j660R281J07l6145o5151n3654j0628L2811N9792
41093a11731O5368M3186N95k8308j2276L5001O0712K8522l7195p1682l9498K3068
41081d4238M8529J6628k9539m5901l5173k1222r182N303J3576Q185K96j04n85
41068i3427k026J4087M7238N7069J6467m0351o0846m1926j5883N852K8759L7503
41056d7484J6055o971J2391O2180Q2377M5857j1281m1104k7088K0346P0486P7648
41044B53412K2221n3354q7311p2472m8351l1413n365K4233K6320L742j553K0206
41032E0315K4390j3500m9517l2440K1138M9224K2403k9124n5615l5810P954L2877
$$ y = [-111915, 1458, 102286, 117479, 63277, -581, -49074, -84695, -94414, -65265, -21505, -2105, -11995, -27820, -38158, -46484, -48144, -38863, -38756, -74901, -140052, -193706, -204334, -171523, -111731, -46363, -3177, -2582, -30890, -43166, -8165, 52547, 81069, 43874, -27808, -67306, -44238, 4291, 20919, -8620, -54521, -89694, -110916, -120098, -114795, -101219, -93034, -92738, -92842, -93427, -95453, -81366, -34128, 22941, 39408, -943, -61789, -103715, -119598, -113746, -84987, -47484, -31429, -38400, -26009, 36171, 118548, 164405, 153124, 112020, 84932, 105278, 175764, 253412, 275633, 222279, 134968, 62496, 14145, -17268, -22633, 1600, 27920, 31662, 30109, 50315, 74705, 61205, 11688, -20752, 386, 49610, 72013, 42889, -12726, -48536, -40582, -7705]
41020g705J9444r008j9561j1896p842j0834m916J0957J7549N000j5160k5909j5313
41007g5194J7599M9086M2983P66k7891j5454j369k2363m0165n263M2597K4906
40995i762m1535n8734q67M4828J6078l6772m3001j2538O859R222J2844J3568O169
40982i3641J0844L5161M9565L7895K7527L2602J9345k6776n4023k2506J9469O047
40970D1509l7694l5783J2733L0033j9120p6421p6905k9159J5424L1602L1836L4128
40958g7817M1078M1625K4697l656k0058j0149J2635K6420K8186K6600J9250k717
40946A06094l2729m9027l6256R83M0315N3768L0686o455k4425k0502k0219l0648
40934A1585k6984J363K4344J4882p488n171K2873M2008K6539j6186n5600n8414
$$ y = [-7705, 11739, 2731, -16830, -28726, -36568, -47402, -52318, -41361, -23812, -18812, -33972, -59881, -75194, -57595, -8509, 34474, 35240, 7349, -8105, -9474, -31837, -72002, -77265, -34668, -9762, -51297, -110031, -110898, -66070, -49992, -86764, -129765, -142303, -135444, -126222, -113378, -99810, -93641, -82797, -47636, 1929, 39824, 67351, 99953, 119298, 92522, 38499, 15993, 35462, 41509, 3815, -31968, -19235, 10798, -8322, -84743, -161648, -190807, -175383, -143781, -111945, -77817, -36739, 4886, 29583, 25927, 5869, -4280, 8355, 34775, 62961, 89561, 108811, 106094, 73365, 24338, -11918, -10935, 29380, 83148, 113834, 107379, 82954, 62452, 42233, 11585, -15399, -14036, 10308, 25190, 17702, 12531, 35404, 77412, 103951, 87765, 32165, -26249]
40922b6249j5488L8323N0212R441l9086n3888m3246l5915l5341k7778j0146J6344
40910a72817N5823R3421Q7504K1500n5800p8738m2303J435J4062M938M34J0355
40898f0186K6256L1093J0600k9034n8788n5182k4652R398L1397L6382K5463J0344
40886d6909N328O416K91k009K3738N9790N0756j0355n1296j9666L3041K5211l2073
40873D2263n5938j6257L4747N3590N2036M1590L859n4114p5866l0443L0562L6122
40861F2151j1932n2238m9485k2860R74J8449K8782K2631N841L727K1237K4688
40849E1965q613m3204k7782K3307L9253o642n4911m6084l985J0937m157m229K0758
40836e3387L6264L0258K6765K8701R185k8502m3027k5086j6310l5163m3148j4191
$$ y = [-26249, -41737, -3414, 46798, 56239, 17153, -36735, -79981, -115896, -151237, -179015, -189161, -172817, -116994, -23573, 63931, 85431, 29631, -49107, -91410, -89975, -75913, -70975, -70541, -60186, -33930, -2837, 7763, -21271, -80059, -135241, -159893, -150495, -119098, -82716, -57253, -46909, -41581, -35165, -34874, -36883, -13145, 46645, 97401, 87046, 35750, 16084, 49125, 74336, 42263, -13675, -29932, 4815, 58405, 110441, 152031, 155890, 101776, 25910, -4533, 26029, 62151, 50219, -2019, -51504, -74364, -73390, -54941, -26159, -3528, 2313, 6040, 27277, 51965, 43352, 148, -27634, -4327, 34926, 28284, -26627, -72711, -76696, -65759, -69916, -74145, -53387, -17123, 13135, 39900, 68601, 77786, 49284, 6257, -18829, -35139, -70302, -113450, -127641]
40824a27641K0131K9167L0337L8781K7944j2129l3216k300L3562J7737k5454l6878
40812c9959j7924p343j80K8571M7412N260o7592q4850l1333K0486K9079L2876
40800h5497N8877O5630J9433l6397l7867J4198O4683P0944L1181k5842n7185l8515
40788D3643K886J5641n494j3523J4489L9988K6064m829j1510J834M214k365J1785
40775A22823M4719N1939P677m9690n6374k192M9137L1753l9828q5464o1807j7382
40763d689k0479o1219p0058k1513L2415M0295J6607O927K1418L2502K1561O89
40751e544r182n059k587j3888k8866k5921k253K0236K5444K1109J5464L39k1975
40738c2683k0979K0858O8944P5164M0906L890k2626n1863p4674o2104k0014R142
$$ y = [-127641, -107510, -78343, -48006, -9225, 18719, 6590, -26626, -28926, 4636, 22373, -3081, -39959, -57883, -65226, -65406, -36835, 10577, 15837, -51755, -136605, -167938, -147452, -118373, -85497, -26620, 39010, 58443, 22046, -15821, -1623, 63060, 134004, 165185, 139343, 82158, 43643, 46529, 62170, 56676, 43153, 57642, 97630, 123694, 118865, 107355, 109189, 113403, 111038, 122823, 167542, 219481, 227158, 177468, 121094, 118902, 168039, 199792, 159964, 74500, 12693, -4689, -25168, -86387, -156445, -177958, -145543, -105248, -88641, -81714, -60296, -27794, -6233, -5544, -14726, -19785, -22372, -36260, -65126, -91047, -93300, -73064, -47620, -26511, -11047, -10708, -32683, -53662, -32804, 36140, 111304, 152210, 156100, 133474, 81611, 6937, -55167, -75181, -66039]
40726f6039R342Q886K2332K3827J054j1852R361K8092k198n8027o5912p78P5945
40713b5967Q9199L4948k5790m2007j8623J0500K8922L9411L6749J0363k5623l6033
40701G6049r511K5433M0568L7238K2341j1779n9565q5051o3985k0486P637J7017
40689b4094K2645K0546L711q077M177J9105M649k7170l6313j4658Q259J0151n983
40676b3052k5873k7867N627N1548N3139N0l8725j0768L5352K6445j6797j9787
40664I292J8958L5112J6134J1269K5994R543l8074m7723Q18L5769Q481l2121k7576
40651B5876J852R628R26L924J3458J2540P956M565j2851l7632k9939J5632M1986
40638E7921J1447l2960l4680o863K473j0411j4821n742k319n871l694N22l385
$$ y = [-66039, -56697, -47811, -25479, -1652, -598, -12450, -3089, 25003, 22805, -35222, -101134, -101912, -25967, 63232, 98180, 72390, 30383, 11760, 22260, 51182, 90593, 127342, 137705, 112082, 76049, 66538, 91971, 132539, 169777, 192118, 180339, 120774, 35723, -28262, -48748, -41111, -24094, -1449, 19097, 22808, 14731, 18908, 38013, 42662, 15492, -20821, -35479, -27220, -17069, -23052, -48925, -76792, -71165, -19617, 33522, 33572, -5153, -15921, 19431, 45876, 29079, 9292, 28250, 63362, 79496, 90765, 116759, 126302, 88228, 40505, 41323, 77092, 85573, 53452, 25876, 27728, 37356, 38282, 42206, 55664, 68204, 76160, 80725, 67874, 30242, 303, 15935, 57921, 69368, 36408, 1728, -5135, -2662, -13073, -27894, -33636, -35955, -41826, -45520, -44998, -48383]
40625d8383o622L192J5817J3518j820j5733j9165p781J4575K4956M097k4211j5541
40612f3101K4702L9232L069l8035l6247m613J4437M780k2525m8616m9566j4982
40600a91465K6318L8231L4560N2514P4846M9990q572k9554l672P21l2619l1021
40588a9723K7784N3071r757p2943m2762K8542L4551j4757k9789N293L1765L1197
40576B2472L0695K1242k3568o8126n4484m072J5742O926K2826N3649L9561q245
40564E4618j2827L3946N1999Q338l3162k7956j7513l6897m5299m210M6426M8824
40552F6287J2014j4887j2200R673M0310O1696M5707n164m5079m2922k2374j6407
40540G6654j6002J399K1549J2651j9764l4860j1648K4351L3909Q223k5756l8694
$$ y = [-48383, -55005, -51813, -35996, -22478, -24298, -40031, -59196, -66977, -52402, -27446, -23349, -47560, -63101, -38399, 833, 3902, -34133, -70380, -74993, -60556, -55776, -78301, -126917, -176483, -191465, -165147, -126916, -92356, -39842, 35004, 84994, 76422, 46868, 43196, 43917, 11298, -19723, 8061, 61132, 51375, -21568, -64330, -35788, -1237, -15994, -45783, -40490, -8725, 22472, 53167, 74409, 50841, -17285, -71769, -75841, -60099, -53173, -30347, 23302, 62863, 54618, 41791, 75737, 127736, 136074, 102912, 74956, 57443, 20546, -24753, -28963, 17463, 66287, 78301, 63414, 51214, 60887, 101197, 162893, 208600, 203436, 158357, 115435, 93061, 76654, 60652, 62051, 83600, 96251, 76487, 41627, 29979, 54330, 88239, 96462, 70706, 32012]
40528C2012l1338k8169m0161m7467k7037J5646N3817O7633N5710L1966J9368K9438
40516A31418L9593J3888m2777p9151o2408j9400O261Q228N575N883N123L38j5651
40503c080m4840n9540k7652K7215M4380K0696J9876O0504P3723J9266l7441l0343
40491F2764Q55r917l7499k1385J7168J6410j0744p585J3709l403m7037n4363k4312
40478a05339r306r850J6646N4318M6999J1382J6830N1863L2964m0258o4891j774
40466d16N7050L5533j9155l3692j9254k1723l7382l9747l1281j9618M188K8518
40454i6979K0656p790q17M7175O7988K5495k7800l9202k8616k9323k7117q191
40442a04521j967k3129k9997O981M9334N2746L2324J7952m19l0121l1482K2662
$$ y = [32012, 674, -27495, -67656, -115123, -142160, -126514, -72697, -5064, 50646, 82612, 101980, 131418, 171011, 184899, 142122, 62971, 563, -18837, -12576, -4348, 1227, 7110, 12233, 12571, -3080, -47920, -107460, -135112, -107897, -63517, -42821, -22945, 37559, 111282, 130548, 93107, 62764, 63619, 53702, 16203, -5182, 11986, 28396, 17652, 10067, 23776, 20373, -26664, -81027, -105339, -114645, -124495, -107849, -53531, -6532, 4850, 21680, 73543, 106507, 66249, 1358, -416, 56634, 92167, 73012, 39320, 20066, -1657, -39039, -78786, -110067, -129685, -125497, -96979, -76323, -84113, -84930, -37755, 30233, 55728, 27928, -11274, -39890, -69213, -96330, -104521, -106488, -129617, -159614, -152633, -103299, -50553, -18229, -277, -696, -30817, -62299, -39637]
40430c9637Q2906P8118Q248o3431q6307n5410J970L9981K4273k3791m3604j5743
40418i2427J3048M842j5663q120K5943N8209O7044L8253k4520p6771o8810j4917
40406i3889K4078K8430K5789J5210k7565o4712k3418O6759P9655j7146r3994m9701
40394a30504M0633N6885J3329q11J8920J1230k2423k2159K2708O3053O8135M1975
40382A60971j0860p0289q6731m5997o871j2283j7675K0205M7997L856n6414l4879
40370a08970M4429O6527L354n6595n5955l4409l1191k1969J5490N0810N0198K2450
40358e5831l834n680L2842R5651J17785N1593n4187j01799o8530k1760j1747j7164
40346d2661o522J1258J7977J6760J1721l247k2063k6327j3568L997K4782M8576
$$ y = [-39637, 43269, 121387, 129635, 66204, -20103, -75513, -73543, -33562, -9289, -33080, -76684, -92427, -79379, -74537, -90200, -98320, -72377, -14168, 52876, 91129, 66609, -10162, -78972, -93889, -69811, -41381, -15592, -382, -27947, -92659, -116077, -49318, 30337, 13191, -80803, -130504, -89871, -32986, -19657, -20468, -1548, 9682, -12741, -34900, -12192, 50861, 118996, 160971, 150111, 79822, -6909, -52906, -59777, -72060, -89735, -69530, -21533, -17677, -74091, -108970, -64541, 1986, 5340, -51255, -107210, -141619, -172810, -194779, -179289, -128479, -78281, -55831, -59665, -65345, -32503, 63148, 180933, 232526, 178339, 76540, 8010, -13750, -25497, -42661, -49183, -37925, -19948, -3188, 8533, 5286, -16777, -43104, -56672, -52675, -27893, 20683]
40334B0683N2695J8410k6871l6675q929J7717K2210J4060j547k6086m1996k8662
40322b4991J347K0892L1509M6572M7777R196m5541o2632l1448P997K5877K6020
40310E2575J6485M189J1861N0727Q1332N2648k0445o9075o2333l8464l6815m5080
40298b395l0506J0189M9063N6737K7631j3645l5594l5115l1436k2300J3990N8569
40286D5188M9312k5773q7200o7364n209K3331K0191L3062M8371J1297o1371q2430
40274i8595j9308N7959P2848K7641k5469m9793m1761j7532K861J4843L0005M6582
40262B81M2750J6952m53l28j3918m6344m7381M082M6487K8270m977J0212M5346
40249H0979L5904k786j1763J7j7707n0257m3533j2132j5673m4567l6661M472J6927
$$ y = [20683, 73378, 91788, 64917, 28242, 19313, 37030, 59240, 73300, 71753, 45667, 3671, -24991, -23644, -2752, 28757, 75329, 123106, 132302, 86761, 24129, -7319, 678, 26555, 52575, 69060, 73249, 85110, 135837, 217169, 269817, 249372, 180297, 117964, 79500, 42685, -2395, -32901, -22712, 26351, 83088, 110719, 97074, 61480, 26365, -5071, -27371, -13381, 45188, 94500, 68727, -18473, -85837, -91046, -67715, -47524, -14462, 33909, 45206, -16165, -98595, -117903, -59944, 12904, 40545, 15076, -34717, -76478, -94010, -91149, -76306, -46301, 281, 43031, 59983, 59530, 59202, 45284, -1060, -48441, -44359, 2128, 30398, 25421, 35633, 80979, 116883, 114097, 102334, 102351, 84644, 34387, -9146, -21278, -36951, -81518, -118179, -113707, -96780]
40236i6780j428O272L7919K8731k6116n5548l3462r332l139K2083O2751N9367
40224h682P725j8725J0096L7743L0526K6297L6673P953o8312j06095n0233L3482
40212f1552N7668K9246M001p090k1833l1505k1571o984j381J0420L5009M6430
40200C0858K8354Q95j4340j6434m925J6622J9265j3336l6631m727L8298J6089
40188E9988m4442m5399J4868L2799k2340n4477p856M1564K5078p639N855K8904
40176B6903O857k7116j6189J8886K4065J105j5894k1116j8937P46K5320J8316
40164B2946j0918j0238J5044l22n0096l9429M5479P7844j4431j14542q6808K1490
40152a43981O9987L3738n677j4123k3122l6229l0439j9424k0655J626P0559J20131
$$ y = [-96780, -98208, -91936, -54017, -25286, -51402, -106950, -140412, -149744, -152883, -130800, -68049, -8682, -957, -19682, -9586, 28157, 58683, 84980, 121653, 129606, 61294, -44801, -95034, -61552, -3884, 25362, 29363, 22273, 440, -31065, -52636, -59620, -61001, -50581, -15572, 30858, 59212, 60107, 45767, 29333, 24408, 41030, 60295, 46959, 10328, 5601, 43899, 59988, 15546, -29853, -14985, 17814, -4526, -59003, -66859, -25295, -217, -7856, -2001, 26903, 33760, 6644, -9545, 9341, 33406, 34511, 18617, -2499, -21436, -20690, 4630, 22946, 12028, 1790, 16834, 16512, -33584, -73013, -27534, 50310, 35879, -78663, -165471, -143981, -73994, -40256, -45933, -60056, -83178, -119407, -149846, -169270, -189925, -188299, -117740, 2391]
40140B391Q0215n301m1530k1723o347o312Q257J8455j5580o1543n4384j1013m466
40127a18881l5769l1023L5397J03547J17183P7206J0165m9491n7598p621L5389
40116G8504J2836l7791l9983K284K0811k373j9987q006R751K0940L7580N2345
40104A26911M3631J8249l650k8800o2538o8499k0487L2752K5258k5420m5960j7022
40092b5575J5219K1577J4924M156j3634k4459j4187J499Q785K6895N9857O0181
40080A35238O20o2886o7174l5173k1805j7517J0534L0781j912m6712l0236K8685
40068g7557M8349J6193o883M089J9704K9743M2154K8903l1648p9949m3961L6370
40056a4493N8089J1580k1910j5115j8268m0122k7561K2288M3202J4521q371J688
$$ y = [2391, 82606, 77305, 35775, 14052, 7705, 1393, 9650, 28105, 12525, -49018, -103402, -114415, -118881, -154650, -185673, -150276, -46729, 70454, 147660, 157825, 108334, 50736, 43115, 78504, 91340, 53549, 13566, 15850, 36661, 34288, 14301, 6295, 16046, 36986, 74566, 126911, 170542, 188791, 185141, 156341, 93803, 25304, 4817, 37569, 62827, 37407, -8553, -25575, -10356, 11221, 26145, 30301, 16667, -7792, -21979, -20480, -11695, 15200, 75057, 135238, 135858, 72972, 5798, -29375, -51180, -68697, -58163, -27382, -29294, -76006, -106242, -77557, -29208, -13015, -19898, -15809, 3895, 33638, 75792, 104695, 73047, -6902, -50863, -14493, 43596, 55176, 33266, 18151, -117, -40239, -67800, -45512, -2310, 12211, 3840, 5528]
40044E528Q392O29J6592N4445N5268M660l6886l3359j9307k1018j4320J2502L1634
40031F4760L5065M5573N1459J1206n7942q0556l6983M854j178j7553k138K4196
40019D0763K4149j043k9620m1906j6270M2160P2660K5918m8600o0965j5921K634
40007f041k4008k7607J6376M7779L4876K2019L3149K8613o424k6944j7629k2711
39995E1448m9959m2167J3404M4857J4665j5267N420K8117n854o3966p6932l5710
39983a31944K0666O1236O4679K0832l3219l6393Q462L3796J5511L683K0632J9885
39971F7826j4978k5490J5337M2826R835k7642n699L9839L7771n329l1514k5454
39959G7328j4324r143k801K949Q900K3789L1836J010n2789o7402k7660O005o974
$$ y = [5528, 13920, 14549, 31141, 85586, 140854, 145514, 108628, 75269, 55962, 34944, 20624, 33126, 64760, 99825, 145398, 196857, 208063, 150121, 69565, 32582, 37436, 36258, 18705, 16567, 40763, 64912, 63869, 34249, -7657, -23927, 18233, 90893, 116811, 68211, 7246, -8675, -6041, -30049, -57656, -41280, 6499, 41375, 63394, 96543, 125156, 118732, 91788, 74159, 51448, 1489, -40678, -27274, 17583, 32248, 16981, 22401, 50518, 44664, -19302, -96234, -131944, -111278, -50042, 14637, 35469, 2250, -34143, -25681, 8115, 23626, 27309, 47941, 67826, 52848, 27358, 42695, 85521, 95356, 67714, 62015, 101854, 139625, 134296, 102782, 77328, 63004, 53861, 51060, 54009, 62909, 86698, 118534, 119544, 66755, -647, -28307, -22302, -29276]
39946b9276l0416k5457j1646j1740l218K7802M5685K4706o681j9952k6438k9470
39934i6101l276M4194N8066K5033J447J3930J3739k2631l6101R204M8152J8487
39922G4143l2257k7485J4222K3708j17n782J1635J2170q731j6831o292p505k9907
39909I71m4736k7835R776L5651K9391P270O963L2173L6247m728l8105j2308K9452
39896F0182J4928l0502k5147K4193L6888O847N343L4280J8633l8334m2423J6994
39884H1882L4446k3123n3634p759K1925j9906m3303J5762O8814L5598j0798J2733
39872A12637M3771J587n1720k7953J6121j6670p7791n4892K8848N6552Q594l5291
39860C793m2575m0413k0688L6760Q0568N0149j0353j3639L0311M3448J0069k8049
$$ y = [-29276, -59692, -85149, -96795, -108535, -111753, -83951, -38266, -13560, -20241, -40193, -66631, -96101, -99377, -55183, 2883, 27916, 29363, 43293, 57032, 34401, -1700, 7504, 55656, 74143, 41886, 14401, 28623, 52331, 52214, 46432, 58067, 70237, 61506, 44675, 38383, 30878, 971, -43765, -71600, -61824, -26173, 3218, 10488, 17451, 49624, 85871, 81143, 43038, 30730, 60182, 75110, 44608, 19461, 43654, 80542, 87389, 92732, 127012, 145645, 107311, 64888, 81882, 116328, 93205, 39571, 31812, 53737, 33831, -9472, 6290, 75104, 110702, 99904, 112637, 156408, 157995, 106275, 78322, 94443, 77773, -18, -54910, -26062, 30490, 39084, 3793, -38782, -79195, -99883, -63123, 17445, 67594, 57241, 43602, 73913, 117361, 127430, 99381]
39848I9381o3119j00473r2472n884Q5772Q7982K5010r725J735J2334J6281L3572
39836I0394L3997j2274n3164l1976N081r591l4468N132O6546N3250j4349l2939
39824F5639R516L1318O355j5526j9067l0483l3608J323K8889j1698p4578o6565
39812a08485JL8054L8541O0023R2212O8573n0l7370l3555l7870m0118O073O1219
39799A07248M2993k1443k9225K1397L4928m820j4619K4255L4817k487j2352K8720
39787B09412M5709K763l7161k8848p707k218R308K4394K743m4548n1278p575J9364
39774A34358j644k2797p498K0729L3902K8233l066n0006n5044J2786P8410N2718
39762B21081k5352m7678p524J0577j3904k3970j0846j9284l6577r415L5681K2896
$$ y = [99381, 36262, -64211, -156683, -162567, -76795, 11187, 36197, 26472, 28207, 40541, 56822, 90394, 124391, 112117, 58953, 26977, 32058, 22467, -12001, -6869, 59677, 112927, 98578, 65639, 75155, 106473, 112828, 97302, 78235, 47752, 14144, 15467, 44356, 32658, -41920, -108485, -108484, -70430, -31889, 28134, 120346, 188919, 188869, 151499, 117944, 80074, 39956, 46029, 107248, 150241, 128798, 99573, 120970, 155898, 151078, 136459, 160714, 195531, 193044, 180692, 209412, 255121, 257884, 220723, 191875, 184168, 181950, 191258, 215652, 218395, 173847, 122569, 114994, 134358, 132714, 109917, 102419, 123148, 157050, 185283, 182217, 132211, 77167, 89953, 168363, 221081, 195729, 148051, 140527, 151104, 137200, 113230, 102384, 83100, 46523, 37108, 72789, 95685]
39750I5685k8428k6930K7755M5496P968j2113L977R26k1111l741L5249J4519n1006
39737H8246n4817J6854N5851J3805l2450k6985o675K782K8817O2469N4294J8023
39725B20214J2548J7612l3720j02555q2505O489L3391k1632l9087K0401N3717
39714H4873J5243k787N0675R4031O5603J5897r917l6455n8641k6659K9886J7880
39702B39629m4850l8824L8883N1710l2785p3911l504N5706J0050n0731k6963K8010
39690A52420L0954R652J3522J3059j5424k5590j960m075m3425m4922R701L7076
39678A30988N725j1015J2725O819l7207k7267M9386P8796J9371k5557k427N378
39666B05715m1029n2451P761M2111L134k1820Q715J2338l3738k8670M7099O8363
$$ y = [95685, 67257, 40327, 68082, 113578, 121546, 109433, 113410, 114336, 93225, 89484, 124733, 139252, 88246, 33429, 50283, 106134, 119939, 87489, 60504, 53829, 56611, 85428, 147897, 202191, 220214, 232762, 250374, 216654, 114099, 31594, 38083, 71474, 49842, 10755, 31156, 84873, 100116, 97329, 148004, 242035, 307638, 323535, 313618, 277163, 218522, 191863, 221749, 239629, 194779, 155955, 194838, 246548, 213763, 139852, 136348, 192054, 202104, 151373, 124410, 152420, 183374, 193026, 206548, 219607, 204183, 178593, 176633, 172558, 129133, 84211, 93912, 130988, 136713, 125698, 138423, 145242, 108035, 80768, 130154, 208950, 228321, 202764, 200337, 205715, 164686, 112235, 119996, 162107, 165241, 143421, 152136, 164474, 130736, 102066, 149165, 217528]
39654B17528l485m0149Q647J9891m7134m7007O9279J21152O969j01120n1706L4233
39642A87098N530n3026j5654L3716k0531q4446l0215N3740K5812m6907k5393M0283
39630G0007K0519m4340l0974L5255M6924J6234J7437K5399j0663l5690M497L8766
39618A53371N867j8511K0559K8908m6505p3753L4916J30084O5645m3505k5592
39607B31484N3560L5911m1328m6062m771j8702m9876j5996K3674q372l1615L3725
39595A61632P7736q855j07359o4989L6190M0872l891K0561N5136n24n6081M027
39583A54455P5680J9447o6986l1792L9185k123o5791j320Q9717L8469n2570P158
39571B03529J23734Q3400m5540m2877M9762K3881q4071o0489P6285J11282K6306
$$ y = [217528, 214043, 173894, 182541, 202432, 155298, 108291, 177570, 298722, 305691, 204571, 152865, 187098, 192628, 139602, 123948, 157664, 137133, 52687, 22472, 76212, 102024, 55117, 29724, 70007, 90526, 46186, 15212, 50467, 97391, 113625, 131062, 156461, 145798, 110108, 114605, 153371, 159238, 140727, 161286, 190194, 143689, 69936, 104852, 234936, 300581, 257076, 231484, 285044, 320955, 279627, 233565, 228794, 210092, 160216, 144220, 167894, 159522, 127907, 161632, 239368, 230513, 123154, 58165, 94355, 135227, 131336, 151897, 207033, 206509, 150428, 154455, 230135, 249582, 182596, 150804, 189989, 187866, 122075, 120755, 210472, 248941, 196371, 203529, 327263, 410663, 365123, 322246, 372008, 395889, 311818, 251329, 327614, 438896, 465202]
39560D65202l138L9611J1617p8312r1877m9077p1816j04062j4660R9818N6481
39549B59787n5851j8636J04624P8649o2183q1483J5883J9101o0781j9857J12602
39538B91855J02257m4730q1754K7812O7864j1504l2405L7308L8943l2870k0384
39527C42392N6819K6962p6377o1650L8643K5613o1226r887J32953J32126K6568
39516E72936O3436K04411J82292K8458L6160K06968K70518K66681N25006R81694
39506C338560J096567O12707r8236n92851p94195p65541n31579k62600j95233
39497A807599k56461j72942J5585J4477j53600j65057m859Q282j51296j59359
39487G82369K2628O9486o4503n5994J29863J41992p0255j35871K7544N8401j30341
$$ y = [465202, 462064, 501675, 513292, 434980, 343103, 294026, 222210, 118148, 103488, 203306, 259787, 203936, 185300, 289924, 368573, 306390, 224907, 240790, 259891, 199110, 179253, 291855, 394112, 349382, 267628, 295440, 363304, 351800, 319395, 356703, 395646, 362776, 342392, 399211, 426173, 349796, 288146, 326789, 352402, 291176, 281289, 414242, 546368, 572936, 636372, 840783, 1023075, 1051533, 1087693, 1294661, 1565179, 1831860, 2356866, 3338560, 4435127, 5047834, 4949598, 4356747, 3562552, 2797011, 2265432, 2002832, 1807599, 1551138, 1378196, 1393781, 1408258, 1254658, 1089601, 1084742, 1093024, 941728, 782369, 804997, 874483, 809980, 753986, 883849, 1025841, 955586, 819715, 847259, 905660, 775319]
39476G75319j69391M0971J23273m7500j08901O9850J42387q252l8826J37787J46425
39465A063142q7824j35318J11030J92811m1809j38634P6995J57468p8749j77514
39455I41598N5025J61703n8760j46007R8190J95738n2522j39332J51354K91721
39445A498708M8032m1691K48873L33788l5531k22214Q5250K60483j4515j00251
39435B060932K97593M52329K3871j89678K38233M96860J14494p3034M37197P55666
39425D614463L26029Q6574O50263J041389O33472N14139J384587K086122J939350
39416A3276388K345655M026409N051674M028870K752628K976333L408476L165749
39408D1032182M867566J0149038J6055938K1610796L3109475N3092250O6483384
$$ y = [775319, 605928, 646899, 770172, 722672, 613771, 683621, 826008, 817756, 778930, 916717, 1063142, 975318, 840000, 951030, 1143841, 1102032, 963398, 1040393, 1197861, 1119112, 941598, 996623, 1158326, 1099566, 953559, 1051749, 1247487, 1194965, 1055633, 1206987, 1498708, 1546740, 1505049, 1753922, 2087710, 2052179, 1829965, 1915215, 2175698, 2161183, 2060932, 2358525, 2810854, 2834725, 2645047, 2883280, 3380140, 3494634, 3421600, 3858797, 4614463, 4940492, 5027066, 5677329, 6718718, 7352190, 7866329, 9250916, 11337038, 13276388, 15622043, 19648452, 24700126, 28728996, 31481624, 34457957, 37866433, 41032182, 45899748, 56048786, 72104724, 93715520, 126824995, 179917245, 246400629]
39401B46400629N1143620O431616l9592876n8614621n0120967l4199667k4459569
39394I6988165j8814256j2522080p309133n674221n537089m524958l863027m797894
39386C3945507n509963m383097k863113k608892k711119j917649j057138j182326
39378A1712210j493452j019979m80467p36901j087572o98037k01955l86139o82028
39369D925680l70830K487k41859n69907k97737Q9211r1480m30483k83740O569
39359B737911j28203l56349j56587J30237j3019k71344j47682P0911p0268k74219
39349A521388r7688J50970N480k54005j50465Q7203O967j96581j06772J00342
39339A066839M6207r6061J3990J76659M9640j61454j03278M1358n7066k06677
$$ y = [246400629, 297544249, 303975865, 264382989, 205768368, 155647401, 121447734, 96988165, 78173909, 65651829, 58342696, 52668475, 47131386, 42606428, 38743401, 33945507, 28435544, 24052447, 21189334, 18580442, 15869323, 13951674, 12894536, 11712210, 10218758, 9198779, 8718312, 7981411, 6893839, 6195802, 5993847, 5607708, 4925680, 4554850, 4557337, 4315478, 3745571, 3447834, 3537045, 3445565, 3015082, 2731342, 2737911, 2609708, 2253359, 2096772, 2227009, 2213990, 1942646, 1794964, 1865875, 1795607, 1521388, 1423700, 1574670, 1580150, 1326145, 1175680, 1262883, 1269850, 1073269, 966497, 1066839, 1113046, 1016985, 1030975, 1207634, 1257274, 1095820, 992542, 1033900, 976834, 770157]
39329G70157q3154J07901K0987j56645p9111P9922j9342k02176j12403R7396O2289
39318D85821j05410o4399R3027N5688q3124l0600J13305O3947p2468j1983J36755
39307E80559Q6592n4674R064J83920J75593O4269J30712K94864K97895K73603
39297B042397N41929R43161R60853M66945j59536o04226q39223q47225o02232
39288A902843k97273j76698j80088j04619o895o6022j87437j53671l9913o3429
39278F26798j49284p4736P6916M9362j04417j16164Q009L0031o0505o0583L0911
39267B56338L1184m3181j5968P5649M3757o7935n7680L5182L178j11637q0914
39256F7973P0010R6351j5539l9836N3577N7286o6875j23385n2872p698l1774m767
$$ y = [770157, 687003, 794904, 815891, 659246, 580135, 660057, 640715, 438539, 326136, 423532, 485821, 380411, 316012, 409039, 464727, 381603, 351003, 464308, 528255, 455787, 443804, 580559, 667151, 612477, 621541, 805461, 981054, 1045323, 1176035, 1470899, 1768794, 2042397, 2584326, 3527487, 4488340, 4955285, 4795749, 4191523, 3352300, 2505075, 1902843, 1605570, 1428872, 1248784, 1144165, 1137270, 1071248, 883811, 730140, 690227, 626798, 477514, 402778, 479694, 529056, 424639, 308475, 316484, 346515, 286010, 225427, 256338, 287522, 244341, 228373, 304022, 347779, 279844, 222164, 257346, 260524, 148887, 67973, 137983, 234334, 218795, 178959, 232536, 289822, 222947, 99562, 46690, 38992, 7218, 2451]
39244B451P3545O9527k080K881O0882J8210r0259q3860K1035M0788k4785j1064
39232G7271O4327K8329q4753o3782P8488J03452k8669r5889j7183L7372p467k0976
39220G0520L6225L5280l5744l0051N4062M5191o7201r2338O048L9475m7231p5982
39208f1746J8246O5494r506m8850K8004P2800k513o3115j2156M1518P283l2506
39196B953j2147k784l5481k2683M7443N6013k0279m8440J4469M0697k1168m9732
39184e1139J1487M9262N391j7897K9548M7132q786l1968K5526N8143R084l1501
39172I4282j1302k610l3626l0484J1564J421n3683m0241L4385L7405k7980r528
39160c0397R7498J13036j662o3352J466L3614m2211p0859K7500Q8939L523q3176
$$ y = [2451, 75996, 145523, 143443, 146324, 207206, 225416, 135157, 51297, 72332, 113120, 88335, 77271, 141598, 169927, 85174, 21392, 99880, 203332, 174663, 78774, 61591, 98963, 91496, 70520, 106745, 142025, 106281, 76230, 130292, 175483, 108282, 15944, 21992, 61467, 14236, -61746, -43500, 21994, 12488, -36362, -8358, 64442, 61929, -1186, -13342, 28176, 35459, 2953, -9194, -11978, -47459, -70142, -22699, 33314, 13035, -35405, -20936, 19761, -1407, -51139, -39652, 9610, 15001, -2896, 26652, 73784, 64998, 33030, 58556, 116699, 125783, 94282, 82980, 80370, 46744, 16260, 27824, 29245, -24438, -64679, -30294, 7111, -20869, -30397, 67101, 180137, 178475, 115123, 116589, 150203, 107992, 37133, 64633, 153572, 157095, 73919]
39148G3919l9494K7835q86l9753P834M8498j5275q9451o3527o444j4475l1068
39136a42287J6538O2306L8604J1036L4129L5206k3288l9191L5716P8519J1872
39125A19160m8160p472L4278j4773n7154J969O5486K7996k5836P470M7861p360
39113A43465p7218m7967J4123l587m7662j3974M8018L6622r111R44L2377J1397
39101H7427k1119l301J0197l8239p4164k5936K7630K772k4935L1272Q7916L7144
39089I6664m9643m9125j672j2038m3641l801O3020N6670R089J1008L6179J1094
39077A23804k7701j4868j626n0590q4574j7454O3512L2127n4068n6583O619K1795
39065e9607l195J8515O1692L7365k5053l0306L605l957k7954L161M4354R632n3039
$$ y = [73919, 34425, 62260, 61374, 21621, 29455, 77953, 62678, -26773, -90300, -96744, -111219, -142287, -125749, -63443, -24839, -13803, 20326, 55532, 32244, -6947, 28769, 107288, 119160, 71000, 63528, 97806, 83033, 25879, 27848, 93334, 121330, 95494, 102964, 150825, 143465, 66247, 18280, 32403, 28816, -18846, -32820, 15198, 51820, 42709, 43653, 76030, 87427, 66308, 63007, 73204, 34965, -39199, -65135, -37505, -34733, -59668, -28396, 59520, 96664, 47021, -2104, -3776, -15814, -59455, -63256, -236, 56434, 65523, 76531, 112710, 123804, 96103, 81235, 79609, 29019, -55555, -73009, -9497, 22630, -31438, -88021, -81402, -59607, -62802, -44287, 17405, 54770, 29717, -589, 3016, -941, -28895, -25734, 18620, 28252, -24787]
39052b4787m1588J1724J2526p240L5811Q5353L3875n9656n2452L1851M8923j1952
39040F2388l4731n689j8162o7539n5235J0805K4236j7053j6148K2841L458n7467
39028a48296m0770N1034Q7167M1212K4022O1054M7014l6646o5488O024N7861J2819
39016I7007m2386k4627J3814O474j0777R919L5334K4928K819l226q508j5415K700
39003H8056L1603J9423k7520m3962j8475j1923m6436p1104n5467k7658p605J2293
38991a58775J7760r667l2160k268M5005M2153Q959J6408N4396N1443P908j0109
38979C1053M930L326j1634M412L1532J4910j9548n075L3053J7094l4551l8299
38967C1203j310P14k1901K376M7486K4129m0166l2688L6439M3034k6611n1683
$$ y = [-24787, -66375, -54651, -42125, -49365, -13554, 71799, 105674, 46018, -6434, 25417, 74340, 62388, 27657, 21968, 3806, -63733, -118968, -108163, -83927, -100980, -117128, -94287, -90829, -148296, -189066, -138032, -50865, -9653, 14369, 75423, 122437, 85791, 20303, 26327, 84188, 97007, 54621, 29994, 43808, 50282, 39505, 49424, 84758, 109686, 112505, 109279, 100771, 85356, 88056, 119659, 139082, 111562, 67600, 49125, 37202, -9234, -80338, -135805, -163463, -171068, -158775, -141015, -150682, -182842, -185110, -140105, -97952, -88993, -72585, -18189, 33254, 41162, 31053, 35983, 39309, 27675, 32087, 63619, 78529, 58981, 53906, 86959, 104053, 69502, 31203, 29893, 30607, 8706, 11082, 58568, 82697, 42531, 9843, 46282, 89316, 62705, 11022]
38955A1022M14K2135k4029l6541K6722O4879K0059k2936q19K0872j5399n8649
38943G730o1684n8485o1151j6831O4711Q0229K923n2705j1373N0235M8315J8482
38931A0396J5879J4323r927j0942K7973L9973l827l0511K742K7622q381m8996
38919B6324m1513k8033m3806l8150J8877O1051M2203J9266L5362L2985k4554n9020
38907I92q975M8847K2013m4610n1862m827K2844J8168J7103J6525p221l4255l2462
38894c7720j1837Q363L3125M6915P100o9597r5264l8461K2351K7202K0319M4323
38882d3181N1642J395n0264m4023j6827k1443k8495L644L9031L2893J7636L3371
38870b4621M3352O600l2620j7234K1012J9064j1663j8024M108K2680K7323J6558
$$ y = [11022, 11436, 33571, 9542, -26999, -277, 64602, 84661, 61725, 60906, 81778, 66379, 7730, -53954, -112439, -173590, -190421, -125710, -45481, -42558, -95263, -106636, -56401, -8086, 10396, 26275, 40598, 30671, 19729, 47702, 87675, 83848, 53337, 56079, 83701, 75320, 26324, -15189, -43222, -87028, -125178, -106301, -45250, -3047, 16219, 51581, 84566, 60012, 992, -7983, 40864, 62877, 18267, -33595, -38422, -15578, 2590, 19693, 36218, 28997, -5258, -37720, -49557, -41194, -8069, 38846, 45946, -23651, -118915, -157376, -135025, -107823, -87504, -43181, 8461, 9856, -40408, -84431, -101258, -122701, -151196, -147552, -108521, -75628, -57992, -24621, 18731, 25331, -7289, -24523, -3511, 15553, 3890, -14134, -10026, 12654, 39977, 56535]
38858E6535k1076o4910o2945j7337M194j8243k1248K0195M0334P881j0058K0744
38846f5934K5867l4829o8270J72Q5223P3707L941j5400J4113J4827j3682p758
38834A1977L3819N3614L7646J7688J138k0673k9410j3567j977q059n68K0177r51
38821A00854o4176q0334j5647L7233J4484r926L1576O9582K9483k5182j5094L134
38809G5987m4237q6506l1808M4945J8647o0562m9006M2974P9834L7453J6665M0846
38797H5232K9529k6889m3674n579O388l1455n1233k7253o661L031M1911Q5340
38785E8687N9830j7604m9188j7947q013m9135p2775m3351o721J3890M6962P6637
38773h728M1836m1420p6430l4013R384Q960J0189L7078L7940j1148n0612l3653
$$ y = [56535, 35459, -29451, -92396, -109733, -105539, -123782, -145030, -124835, -84501, -76620, -86678, -65934, -40067, -74896, -143166, -142994, -57771, 15936, 19877, 4477, 18590, 33417, 19735, 11977, 45796, 99410, 137056, 154744, 155882, 135209, 105799, 92232, 90255, 82196, 81628, 101805, 100854, 36678, -43656, -59303, -22070, -7586, -17512, 14064, 83646, 113129, 87947, 72853, 75987, 31750, -54756, -86564, -41619, -22972, -83534, -132540, -89566, -9732, 27721, 44386, 85232, 114761, 87872, 44198, 38619, 45007, 13552, -37681, -64934, -71595, -68564, -26653, 58687, 118517, 100913, 51725, 33778, 25765, -23370, -96145, -139496, -146217, -132327, -85365, -8728, 33108, -8312, -84742, -118755, -109371, -100411, -90222, -53144, -15204, -26352, -76964, -110617]
38761a10617O260K2667J4267r863m5833n8410j0662N6815O2497J0644j0637K9822
38749d3050O4915M7619J3105k891j5567l1893k4201R913L5576M3776N2313M3025
38737A92640j3479p1637n2638K0268L8725k0709n8265j4100M2853L5848r980l2906
38725E6620k5987j1120Q395K5645K0089m20m982j32j8381m1923j9289L4115M2713
38712F5343o970m2532k4172M619P415N127J1227M923q039M539K2298j2069p9361
38699d7652q8338j9272M1502M1734L0584M7342N1923J7745p710O180J2116k6085
38687F0069o4706n7048k5844q339K811K0951L3029L7708M8518M1169k1051r5464
38675b8197r1138j1359M1600K7475J4914L5263K2979m3174p2714j4144M7073K8018
$$ y = [-110617, -104357, -81690, -67423, -77286, -123119, -181529, -192191, -135376, -72879, -62235, -72872, -43050, 21865, 69484, 82589, 79698, 64131, 32238, 8037, 17950, 53526, 97302, 149615, 192640, 179161, 107524, 54886, 75154, 113879, 93170, 34905, 20805, 63658, 99506, 89526, 56620, 30633, 19513, 27908, 53553, 73642, 73222, 68240, 68108, 49727, 7804, -11485, 22630, 65343, 58373, 15841, -8331, -3712, 3703, 8830, 20057, 24980, 16941, 21480, 43778, 31709, -47652, -135990, -155262, -113760, -72026, -41442, 5900, 57823, 75568, 67858, 74038, 86154, 60069, -4637, -61685, -87529, -95868, -93057, -72106, -39077, -1369, 47149, 88318, 67267, -28197, -119335, -130694, -89094, -61619, -46705, -11442, 11537, -31637, -104351, -118495, -71422, -43404]
38663d3404k1763k0334J4173K3939J6760K0418J1954k1910l1646O987L2548N636
38651f642r984L8908Q8279O1423j762k3403j9584m5282p5381n3707m658J4138
38639c7655K0560O0860R9675O8976o879m2129k1347k643j0779j9131k0802l2840
38627E5866m3530k9024n450o61p13J4227J7151j6190m5073k2677K1438L0410J1745
38614a2481N424K423k3917m3626j2548M2044O0702M7808M7675N4278K8411j8947
38602A77246m1993l8946l9818l7662p147L0485L4835J6480R500K599k7436m5136
38590C3007l940N9276O4265P443m0083m2421k7653j6855k249Q312m243k4245k0397
38577i783j299L838J310J2979K6166K3611L0546O3651P0130o21r5096j14534n5345
$$ y = [-43404, -65167, -85501, -71328, -47389, -30629, -10211, 1743, -20167, -51813, -44826, -12278, -6642, -16626, 22282, 110561, 171984, 170222, 146819, 127235, 81953, 6572, -47135, -51793, -37655, -17095, 43765, 143440, 212416, 205537, 163408, 142061, 139418, 128639, 109508, 88706, 55866, 12336, -16688, -22138, -22799, -23512, -9285, 7866, -8324, -53397, -76074, -54636, -24226, -12481, -7057, -4634, -28551, -72177, -84725, -42681, 18021, 65829, 113504, 167782, 196193, 177246, 135253, 96307, 56489, 18827, 11680, 42165, 77000, 93480, 102980, 105579, 78143, 33007, 29067, 88343, 152608, 160051, 119968, 77547, 49894, 33039, 30790, 39102, 34859, 10614, -9783, -11082, -7244, -5934, 7045, 33211, 56822, 87368, 151019, 221149, 220528, 125432, 10898, -44447]
38564d4447j878N771N477K0999K6555J0780k12O143J4606J8827K0311M651k8452
38551E9131l8013m185J9038j4554n1690j9399M2184L4556l5182o1984j0518L9900
38539d0716L1001K7o254J006J841O915J9320J8734J423j6383l5163n7076n0034
38526a25359N061N3014L2221j7960j2347L6472L8825j5497m0682l827K8962J7925
38514c192O075J9237K0367J016J0735N2141N2276j1204n7915l5769m431k2086
38502B7250m4226j3923L0146K2870j5970k5945r299o563r950J7452O1582O8352
38490A01776K1827m1253q0709p6390k4768M8480R2917Q3491M5983J1199k1980
38479A60573n2796n0925j535N5368P0672M6858J9932N335n793j6740k1211j6297
$$ y = [-44447, -46325, -40554, -35077, -14078, 12477, 23257, 23045, 29188, 43794, 62621, 82932, 87583, 59131, 21118, 16933, 35971, 21417, -30273, -49672, -7488, 27068, -8114, -70098, -80616, -40716, -9715, -9688, -15942, -14936, -13095, -6180, 13140, 31874, 33297, 16914, -18249, -75325, -125359, -120298, -67284, -35063, -53023, -65370, -28898, 9927, -5570, -46252, -50079, -21117, -3192, 2883, 22120, 42487, 43503, 54238, 106379, 158655, 147451, 89536, 53767, 49336, 27250, -16976, -30899, -753, 22117, 6147, -19798, -29097, -35660, -45610, -28158, 33424, 101776, 123603, 82350, 1641, -74749, -99517, -51037, 41880, 125371, 171354, 182553, 160573, 107777, 56852, 55317, 110685, 181357, 228215, 248147, 253482, 247689, 230949, 209738, 193441]
38467A93441j686J9133K8633Q023l3769o7318p8726p1178l9644J5703N8892N0605
38455H2109Q320j6643j6020k0029k4468L487M5410M0716r777l3570l468K0981
38443G7048K200j2886J3546L6458P941l9135n1718m1061m1922m0431r397K7759
38431g1598L2522J5564R451J2122R040J3517L2722L3518k448k9960o770K9533
38419G7213J7988k5078l4899n214J0157o412j4148N425J4074j3972m1079j8676
38407c4621L8157O2751J9638m7096o2920j7071J8211j6270p8054p7332n848N3382
38395a47073N1112L2957M6702O1024K9887j8711k4929O917K0443k972k5766j9065
38383A0526L579J8338J9802J4520J0332J0856O432j7579n0602n6288k0759K1092
$$ y = [193441, 191755, 210888, 239521, 247544, 213775, 146457, 67731, -3447, -43091, -27388, 31504, 82109, 90429, 73786, 57766, 37737, 13269, 16756, 62166, 102882, 93105, 59535, 56067, 77048, 79248, 66362, 79908, 116366, 124307, 85172, 33454, -7607, -49529, -89960, -99357, -71598, -39076, -23512, -14061, -1939, 7101, 20618, 53340, 86858, 84410, 54450, 47680, 77213, 95201, 70123, 35224, 30010, 40167, 33755, 19607, 25032, 39106, 25134, -15945, -34621, 3536, 66287, 85925, 38829, -24091, -41162, -22951, -39221, -117275, -194607, -200455, -147073, -95961, -63004, -16302, 44722, 74609, 55898, 30969, 37886, 58329, 55357, 29591, 10526, 14105, 32443, 52245, 66765, 77097, 87953, 94385, 76806, 26204, -30084, -50843, -29751]
38371b9751L0132J3125M208J4733K7192K6754J6135N165k84k680r302j8240j6475
38358F0712n410r460l3695l8799l02L4219P318m9431n3799j188L1043J1635n308
38345e2465J0997J6353j3436k7359Q424M3959L0824K123M296J5030l677k9109
38333E960k3875p183j1517j4572J6539N3963N0391J6998m081j2480l2205n1015
38321a3077l8217K3L4373N6395O5676M6319l7l4919l9000m4171o7444o6343j2492
38308a12914M5174N0975K4377R620j752k9712m2326j0305K4726J5797l583J8180
38296a1743N0692L4371j0182k1589q409j9729l7903q668M2959L7563k5113o2129
38284c9880l8261l995K605J170P481R215J1038K9463M2015J4760k5687k4760N560
$$ y = [-29751, 381, 13506, 17714, 32447, 59639, 86393, 102528, 107693, 107409, 104729, 95427, 77187, 60712, 55302, 45842, 12147, -26652, -26954, 7265, 14583, -34848, -88647, -89835, -58792, -47157, -52465, -41468, -25115, -38551, -65910, -57486, -13527, 17297, 19420, 23716, 38746, 35069, 5960, -17915, -25098, -36615, -51187, -34648, 19315, 69706, 86704, 82623, 70143, 37938, -13077, -51294, -51271, -16898, 39497, 105173, 151492, 151455, 116536, 77536, 33365, -34079, -100422, -112914, -67740, -16765, 7612, 17232, 15480, -14232, -56558, -66863, -42137, -26340, -29923, -11743, 38949, 73320, 63138, 41549, 33140, 13411, -24492, -33160, 9799, 47362, 22249, -39880, -78141, -82136, -79531, -78361, -70880, -61665, -50627, -21164, 20851, 35611, 9924, -14836, -9276]
38271i276P940j6216j4816J1579J2817p509M271M0132L0658k7352n2049j0849
38259c0670L1902L4213L8173O8260O9121M833o3886o6009j8347J8081K1877L937
38247A11485k7524n1313l6757j89o88m5158o2775j4814L8424L2324l975o450J8886
38234d8524J8747j3434l1961j3123J5245J5369j7192m7125k9275L6871Q6865O0850
38222C3313j2119m8369k4095P327J4380K6400N5255N9513K2519q380m333o521
38210A14890m4512o9655l1747L2179N0956K0091j1281j9911j7857j0919r8p31
38198A1405j6467k0731l112K3l4329o1377k8168M0284P1537M5254Q277q32P131
38185A8895O830m288j0367J642K5990L6972J7586q560l312K2160J2201m6968r3789
$$ y = [-9276, -1336, -17552, -32368, -20789, -7972, -15481, -11210, 28922, 59580, 32228, -19821, -30670, 1232, 35445, 73618, 141878, 210999, 215832, 151946, 85937, 67590, 85671, 107548, 111485, 83961, 32648, -4109, -4298, -4986, -50144, -112919, -127733, -89309, -56985, -60960, -67410, -48524, -29777, -43211, -75172, -88295, -73050, -57681, -74873, -121998, -151273, -114402, -27537, 33313, 21194, -27175, -51270, -43943, -29563, -3163, 52092, 111605, 134124, 125744, 121411, 114890, 70378, 723, -31024, 1155, 52111, 72202, 60921, 41010, 23153, 12234, 12136, 11405, -5062, -25793, -28905, -28882, -63211, -124588, -152756, -112472, -40935, 4319, 12596, 11764, 18895, 25725, 21437, 11070, 12712, 38702, 75674, 93260, 84700, 81388, 103548, 115749, 68781, -25008]
38172b5008p6117k4389K205L852K2120N9629P3980M4995J795k0645k0888k1881
38160A9648l9931o3553n8236m647O4349Q7486M5797j3517l4602j0909K3971L7761
38148E3617K0871j0414k5464j5188j1093l7827o0819l0872K9149M7480J3606j0404
38136c7358r29r425n6568p8070l0947K3801J5088k4450j7607L1261N3261L0214
38124a01729J2024K8894N5017O0042M3348J6022r822j6685j282Q977j0549m3491
38112D0766n5716m1343j8953q29P613o47j6828j4436R648K0659L91j6340O162
38099g9853M6268N6997L1147j699k0748k3865j3507r21j384m279K0136O4053P5184
38086A47529L3755j1550j8841j3138k8759m4260k8647n399r593k0903k909K4927
$$ y = [-25008, -101125, -125514, -123309, -119457, -97337, -37708, 36272, 81267, 83062, 62417, 41529, 19648, -20283, -83836, -142072, -146719, -82370, 5116, 50913, 37396, 2794, -8115, 15856, 53617, 74488, 64074, 38610, 23422, 12329, -25498, -86317, -117189, -88040, -40560, -26954, -37358, -38287, -47712, -104280, -182350, -213297, -189496, -174408, -198858, -216465, -185204, -131943, -101729, -89705, -60811, -5794, 54248, 97596, 113618, 103796, 87111, 85829, 94806, 84257, 40766, -14950, -56293, -75246, -76075, -68462, -69109, -85937, -100373, -90725, -70066, -69675, -86015, -79853, -33585, 23412, 54559, 52860, 32112, 8247, -5260, -6181, -7565, -11844, 8292, 72345, 147529, 181284, 169734, 150893, 137755, 108996, 64736, 36089, 30690, 21097, 194, -2715, 22212]
38074B2212K0753j995J811K6816K4723j6016n6402o7146n3883k9521m931J475
38062a32104j7292l8403l8582k3449m425K1443M2841K9021j2911k5254J4326M8328
38050a36461L0118k15Q468K7779J0290j4654O972M9783M8493Q140j5399j6158
38038G156k8623m2700k1422J4395J0363k6320m1857l0072k5609k2106J1827N2683
38026a42285N2258L0495M0959O3556L8692r509m005L9823K9205m0044o7308j8931
38014A2906J7207j3917n2361m3389k0686j5945R72L3466K1695m0183n9765O395
38002a53605O6297L7031k3635k5071P527m2l0396j7379K3533K3375j3856j9696
37990a25917K0971N5103N5735M7681M2418K1276j3679l2810k6337j1484L514K0228
$$ y = [22212, 42965, 40970, 42781, 69597, 94320, 78304, 21902, -45244, -99127, -128648, -133579, -132104, -149396, -187799, -226381, -249830, -254255, -232812, -189971, -160950, -173861, -199115, -184789, -136461, -106343, -106558, -98090, -70311, -60021, -74675, -67703, -17920, 30573, 38713, 23314, 7156, -21467, -64167, -85589, -71194, -60831, -87151, -129008, -159080, -184689, -206795, -194968, -142285, -90027, -59532, -18573, 44983, 83675, 74166, 70161, 109984, 139189, 99145, 31837, 12906, 30113, 16196, -36165, -79554, -100240, -116185, -115213, -81747, -60052, -100235, -160000, -153605, -87308, -50277, -73912, -98983, -91456, -91498, -121894, -139273, -115740, -92365, -106221, -125917, -104946, -49843, 5892, 53573, 95991, 117267, 103588, 70778, 44441, 32957, 36471, 56699]
37978E6699K4341J513k9252l5566j6381L855J2654J3859J0605P055Q159K535k5060
37965C5016n2686l7217J1771L0410m24j9154J3899M7467K8419q052p960M074j8341
37952B7222m2188r224M5654L7283k4985m2978J5885P0031M9365j7621p0357r2979
37940e4892r0266n3648O840M6818M2918K5929K8684L8725L2757K1306K3593K6350
37928I5114N479k7999l7830j2405K0271K6436J69l4972m7720k5427J3515L5387
37916A0018K3498p057k7916k6233j1944M17R866K2327L0282J7344q812j1301K4662
37903D5151N5985L4728j6493l0782M334L1307J6122m681K057O004k6736o2163
37891E4833m4526J6024N7148M7452Q834k7418m1954k1358K3020M2877M932n4738
$$ y = [56699, 81040, 82553, 53301, 17735, 1354, 5209, 17863, 31722, 42327, 49382, 57541, 60076, 35016, -17670, -54887, -43116, -12706, -13130, -32284, -18385, 29082, 57501, 49449, 41489, 45563, 27222, -14966, -24190, 21464, 58747, 33762, -9216, 6669, 76700, 126065, 108444, 38087, -54892, -145158, -198806, -191966, -145148, -102230, -76301, -47617, -8892, 23865, 45171, 68764, 95114, 100593, 72594, 34764, 22359, 42630, 69066, 69235, 34263, -13457, -38884, -25369, 10018, 33516, 26459, -1457, -27690, -39634, -39217, -29351, -7024, 23258, 40602, 31790, 20489, 45151, 101136, 135864, 119371, 88589, 92923, 124230, 140352, 135671, 137728, 143732, 116996, 54833, 10307, 26331, 83479, 130931, 139765, 112347, 70393, 49035, 72055, 114932, 119864, 65126]
37879F5126p1566l7466l06J1486J3247J6251Q870o274m363J7368K8244J4372K993
37866E7982J4145K0638j2170o4842p6148j8070O4077R7429N8706p002m3187m0254
37854E1304k5629j4717q15J3415J1177n422j1528m83L076j4981l4782l6254k4666
37841i0305o837K2920N3935N3785J6020k2024l2758l1950l5212k5878K614J9591
37829g6099J0611J0537L8967N2497J5955k6580j7377J9091J8708j6225l1250j7183
37817a8348j3069k4999k1191l215n720k4459j7979J4474K7970J2175O706K5416
37805d2239L4064J8332P131J0086k229l2831l6745O299N3618O3215M5288K4257
37793A48246m92k9071m4154m5270n3807o3169l7655J4727L0123j3390m6052m536
$$ y = [65126, -6440, -43906, -44212, -32726, -19479, -3228, 5642, -632, -4995, 12373, 40617, 54989, 57982, 72127, 92765, 80595, 15753, -60395, -78465, -14388, 83041, 141747, 134745, 91558, 51304, 25675, 10958, 10143, 23558, 34735, 29313, 17785, 17302, 20378, 5397, -29385, -65639, -90305, -97142, -74222, -20287, 33498, 49518, 27494, -5264, -37214, -72426, -98304, -95690, -76099, -65488, -54951, -15984, 36513, 52468, 25888, 8511, 27602, 46310, 30085, -1165, -18348, -31417, -56416, -77607, -80822, -86542, -111001, -128980, -114506, -86536, -74361, -67655, -42239, -8175, 10157, 17288, 27374, 25145, -7686, -44431, -38132, 15486, 78701, 123989, 148246, 147754, 118683, 74529, 29259, -24548, -87717, -125372, -110645, -80522, -93912, -139964, -144500]
37781a44500P1534R9590P0186L8814K8957J1622k5672n0763l8465q242M475j0517
37769D7019l4700m2178k0994J4478L2135J2925k7230n1103l3342J8041O4114O2376
37757D1541P768n2857o2895j4160M9360Q1302P1082M0534K1462K7555L1761q921
37745B33532q3255j13131n3797K6681L1912k3551m0937N978L7691R059j7452J5578
37733B8308O1573M9690j972k5688j0729kj1369k6707l7489m5842l9669j5301k738
37720g7935k1371l6676j1654K5630K3150r974k2981j1014j3504l1259j8756L0089
37708a76255N6716K4099k6652l8365j4257L718K766O062K4486L6849K3243k719
37696h0309r069J1218K7409J2403j5454j6467R678K3407J1096P090K9406M0968
$$ y = [-144500, -72966, 26624, 96810, 135624, 164581, 176203, 150531, 99768, 61303, 53061, 57536, 47019, 12319, -29859, -50853, -36375, -4240, 8685, -18545, -69648, -102990, -84949, -20835, 41541, 49309, -3548, -66443, -80603, -31243, 50059, 121141, 161675, 183137, 210692, 242453, 233532, 150277, 37146, -16651, 10030, 41942, 18391, -22546, -16568, 21123, 30182, 12730, 28308, 89881, 139571, 137599, 111911, 101182, 101180, 89811, 63104, 25615, -20227, -59896, -75197, -77935, -99306, -135982, -147636, -122006, -98856, -108830, -131811, -142825, -156329, -187588, -206344, -176255, -119539, -95440, -122092, -160457, -174714, -170996, -168230, -162168, -137682, -100833, -77590, -80309, -89378, -78160, -50751, -38348, -53802, -70269, -60591, -37184, -26088, -18998, 10408, 51376]
37684E1376J2135k1370j3672J3571R272j8127j9657J966k960l4326l2013J8701
37672c5104M9370J2380m4124n1904j7809R598K1936L8760M8013K5093p199k070
37660D6940L4707N1668L3977J7912J5219j2726p9081j26466r9520k3462L3673
37649a07159M8373M5496L7286J1911k3467l8931k7479j2992m879J3867M0894M0149
37637B3069j652m0212k7931K1120N1873L6948k576k9620k0264K2569O1190M9289
37625A43803r132n2286m1734j8300l3006n6439k3170N1863Q0867L2250k5559l2219
37613A6938j4802k0181l2216j1442K8072M1255K3770N973o023l0038n7804n5953
37601a12451j8886K0377L7716M2490M8083M8193L3459R580j1681k3768k0992J028
$$ y = [51376, 63511, 42141, 28469, 42040, 51312, 33185, 13528, 15494, 12534, -21792, -53805, -35104, 14266, 26646, -17478, -69382, -87191, -77593, -55657, -16897, 31116, 56209, 49010, 46940, 81647, 133315, 167292, 185204, 200423, 187697, 108616, -17850, -117370, -140832, -107159, -58786, -13290, 23996, 35907, 12440, -26491, -53970, -66962, -71841, -57974, -17080, 23069, 21417, -18795, -46726, -25606, 26267, 63215, 60639, 31019, 10755, 33324, 94514, 143803, 134671, 82385, 40651, 22351, -10655, -67094, -90264, -38401, 42466, 74716, 49157, 16938, 2136, -18045, -50261, -61703, -33631, 7624, 31394, 37367, 31344, 1306, -56498, -112451, -131337, -110960, -73244, -30754, 17329, 65522, 98981, 108561, 96880, 73112, 52120, 53148]
37589E3148L0870L9423O699n0642q8641p9254m0535j4125j2938q032K4096O2560
37577g7371P2008N3709L6396K8252J3935p593k1411k9013l9939l4807J0687O2278
37565F7131N1509j8043n5689r696N5049N5425J0334j881L4048O1869M6090N374
37553C01520l5984o8657p4730m1097J504M936k5552l4878l25L5739K8925j1061
37541H0340m4511m9955l0786J429L2305M7818M3476K3741n951l6161n0294l9724
37529b8273j4389J4314M5700O9679N9329J1623k8133j9456J3873J8509r704k8079
37517A04993j8957q351j2565j5675q617o008j1524n762J6962L3767K8823J3617
37505A10703J002j0965j8867p779K2348M9209N5616M1523Q703l5576o0065l4758
$$ y = [53148, 84018, 123441, 130140, 79498, -9143, -88397, -128932, -143057, -155995, -164027, -139931, -77371, -5363, 48346, 84742, 112994, 126929, 119336, 97925, 68912, 28973, -5834, 4853, 67131, 118640, 100597, 44908, 35212, 90261, 145686, 156020, 154139, 188187, 250056, 296146, 301520, 265536, 196879, 122149, 81052, 82556, 87492, 61940, 27062, 26737, 62476, 91401, 80340, 35829, -14126, -44912, -43483, -11178, 36640, 80116, 103857, 97906, 61745, 11451, -28273, -42662, -28348, 17352, 87031, 146360, 157983, 129850, 110394, 124267, 142776, 133072, 104993, 86036, 77685, 65120, 49445, 40828, 34820, 23296, 17534, 34496, 68263, 97086, 110703, 111705, 100740, 81873, 74094, 96442, 145651, 201267, 242790, 251493, 215917, 155852, 121094]
37493A21094J8228M0460J5831r515l233L951k4174o2920o1320j9593J1613J680
37481C2102k5536k9812l585K3361J9481j0264k4961K945M4810M6048l42m1490
37469C2757l5997m831R231L605P364K8828M3551K9382q847m6742n7564k9184K1237
37456g210N6114N3708K8297M597j3472l2483m2952k8551K859K2673J9419J2438
37444G5437J9420K7127Q651l7919q2286r3265o7345k3833J8241N0353O7527O3719
37432B5827L7778r96l4800m4259k1115J7367L5138J4334j9281k5841k617J5918
37420b547P090j6352l1965k9317n128L1886N0520K9613K596K1215O8623O9939
37408A96173Q183m1184k7377l22j3647k7530J0657N3030K0864n5507p7743l6133
$$ y = [121094, 139322, 179782, 195613, 186098, 182865, 186816, 162642, 99722, 38402, 18809, 30422, 32102, 6566, -23246, -26831, -3470, 16011, 5747, -19214, -16269, 28541, 74589, 74247, 32757, -3240, -8071, 1160, 4765, 12129, 40957, 84508, 113890, 105043, 58301, 737, -28447, -7210, 48904, 102612, 130909, 135506, 122034, 89551, 46599, 18048, 20907, 43580, 62999, 75437, 94857, 121984, 130635, 92716, 10430, -82835, -150180, -174013, -155772, -105419, -37892, 25827, 63605, 62609, 27809, -16450, -37565, -20198, 14940, 29274, 9993, -15848, -18465, -2547, 4543, -11809, -43774, -73091, -78219, -46333, 4187, 33800, 36396, 57611, 126234, 196173, 204356, 163172, 135795, 135473, 121826, 94296, 104953, 157983, 178847, 123340, 45597, 9464]
37396I464r734j9215k267N1533O5254J2392k2340K3271R0277J00105P2965O9808
37384D41513Q1065N3718j3080p1083r3555q6061n3926q823J7385Q489j0701j6793
37372B48148k1563l2959k7032K929J5964j3059m5134m0445k3282l0078l9233j5020
37360b0764J9476K0235r84m666L442m978j6210m458L494k8379o3712m0870J8356
37347a20018L9160J9576K4545N5233L6577m1009p8036j4848O8553O7514l479n1801
37335A967l7598N518M0542N0590K0750m0404p9757n6973q574j220l3770m3772
37323a82701p752K5972J6956r675j1643O651J3724O201N583J3899J1660j237J225
37310a11137K7201M7830M0819K6363L1649M0594J7432k8913m9111k7453o925k2019
$$ y = [9464, -270, -19485, -21752, 29781, 95035, 107427, 85087, 108358, 198635, 298740, 371705, 441513, 522578, 576296, 563216, 492133, 398578, 312517, 258591, 249768, 267153, 275642, 264941, 248148, 226585, 193626, 166594, 169523, 185487, 172428, 127294, 86849, 63567, 33489, -5744, -20764, -1288, 18947, 17963, 13297, 16739, 11761, -4449, -8907, -5413, -33792, -97504, -138374, -120018, -80858, -61282, -36737, 18496, 55073, 14064, -63972, -78820, -10267, 57247, 53768, 1967, -35631, -30113, 10429, 61019, 81769, 41365, -38392, -95365, -103939, -105159, -138929, -182701, -190453, -164481, -147525, -157200, -168843, -162192, -148468, -142267, -136684, -122785, -111125, -112362, -111137, -83936, -36106, 4713, 31076, 62725, 103319, 120751, 91838, 42727, 15274, 8349, -13670]
37298a3670m6724l7788K518L9542N5508N1427K4603j6330l4631q216K5968J7825
37286F0032j6897j7874K1772L9569O35m6524m1706L863L3567K3141n982k9392
37274B4204l7266k1769J5643M6092L4119j7066o2073o1679k1386K0362K9555J588
37262d9676l6550m6201j3552K9581L7277P997r770J3362L6767L448o7350r1258
37250a85925l3560L8080M7011R041p847J0262K1733J5367K3779M9541N1927K3949
37238F3358J1685K9094K3379l3638q4768p1877k5488q574j7963r708J4483J9021
37226i0996P175J0811K5421K3255J5204L0060M5467J3383n1739q4370o5894l7255
37214a59478j4287K7758P6362P5331K0840j7374l392J3177q596l1671j6190O729
$$ y = [-13670, -60394, -98182, -95664, -56122, -614, 50813, 75416, 59086, 24455, 16239, 42207, 60032, 43135, 25261, 47033, 86602, 87237, 40713, -993, 2870, 36437, 59578, 53596, 24204, -13062, -34831, -19188, 26904, 61023, 43957, -18116, -79795, -101181, -80819, -51264, -49676, -86226, -132427, -145979, -116398, -79121, -71124, -80894, -67532, -30765, -27317, -94667, -185925, -219485, -181405, -134394, -125353, -133200, -122938, -101205, -85838, -62059, -12518, 39409, 63358, 75043, 104137, 127516, 93878, 9110, -62767, -88255, -96829, -114792, -124500, -110017, -90996, -83821, -73010, -47589, -24334, -9130, 20930, 66397, 79780, 28041, -56329, -122223, -159478, -173765, -146007, -69645, 5686, 26526, 9152, 5760, 18937, 10341, -21330, -37520, -30791]
37202c0791k714j7616L7J8686j1904o3466o0912N052O6332P2742M0545Q711j145
37189B3557J7655N1413N7592N916o9294r7734n7738K763L1057K0161p166k8649
37177e0467k9894j1506N284M381L568K8159O1851O3053L0057M802L518o917m3208
37164F2681o6209m3454q923j0457k6770J399O6912Q9669L0466m6658o1789k5986
37152c9119j1147l6799m5600M129P1611Q4215K6406m7434p4785m0546J9165N3127
37140c6777M0772J0418M497K6036L8090K0194k660k136J0993J0884j642j1765
37128A06904k4128m7192n8912k9540K6078N8461M7434K0344K834j1954l4424n1251
37116D654m4724j8872P122J7911R363q495j5377l662O305o442k7648k5475J011
$$ y = [-30791, -33505, -51121, -51084, -32398, -44302, -107768, -168680, -163628, -97296, -24554, 15991, 24702, 23557, 41212, 92625, 150217, 156133, 86839, -10895, -68633, -65870, -34813, -14652, -21818, -50467, -80361, -91867, -86583, -82202, -78634, -50475, 11376, 74429, 104486, 109288, 112806, 105889, 62681, -3528, -46982, -55905, -66362, -93132, -91733, -24821, 64848, 95314, 48656, -13133, -39119, -50266, -87065, -132665, -128536, -56925, 27290, 53696, 6262, -68523, -109069, -89904, -36777, 3995, 14413, 18910, 44946, 83036, 103230, 100570, 98434, 109427, 120311, 118669, 106904, 82776, 35584, -23328, -52868, -26790, 31671, 79105, 99449, 102283, 90329, 55905, 4654, -40070, -58942, -51820, -33909, -24546, -33041, -48418, -52080, -45775, -52217, -79865, -105340, -104329]
37103a04329K1274J9471R285K004o536j3381o986N330K205j1758o039K4183M1901
37090b3376K1318j3943k6365j3825k768r241k3838k5863n699J9061J6278j6825
37078a05086l7739j3335K8507M0632L0553L9388O0785M8374L849j6657J620N267
37066H6158l1495n8344l5097K799J2808J4505L3442L5775j2603o8972o9101k5461
37054a15586R02j615K226J5566R401p714N495M5388N8019K2847j6834k3328j3245
37041a8478j6300k7791k6434r978Q336J9996K3984K2302J8997J4327K620j3900
37029b319j9154n363J0978J1043k314j6949k8413k8589l720L4512M6042J8683
37017A4437m783R714L1562J8127r748k446L1436L7577N686j7430o331J0946Q392
$$ y = [-104329, -83055, -63584, -54299, -52295, -58831, -72212, -79198, -73868, -71663, -83421, -89460, -65277, -23376, -2058, -16001, -42366, -56191, -58959, -68200, -92038, -117901, -123600, -104539, -88261, -105086, -142825, -156160, -127653, -87021, -56468, -17080, 43705, 92079, 95928, 79271, 80891, 86158, 54663, -3681, -38778, -35979, -23171, -8666, 24776, 60551, 47948, -21024, -90125, -115586, -114684, -116299, -114073, -98507, -89106, -96820, -91325, -45937, 12082, 34929, 18095, -5233, -18478, -34778, -62569, -89003, -98981, -90645, -70649, -46665, -24363, -5366, 8961, 11581, -2319, -21473, -26836, -15858, -4815, -7129, -24078, -52491, -81080, -84800, -50288, -4246, 14437, 9654, 19368, 50930, 69057, 59309, 56863, 88299, 125876, 131562, 114132, 107801, 118747, 127139]
37004A27139l780j4600l3925n9438o2423k9576R916K0018K545q237J4140N8259
36992B0038Q1168N3941M277j1446J1678J4892l2321p7652o6798k8685j8007j8367
36980f7282J7089O3258N6652J3369J0398N0273N1952p164m9497l2077j6026m7620
36968D3325p0402l0161J8591J576m5950l8383J6787L7919Q538m258L0261O1344
36956B9187M9137K2804J6440J1947j4838l9357k4149J9579M5977L4262L050k2898
36944A31141l1334j6379J5460L3406P124m6917p1138l8155O419J870m1915n6352
36932a06770j1102M4547N2452J8614j0345j1283O012K7150L8216K4989j772n651
36920F5057J8108J8146l5155q2585m9634L7351Q0839M5819j2248m9055p6174r2147
$$ y = [127139, 123359, 108759, 74834, 15396, -47027, -76603, -66687, -46669, -44124, -52361, -38221, 20038, 101206, 155147, 159424, 147978, 159656, 174548, 142227, 64575, -2223, -30908, -48915, -67282, -50193, 13065, 69717, 83086, 93484, 143757, 195709, 188545, 139048, 106971, 90945, 43325, -27077, -57238, -38647, -37071, -83021, -121404, -104617, -66698, -58160, -62418, -32157, 29187, 78324, 101128, 117568, 129515, 114677, 75320, 51171, 70750, 116727, 150989, 154039, 131141, 99807, 83428, 98888, 132294, 139418, 92501, 21363, -16792, -10373, -8503, -50418, -106770, -117872, -73325, -20873, -2259, -12604, -23887, -17875, 9275, 47491, 72480, 70708, 65057, 83165, 101311, 66156, -16429, -66063, -28712, 52127, 97946, 85698, 36643, -39531, -131678]
36908a31678n7828K3100P4061M4366j8913m2837k1359Q006K9963M2929K7571k0154
36896d2773n4611l1483K7458O3396N3933K0488j3238l1842k1515Q119J8269o047
36884i846k3459L474M4520M6498J6100K441J4337J5242n745j8521j2688j6792
36872E5561m1279n1830k4587J0626J1862j6175l4490k5240o873K66j160J226R257
36859a12836J8151L0835N2991P4222O9804K9109k7697o7623o9038k7710L6737
36848F945P2933L3511n6426j04997o6174p543j2060n2221m0135K3697N0120Q653
36836a43697k8707j3329J0963M551K178L0219M1256J208l3655m994M6632N1447
36824c5928K4763K3974L9772K4768o123k256K0082J51n4261p1924l4121N171J8235
$$ y = [-131678, -189506, -166406, -92345, -47979, -66892, -109729, -131088, -123082, -93119, -50190, -22619, -42773, -97384, -128867, -101409, -38013, 15920, 36408, 23170, -8672, -30187, -22068, -3799, -9846, -33305, -29831, 14689, 61187, 77287, 79728, 94065, 109307, 103562, 85041, 72353, 55561, 14282, -37548, -62135, -51509, -39647, -55822, -90312, -115552, -122425, -122159, -123319, -122093, -112836, -94685, -63850, -10859, 63363, 133167, 162276, 134579, 66956, -2082, -29792, 6945, 79878, 113389, 56963, -48034, -114208, -121751, -133811, -186032, -226167, -202470, -152350, -143697, -172404, -185733, -174770, -170219, -168041, -137822, -96566, -95358, -129013, -134007, -87375, -35928, -11165, 12809, 52581, 77349, 71226, 68970, 89052, 89203, 34942, -36982, -71103, -65932, -47697]
36811d7697L3018N2200L2468k9404o8803m6256l137R643R60J965R008K435j3943
36798f7543k4326k4905j5702M860K4034K3190J1327J6808L7663L8182O629k2167
36786H050j8265L105J0244l747k2840k8665j1515J7945K8276L534k5818j9158
36774e8854J5642L7374L6022L5569L6857J1030m2891q3347q1751n1705j5239J9169
36762a42124M0492M0391L7065M8990M8615o33o2647n5507K5773Q6987O3652L201
36750A34255j9504m050O800N241Q953J2989M713k094N733O308k1253n0847m3126
36737D4118o944J3150j741k9076m0229k6310M43J3650l771l1909l2030p00K4814
36724g6535K3749J5305J3407N353n813Q798M3617M4494o133m5625k2976J7417
$$ y = [-47697, -14679, 37521, 69989, 40585, -28218, -74474, -77611, -67968, -67008, -65043, -56035, -53600, -67543, -91869, -116774, -132476, -127616, -103582, -80392, -69065, -52257, -14594, 23588, 30217, 8050, -10215, -7110, 3134, -613, -23453, -52118, -63633, -45688, -17412, -13878, -39696, -58854, -43212, -5838, 30184, 65753, 102610, 113640, 70749, -12598, -94349, -146054, -161293, -142124, -101632, -61241, -24176, 24814, 73429, 72796, 10149, -45358, -19585, 67402, 131054, 134255, 114751, 110701, 117501, 122742, 131695, 144684, 149397, 147303, 153036, 159344, 138091, 87244, 44118, 37174, 50324, 48583, 19507, -20722, -47032, -46589, -32939, -36710, -68619, -100649, -101349, -76535, -52786, -37481, -24074, -18721, -24534, -15736, 27881, 72375, 66242, 20617, -2359, 15058]
36712A5058N802m1569n2119j0721K8210K9232J0141q095k6393m0103l5482j7301
36700a43340k332R779K3541K0362j1509l5184o935M8000N8637Q946m0293m0057
36688a10385j1863p15j2913k3454j4953R576L2748L4238J4919N496K5846M6859
36676d601L0077n161m897K9742L5410j4345o1043m6180L417K0919k068j4762P434
36663b6058K7564O963l4348l9746J2610P9202R7523N5329N64k0263j4935j9857
36651A24548l8346l7822q180J3423o268m6115n6519k4156J3656J8403n086k1302
36639g3764j0556J0238J5266O862J0724L4825N1519L2116j3128m5813m4447k3531
36627d9689j0121j5076k7927l0335j4692M695M207j7432k8792j404M9090P4806
$$ y = [15058, 20860, -20709, -72828, -83549, -55339, -26107, -15966, -24061, -50454, -90557, -126039, -143340, -145672, -135893, -112352, -91990, -103499, -138683, -145618, -97618, -38981, -30035, -70328, -110385, -122248, -122963, -135876, -159330, -174283, -164707, -131959, -97721, -82802, -77306, -51460, -4601, 25476, 20315, 15418, 45160, 80570, 66225, 5182, -40998, -37581, -16662, -18730, -33492, -26058, 1506, 8469, -25879, -65625, -53015, 26187, 123710, 179039, 179603, 159340, 144405, 124548, 86202, 48380, 40200, 53623, 47355, 1240, -55279, -79435, -65779, -47376, -52462, -73764, -84320, -74082, -58816, -51954, -41230, -6405, 45114, 77230, 64102, 18289, -26158, -49689, -59810, -74886, -102813, -133148, -147840, -143145, -138938, -156370, -185162, -186566, -137476, -62670]
36615f2670N0778L715k1302j2981m95q467k0211l253L2412L2558k4776p8920n4263
36602a67875L2993Q5946N0861k0527n1423l3138m538J9148M8955P7114P6872M2041
36590A56429m047l3212k7907R641M4476L1640k3421n8306l6920j229R5r330J4448
36577F2357M3499J7766m2936n6677j1397J1440l1126p2154l9739L4948P0991N0199
36565C7171J6580m086k3810m5809n1450l4566j1314P206K3674L3589K1883j0482
36553d1414l4415k1529J8992M3886K3242k0934l8794j7081L668j0230l4921k7566
36541a57096P144K9226K7934K7552L3707K4355R1o269J4255K5779L390k8028l3221
36528c1181j2551J1587K4623J9559k334j6380N043M2539M0880j0167n0275l0769
$$ y = [-62670, -11892, -8177, -29479, -42460, -42955, -51422, -71633, -74886, -42474, -9916, -34692, -113612, -167875, -134882, -48936, 1925, -18602, -70025, -103163, -107701, -88553, -39598, 37516, 114388, 156429, 152382, 119170, 91263, 100904, 145380, 177020, 153599, 95293, 58373, 57144, 57239, 47909, 62357, 105856, 123622, 80686, 24009, 12612, 24052, -7074, -79228, -118967, -84019, -13028, 37171, 53751, 49665, 25855, -19954, -71404, -105970, -117284, -110078, -86404, -52815, -30932, -41414, -75829, -97358, -78366, -34480, -11238, -32172, -70966, -88047, -84379, -94609, -129530, -157096, -149952, -120726, -92792, -65240, -31533, -7178, -7087, -13356, 899, 26678, 30068, 2040, -31181, -43732, -32145, -7522, 12037, 9703, -6677, -1634, 40905, 81785, 71618, 21343, -9426]
36516i426K0300M7292L9361J6974j2433m1421m2578j0576Q445j9167n2540l5462
36504i1231J1165K2836l273j1836R311J1657k0009l3629K426M4290M3358J8115
36492C180J2024K2732J9976K826p670j1913k4399l6796k8428n667N310L47j631
36479e0109L351p93j4501j4424R024L2574L1924J2103p045j7429j9831j0475J0112
36466c5519K4225J3316j4500k9740j6654R282K2586J7151R336J6116L3536L7259
36454H6394Q716l7156o0125l9962l324J0869M136J1758M5415P3184O6590L8750
36442B05245J7834P783j489o872l679p327l1061n3821m4797j3380J050j2621k5162
36429C1703j5770K790J4571K1153K2107Q836r477p383J4023J9317q314m0729n2562
$$ y = [-9426, 10874, 58166, 97527, 114501, 102068, 60647, 18069, 7493, 15938, -3229, -55769, -91231, -80066, -57230, -60503, -72339, -63028, -51371, -71380, -105009, -102583, -58293, -14935, 3180, 15204, 37936, 57912, 60738, 53068, 41155, 16756, -20040, -48468, -54135, -48825, -48478, -50109, -46758, -47551, -62052, -76476, -67452, -34878, -2954, 9149, 2104, -15325, -35156, -45631, -35519, -11294, 2022, -12478, -42218, -58872, -49590, -27004, -9853, -517, 15599, 49135, 86394, 95110, 57954, -2171, -42133, -45457, -34588, -30452, -18694, 26721, 99905, 166495, 205245, 223079, 230862, 229373, 222501, 218822, 211495, 180434, 126613, 81816, 68436, 69486, 56865, 31703, 15933, 18723, 33294, 54447, 76554, 85390, 75913, 68530, 82553, 101870, 93556, 52827, 265]
36416B65n8072p1491o8508k8339J6164J9541m517l650L1105N5257M1675J1535
36404e9035j1034k7350l5186j8038J7011L3169K0888K0809N6955Q4206M8271k6066
36392A04600n9357k3006K9761M3052K1710m67j3825k5468k8569j4140J857m463
36380C1685k7803m1579l7880l1402k6090q818J9151L5030K9567K2098K7018L1500
36368B2477K3576J6186K0806K1507L371j4200o204J1817M261k6634m3433l2763
36356G67k1667k8349l3972j7502J2307L5559M6500M5327K8398K414j2111p353
36344E0318n14o464j5744j3258j667P332R666N613l897q350N213K5219J8998k0596
36330E1869n4167m2500L659M2317N2841M5478L0935Q690j6708l1311k8781j8754
$$ y = [265, -57807, -129298, -197806, -226145, -209981, -190440, -194957, -198607, -167502, -112245, -70570, -59035, -70069, -97419, -132605, -150643, -133632, -100463, -79575, -58766, -1811, 82395, 130666, 104600, 45243, 22237, 51998, 95050, 116760, 116293, 102468, 77000, 48431, 34291, 36148, 31685, 3882, -37697, -75577, -106979, -133069, -141887, -122736, -87706, -58139, -36041, -9023, 22477, 46053, 62239, 83045, 104552, 107923, 93723, 87519, 99336, 103597, 76963, 33530, 767, -20900, -49249, -83221, -100723, -88416, -52857, -6357, 38970, 67368, 69782, 57671, 50318, 49804, 43340, 27596, 14338, 12671, 20003, 29669, 35282, 31385, 23035, 28248, 53467, 72465, 51869, -2298, -44798, -41139, 1178, 54019, 99497, 130432, 139122, 122414, 91103, 62322, 43568]
36318D3568j4769k0001k4543j4084J4324M3928N2860L7547J3224o068j5303j1021
36306I9662M936J6302P973j0217j7526j6254k3462l2541j9876Q060J6478L86l341
36293C0580K1898M3538L5885J9909J7179Q380k3462m7256k7184J6998L8286K8141
36281A62892J1049n402l0082n3133n3737l3947j1288Q657K2214J2158k1468l8207
36269c0294p301L8590M4160Q822k2302k8876k7673k5854j2608O088R471k050r333
36256e9160o501J644J8508L7211K7767j4477l7672n098L3280R391m9107n5461
36244i9675j48L8897K2848k255j27L895q252p957J6377K7301M717j9170k0696
36231d4245j6541r037K8684Q2891R0593L7068j5082l2309n7541j02422r2684J912
$$ y = [43568, 28799, 8798, -15745, -29829, -15505, 28423, 81283, 118830, 132054, 125986, 110683, 99662, 104598, 120900, 128873, 118656, 101130, 84876, 61414, 28873, 8997, 17057, 33535, 33921, 30580, 52478, 96016, 131901, 151810, 168989, 177369, 153907, 106651, 79467, 96465, 134751, 162892, 173941, 168539, 138457, 85324, 31587, -2360, -13648, -4991, 17223, 29381, 7913, -30294, -37595, 995, 45155, 53977, 31675, 2799, -24874, -50728, -63336, -57248, -47777, -49827, -59160, -65661, -64017, -45509, -8298, 19469, 4992, -32680, -37778, -4498, 4893, -44214, -99675, -99823, -60926, -38078, -40333, -40460, -36565, -44817, -52774, -36397, -9096, -4379, -23549, -44245, -60786, -69823, -41139, 41752, 132345, 169413, 154331, 122022, 64481, -37941, -130625, -128713]
36219a28713P7818M0604l9627l4918L6726M9070k0676o0035p439O0054N9756J6988
36207D9608k969P213K0621L4778N4326N8892L2186p327l4493m7605n1864m6450
36195F6916m3378o0474p9675n6220R258N4027L7903O36k091K0112K1363p83q734
36182d1140O517J3215m182k1317j7517o471p103j2618r482o236j7501l0335j5459
36169a69629K6295N5264M3124J1478P51J4832K2322O996j1553j0658P594K7744
36157B4560L7366K6634k768k1872J768N2952P4928M3349j183j6289j4420k5153
36145A79872m0316l8990l2949l7740k8418J8763O5319N6446J1797j253K1846J8237
36133A92614k8626n4374k1545J5338j207m0860m0677l463J9892J3412P08j2264
$$ y = [-128713, -50895, -10291, -49918, -84836, -48110, 960, -19716, -79751, -87190, -27136, 32620, 49608, 46639, 53852, 74473, 109251, 163577, 222469, 254655, 247328, 212835, 165230, 113366, 66916, 23538, -36936, -116611, -172831, -163573, -109546, -71643, -71007, -73098, -52986, -31623, -32406, -41140, -34623, -21408, -25590, -46907, -64424, -70895, -77998, -90616, -100098, -106334, -123835, -154170, -169629, -143334, -88070, -44946, -33468, -32717, -17885, 4437, 11433, -120, -10778, -3184, 24560, 61926, 88560, 85792, 63920, 65688, 118640, 193568, 236917, 235734, 219445, 205025, 179872, 139556, 100566, 67617, 29877, 1459, 20222, 85541, 141987, 153784, 152531, 174377, 192614, 163988, 109614, 88069, 103407, 102200, 61340, 20663, 17200, 37092, 50504, 51212, 38948]
36121C8948l9529o7994o1416j4846L5283N8931N7550M1822J8143K7R01R505R5
36108G7420k7087m2548l1993j6624j6784k0366o318J8030K5574Q672r367l782
36096d5173K1706L8519K3557j5334m4559l8456p463J3103M034j6381j8743k872
36084h8062K715j6955l7779k6515J2519L9207K6587r385l3971l0401m448K8352
36072a38136M5097K4256k4579n3132k4619L5225O5824M6305J1043q520j9215l2584
36060g3035l3965r881K0216K7418J2475k305o816o314k533N082P220m462j8945
36047h5845j6757M220K8131M0009L2682O168k3425k7088M220M0857N0642M0800
36035I4614L6577L1946J020m5310n9300k4155J8216K6550J2359P165Q009j0165
$$ y = [38948, -581, -68575, -129991, -144837, -109554, -50623, 6927, 48749, 66892, 66919, 67820, 77325, 77420, 50333, 7785, -24208, -40832, -57616, -77982, -84300, -66270, -40696, -32024, -41391, -45173, -23467, 15052, 38609, 23275, -21284, -59740, -67203, -54100, -50066, -66447, -85190, -88062, -85347, -102302, -140081, -166596, -154077, -114870, -88283, -97668, -131639, -162040, -166488, -138136, -93039, -68783, -93362, -146494, -171113, -135888, -70064, -23759, -12716, -21236, -40451, -73035, -107000, -116881, -96665, -69247, -56772, -59077, -65893, -72207, -74740, -69658, -62438, -66900, -85845, -102602, -98382, -70251, -30242, 2440, 8608, -14817, -41905, -37685, 3172, 53814, 94614, 131191, 163137, 164157, 118847, 59547, 35392, 53608, 80158, 92517, 99682, 107691, 97526]
36023I7526m5639o7892n8015k5578R499L0800K8626R992k704j697q262l3325m3750
36010a10419o570M7019N2397N554k9335j8809p042l2559n4341j4630O2030R5455
35998a1250N9370N712j5906q600M671J2433K627l3334o8952n8737m511L6093K8659
35985e1725O515Q398J6509q99k2550n879L3447L3212k2828p5077o5274o390M3316
35972a09225M9477K4340k968j7165j9540j3091O042L7098N9414M5972K88l7076
35960B3566l3733l971J4088O439j0672k0048j6457J34K1077K6394Q937o292P835
35947A7297L7582M3711J7171j0070j2091J443R267O256l251j9252m0242n5612
35935g791n2933k8217R450L7341L3702O489n653J8745M8950M2039O157j0948P743
$$ y = [97526, 51887, -16005, -74020, -99598, -90099, -59299, -30673, -20681, -23385, -25082, -33344, -66669, -110419, -116989, -69970, -17573, -12019, -41354, -60163, -67205, -99764, -154105, -168735, -106705, -11250, 48120, 53832, 37926, 29326, 33997, 46430, 49057, 15723, -53229, -111966, -116477, -80384, -51725, -45210, -36812, -20303, -21202, -43752, -49631, -16184, 17028, -5800, -80877, -146151, -152541, -109225, -59748, -35408, -38376, -55541, -75081, -88172, -82130, -45032, 14382, 60354, 60642, 23566, -10167, -14138, -50, 6389, -4283, -24331, -40788, -40654, -19577, 6817, 15754, 9462, 17297, 54879, 98590, 115761, 105691, 93600, 95043, 104310, 110566, 107315, 88063, 47821, -7791, -60724, -88941, -79491, -42150, -8448, -1959, -7612, 11133, 60083, 102122, 108279, 97331, 105074]
35922A05074K7025J3178k3567m9333m3578r263L0840M4860K1437j1902k2922j9544
35910F2305k9840m7721m1657j4237l687j9701k7169o343J8650K7634L3814M6138
$$ y = [105074, 132099, 145277, 121710, 72377, 28799, 19536, 50376, 95236, 116673, 104771, 81849, 62305, 32465, -15256, -56913, -71150, -74837, -94538, -121707, -128050, -109400, -81766, -47952, -1814]
$$ [...]
##END NTUPLES=NMR SPECTRUM
##END=
