##TITLE=31Pdec_103-2024
 DMSO-d6, 24 sc
 5.12.2024
##JCAMPDX= 6.0         $$ Bruker NMR JCAMP-DX V2.0
##DATA TYPE= NMR SPECTRUM
##DATA CLASS= NTUPLES
##ORIGIN= UXNMR, Bruker Analytische Messtechnik GmbH
##OWNER= root
$$ XWIN-NMR		Version 3.5
$$ Thu Dec  5 14:28:41 2024 Russian Standard Time (UT+4h)  she@DPX200
##.OBSERVE FREQUENCY= 81.013821
##.OBSERVE NUCLEUS= ^31P
##.ACQUISITION MODE= SIMULTANEOUS
##.ACQUISITION SCHEME= undefined
##.AVERAGES= 24
##.DIGITISER RES= 17
##SPECTROMETER/DATA SYSTEM= spect
##.PULSE SEQUENCE= zgpg30
##.SOLVENT NAME= DMSO
##.SHIFT REFERENCE= (INTERNAL, DMSO, 0, 198.062)
##AUDIT TRAIL= $$ (NUMBER, WHEN, WHO, WHERE, WHAT)
$$ ##TITLE= Audit trail, XWIN-NMR		Version 3.5
$$ ##JCAMPDX= 5.01
$$ ##ORIGIN= Bruker BioSpin GmbH
$$ ##OWNER= she
$$ F:/spectra/data/she/nmr/P31/2/pdata/1/auditp.txt
$$ ##AUDIT TRAIL=  $$ (NUMBER, WHEN, WHO, WHERE, WHAT)
(   1,<2024-12-05 14:27:41.45 +0400>,<she>,<DPX200>,
      <created by zg, POWCHK disabled, PULCHK disabled
       configuration hash MD5:
       00 E9 B6 7A A2 85 ED C7 34 08 36 98 17 FE 4E 26
       data hash MD5: 32K
       43 4C 6C C1 AC 44 EE 02 8A 24 C7 5F 7D 2F 4E 29>)
(   2,<2024-12-05 14:27:43.76 +0400>,<she>,<DPX200>,
      <Start of raw data processing
       efp BC_mod = 2 LB = 1.5 FT_mod = 6 PKNL = 1 PHC0 = 1676.932 PHC1 = 1480.287 SI = 64K 
       data hash MD5: 64K
       39 55 ED DF C2 4D CF 85 29 61 D4 A3 69 EF 97 A6>)
(   3,<2024-12-05 14:28:12.35 +0400>,<she>,<DPX200>,
      <pk PHC0 = -40.35117 PHC1 = 88.59898 
       data hash MD5: 64K
       C2 C9 23 AD C4 30 2D E9 F4 AC 9B A4 63 04 65 F3>)
(   4,<2024-12-05 14:28:18.17 +0400>,<she>,<DPX200>,
      <abs ABSG = 5 
       data hash MD5: 64K
       18 45 D6 1F 68 93 05 E6 E6 C3 49 D1 5E A0 7E 59>)
$$ ##END=
$$ 
$$ hash MD5
$$ 53 D8 51 85 CB CF 3B 48 B9 53 AF 6B CD 4C 66 0B
##$RELAX= 
##$RELAX= 
##$RELAX= 
##$RELAX= 
##$RELAX= 
##$RELAX= 
##$RELAX= 
##$RELAX= 
$$ Bruker specific parameters
$$ --------------------------
##$DU= <F:/spectra>
##$EXPNO= 2
##$NAME= <P31>
##$PROCNO= 1
##$TYPE= <nmr>
##$USER= <she>
##$AMP= (0..31)
100 100 100 100 100 100 100 100 100 100 100 100 100 100 100 100 100 100 
100 100 100 100 100 100 100 100 100 100 100 100 100 100 
##$AQSEQ= 0
##$AQ_mod= 1
##$AUNM= <au_zg>
##$AUTOPOS= <>
##$BF1= 81.014009
##$BF2= 200.13
##$BF3= 200.13
##$BF4= 200.13
##$BF5= 200.13
##$BF6= 200.13
##$BF7= 200.13
##$BF8= 200.13
##$BYTORDA= 1
##$CFDGTYP= 0
##$CFRGTYP= 5
##$CHEMSTR= <none>
##$CNST= (0..31)
1 1 145 1 1 1 1 1 1 1 1 1 1 1 1 1 1 1 1 1 1 1 1 1 1 1 1 1 1 1 1 1 
##$CPDPRG= <waltz16>
##$CPDPRG1= <>
##$CPDPRG2= <waltz16>
##$CPDPRG3= <>
##$CPDPRG4= <mlev>
##$CPDPRG5= <mlev>
##$CPDPRG6= <mlev>
##$CPDPRG7= <mlev>
##$CPDPRG8= <mlev>
##$CPDPRGB= <>
##$CPDPRGT= <>
##$D= (0..31)
0 1 0 0 0 0 0 0 0 0.06 0 0.03 2e-05 3e-06 0 0 0.0002 0 0 0 0 0 0 0 0 0 
0 0 0 0 0 0 
##$DATE= 1733394460
##$DBL= (0..7)
120 120 120 11 120 120 24 19 
##$DBP= (0..7)
150 150 150 150 150 150 150 150 
##$DBP07= 0
##$DBPNAM0= <>
##$DBPNAM1= <>
$$ [...]
##$SUBNAM3= <"">
##$SUBNAM4= <"">
##$SUBNAM5= <"">
##$SUBNAM6= <"">
##$SUBNAM7= <"">
##$SUBNAM8= <"">
##$SUBNAM9= <"">
##$SW= 400.765351723535
##$SWIBOX= (0..15)
0 1 3 0 0 0 0 0 0 0 0 0 0 0 0 0 
##$SW_h= 32467.5324675325
##$TD= 32768
##$TD0= 1
##$TE= 0
##$TE2= 300
##$TE3= 300
##$TEG= 300
##$TL= (0..7)
0 120 53 12 22 120 120 120 
##$TP= (0..7)
150 150 150 150 150 150 150 150 
##$TP07= 0
##$TPNAME0= <>
##$TPNAME1= <>
##$TPNAME2= <>
##$TPNAME3= <>
##$TPNAME4= <>
##$TPNAME5= <>
##$TPNAME6= <>
##$TPNAME7= <>
##$TPOAL= (0..7)
0.5 0.5 0.5 0.5 0.5 0.5 0.5 0.5 
##$TPOFFS= (0..7)
0 0 0 0 0 0 0 0 
##$TUNHIN= 0
##$TUNHOUT= 0
##$TUNXOUT= 0
##$USERA1= <user>
##$USERA2= <user>
##$USERA3= <user>
##$USERA4= <user>
##$USERA5= <user>
##$V9= 5
##$VALIST= <valist>
##$VCLIST= <CCCCCCCCCCCCCCC>
##$VD= 0
##$VDLIST= <DDDDDDDDDDDDDDD>
##$VPLIST= <PPPPPPPPPPPPPPP>
##$VTLIST= <TTTTTTTTTTTTTTT>
##$WBST= 1024
##$WBSW= 4
##$XGAIN= (0..3)
0 0 0 0 
##$XL= 0
##$YL= 0
##$YMAX_a= 3207
##$YMIN_a= -5529
##$ZGOPTNS= <>
##$ZL1= 120
##$ZL2= 120
##$ZL3= 120
##$ZL4= 120
##$ABSF1= 198.0616
##$ABSF2= -202.7028
##$ABSG= 5
##$ABSL= 3
##$ALPHA= 0
##$AQORDER= 0
##$ASSFAC= 0
##$ASSFACI= 0
##$ASSFACX= 0
##$ASSWID= 0
##$AUNMP= <proc_1d>
##$AZFE= 0.1
##$AZFW= 0.5
##$BCFW= 0
##$BC_mod= 2
##$BYTORDP= 0
##$COROFFS= 0
##$CY= -3
##$DATMOD= 1
##$DC= 0
##$DFILT= <>
##$DTYPP= 0
##$F1P= 0
##$F2P= 0
##$FCOR= 1
##$FTSIZE= 65536
##$FT_mod= 6
##$GAMMA= 0
##$GB= 0
##$INTBC= 1
##$INTSCL= 9.790993e-09
##$ISEN= 30
##$LB= 1.5
##$LEV0= 0
##$LPBIN= 0
##$MAXI= 10000
##$MC2= 0
##$MEAN= 0
##$ME_mod= 0
##$MI= 50
##$NCOEF= 0
##$NC_proc= -8
##$NLEV= 6
##$NOISF1= 182.463
##$NOISF2= 159.3651
##$NSP= 0
##$NTH_PI= 0
##$NZP= 0
##$OFFSET= 198.0616
##$PC= 4
##$PHC0= 1636.581
##$PHC1= 1568.886
##$PH_mod= 1
##$PKNL= yes
##$PPARMOD= 0
##$PSCAL= 0
##$PSIGN= 0
##$REVERSE= no
##$SF= 81.0140089999434
##$SI= 65536
##$SIGF1= 159.3651
##$SIGF2= -187.1042
##$SINO= 113.3802
##$SIOLD= 16384
##$SREGLST= <1H.CDCl3>
##$SSB= 0
##$STSI= 65536
##$STSR= 0
##$SW_p= 32467.5324675325
##$SYMM= 0
##$S_DEV= 0
##$TDeff= 32768
##$TDoff= 0
##$TI= <>
##$TILT= no
##$TM1= 0
##$TM2= 0
##$TOPLEV= 0
##$USERP1= <user>
##$USERP2= <user>
##$USERP3= <user>
##$USERP4= <user>
##$USERP5= <user>
##$WDW= 1
##$XDIM= 65536
##$YMAX_p= 272124797
##$YMIN_p= -44739305
$$ End of Bruker specific parameters
$$ ---------------------------------
##NTUPLES= NMR SPECTRUM
##VAR_NAME=  FREQUENCY,     SPECTRUM/REAL,   SPECTRUM/IMAG
##SYMBOL=    X,             R,               I
##VAR_TYPE=  INDEPENDENT,   DEPENDENT,       DEPENDENT
##VAR_FORM=  AFFN,          ASDF,            ASDF
##VAR_DIM=   65536,         65536,           65536
##UNITS=     HZ,            ARBITRARY UNITS, ARBITRARY UNITS
##FACTOR=    0.49542278885378, 1,            1
##FIRST=     16045.7642231865, 0,            0
##LAST=      -16421.768244346, 0,            0
##MIN=       -16421.768244346, -44739305,    0
##MAX=       16045.7642231865, 272124797,    0
$$ Real data points
##PAGE= N=1
##DATA TABLE= (X++(R..R)), XYDATA
$$ [...]
40105B319399j016126n73732P35289J922695J509830m55536k017051j519930L45144
40096A249982J318502J65069j980430k826464j236715J646085L505393L155694
40088D997116J668900R55546J392512J477318l7460k407277l810936l460281k087754
40079a312316o72866M28054J085608J050222M34980m9380R5136M30909K40017
40070A730364k67586q7733J060374J978233J331463n14152j726565j198251J75522
40061B481669P98535L21667m01454q01545j016159j029729o05113j95768n83189
40052a031086j151478o5231K765554M378200K243281j840277l580585j747702
40044b9324M62456J57160j463978j463745M24602J783566J160376k75058q08323
$$ y = [2319399, 1303273, 729541, 1464830, 3387525, 4897355, 4441819, 2424768, 904838, 1249982, 2568484, 2733553, 753123, -2073341, -3310056, -1663971, 1841422, 4997116, 6666016, 7621562, 9014074, 10491392, 10453932, 8046655, 4235719, 775438, -1312316, -1985182, -1557128, -471520, 578702, 1013682, 964302, 1059438, 1490347, 1730364, 1462778, 1375045, 2435419, 4413652, 5745115, 5230963, 3504398, 2306147, 2481669, 3280204, 3601871, 3200417, 2398872, 1382713, 352984, -252129, -447897, -1031086, -2182564, -2247795, 517759, 4895959, 7139240, 5298963, 1718378, -29324, 433132, 590292, -873686, -2337431, -1912829, -129263, 1031113, 756055, -52268]
40035e2268l52077N1799o6218j97542J34160N69087L47925n94317j353398j148204
40025b661053l59885Q4799J36237N88622J628928K391461K212508J414636N46156
40016E982409j85321m18069K10092R03666J12386k043249l200369j850811L58214
40007a31052R90238K15084j26510K02310p3318q93652p46201M98635J148263O14801
39997A698598M05148J269138J573258p6126k332694k875701j526347j03519N7087
39988a911158p94480j578629j254918M61504K443858K876315J323218o57278j482573
39979e74141j097195k7856J623179L211757L132541R58725j198632j259967j52298
39970D616113k56867j619668j972706l50420J547278J957919J154447L63158R4369
$$ y = [-52268, -404345, -352546, -418764, -616306, -482146, 86941, 434866, -159451, -1512849, -2661053, -3020938, -2936139, -2799902, -2211280, -582352, 1809109, 4021617, 5436253, 5982409, 5797088, 5379019, 5589111, 6492777, 6605163, 4561914, 1361545, -489266, -131052, 859186, 1074270, 947760, 1150070, 1076752, 183100, -563101, -64466, 1083797, 1698598, 2103746, 3372884, 4946142, 4870016, 2537322, -338379, -1864726, -1968245, -1911158, -2705638, -4284267, -5539185, -5077681, -2633823, 242492, 1565710, 908432, -574141, -1671336, -1699192, -76013, 3135744, 6268285, 7227010, 6028378, 4768411, 4616113, 4359246, 2739578, 766872, 416452, 1963730, 3921649, 5076096, 5439254, 5533623]
39961E533623J90955L72829K18102m78386j149224j231548j333830k226809k875962
39952b980250j473794J341543K656933J533806O06027J811937K926208R75604
39944G398014k568547l359786m46513K371685J958200l93759j808953j797262
39936A353079j472949q76087M43319J366803L86699j543608j859751k64299O71557
39927a795237m57211j546614j96412K480248L325176J504238p23785j399668j026021
39918A64714r05118r50977j60718J550366K915630K583181M95792j892273k869316
39909I31281k208608j330571j286325j248057J517J722512J972476N57493n96914
39900a485196l50145K34860J02668k5834O68086J259928N58998o93301p89621
$$ y = [5533623, 5724578, 6097407, 6315509, 5837123, 4687899, 3456351, 2122521, -104288, -2980250, -4454044, -3112501, -455568, 1078238, 1684265, 3496202, 6422410, 7398014, 4829467, 1469681, 1023168, 3394853, 5353053, 4959294, 3150341, 1353079, -119870, -995957, -552638, 814165, 1200864, -342744, -2202495, -2466794, -1795237, -2252448, -3799062, -3995474, -1515226, 1809950, 3314188, 2590403, 1190735, 164714, -740404, -1691381, -1852099, -301733, 2613897, 5197078, 5692870, 3800597, 931281, -1277327, -2607898, -3894223, -5142280, -5140763, -3418251, -1445775, -888282, -1485196, -1835341, -1600481, -1497813, -1523647, -855561, 404367, 963365, 270064, -519557]
39891e19557N16499K038191K901830K824881J464669q22469k262979j577560j07765
39882D455740r1830j301851j657583q71879p19122j390567o54304K125087L961614
39873C855305K295220j085220k565058j580253l77499n070N45779J532511J706660
39864D322375Q19343L45144P95231N37649j376483l112953k543010m54105O96530
39855B9721L13553j78007j73535m71073q89645J45577K638561L894479K065985
39846G375616q81605j868831j100120j183242k520426k650517n94296J146620
39838b276801L77649j394457j396414K73129J280816Q45155M72543J192552K222919
39829A597091K581882K249134J364003j74909j791719k250576j262538o7566K18483
$$ y = [-519557, -3058, 2035133, 4936963, 7761844, 9226513, 8404044, 6141065, 4563505, 4455740, 4363910, 3062059, 1404476, 532597, -186525, -1577092, -2231396, -106309, 3855305, 6150525, 5065305, 2500247, 919994, 542495, 537425, 1083204, 2615715, 4322375, 5141718, 5486862, 6282093, 6819742, 5443259, 2330306, -212704, -666809, 29721, 343274, 165267, -8268, -479341, -1368986, -1223409, 1415152, 5309631, 7375616, 6494011, 4625180, 3525060, 2341818, -178608, -2829125, -3423421, -2276801, -1899152, -3293609, -4690023, -4416894, -3136078, -2290923, -1818380, -625828, 1597091, 4178973, 6428107, 7792110, 7617201, 5825482, 3574906, 2312368, 2244802, 2463285]
39820B463285J3142L98834J481904K264053J856248M15739j008695j464339j027052
39811E393119n99837o82359q17623n33494r8276K10948P16449J379176J205230
39802F173333j80015j294229o86011P19327R68885J24864j52404L86679M40764
39793F501193n8822K56376J186374N91746j901725l470176j966386R69088K465906
39784D573574K212829J756198J619247J222649N12754k85123j566813l236071
39776F809244l765737k286299n92496r06817k406931k316439q2580J895972J800091
39767a851992M90738l79450n35880o12434p92502p10118q8733Q62636J386665
39758b231070P98295l94714p15632K08565Q35876J38770l68447J124611L379650
$$ y = [2463285, 2476427, 2875261, 4357165, 6621218, 8477466, 8893205, 7884510, 6420171, 5393119, 4793282, 4110923, 3293300, 2759806, 2661530, 2872478, 3588927, 4968103, 6173333, 5993318, 4699089, 4013078, 4732405, 5701290, 5826154, 5673750, 6060429, 6501193, 6442371, 6698747, 7885121, 8476867, 6575142, 3104966, 1138580, 2107668, 4573574, 6786403, 8542601, 10161848, 11384497, 11897251, 11612128, 10045315, 6809244, 3043507, 757208, 164712, -742105, -3149036, -5465475, -5548055, -3652083, -1851992, -1361254, -1740704, -2276584, -2889018, -3681520, -4391638, -4480371, -3617735, -2231070, -1432775, -1827489, -2543121, -2334556, -1498680, -1359910, -1728357, -603746, 2775904]
39749B775904L361897N34447k457479l483631k991349j996630m29045J518034
39741c167852K447594J629767M61619O92543K055235K735209J591308q06628k794035
39732D844760k896338j216513L05213l5390j370944j338806M43276J799640J399812
39723A934710O57984J055434J529420L96737j523043j919206m59493Q46840O15287
39714C134670m03664r60601r06366o99417m65410r9461L94597R94533J558539
39705B547420J570703O46506o29726j098513m75668K17928n2098j139780k089820
39696e03048k215749j488784k95813P59333J113983P85961N25797R96917J867166
39687A545763K184361J668400J022359P08816J38597j214752k453580k171712
$$ y = [2775904, 6137801, 6672248, 4214769, 731138, -2260211, -4256841, -4685886, -3167852, -720258, 909509, 1371128, 2063671, 4118906, 6854115, 8445423, 7638795, 4844760, 1948422, 731909, 1037122, 1001732, -369212, -1708018, -1264742, 534898, 1934710, 2592694, 3648128, 5177548, 5574285, 4051242, 2132036, 1672543, 2519383, 3134670, 2731006, 1770405, 864039, 164622, -300788, -400249, -5652, 988881, 2547420, 4118123, 4764629, 4134903, 3036390, 2560722, 2778650, 2726552, 1586772, -503048, -2718797, -4207581, -4503394, -3744061, -2630078, -1844117, -1318320, -321403, 1545763, 3730124, 5398524, 6420883, 7129699, 7268296, 6053544, 3599964, 1428252]
39679A428252o44611K23822m53242j266629p33352L90372L62928p63566j241020
39670b697046k56596J085925J538599J111257M14229j89123l67500J58793Q99447
39661A697985Q54137L937l60337N87680J886589J938980M40938j455800k487754
39652C106355k250030j162010J7505P30675R26993Q50236O87065O10949P72041
39643D289779Q17160K272j483779k037200o97758R38563N56681j424778k260144
39634a299204q85679O92746P07252Q1190K67398O30021j28307j332454j254844
39625b521881N2013P84680l2299j579203k651303k628270j232610J230286L348847
39616e229740L627309K261045Q75797L75733J17666n15800q45446N0189J619649
$$ y = [1428252, 783641, 1007463, 554221, -712408, -1445760, -1055388, -692460, -1456026, -2697046, -2953642, -1867717, -329118, 782139, 1196368, 1007245, 639745, 798538, 1697985, 2552122, 2556059, 2195722, 2783402, 4669991, 6608971, 7049909, 5594109, 3106355, 856325, -305685, -288180, 442495, 1369488, 2219724, 2906789, 3517738, 4289779, 5106939, 5109211, 3625432, 1588232, 890474, 1829037, 2385718, 960940, -1299204, -2184883, -1492137, -784885, -703695, -436297, 193724, 65417, -1267037, -2521881, -2469868, -1685188, -1717487, -3296690, -5947993, -8576263, -9808873, -8578587, -5229740, -1602431, 658614, 1534411, 1910144, 2027810, 1512010, 666564, 716753, 2336402]
39607B336402K084705N19478j793021k507070p17260K078073L681070L298735
39599H981112J526864q68358k976763l275001j059204J627098J583016j349918
39591D188846l598716k437671N19158J823152O14600j217924k067273j793786
39583c969614o12952J214401K758144L010278K058456P10013n56262j313580p74155
39574B524729R79770K184821J392276m00302j200749q84972q23624j311439j432285
39565A028225j113720j151866j252227j82118J888737L149874K650391J366433
39557F383729M59376M5328r2077j58417q30130k373063l257813j683465J309107
39548a97425K538948J080304m42788M619Q38154l09497k647896l366574j714681
$$ y = [2336402, 4421107, 4940585, 3147564, 640494, -76766, 2001307, 5682377, 8981112, 10507976, 9639618, 6662855, 3387854, 2328650, 3955748, 5538764, 4188846, 590130, -1847541, -1328383, 494769, 1109369, -108555, -2175828, -3969614, -4582566, -3368165, -610021, 2400257, 4458713, 5168726, 4612464, 3298884, 2524729, 3504499, 5689320, 7081596, 6681294, 5480545, 4595573, 3771949, 2460510, 1028225, -85495, -1237361, -2489588, -2671706, -782969, 2366905, 5017296, 6383729, 6843105, 6888433, 6796356, 6637939, 5807809, 3434746, 176933, -1506532, -197425, 2341523, 3421827, 2979039, 2983658, 3821812, 3512315, 864419, -2502155, -4216836]
39539d216836J64750K60794r82469j543468k16635K013120K845058J201490j267077
39530a741273k004546o89151O87739Q49459O78179J192485J818352J622513Q55900
39521C269657J87614m55307j234699j586697j082918k86024J19992K78688N23304
39512b66390O12331K77880k01656m32060j61654R09158K392647K496032k4811
39503E601477l090954k992443M13033K931220J804851o05331j002909k15623r62427
39494A880894k619225k011188J324486M175020M059155J825420m10116j556899
39486F667547j469233o52116m16592j614232l036850k640865l34766K005704L062927
39477A571524K926615J799382j30528j702636j753106j030244j118458j635159
$$ y = [-4216836, -4052086, -3791292, -4773761, -6317229, -6533864, -4520744, -1675686, -474196, -1741273, -3745819, -4434970, -3747231, -2897772, -2219593, -1027108, 791244, 2413757, 3269657, 3457271, 3001964, 1767265, 180568, -902350, -1188374, -1068382, -789694, -266390, 345941, 623821, 422165, -9895, -171549, 737609, 3130256, 5626288, 5601477, 2510523, -481920, -68887, 2862333, 4667184, 4061853, 3058944, 2843321, 1880894, -738331, -2749519, -1425033, 2749987, 6809142, 8634562, 8224446, 6667547, 5198314, 4546198, 4129606, 2515374, -521476, -3162341, -3497107, -1491403, 1571524, 4498139, 6297521, 6166993, 4464357, 2711251, 1681007, 562549, -1072610]
39469a072610q53860R24861J368000n5019r88276J22241J810757K269109J844384
39460E369587J399679M26331j401972k667532k153401q68516k81583O1874J157869
39451A042336K035153R99656j222175j905917J5589K488177K874651P75158j931997
39442E170631l023886j783355N08587J915891J853214J297913R64409L87407o98750
39433F592061j436096j274926j043989j332714j068617O40063K306749J748645
39425E131176o06217k145177j575367o6924R67010J181340L33988j711269l464406
39416a955846k565932P96740L174752K068215p16373j645401j01523J616071K063539
39407B734242J963930J805658O32786j818607l652652k956807l67500J858822
$$ y = [-1072610, -1926470, -1001609, 366391, 311372, -676904, -554663, 1256094, 3525203, 5369587, 6769266, 7195597, 5793625, 3126093, 972692, 104176, -177407, -115533, 1042336, 3077489, 4077145, 2854970, 949053, 964642, 3452819, 6327470, 7102628, 5170631, 2146745, 363390, 871977, 2787868, 4641082, 5938995, 6903404, 7290811, 6592061, 5155965, 3881039, 2837050, 1504336, 435719, 1075782, 3382531, 5131176, 4524959, 2379782, 804415, 737491, 1704501, 2885841, 3219829, 1508560, -1955846, -4521778, -3725038, -550286, 1517929, 801556, -843845, -945368, 670703, 2734242, 4698172, 6503830, 7136616, 5318009, 1665357, -1291450, -1658950, 199872]
39399A99872K611692K422709J773528N26560j017606k049374k521580l067072
39391a121271l239356j475045K228575N113765M644776J671648r30496j854573
39383E038023j798197j201855M353O75751p40320l143574l239972k55772K316702
39374b344861J486032r14400j073478J260721K983714K564324J707885J926627
39366G596564K185066R52446j309624k883014k866910j678007l46779J39492m21523
39357A367711j067165q63744m67774j226439k644713k507821j88253J983718J918126
39348c696354P64214R30890K228490K215078P7755k056397k139774p07816N24729
39339a859185J136708J805463K525832K470592J425364J82000o11500j066376
$$ y = [199872, 2811564, 5234273, 7007801, 7534361, 6516755, 4467381, 1945801, -1121271, -4360627, -5835672, -3607097, 1506668, 6151444, 7823092, 6892596, 5038023, 3239826, 2037971, 2042324, 2718075, 1977755, -1165819, -4405791, -4661563, -2344861, -858829, -1773229, -2846707, -1585986, 1397728, 3962052, 5669937, 7596564, 9781630, 10734076, 9424452, 6541438, 3674528, 1996521, 1649742, 1789234, 1367711, 300546, -563198, -1030972, -2257411, -4902124, -7409945, -7598198, -5614480, -3696354, -2932140, -2001250, 227240, 2442318, 2520073, 463676, -1676098, -2383914, -1859185, -722477, 1082986, 3608818, 6079410, 7504774, 7686774, 7075274, 6008898]
39331F008898j324925j134378n94038n06102j242432j834421j100267O14384J764326
39322F51045J560267O10600l99500j482403k423544k296761p69080R53879J457863
39313b137634Q34530J99523P5885K40176O59945J420220K003757J793813J130472
39304F220687P75217N37905l04219j335660j219235J93962J355277J044417k84841
39295F983510j535749k096882j599898j1725J470210J163087o60740j649225o69058
39286A393530M92392P7702q28258m38299M16748k10257j619461j364534L36442
39277a743995M48648j927416l602110j853919J604079L236669K321502P17356
39269g99186n06619j593391k011189n92390K024958L321354K008529k97781j250950
$$ y = [6008898, 4683973, 3549595, 2955557, 2449455, 1207023, -627398, -1727665, -1113281, 651045, 2211312, 2821912, 2422412, 940009, -1483535, -3780296, -4549376, -3595497, -2137634, -1303104, -1103581, -1027696, -787520, -127575, 1292645, 3296402, 5090215, 6220687, 6995904, 7533809, 7229590, 5893930, 4674695, 4868657, 6223934, 7268351, 6983510, 5447761, 3350879, 1750981, 1739256, 3209466, 4372553, 3711813, 2062588, 1393530, 1885922, 1963624, 1135366, 697067, 1113815, 903558, -715903, -2080437, -1743995, -1295347, -3222763, -6824873, -8678792, -7074713, -3838044, -1516542, -799186, -1305805, -2899196, -4910385, -5502775, -3477817, -156463, 1852066, 1554285, 303335]
39260C03335m85906N16967M04029q37093k037578j853856j66539J414659J200377
39251a541605l71329j211384m60408M10600k3694j019862j014974j9938P43637
39242d508957Q97550J067389J341297J120921M83006K17494L18349j56560j347848
39233e67359k077443j634991q05183m02873m5906O80139J055833M66402k20956
39224c552337J5238M53520k53618j576381j584740J63694K039509K834281L017025
39215A556191L020449K132245R8963j686542j889203j070358o29311q02363r03551
39206a73480p61239o45682l74495K68673P16853L96566j82961l18695n01883j456181
39196c032524k264753j246097J315343L060466K521710P00430p23092j283989
$$ y = [303335, -182571, 334396, 738425, -98668, -2136246, -3990102, -4156641, -2741982, -1541605, -1912934, -3124318, -3584726, -3174126, -3197820, -4217682, -5232656, -5252594, -4508957, -3611407, -2544018, -1202721, -81800, 401206, 618700, 937049, 780489, -567359, -2644802, -4279793, -5084976, -5487849, -5533755, -4853616, -3797783, -3331381, -3552337, -3537099, -3083579, -3337197, -4913578, -6498318, -6334624, -4295115, -1460834, 1556191, 4576640, 6708885, 6807848, 5121306, 3232103, 2161745, 1532434, 730071, -173480, -934719, -1580401, -1954896, -1686223, -969370, -572804, -755765, -1074460, -1576343, -3032524, -5297277, -6543374, -5228031, -2167565, 354145, 1054575, 331483, -952506]
39188i52506j246895o12524N08567J476165J783048J408868K37879j769239l492930
39179b659567l185103q10700J495113K165622J985185K096920J854024L33679
39171C275173j325374j253705J70432Q47102J95655k93214J14806J79042r67657
39162I42260k061912j513181K11743J323319J241456J154921K035403L002519
39154F336528K249635n45873l365765l967994k555363j344190j457818j679596
39146f330436q68787R4201J29357J34164J304313K504942J875775K97704K69118
39137e89649J512322J068774j589312l033011j088932J551052J366046q21805
39129a624515j640443l85005P58379P25490N63810O31877j24686j631543k064949
$$ y = [-952506, -2199401, -2811925, -2303358, -827193, 955855, 2364723, 2602602, 833363, -2659567, -5844670, -6655370, -5160257, -2994635, -1009450, 1087470, 2941494, 3275173, 1949799, 696094, 866526, 1713628, 1909283, 1616069, 1730875, 1909917, 942260, -1119652, -2632833, -2421090, -1097771, 143685, 1298606, 3334009, 6336528, 8586163, 8040290, 4674525, 706531, -1848832, -3193022, -4650840, -6330436, -7199223, -7105022, -6975665, -6841501, -5537188, -3032246, -1156471, -858767, -589649, 922673, 1991447, 402135, -2630876, -3719808, -2168756, -802710, -1624515, -3264958, -3649963, -2891584, -2166094, -1602284, -970407, -1095093, -2726636, -4791585]
39120d791585p10192O78002N35161j73285L73193K014755K916374K185411R31322
39111C959156O64261J385073J616707K47507j892861k724887j350607Q06099J802484
39102D512932J462752R71312P44440M9392j293884k215823j929145j179263j194896
39093g2183j855654j658253L86249L189603M392521K986060O35909m20113l74893
39084G209246j215377l058709l394311j089570J188169P27294r71131o89808J044003
39075b50194P43418k010642l369981j112070J921949K284264P97983L08268Q04985
39066A17980j910k321362l612153k278220L23517J961202J921715R19633n5584
39057c025182k95130L47608J287209J728838J451417Q35184L71614M21828R99351
$$ y = [-4791585, -5501777, -4823775, -4288614, -4461899, -4088706, -2073951, 842423, 3027834, 3959156, 4623417, 6008490, 7625197, 7872704, 5979843, 3254956, 1904349, 2710448, 4512932, 5975684, 6946996, 7691436, 7740828, 6446944, 4231121, 2301976, 1122713, -72183, -1927837, -3586090, -3199841, -10238, 4382283, 7368343, 8004252, 7584139, 7209246, 5993869, 2935160, -459151, -1548721, -360552, 366742, -604389, -1294197, -250194, 493224, -1517418, -4887399, -5999469, -4077520, -1793256, -995273, -687005, 117980, 116070, -2205292, -5817445, -8095665, -7772148, -5810946, -3889231, -2969598, -3025182, -3320312, -2972704, -1685495, 43343, 1494760, 2329944, 2701558, 3123386, 4122737]
39048D122737J463506J029531p6783p70847p93648j118790j999454j980123j26111
39039b49982J950013K022742M67079l77037K57676O67679m30009j917144j966915
39030D24102m78625J064866J449109P29725j67786l27068L97414J146992P78593
39021E017322r34992k876692l457383k024079M26812K033482J884650Q92544L80127
39012A341791K33965m47929j196523m81137J461920K186927N44391j303096j017385
39003A322924M93625Q95871J90735O2903M90604l1922j264556j240806K75073
38994A194451J216575O76082J89508O71393P68142l87365j258551m90823O68253
38985C247665M63965n92601j039254r90185j188753q97540Q16877K633752K385100
$$ y = [4122737, 5586243, 6615774, 6538991, 5768144, 4974496, 3855706, 1856252, -123871, -249982, 1700031, 3722773, 4189852, 3812815, 4070491, 4738170, 4308161, 2391017, 424102, -54523, 1010343, 2459452, 3189177, 3021391, 2694323, 3091737, 4238729, 5017322, 4082330, 1205638, -2251745, -4275824, -3849012, -1815530, 69120, 961664, 1341791, 1575756, 1127827, -68696, -549833, 912087, 3099014, 3643405, 2340309, 1322924, 1816549, 2712420, 2903155, 2966058, 3456662, 3424740, 2160184, 919378, 1194451, 2411026, 3087108, 3276616, 3948009, 4716151, 4328786, 3070235, 2579412, 3247665, 3711630, 3119029, 2079775, 1089590, -99163, -996703, -179826, 2453926, 4839026]
38976D839026M34827q41520p32701p68201j474843j283119M76936J937641J454509
38967D042555N8046m95304n26378j357310k587594k627511j418859m86219l49266
38958e747840N5337J069660J483421P95557L88306J132960J479983k00519k518206
38949b061341k568141j30646J924891J654454L14667r9794L30785L37559k62532
38940e60098o28232l66270L21889J326821K364919K607049J634607L08719k24358
38931F785046P4564M88565O00523J83466j095863k809853l447063k158595q1271
38922a460481J236482J793511K186939J861298J74602j704525k121149j525195
38914D41482j497901j751911o78226J375896K232045J497938J147701J845115
$$ y = [4839026, 5273853, 4432333, 3699632, 2931431, 1456588, 173469, 650405, 2588046, 4042555, 4100601, 3605297, 3078919, 1721609, -865985, -3493496, -4912355, -5398574, -5747840, -5692503, -4622843, -3139422, -2343865, -1955559, -822599, 657384, 456865, -2061341, -4629482, -4760128, -2835237, -1180783, -866116, -965910, -635125, -297566, -560098, -1188330, -1554600, -1232711, 94110, 2459029, 5066078, 6700685, 7009404, 6785046, 6859610, 7348175, 7948698, 8132164, 7036301, 4226448, 779385, -1379210, -1460481, -223999, 1569512, 3756451, 5617749, 5792351, 4087826, 1966677, 441482, -1056419, -2808330, -3486556, -2110660, 121385, 1619323, 2767024, 4612139]
38906D612139J633757m87553k383462j876370J13617J231846P07162q18776k671310
38897F1050l754188k597396L89367K358135J616906J83794O56035K112461J771197
38888B797361l19510j189007O06281L006426L363548J446737j009704k391377
38880F310755k325322j585561j184305j212742r31829l29974n65554j995640k903038
38871f723210j571904J165288K882251K465695P92545p97968j348127l36738J551573
38862a920595K266671N75028j969440k648419q14709J721854K982532K258989
38854B451911N0198j995242j894578L23620J934233Q56897j327684j694751k30544
38845a525940P11838L55893m613l6407p31721j601496o90075J873108L258655
$$ y = [4612139, 6245896, 5758343, 3374881, 1498511, 1612128, 2843974, 3551136, 2732360, 61050, -3693138, -6290534, -5901167, -3543032, -1926126, -1742332, -1086297, 1026164, 2797361, 2477851, 1288844, 1895125, 4901551, 8265099, 9711836, 8702132, 6310755, 3985433, 2399872, 1215567, 2825, -929004, -1258978, -1824532, -3820172, -6723210, -8295114, -7129826, -4247575, -1781880, -989335, -1787303, -3135430, -3472168, -1920595, 346076, 921104, -1048336, -3696755, -4511464, -2789610, 192922, 2451911, 2502109, 506867, -1387711, -1064091, 870142, 1727039, 399355, -1295396, -1525940, -814102, -458209, -462822, -499229, -1230950, -2832446, -3522521, -1649413, 1609242]
38836A609242J993527Q8351j49991Q32764J301767O99520o86956k610683m049512
38827i71971l343923o30917J534928J495029P81171J432977K601006J927700o74779
38818D151221k763913k580059q76410M13390J65402j269649k603582k790525j913930
38809a0068055o42303R20538K828468L977759K948949N18995o10776N15018J593585
38800A982178N12708j459608j698113r1347J103066N13777j043565k100011j854721
38791d135636k97943J639056K300041Q59809j444000k501668j572881K51211J417109
38782c484902J247757M65732O86596K543791M180516L072340k30695k160087r68413
38773E352635O58554l46695k751001k996364n73653J540089J382374J16253n56547
$$ y = [1609242, 3602769, 3691120, 3541129, 4373893, 5675660, 6375180, 5688224, 3077541, -971971, -4315894, -4946811, -3411883, -1916854, -1135683, 297294, 2898300, 4826000, 4151221, 1387308, -1192751, -2069161, -1655771, -1490369, -2760018, -5363600, -8154125, -10068055, -10710358, -9789820, -6961352, -2983593, -34644, 484351, -126425, 388593, 1982178, 2494886, 1035278, -662835, -754182, 348884, 862661, -180904, -2280915, -4135636, -4433579, -2794523, -494482, 365327, -1078673, -3580341, -5153222, -4902011, -3484902, -2237145, -1771413, -1084817, 1458974, 5639490, 8711830, 8481135, 6321048, 5352635, 6011189, 5664494, 2913493, -82871, -656524, 883565, 2265939, 2382192, 1825645]
38764A825645n84894m91642j36506M75415N49576m29689j861331k787067k759182
38755f199675j726272Q5326J869638K552559J792695L58822n44186j95121J011261
38746i94953J635904N86950j225902j593328J18185J996871K238095J325105M95673
38737D582600k91566j253196j301159J82723J460982P79155n58118j82177J237356
38728D656600J065026o39021j038227P31742K218395J799045Q74742P34744K91937
38719A0694983j435403l180438l484966k707250j507739L54294K178418J832452
38711B744351q82785k783481j581167N89246N74446r23778j031670L71553R85390
38702a937895L94689L42698R79766M95991j144831j563379M1482J393138R17913
$$ y = [1825645, 1240751, 749109, 612603, 1088018, 1637594, 1207905, -653426, -3440493, -6199675, -7925947, -7840621, -5970983, -3418424, -1625729, -1266907, -1811093, -2006214, -994953, 640951, 1227901, 1999, -1591329, -1473144, 523727, 2761822, 4086927, 4582600, 4291034, 3037838, 1736679, 1919402, 3380384, 4159539, 3601421, 3419244, 4656600, 5721626, 5082605, 4044378, 4776120, 6994515, 8793560, 9668302, 10403046, 10694983, 9259580, 6079142, 2594176, -113074, -1620813, -1266519, 911899, 2744351, 1861566, -921915, -2503082, -1913836, -1339390, -2263168, -3294838, -2923285, -1937895, -1543206, -1200508, -220742, 275249, -869582, -2432961, -2391479, -998341, -80428]
38693h0428J54444P05260J386293O10300m84168J22039J744062J949412M00486
38684F507700q17075n33206J80926K33691p3770l77264j052440j873008j606105
38675E89449n9910R38793l9050j794904k146557q57319O35391J572087K094907
38666I32887J726040j23576k146081j988131L04611J862643R60769o57908p58760
38657A12494P1242k1299r03884j093355o05758o73453j091572l46860J531406
38648c021039K541485J624744J02327m44643j21693J39848K8353k46434m22261
38639A80687j08844P48645J179307K05596j340737j517214j7288J420797J703468
38630B454417J647441J941577J804600P33786j86484o4974J79110o27768j981183
$$ y = [-80428, 74016, 779276, 2165569, 2775869, 2291701, 2413740, 4157802, 6107214, 6507700, 5690625, 5157419, 5338345, 5572036, 5498266, 5121002, 4068562, 2195554, 589449, 529539, 1468332, 1429282, -365622, -2512179, -3369498, -2734107, -1162020, 932887, 2658927, 2535351, 389270, -1598861, -1294250, 568393, 1529162, 871254, 112494, 183736, 162437, -741447, -1834802, -2440560, -3114013, -4205585, -4552445, -3021039, -479554, 1145190, 1247517, 802874, 681181, 821029, 849382, 602948, 180687, 71843, 820488, 1999795, 2205391, 864654, -652560, -669848, 750949, 2454417, 4101858, 6043435, 7848035, 8581821, 8395337, 8330363, 8509473, 7881705, 5900522]
38621E900522k657536k472217j829216o89052P08229J260240N23268k95658k01638
38612B46942n428n78362r42302K5090J295517J288453O34433Q79930J347797J17014
38602D309084k306666l280878k054905n71235J77853J531947L831669M641315
38594F278184K202848j496821l239237k651304j704426j290160n48797Q18931
38586a630782J631323R29501o51633j584989r60202O46773J461811J96403k061488
38577b023283k497361k1967K824997K838976M08374j011191L83196K553689K805785
38568F261215J292480k9016n26283j035969j568006j100996J24523K20803j459963
38559B178788k739190j409846J505252K994977J894509k61673j797397k361919
$$ y = [5900522, 3242986, 770769, -1058447, -1747499, -1039270, 220970, 744238, 448580, 246942, 241514, -336848, -1279150, -1254060, 41457, 1329910, 1964343, 2844273, 4192070, 4309084, 2002418, -1278460, -3333365, -3904600, -3726747, -2194800, 1636869, 6278184, 8481032, 6984211, 3744974, 1093670, -610756, -1900916, -2449713, -1630782, 541, 930042, 278409, -1306580, -2266782, -1620009, -158198, 38205, -2023283, -4520644, -4542611, -1717614, 1121362, 1529736, 518545, 901741, 3455430, 6261215, 7553695, 7524679, 6998396, 5962427, 4394421, 3293425, 3417948, 3638751, 2178788, -560402, -1970248, -464996, 2529981, 4424490, 4162817, 2365420, 3501]
38551C501j884247j74333J877084K564973J648884P21143N03531l57513k587593
38542B315430m256369l247365l59392J930187K630532K278033J060467p51451
38534A600072j423858M66557L173962L351749O09095j968242k170443j069851
38526B569041m54871l10215K0126K38816P0618K59404J217289J850405R23167
38517F383780j258100l288086l915528k513806L97920K731504K513142N18522
38509A569348m72769M38279J236202O09530K8939O94906J005011o01017k421793
38500B086636j964267n4416O14893k0690L36201K023754K743665J513421K12146
38491G491343L12523P13045O2665r02698q04574J41872P08007M10956l72563j201423
$$ y = [3501, -1880746, -2055079, -177995, 2386978, 4035862, 4757005, 5260536, 4903023, 2315430, -1940939, -5188304, -5547696, -3617509, -986977, 1291056, 2351523, 1600072, 176214, 642771, 3816733, 7168482, 7777577, 5809335, 3638892, 2569041, 2114170, 1803955, 1824081, 2062897, 2133515, 2392919, 3610208, 5460613, 6383780, 5125680, 1837594, -2077934, -4591740, -4193820, -1462316, 1050826, 1569348, 1096579, 1534858, 2771060, 3380590, 3409529, 4104435, 5109446, 4508429, 2086636, 122369, 67953, 682846, 662156, 998357, 3022111, 5765776, 7279197, 7491343, 7803866, 8516911, 8579576, 7676878, 6872304, 7014176, 7722183, 8133139, 7760576, 6559153]
38481F559153j676010j500360r87792p60280o82393o2650R14393J194086N59133
38472C557280m3433k19570n81577r67058q3498K022473K961339J058041j954150
38463E749847l033577j607576M52919J686660J915801R59462j235307l198013
38455A690216k852018m14677J330861M73057j632147k280887p23862J376583K092142
38446i40732R52253j033257k276225j741963J55567J774622J771086M81645m13222
38437a270226L26896K122670L098092K136118K85634l80830O04626J430043N06183
38428H859206j234350j677850o05367J05924o81470j942173k335289j958515j455071
38419b924955p29536L13105Q57112L70928r9527O94398K115962K492771J648142
$$ y = [6559153, 4883143, 3382783, 2394991, 1634711, 952318, 889668, 1804061, 2998147, 3557280, 3513847, 3294277, 2712700, 1745642, 1662144, 3684617, 6645956, 7703997, 5749847, 2716270, 1108694, 1561613, 3248273, 5164074, 6123536, 4888229, 1690216, -1161802, -1576479, -245618, 227439, -1404708, -3685595, -4409457, -3032874, -940732, 11521, -1021736, -3297961, -5039924, -4884357, -3109735, -1338649, -857004, -1270226, -943330, 1179340, 4277432, 6413550, 6699184, 6318354, 6922980, 8353023, 8859206, 7624856, 5947006, 5341639, 5447563, 4766093, 2823920, 488631, -1469884, -2924955, -3654491, -3341386, -2484274, -2113346, -2212873, -1518475, 597487, 3090258, 4738400]
38410D738400Q40277L41190q91531k757307l323553j623830O14989J408579J158111
38401E05325J186747J039801m16687j993180j108504J997182L634716J396006
38393F241406k551513m416571l411006j628927n33984K50929J136491J676477
38385c236698J655050J444905J052258J91112n93947m01529K89334J26422n22586
38376D321L74039K916335M023725J620618j811580k363583j60734J152509j36140
38367E619510j918595k099316j343153r35028m76094O44953J473723J061640L54143
38358B381783O37441J268769Q82848o9433n8436Q14718R50006o1697q41816m90503
38348E413680K44523L89168q1053p73123j334133j215201k18712O65565K98591
$$ y = [4738400, 5578677, 5919867, 5028336, 2271029, -1052524, -2676354, -2061365, -652786, 505325, 1692072, 2731873, 2315186, 322006, -786498, 1210684, 4845400, 6241406, 3689893, -726678, -4137684, -5766611, -6300595, -6049666, -4913175, -3236698, -1581648, -136743, 915515, 1106627, 512680, 111151, 400485, 526907, 4321, 378360, 3294695, 7318420, 8939038, 7127458, 4763875, 4603141, 5755650, 5619510, 3700915, 1601599, 258446, -676582, -1152676, -507723, 966000, 2027640, 2381783, 3019224, 4287993, 5170841, 5101408, 5042972, 5857690, 6807696, 6745999, 5904183, 5413680, 5658203, 6047371, 5966318, 5193195, 3859062, 2643861, 2425149, 3090714, 3389305]
38339C389305p81245j115833q13422j275939k244205j537486J350313L750744
38331G22232L407033J517274L94272k7028j052615k105682j525712K07811P95606
38322B333191l99495j611644j601553j044065n58530L92356J773926K169835R58215
38313B412236k76526R0556J334310J588328N38799o00479j212639j752888k193769
38304g2072j546758N40292K741500L356642K162809L53617j032362j907828k425979
38295B169861k327259j492683n85007l49186m99487j70255N82207P84381K68494
38286a618934J72906J079752J839537J311835K88434K87672J093548J087614k07693
38277E334671j464132j495114n04886P78928J916159K379321J588683j47563j617201
$$ y = [3389305, 2608060, 1492227, 678805, -597134, -2841339, -4378825, -3028512, 722232, 4129265, 5646539, 6040811, 6013783, 4961168, 2855486, 1329774, 1537585, 2333191, 1933696, 322052, -1279501, -2323566, -2882096, -2489740, -715814, 1454021, 2412236, 2135710, 2226266, 3560576, 5148904, 5687703, 5087224, 3874585, 2121697, -72072, -1618830, -1078538, 1662962, 5019604, 7182413, 7536030, 6503668, 4595840, 2169861, -157398, -1650081, -2235088, -2584274, -3083761, -3254016, -2671809, -1887428, -1618934, -1446028, -366276, 1473261, 2785096, 3073530, 3361202, 4454750, 5542364, 5334671, 3870539, 2375425, 1870539, 2649467, 4565626, 6944947, 8533630, 8386067, 6768866]
38268F768866k032505j639041q56844K32198J286618J571787Q47150l15375j293180
38259D569674j786775j495456m14190N63271M83323k07359l22156l4436o60357
38250F95539k086210k344393n52556J526821J983868J208253N56657J26063n43821
38241E70221q76697k51808L54039l21279j475654j182563N95812J868786J539015
38232H19872O42089L20741K66657p1303j29416P77864J907301J770708K53521
38223F558034r48002m21200J009242J200822m71408k156536j970714m75513M27419
38214B752144L36599L56867O03177m1940j288409j035578J131961K323160K57576
38205E395557k883859l023737L05537L526403L789170J841763o5790j039841j522145
$$ y = [6768866, 4736361, 3097320, 2240476, 2472674, 3759292, 5331079, 6178229, 5862854, 4569674, 2782899, 1287443, 873253, 1436524, 1919847, 1712488, 1390332, 1355896, 695539, -1390671, -3735064, -4287620, -2760799, -776931, 431322, 987979, 1114042, 570221, -306476, -558284, -204245, -525524, -2001178, -3183741, -2587929, -719143, 819872, 1461961, 1782702, 2049359, 1978056, 1848640, 2626504, 4533805, 6304513, 6558034, 5610032, 5188832, 6198074, 7398896, 6927488, 4770952, 2800238, 2324725, 2752144, 3088743, 3445610, 4048787, 4006847, 2718438, 1682860, 2814821, 5137981, 5395557, 2511698, -512039, -206502, 3319901, 7109071, 8950834, 8885044, 7845203, 6323058]
38196F323058j815675j615993n96524Q78640J596488N64153j428764k238130j036509
38187F30744N84203J143229J424694K496875L077730J312448j697656k908032
38179F064235j674390l80809m92299o81949K72520J154458L15614j604706k429544
38170E43130j090629J345563K714146J572853j217534k840646j550396R58454
38162D34941J664807K76978q17892l98459L06695L94586N57392P73686m17760
38153B774974k896496l879550j874381N55064L91564j274905j074380J395387
38145e882723L114626K196788K35882m14250L08056Q17674M22510J26214J012884
38136A937661K402403K244602k04718k747485k583195p0309J622708Q81904m30193
$$ y = [6323058, 4507383, 2891390, 2294866, 3173506, 4769994, 5334147, 3905383, 1667253, 630744, 1214947, 2358176, 3782870, 6279745, 9357475, 10669923, 8972267, 6064235, 4389845, 4009036, 3516737, 2834788, 3107308, 4261766, 4577380, 2972674, 543130, -547499, 798064, 3512210, 5085063, 3867529, 1026883, -523513, 434941, 2099748, 2376726, 1558834, 1160375, 1467070, 1861656, 2419048, 3192734, 2774974, -121522, -4001072, -5875453, -5320389, -4928825, -6203730, -7278110, -5882723, -2768097, -571309, -335427, -749677, -441621, 376053, 798563, 924777, 1937661, 4340064, 6584666, 6379948, 3632463, 1049268, 978959, 2601667, 3483571, 3053378]
38127C053378k50786P20684Q93806O29742J070932J586322P90794p53703j222267
38118F518902m88910k08114j032404j730828j298103l64429j79924j234635k888685
38109b907130l595687k007276J192238L341516K864181J276847P01521O95408
38101A561618k85317j477009q57294Q82715P99974j435505k489868m92758J788143
38092b005301J038285j589077k223304J37869K451784J905234p33135k552708
38084c570353j978062o1429J154231R01994J56292N9521N07923P58862Q01762
38075a269259J072289J166411K85709r69077q69847Q20347K064056J362563k0599
38066C642593J316J229768J666113N45096q68233j483115j716631k137590k190669
$$ y = [3053378, 2802592, 3523276, 4417082, 5046824, 6117756, 7704078, 8494872, 7741169, 6518902, 6029992, 5821878, 4789474, 3058646, 1760543, 1396114, 1216190, -18445, -2907130, -6502817, -8510093, -7317855, -3976339, -1112158, 164689, 866210, 1561618, 1276301, -200708, -1058002, -175287, 624687, -810818, -3300686, -3793444, -2005301, -967016, -2556093, -4779397, -4641528, -2189744, -284510, -1017645, -3570353, -5548415, -5609844, -4455613, -3553619, -3397327, -3337806, -2829883, -2071021, -1269259, -196970, 969441, 1255150, 286073, -583774, 236573, 2300629, 3663192, 3642593, 3643909, 4873677, 6539790, 7084886, 6216653, 4733538, 3016907, 879317, -1311352]
38057a311352j258614j13342p8884j008650j274794l6413J441365J407806l2471
38048b265349j097596o54710N44804J064397L85190r64327k096083k157295p62380
38039h003349J402308K955239L274579K983116K593024J597262l09424j999914
38031D492841k060540o63221P64225J317741J072929K61191q44588j565597j483651
38022A291330j184122j268444j088422K45887K042286K744227K196788J545514
38014F525044J053215o3671j474354j512544J50512J441346N83666j508215k630914
38005B564085k022454o92886J04464j40970j021030j381335m17028R92995J047946
37996i66213m67679j701466j349922l10529J82357N49418J647236K864628L085876
$$ y = [-1311352, -2569966, -2683308, -2762192, -3770842, -5045636, -5082049, -3640684, -2232878, -2265349, -3362945, -4017655, -3472851, -2408454, -2023264, -2987591, -5083674, -7240969, -8003349, -6601041, -3645802, -371223, 2611893, 5204917, 6802179, 6492755, 4492841, 2432301, 1769080, 2533305, 3851046, 4923975, 5185166, 4340578, 2774981, 1291330, 107208, -1161236, -2249658, -2003771, 38515, 2782742, 4979530, 6525044, 7578259, 7514588, 6040234, 4527690, 4678202, 6119548, 6703214, 5194999, 2564085, 541631, -151255, -46791, -187761, -1208791, -2590126, -3007154, -2014159, -966213, -1433892, -3135358, -4485280, -4795809, -4613452, -4064034, -2416798, 447830, 3533706]
37987C533706K575671K156551J336987o79384k574655j922827R95981K607000
37979H029030M36471l459021m949419k796515M32910K029930J965191J619534
37971C308111J243997M6702j797973k785374k016073l72434P92732J254810J508117
37962A182615J542407R70308p7660j037647j563578j459027n17970Q52823J581305
37953A473576J349877J158060J453941R86139q93914k201636r67231J213669J302217
37944D874698j92798j0086K045504K308731n13557k573872q10399K044450J756805
37935H929476r54697k188994j155626m74076j126389j320759m32281k46365j459091
37926d28802k130817q74306R15092J352015O22717k3806k49166l45572k19375
$$ y = [3533706, 6109377, 8265928, 9602915, 8923531, 6348876, 4426049, 5422030, 8029030, 8465501, 5006480, 57061, -2739454, -2306544, -276614, 1688577, 3308111, 4552108, 4598810, 2800837, 15463, -2000610, -2373044, -1580312, -325502, 1182615, 2725022, 3695330, 3617670, 2580023, 1016445, -442582, -960552, -107729, 1473576, 2823453, 3981513, 5435454, 6421593, 5527679, 3326043, 2358812, 3572481, 4874698, 4681900, 4671814, 6717318, 9026049, 8512492, 5938620, 5128221, 7172671, 8929476, 7974779, 5785785, 4630159, 4156083, 3029694, 1708935, 1276654, 1030289, -428802, -2559619, -3433925, -2518833, -1166818, -544101, -567907, -817073, -1162645, -1382020]
37917a382020K12143N14543M99675O98295J370264J813743J323463J92002p95576
37908D446532j287890j334399r86800l96894R6140L48459O03761J066159J474391
37899D029459J267964K27070r44891r53846N04054J678007N20896k256962l500904
37890E70847j753929O89038J218751N68171R42988K044092J734453j48576j602112
37881D263723j833014j903704j899275n04001J916254K780849J114342o87445
37873C247729m89646M59498q6525j760532k492682j717258n87697J50023O25581
37864b651509P77313M71157K55445N67260O39156l69453j538423j069150R89507
37855a928697K366784J387459q61867j885015q34442N07114K695k000293k899105
$$ y = [-1382020, -1169877, -655334, -155659, 542636, 1912900, 3726643, 5050106, 5242108, 4446532, 3158642, 1824243, 837443, 440549, 536689, 885148, 1488909, 2555068, 4029459, 5297423, 5524493, 4579602, 3625756, 4129810, 5807817, 6328713, 4071751, 570847, -1183082, -494044, 724707, 1292878, 2235866, 4279958, 6014411, 5865835, 4263723, 2430709, 527005, -1372270, -1876271, 39983, 2820832, 3935174, 3247729, 2758083, 3217581, 3131056, 1370524, -1122158, -2839416, -3427113, -3277090, -2651509, -1874196, -1403039, -1147594, -580334, 58822, -310631, -1849054, -2918204, -1928697, 438087, 1825546, 963679, -921336, -1755778, -1248664, -1245969, -3246262, -6145367]
37846f145367j180452J430886K180127Q50875m64195p04191q34868j332241j023662
37837g223088N96698J980058J874059J328019J689702K073704P76917j777650
37829A318419l442608l089324j333127P99628K280345J898519l70546k247972
37821d186666j419415J211412K503992J366003J7856N48446K164760K777625J805648
37812F789661L23080n34211l56102N40459J096222K19708j741660k911390k030789
37803A394978j04594R14472N68607L1496O9326M6724p15627j567203j361218k54983
37793i78022L45419j92717p28827m5769J215527J436733M41466l85298m39928
37784F68584p42128j813027k287292q92304J303994K110635J038433m74742j190923
$$ y = [-6145367, -7325819, -5894933, -3714806, -2863931, -3328126, -4032317, -4867185, -6199426, -7223088, -6626390, -4646332, -2772273, -1444254, 245448, 2319152, 3096069, 1318419, -2124189, -5213513, -6546640, -5747012, -3466667, -1568148, -1938694, -4186666, -5606081, -4394669, -1890677, -524674, -506818, 41628, 2206388, 4984013, 6789661, 7112741, 6578530, 6222428, 6762887, 7859109, 8078817, 6337157, 3425767, 1394978, 1290384, 2204856, 2773463, 2804959, 2874285, 2921009, 2205382, 638179, -723039, -978022, -632603, -825320, -1554147, -1599916, -384389, 1052344, 1493810, 1108512, 668584, -73544, -1886571, -4173863, -5066167, -3762173, -1651538, -613105, -1087847, -2278770]
37775b278770j052089l63082O13108J351102J550419J749462K307756K213815
37767F091721M60386j714314j935855j76393R94213K39605o60334J7640R36936
37758D253605j24519k440421l068175j030305J395081J824125M84984q12380j104600
37749f22605q12909o23907o63089n31575K52556J643723K742207K460328P46422
37740D591151j182127k024451j517422k96694Q55325J357192R54242J9695n52236
37731B204675k53025M03432N66627J59222j99194j94196j24118k62504n62614
37722A738305j026421j666797j977677j228084L89057J625813J622710Q36770
37714C13676J40147k38737l82234j85955J02801k32421j078423j052252N24539
$$ y = [-2278770, -3330859, -3693941, -3080833, -1729731, -179312, 1570150, 3877906, 6091721, 6552107, 4837793, 2901938, 2725545, 3719758, 3959363, 3299029, 3316669, 4253605, 4129086, 1688665, -1379510, -2409815, -1014734, 809391, 1294375, 481995, -622605, -1435514, -2059421, -2722510, -3254085, -3001529, -1357806, 1384401, 3844729, 4591151, 3409024, 1384573, -132849, -429543, 425782, 1782974, 2737216, 2756911, 2204675, 1951650, 2355082, 2921709, 3080931, 2881737, 2687541, 2563423, 2300919, 1738305, 711884, -954913, -2932590, -4160674, -3771617, -2145804, -523094, 313676, 453823, 215086, -167148, -353103, -250302, -482723, -1561146, -2613398, -2088859]
37705b088859K215713K418278J686807J386825J115236k11315j555101j000232
37697C967352N30869K07113j763805j935180M66022J533493j004331l350715j263789
37688b612971K880439L365547j75372k419221m57968K603637L094140J572526
37680G850757L66619k69704j178153j875630j515662p64797p18094j028824p68628
37671I7884k38763m35575j345441j942328j414995K83389K390324L369952K082699
37662B847146m69709j770457q61818N08554N94666l2707l3392L73412K36919j62406
37652A230208J4890L52153j39473j038977r96461O3938Q97781J000317J064127
37643B448503J247758O31411j018413k239247j515542P53312K661887K842591
$$ y = [-2088859, 126854, 2545132, 4231939, 5618764, 6734000, 6522685, 4967584, 3967352, 4498221, 4705334, 2941529, 1006349, 1472371, 3005864, 2001533, -1349182, -2612971, 267468, 3633015, 3457643, 1038422, 580454, 3184091, 6278231, 7850757, 8217376, 7947672, 6769519, 4893889, 3378227, 2613430, 1895336, 866512, 97884, -140879, -576454, -1921895, -3864223, -5279218, -4995829, -2605505, 764447, 2847146, 2377437, 606980, -254838, 253716, 848382, 815675, 782283, 1155695, 1392614, 1230208, 1245098, 1597251, 1457778, 418801, -577660, -513722, 384059, 1384376, 2448503, 3696261, 4327672, 3309259, 1070012, -445530, 307782, 2969669, 5812260]
37635E812260J582800Q0839r06381j442060j665032j294789k99880N14829N18670
37626B901256M76485J404281K316549J001108k378116m493043l055709j06086
37618a933275Q01447n71524j387505j06208J771761K318601J450974K20184n36099
37609B028356m32018K98984O78357J43366l43805L05014J203114O55688q08091
37600C728965r05565O64832J544423N86039k38764O99682J754030O92989j534525
37591F992106k254760j082236P8875L18803M67486Q43154P09085J23063J31725
37582F327301P54476P57624j14851o18386k74073j71566o96881n01826J004667
37573F466485K038642J026250p35361r98065M4557N30833K72954P31620J820300
$$ y = [5812260, 7395060, 7475899, 6569518, 5127458, 3462426, 2167637, 1867757, 2382586, 2901256, 3377741, 4782022, 7098571, 8099679, 5721563, 1228520, -1827189, -1933275, -1131828, -1703352, -3090857, -3197065, -1425304, 893297, 2344271, 2564455, 2028356, 1596338, 1895322, 2573679, 2717045, 2373240, 2678254, 3881368, 4537056, 3728965, 2823400, 3488232, 5032655, 5618694, 5379930, 6079612, 7833642, 8526631, 6992106, 4737346, 3655110, 3733985, 4052788, 4520274, 5363428, 6072513, 6195576, 6327301, 7081777, 7839401, 7724550, 7106164, 6832091, 6660525, 5963644, 5461818, 6466485, 8505127, 9531377, 8796016, 7797951, 7842508, 8373341, 8646295, 9377915, 11198215]
37564A1198215J482496q11457k539148j516594Q89995J618343o9576k052791k279616
37555E919867p76068J049572J892502J359112K08181k30532M42265J005014J63044
37546A1032957j553107k375742j556689k3161J070781J332405P05673o75892j940349
37537F016876j950472p68442L54821Q13135J293969K071312K029711M42992j403808
37528H900094j730050o35033M46655J055053J835249K633787K292125O52597q44589
37519A4605888j202414j084026j132738m76064J653360L730944L260192K64779
37511A9619921k201059j655040Q65684K333102J439642k69818o81171N24130J996577
37502B1971968K491420K074163J812924K513171L691987L918718K454354L38949
$$ y = [11198215, 12680711, 11869254, 9330106, 7813512, 8703507, 10321850, 10252274, 8199483, 5919867, 5143799, 6193371, 8085873, 9444985, 9653166, 9422634, 9864899, 10869913, 11032957, 9479850, 7104108, 5547419, 5524258, 6595039, 7927444, 8633117, 7957225, 6016876, 4066404, 3297962, 3652783, 4465918, 5759887, 7831199, 9860910, 10303902, 8900094, 7170044, 6535011, 6981666, 8036719, 9871968, 12505755, 14797880, 15450477, 14605888, 13403474, 12319448, 11186710, 10710646, 12364006, 16094950, 19355142, 19619921, 17418862, 15763822, 16629506, 18962608, 20402250, 20132432, 19451261, 19975391, 21971968, 24463388, 26537551, 28350475, 30863646, 34555633, 38474351, 40928705, 41267654]
37494D1267654p13512l62703K35729L81994P65814J946003L080793L210839K896296
37485E2708907L246006L983869M093258M028342N368949Q067985R964951R786157
37477A01248424Q944770R289778J0555215J1426450J1875738J2687514J3488556
37470A79516445J3209514J2226978J2122704J3103556J3375034J1620508Q625056
37463B63799795N671487K653515j084479m985203p747127r191877j0411914j2059604
37455B26644593j3550688j4154526j3904365j3049746j1558306r863762r271133
37448A41292067j0465586j2000799j1596210r031591o488546n658001n824796
37441H0226538n516217m666151l935099l121228j971493j680098l420320n729221
$$ y = [41267654, 40554142, 40191439, 40427168, 40809162, 41574976, 43520979, 46601772, 49812611, 52708907, 55954913, 59938782, 64032040, 68060382, 73429331, 81497316, 91462267, 101248424, 110193194, 119482972, 130038187, 141464637, 153340375, 166027889, 179516445, 192725959, 204952937, 217075641, 230179197, 243554231, 255174739, 263799795, 269471282, 272124797, 271040318, 266055115, 258307988, 249116111, 238704197, 226644593, 213093905, 198939379, 185035014, 171985268, 160426962, 150563200, 141292067, 130826481, 118825682, 107229472, 98197881, 91709335, 86051334, 80226538, 74710321, 70044170, 66109071, 62987843, 61016350, 59336252, 55915932, 50186711]
37433E0186711n733607l258955j376800k082734l684944l782211k751345k356949
37425B5159166k453495j430856P38056K099223J371216o19068k269119k724153
37417A9870970k005463p22156J63378M7763p27873j392627j552406j144560k58028
37408A2278998M80550J91015r05290j370046n67429L33846K97283l2119O7790
37399A0774598j28166j003556j009175P95345K173554O76139j971504j959458
37391H347777O74730K082031P38561n51500J62224Q31211n32755k171640j691941
37382G888698j41188M1699q46427p47000M68533J245757J341283J740026K149259
37373A3140640J275571n69997j574397j190882o45468n36566k5785J155564J784022
$$ y = [50186711, 44453104, 41194149, 39817349, 37734615, 34049671, 30267460, 27516115, 25159166, 22705671, 21274815, 22012871, 24112094, 25483310, 24864242, 22595123, 19870970, 17865507, 17143351, 17306729, 17354492, 16626619, 15233992, 13681586, 12537026, 12278998, 12759548, 12950563, 12045273, 10675227, 10107798, 10441644, 10738927, 10706808, 10774598, 10646432, 9642876, 8633701, 9429046, 11602600, 12278739, 10307235, 8347777, 9022507, 11104538, 11843099, 11291599, 11453823, 12285034, 11752279, 9580639, 7888698, 7747510, 7789209, 6942782, 6195782, 6664315, 7910072, 9251355, 10991381, 13140640, 14416211, 13846214, 12271817, 11080935, 10435467, 9898901, 9873116, 11028680, 12812702]
37364A2812702R50594o32716j810670k317429k319695j660019l42593Q13885P31697
37355F225756p30219k298625k153661K40665L019212L430938J005750j650450
37347G089366j992786n03296N93496N84431N53736R65185R38073R7398n91622
37338G733981m44583k00235p39372j521666j162498P11168K729964L018273J164491
37329A1289523j175654k067615j591728j435650k082902j925403l6975J801953
37321B775549J521830k9189m12492O48783J243378P02579M42413R88861P08178
37312H589890j328176l196307k467429L89022K411971J553882j197723k892806
37304A862324j495771J957687M114627K791033n74299k781802k626122j418541
$$ y = [12812702, 13763296, 13130580, 11319910, 9002481, 6682786, 5022767, 4680174, 5494059, 6225756, 5495537, 3196912, 1043251, 1283916, 4303128, 7734066, 8739816, 7089366, 5096580, 4593284, 5186780, 5771211, 6324947, 7290132, 8228205, 8325603, 7733981, 7289398, 7089163, 6349791, 4828125, 3665627, 4376795, 7106759, 10125032, 11289523, 10113869, 8046254, 6454526, 5018876, 2935974, 1010571, 973596, 2775549, 4297379, 4268190, 3855698, 4504481, 5747859, 6450438, 6892851, 7881712, 8589890, 7261714, 4065407, 1597978, 1987000, 4398971, 5952853, 4755130, 1862324, 366553, 2324240, 6438867, 9229900, 8655601, 5873799, 3247677, 1829136]
37296A829136l36136O53489J231675M88408j067141j434732o1855J149154Q82915
37287C334913L61349Q03650J088196j8518j164077m64565J080870J001037n88214
37278E434641j165993J68967J578735J626682R98306M91682l45101j592883k048324
37269E146712j188860l33445m70698m78078Q26825K126565J182137j603911l327251
37260A879996k395490l29632Q13493J115486J689615K137924R82839j516758k799845
37251A577628j117616J905613L082350J572349l50816n06014N45018P15997o83527
37242F740982k251865k344780p44829J438834K861320K866712J787142M74447
37234A0827963n30018j184263j369068q18818M9400R9941r54110j708244r08248
$$ y = [1829136, 1493000, 2146489, 3378164, 3866572, 2799431, 1364699, 1302844, 2451998, 3334913, 3696262, 4499912, 5588108, 5569590, 4405513, 3940948, 5021818, 6022855, 5434641, 4268648, 4437615, 6016350, 7643032, 8641338, 9133020, 8787919, 7195036, 5146712, 3957852, 3624407, 3153709, 2675631, 3502456, 5629021, 6811158, 5207247, 1879996, -515494, -845126, -31633, 1083853, 2773468, 4911392, 5894231, 4377473, 1577628, 460012, 2365625, 5447975, 7020324, 6669508, 6163494, 6708512, 7424509, 6740982, 4489117, 2144337, 1399508, 2838342, 5699662, 8566374, 10353516, 10827963, 10297945, 9113682, 7744614, 6925796, 6975196, 7075137, 6121027, 4412783, 3504535]
37225C504535M55114L80036j040908j532037m7248J494582R55462r01322j536306
37216A731908j21972J659241K050022J016362m49862j506606j584797m83853J023826
37207C334269J498136M06665j166631j899981j694709j185336n24084M26079J181473
37198C75881J023728J70222m05663k98953P1865M67537J041352J472849J033709
37189D952527j81579j186339j609471k068158k576001k032273j85725J318143
37181c568876J127247J89008Q7717N25646K54084m37701k48634P47871J406298
37172H2660J721948K424121K753537J345214p62221j073022M9092n49871l369657
37163B621801m557711j731618J904855K220763J17009p07476K64343O89693K65358
$$ y = [3504535, 3959649, 4339685, 3298777, 1766740, 1719492, 3214074, 4169536, 3268214, 1731908, 1609936, 3269177, 5319199, 6335561, 5885699, 4379093, 2794296, 2310443, 3334269, 4832405, 5239070, 4072439, 2172458, 477749, -707587, -1231671, -805592, 375881, 1399609, 1569831, 1164168, 865215, 937080, 1404617, 2445969, 3918818, 4952527, 4770948, 3584609, 1975138, -93020, -2669021, -4701294, -4887019, -3568876, -2441629, -2252621, -2164904, -1639258, -1385174, -1822875, -2071509, -1323638, 82660, 1804608, 4228729, 6982266, 8327480, 7565259, 6492237, 6541329, 5991458, 2621801, -1935910, -3667528, -1762673, 458090, 575099, -132377, 131966, 821659, 1087017]
37154A087017R02021K381059K113238k61560j825311r09044O34468Q24271J69478
37145E115637l79445j139689j820117p94848J833713L051642J053254j709690
37137E210457k026403m96747O5068q45021j443265j124407q90006p80076K88331
37128b042069K049123K671266J386208n29192j670374j850707j437802p95533
37120b219080m02935k70035M77392K119457L066045J744846q40833k376439k454113
37111a155695k291442j844001l2236K254181K500880M81400j101465p17723J03585
37102a802516j6030j98482K45051L05870q9467R18656L319204L682259L34712
37093F699257k967612k207325O84175J123006o91299p19087J608411K509322M91668
$$ y = [1087017, 1989038, 4370097, 6483335, 6221775, 4396464, 3487420, 4121888, 4946159, 5115637, 4736192, 3596503, 1776386, 981538, 2815251, 5866893, 6920147, 5210457, 3184054, 2687307, 2752375, 1907354, 464089, -660318, -1550324, -2330400, -2042069, 7054, 2678320, 4064528, 3535336, 1864962, 14255, -1423547, -2219080, -2622015, -2892050, -2414658, -295201, 2770844, 4515690, 3674857, 1298418, -1155695, -3447137, -5291138, -5323374, -3069193, -568313, -86913, -1188378, -1906101, -1802516, -1818546, -2017028, -1771977, -1466107, -1555574, -636918, 2682286, 6364545, 6699257, 3731645, 1524320, 2208495, 3331501, 2640202, 1921115, 3529526, 6038848, 6530516]
37084F530516j370341r64671j76891o24596p28727O35289J493431N36399J9348
37075E349757J735363L160208J254457k278696l417996j828558n36561o62473
37067B775501m06946R69840J755329Q20120p30906j457497j027903L57736K026124
37058E081398K461360Q68650j199133j792010j512614k129654l023011k091288
37050c336302J59035R33920j87404n01520J116938K332057J496681K81591L61412
37041B656408O25893j21718n55891N47632J576358P34366o88788o01914J68737
37032D341083m43319j800995j609691m127P00221m9952m63200K28920P08661K47094
37022A854695j05622L73435Q91215P07895J78424k71479p24860j045223r59546
$$ y = [6530516, 5160175, 4195504, 4018613, 3394017, 2665290, 3300579, 4794010, 5330409, 5349757, 7085120, 10245328, 11499785, 9221089, 5803093, 3974535, 3437974, 2775501, 2368555, 3338395, 5093724, 5913844, 5182938, 3725441, 2697538, 3055274, 5081398, 7542758, 8411408, 7212275, 5420265, 3907651, 1777997, -1245014, -3336302, -3177267, -2243347, -2430751, -2932271, -1815333, 516724, 2013405, 2294996, 2656408, 3282301, 3160583, 2604692, 3152324, 4728682, 5463048, 4774260, 4172346, 4341083, 3897764, 2096769, 487078, 482951, 1183172, 1133220, 670020, 898940, 1607601, 1854695, 1749073, 2122508, 3013723, 3721618, 3900042, 3628563, 2903703, 1858480, 898934]
37013H98934r14607j400903j595504m11667J247820J313412k51773j178615k32531
37004b525434J197536J479939Q28114K22486q6117j73293K0435P9777n78383j330978
36994h65918q49135O02729J204252N19904L40983J585959K433032J059584j448106
36985D583284k647009j957544o97174J27810N24247P05574Q45558J068573Q99181
36976C452500l30536j831618j570395P55862K498905J368319j362212k711582
36968B69243j936503p10395k15927o3512L38859J081085K084286K737184J840387
36959E424707n86049k262984j222594J305424K524043J878412J027404O31641
36951H720004j61236j146583q50353N49816P34093j265057l269349k914720o53127
$$ y = [898934, -15673, -1416576, -3012080, -3423747, -2175927, -862515, -1114288, -2292903, -2525434, -1327898, 152041, 980155, 1202641, 1116524, 943231, 963666, 1043443, 465060, -865918, -1715053, -1112324, 91928, 611832, 952815, 2538774, 4971806, 6031390, 4583284, 1936275, -21269, -718443, -590633, -66386, 639188, 1484746, 2553319, 3452500, 3121964, 1290346, -280049, 475813, 2974718, 4343037, 2980825, 269243, -1667260, -2377655, -2593582, -2657094, -2318235, -1237150, 847136, 3584320, 5424707, 4838658, 2575674, 1353080, 2658504, 5182547, 7060959, 8088363, 8720004, 8558768, 7412185, 6561832, 7111648, 7845741, 6580684, 3311335, 396615, -256512]
36942b56512J400252K085588J519096K18529q94496q02156K43171P59143K79841
36933D552456K12358J445710K576540J905678k2778j408461j734805j741748j645794
36924D139156j055986k36406O2673j57630k87762k47632l90426n65913l27693
36915I32381K26726P52174J314064J792451J354098k04191j334812o22725P57166
36906D967332M48171j402654k073159k52711K058590K544928J572282Q47971N75456
36897I286206l35613k001486l165329k942549j808816p86643l94294m44511m14262
36888c007297j7779M32673M99022M34753Q66234J556020J469043M89837m1070
36879B681436P05111J596626J168188j70280q71013n44515o4750J70145M87407
$$ y = [-256512, 1143740, 3229328, 4748424, 4966953, 4072457, 3270301, 3513472, 4272615, 4552456, 4764814, 6210524, 8787064, 10692742, 10669964, 9261503, 7526698, 5784950, 4139156, 3083170, 2846764, 2909437, 2751807, 2464045, 2216413, 1825987, 1260074, 932381, 1159107, 1911281, 3225345, 5017796, 6371894, 6167703, 4832891, 4210166, 4967332, 5415503, 4012849, 1939690, 1686979, 3745569, 6290497, 7862779, 8710750, 9286206, 8950593, 6949107, 3783778, 841229, -967587, -1754230, -2148524, -2593035, -3007297, -3025076, -2592403, -2093381, -1658628, -792394, 763626, 2232669, 2722506, 2681436, 3386547, 4983173, 6151361, 5981081, 5110068, 4565553, 4500803, 4670948, 5158355]
36870E158355O40261n5584j149885j263580k72059K56902n88705j732752j911857
36861i18904j408564r40627j12535J586610L100245K725289M75963j729067k223587
36852E54823j063761N17819J320386R47397K9133m39707l19405l47692n85691
36843F13302Q0484J960221L249458K234777p4918j386058j529902k136013l143232
36834a31881k438597L05371K140703Q39479j666737j928586K93602K165135J889354
36825A467843M57022n60601q87683p75213n1858J139003J700524P45324r57259
36816B277102j557522l10557J301127J127845r86478k776549k291287l71378O87080
36807b900617M40880N42136J581274J805622m741k262905k775779j776817r28678
$$ y = [5158355, 5798616, 5743032, 4593147, 3329567, 3057508, 3314410, 2725705, 992953, -918904, -2327468, -3268095, -3380630, -1794020, 1306225, 4031514, 4507477, 2778410, 554823, -508938, 8881, 1329267, 2276664, 2305797, 1866090, 1546685, 1198993, 613302, 693786, 2654007, 5903465, 8138242, 8063324, 6677266, 5147364, 3011351, -131881, -2570478, -2265107, -124404, 715075, -951662, -2880248, -2586646, -421511, 1467843, 1924865, 1364264, 476581, -298632, -350490, 788513, 2489037, 3234361, 2277102, 719580, 409023, 1710150, 2837995, 1851517, -925032, -3216319, -3587697, -2900617, -2459737, -1917601, -336327, 1469295, 1464554, -798351, -3574130, -5350947, -6279625]
36798f279625m81885M51449J620082J940156J644830J808432J946773N85165j658255
36789A577122k215105m42763J203035R26726O6706L47497J008454O92149J92728
36780C356549Q03244J383742l7897k483998k853179n71438J399914Q91741o44996
36771A243682q71535L97K98779n6420K34804J200261J324416J39016p62823j37393
36761B613184Q62218L45409j394124k188617j131468K00531K38480k94595J67935
36752e81047J274645J198677l54158j405126n33029J040540J242994N2244o55041
36743A280699K15544J575576J585038j42309k054703k324669r36736K60141J1870
36734e29549m77112O01842K350910J859904j234790l334050j735651J198418J404493
$$ y = [-6279625, -6761510, -6310061, -4689979, -2749823, -1104993, 703439, 2650212, 3235377, 1577122, -637983, -1080746, 122289, 1049015, 1115721, 1463218, 2471672, 3163821, 3356549, 4159793, 5543535, 5505638, 3021640, 168461, -402977, 996937, 1888678, 1243682, 372147, 372544, 671323, 614903, 849707, 2049968, 3374384, 3513400, 2750577, 2613184, 3475402, 3820811, 2426687, 238070, -893398, -692867, -454387, -748982, -581047, 693598, 1892275, 1538117, 132991, -400038, 640502, 1883496, 1935740, 1280699, 1496243, 3071819, 4656857, 4514548, 2459845, 135176, -801560, -541419, -529549, -1006661, -404819, 1946091, 3805995, 2571205, -762845, -2498496, -1300078, 104415]
36725A04415p60349j191529J435154L504405J926192j421375k756084j565498
36717g24669k28540M51r6647j29897p74130j829582j781691M577K134202K930673
36707d95253K294200J272683O53149M86881L87340l905l82616K03801J854198
36698F270478K699334Q54199k420480l474127j064552J479006N10222k945081
36690A908999m611200k666541L20279J252529J74622o67780J25623J977442L274580
36681A088553K678674K36001k299749k985535j847360o09350q7207P05654K241216
36672h79103L002082J739543j53849m09532P91969J269498K30493q70740r28384
36663C791977n87009n29712k59542M59393N31770q05223k360242k409150j057540
$$ y = [104415, -655934, -1847463, -412309, 3092096, 5018288, 3596913, 840829, -724669, -953209, -952758, -1049405, -1179302, -1953432, -3783014, -5564705, -5560128, -3425926, -495253, 1798947, 3071630, 3724779, 4211660, 4599000, 4595095, 4212479, 4416280, 6270478, 8969812, 9824011, 7403531, 3929404, 2864852, 4343858, 4854080, 1908999, -2702201, -5368742, -5048463, -3795934, -3621312, -4289092, -4163469, -2186027, 1088553, 3767227, 4003228, 1703479, -1282056, -3129416, -3738766, -3825973, -3120319, -879103, 2122979, 3862522, 3708673, 3299141, 4091110, 5360608, 5591101, 4720361, 3791977, 3204968, 2675256, 2415714, 2875107, 3406877, 2601654, 241412, -2167738, -3225278]
36654c225278R5139K13389r3726j60655j20007j88283o5020N11756J182792J388373
36644d61520J092522P19257M50218q9848j246014k522762k735913j284565R11057
36635e167568K170800J753300M49935m57076l80224M10143J230705J391008O01833
36626B002856p39713j868819k301768j973798r61697M38927J542824J820327J521708
36617e19153J148848N85910l48138q16930J55160J673497J527674o18381k215192
36608E73295j145171J276912K102610O25923j187031j644216j002248k13698M36047
36599a77577R69599J109222O97750J37110j32330k87345q27636j661769j801178
36590a974154l42320K088185L367138K068879o20323k154716j716784p98175n63725
$$ y = [-3225278, -3130139, -2916750, -3010476, -3171131, -3291138, -3479421, -3544441, -3032685, -1849893, -461520, 631002, 1350259, 1800477, 1710629, 464615, -2058147, -4794060, -6078625, -5167568, -2996768, -1243468, -793533, -1250609, -1630833, -1220690, 10015, 1401023, 2002856, 1263143, -605676, -2907444, -4881242, -5842939, -5404012, -3861188, -2040861, -519153, 629695, 1215605, 867467, 50537, 205697, 1879194, 3406868, 2788487, 573295, -571876, 705036, 2807646, 3433569, 2246538, 602322, -399926, -613624, -177577, 792022, 1901244, 2598994, 2736104, 2603774, 2316429, 1488793, -172976, -1974154, -2316474, -228289, 3138849, 5207728, 4587405, 2432689, 715905, -82270, -645995]
36581f45995l06256P07750J539152J131728K75088L15154Q23334M14022o70948
36572C583029p79122M16070J248693N23536q08696j058633N3786J206735R90808
36563E376206n45867j682319p53434J610348K814299J471138q74315k123283k325059
36554B967714k500827k237608p11535R30274Q94542p3375L29863J935206K100685
36545C634939J32197j419208q86052N8320l68805j028927j36989J514874J908620
36536C408969R36308Q370m32304r67853j492002j306524n56984p7581p5920j23939
36526f79460j13113k53984n03105p43920j083296j453983j545404j394942j126107
36517h897314j07614K057773L644641K254058j164952k504991j75337K285131
$$ y = [-645995, -952251, -244501, 1294651, 2426379, 2701467, 3016621, 3839955, 4253977, 3583029, 2803907, 3219977, 4468670, 4992206, 4183510, 3124877, 3178663, 4385398, 5376206, 4830339, 3148020, 2394586, 4004934, 6819233, 8290371, 7416056, 5292773, 2967714, 466887, -1770721, -2482256, -1551982, -657440, -730815, -400952, 1534254, 3634939, 3767136, 2347928, 1461876, 1520196, 1151391, 122464, -14525, 1500349, 3408969, 4345277, 4353647, 3921343, 2953490, 1461488, 154964, -402020, -479601, -555521, -679460, -792573, -1046557, -1549662, -2293582, -3376878, -4830861, -6376265, -7771207, -8897314, -9004928, -6947155, -3302514, -1048456, -2213408, -4718399, -4893736, -2608605]
36509b608605J541668l97940L19901K920514L139910r3354l213444l338092j460643
36500c190085K31826J102406J256759O21487j97820k09162K06113j98013j026940
36491a403429n78788J031643J724924R74028O04303J172873O28103j834690l498703
36482a179736j960457J089511K413921J726757J046049R70566L73221r36926j799593
36473A743313j724068j300928p75954O0824Q00530Q25530N23136N99397N82705
36464A334485l77633j594769j504255r0651J097721J332704J323694J332048N61469
36455C414813j050171k137424j803400q50503l42686j88579Q216j08057p88506
36446c846297j215669n63832O14513J146448Q75881M70395L6697q03530j586453
$$ y = [-2608605, -1066937, -1464877, -1144976, 1775538, 4915448, 4822094, 1608650, -1729442, -3190085, -2958259, -1855853, -599094, 22393, -175427, -384589, -178476, -376489, -1403429, -1982217, -950574, 774350, 1748378, 2352681, 3525554, 4153657, 2318967, -1179736, -3140193, -2050682, 363239, 2089996, 3136045, 4106611, 4479832, 3542906, 1743313, 19245, -1281683, -2057637, -1996813, -1196283, -370753, 152383, 751780, 1334485, 956852, -637917, -2142172, -2232823, -1135102, 197602, 1521296, 2853344, 3414813, 2364642, 227218, -1576182, -2426685, -2769371, -2957950, -2949734, -3057791, -3846297, -5061966, -5625798, -5011285, -3864837, -2988956, -2518561, -2481864, -3285394, -4871847]
36437d871847j120333O99648K312645K424308J715284J725480K511536K507916
36429G904637P78720j555758k633142k005029q69411m29119o40498o19322J50890
36420H1968J185868J440915M27437r91733j177025N40702K809810L405197J517930
36411I241069j341620k758134j630418Q33076K181711J119528r44380j285279
36403E415553P76772K667548J609343j753710m075815l369197q99640R86676J360904
36394B718434O19560n89398j483027j276928j05480R18129J137113J006858Q70241
36385C815502K31604j032294j914780j669429q94799k84722N13894J626933J823358
36376B215267K94099j439707j292912L19881J110818K71881p43811p56384k89068
$$ y = [-4871847, -5992180, -5292532, -2979887, -555579, 1159705, 2885185, 5396721, 7904637, 8683357, 7127599, 4494457, 2489428, 1620017, 1190898, 550400, -68922, 81968, 1267836, 2708751, 3136188, 2144455, 967430, 1508132, 4317942, 7723139, 9241069, 7899449, 5141315, 3510897, 4343973, 6525684, 7645212, 6700832, 5415553, 6192325, 8859873, 10469216, 8715506, 4639691, 1270494, 370854, 1357530, 2718434, 3337994, 2748596, 1265569, -11359, -116839, 801290, 1938403, 2945261, 3815502, 4047106, 3014812, 1100032, -569397, -1464196, -1748918, -1235024, 391909, 2215267, 2509366, 1069659, -223253, 96628, 1207446, 1479327, 735516, -20868, -309936]
36367c09936j72700l38312m39229m12816j29412M51792Q02466O23760P24972J575177
36357B375762J590364q30395l824994l602571k2167K529185J232810j298992j489387
36348c340385k28909n55007j978657j211534K122573M508589L712290J483456
36340D512416Q2852q07750k093257k751746j492107P06015J779879J267147J02079
36331A305528j208989k378584k238417k4656K620570L092591J341468n0384L80529
36322B839656J186929P17837l79217p35432p25890j481722k427244j920146p7029
36313c002258J071610N42559k84576j6081O59964L61706o53117r67030k41237
36304b528460M17189K17003l44595m18451J52464R12084J254526P22982n01732
$$ y = [-309936, -482636, -820948, -1260177, -1672993, -1802405, -1350613, -548147, 75613, 800585, 2375762, 3966126, 3135731, -689263, -4291834, -4314001, -1784816, -552006, -1850998, -3340385, -3569294, -4124301, -6102958, -7314492, -5191919, -683330, 3028960, 4512416, 4595268, 3787518, 1694261, -1057485, -2549592, -1843577, -63698, 1203449, 1305528, 96539, -2282045, -4520462, -4545118, -1924548, 1168043, 2509511, 2459127, 2839656, 4026585, 4744422, 4365205, 3629773, 2903883, 1422161, -1005083, -2925229, -3002258, -1930648, -1388089, -1672665, -1688746, -1028782, -667076, -1320193, -2287223, -2528460, -2111271, -1894268, -2238863, -2657314, -2504850, -1592766, -338240, 384742, -116990]
36295a16990j359433q74357N22927J364056R71433J09824l88400o46305q80838
36286a298083n50908O71567J781051J476217Q0089o77631J07107J362975J386960
36277D339344k21174k168734k671560j071896J392083K628667J928620P54117
36269D909467O41549R67519J08380j580325j880908j74620J271915O25051p54885
36260D133143o51672M08474L14327p61583n73858J087744J567798l25435j943446
36251C255492p15287J690845J719679q18171k687376k023605l81911L79381O32635
36242A051682J206027J180749o27590l057870l446957j022812J928091K634694
36234a53986P81078j530086k279607j432142l04447L76640R98414J671337J515543
$$ y = [-116990, -1476423, -2350780, -1827853, -463797, 507636, 617460, 229060, -417245, -1298083, -1848991, -1177424, 603627, 2079844, 2159933, 1482302, 1589409, 2952384, 4339344, 4118170, 1949436, -722124, -1794020, -401937, 2226730, 4155350, 4909467, 5551016, 6518535, 6626915, 5046590, 3165682, 2991062, 4262977, 4888028, 4133143, 3481471, 3889945, 4204272, 3442689, 2868831, 3956575, 5524373, 5198938, 3255492, 2540205, 4231050, 5950729, 5132558, 2445182, 421577, 39666, 419047, 1051682, 2257709, 3438458, 2810868, -247002, -3693959, -4716771, -2788680, -153986, 627092, -902994, -3182601, -4614743, -4919190, -4542550, -3544136, -1872799, -357256]
36225c57256J81079r27205l93694Q41404O51293r43703j667987m91195R46076
36216b161188J167936R08240J058512P46129o90904j718492r13205L01624r4364
36207a395712r89173J35468K430705K340473o42397k618925j062451J357871R68812
36198E24671j472216k355157o29125J303196J439250K87471q25399j316830q75622
36189c919761P19223K650041L277215K031483K31123m89904J19450J097845J381296
36180G098011M05808j597113l343735l170362p36706K177021L266993K125246
36172F225163N00659j3795R7243o82838k316242k863713j178391J145650J675329
36163B589065L82410n20649R4011Q04192P8942j345246j683280o68648M40283
$$ y = [-357256, -176177, -1103382, -1497076, -655672, -4379, -948082, -2616069, -3107264, -2161188, -993252, -85012, 973500, 1719629, 1028725, -689767, -1602972, -1301348, -1395712, -2384885, -2249417, 181288, 2521761, 1879364, -739561, -1802012, -444141, 524671, -947545, -3302702, -3931827, -2628631, -1189381, -901910, -1727309, -3044139, -3919761, -3200538, -550497, 2726718, 4758201, 4989324, 4499420, 4618870, 5716715, 7098011, 7503819, 5906706, 2562971, -607391, -1344097, 832924, 4099917, 6225163, 6725822, 6712027, 6809270, 6126432, 3810190, 946477, -231914, 913736, 2589065, 2971475, 2450826, 2544837, 3349029, 3427971, 2082725, 399445, -269203, 171080]
36154A71080Q61537R75249J172153J179160P20656Q1565k48255j25072J11521
36145D899594r2601q70464j483883j055085O1265M46682m04420j212926p34218
36136d46056M94915J172831J065677O53135j21956j225239j440069J82582K177057
36127B512877K062943p2851j529758r35430k9659n54421j439638p41702J052521
36118C24882J630788J71334j658886j979081p39922O43578Q95689k6215r93074
36109a730907q58131K78503J239484J268359P42811K35367k51874p14531p95136
36100e86055o19094r37680j628291j236570P55513K346096J471555o91138j022507
36091b148171J074888K766088J887995j13032n51427P52436J702942J054101l10331
$$ y = [171080, 1032617, 2007866, 3180019, 4359179, 5079835, 5161400, 4913145, 4788073, 4899594, 4806993, 3936529, 2452646, 1397561, 1458826, 1905508, 1501088, 288162, -446056, 48859, 1221690, 2287367, 2940502, 2818546, 1593307, 153238, 335820, 2512877, 4575820, 4502969, 2973211, 2037781, 2008122, 1453701, 14063, -727639, 324882, 1955670, 2127004, 468118, -1510963, -2250885, -1607307, -711618, -737833, -1730907, -2589038, -2310535, -1071051, 197308, 940119, 1175486, 923612, 209081, -586055, -1205149, -2142829, -3771120, -5007690, -4252177, -1906081, -434526, -1125664, -2148171, -1073283, 1692805, 3580800, 3467768, 2916341, 3668777, 5371719, 6425820, 6115489]
36082F115489j013817q02091l47931l11607q54179j562501j699894r04743K91323
36073a089951R68856Q86253P24016J152038J882313J873043N35704j339683k124963
36064C467626j056662P86207J587235P33214q44845k070224k604126k304968r83848
36055c290391P23825J341187M07817m78608L06225J987551K451741J316831K24098
36046D990276J19223J86550m8892L95208J817920K358937M15616k649270m139541
36037C446027l605129k765155k316212j166050R13197K195854J573394L90766
36029a333308L47951R31488N56191o06710p69086O38701J875401J151491r83963
36020A808156k241857j268954Q29833J802870Q54726n37161o24305M24238J126765
$$ y = [6115489, 5101672, 4299581, 3951650, 3640043, 2785864, 1223363, -476531, -1381274, -1089951, -121095, 765158, 1489174, 2641212, 4523525, 6396568, 6932272, 5592589, 3467626, 2410964, 3197171, 4784406, 5517620, 4672775, 2602551, -1575, -2306543, -3290391, -2566566, -1225379, -817562, -1296170, -989945, 997606, 3449347, 4766178, 4990276, 5109499, 5296049, 5247157, 5642365, 7460285, 9819222, 10234838, 7585568, 3446027, -159102, -2924257, -5240469, -6406519, -5493322, -3297468, -1724074, -1333308, -985357, -53869, 502322, -104388, -873474, -234773, 1640628, 2792119, 1808156, -433701, -1702655, -872822, 930048, 1784774, 1247613, 623308, 1047546, 2174311]
36011B174311R84649Q28028R24234M23264p48858j144475p6393Q31792p0763j789450
36001B336339k140910j077331m84731j017904j297630m33009O52799R95259J040090
35992a427028J561663K373089K781706K352123Q66492j361671k910816k398727
35984A836831o15455K1084j248368k398951j641064J21732J092567J230345J421400
35975a79879J318870Q9426j416516j414183M930P54538k08629j316103n69943
35966b937489J712649L145863J985256q10800k391447j150144J145910J301046
35958B000844j105996k932876j660474J273579K797837K330740J454187O72780
35950D830621p17392k016730j483222L34692O38734j203384k092568K27903L407467
$$ y = [2174311, 3158960, 3986988, 4911222, 5334486, 4585628, 3441153, 3364760, 4196552, 4125789, 2336339, 195429, -881902, -1366633, -2384537, -3682167, -4115176, -3462377, -2467118, -1427028, 134635, 2507724, 5289430, 7641553, 8508045, 7146374, 4235558, 1836831, 1221376, 1242460, -5908, -2404859, -4045923, -3924191, -2831624, -1601279, -179879, 1138991, 1228417, -188099, -1602282, -1597352, -842814, -1051443, -2367546, -2937489, -1224840, 1921023, 3906279, 3095479, 704032, -446112, 699798, 2000844, 894848, -2038028, -3698502, -2424923, 372914, 2703654, 4157841, 4830621, 4113229, 2096499, 613277, 947969, 1586703, 383319, -1709249, -1481346, 1926121]
35941A926121L609768P71456j754046j862368n47312N31304R58932P85060j97347
35932D221568j643224k395255j772190m13533N50791O27143J43334j10443N53936
35923b37873J880702K512488J449934m22333j153719r3911J445929J961266J233359
35914H575842j14406j492067k348835k193583j171028k9930P74143J238092R60208
35905D198436o62104k822308l229465q31420K309341L232672J587632m19343j031471
35896B331970l11856J095510K581528K820562N72047k954325m501814k794387
35888a160765l98531L4730m17642O91019K415032J444560k204169m185885j871877
35879e653528J657530J976075n58372j942465n01946J498812J983703J653732
$$ y = [1926121, 5535889, 6307345, 4553299, 2690931, 2143619, 2674923, 3633855, 4418915, 4221568, 2578344, 183089, -1589101, -2002634, -1451843, -824700, -681366, -791809, -237873, 1642829, 4155317, 5605251, 5182918, 4029199, 3935288, 5381217, 7342483, 8575842, 8461436, 6969369, 4620534, 2426951, 1255923, 1225993, 2000136, 3238228, 4198436, 3536332, 714024, -2515441, -3346861, -1037520, 2195152, 3782784, 3363441, 2331970, 2020114, 3115624, 5697152, 8517714, 9089761, 6135436, 1633622, -1160765, -1559296, -1524566, -1942208, -1251189, 1163843, 2608403, 404234, -3781651, -5653528, -3995998, -2019923, -2578295, -4520760, -5022706, -3523894, -1540191, 113541]
35871A13541J676759J440408J37851j230416j193566o8625O79746O05715M10586
35862B571999M91314P19343J181295J741451J315635p54731k821044k416379N3645
35853B082528J255730m08347k156906p48603K508022L357982O89148j951405j563452
35844C064697L17874N07430j039217j765217p81174J03786l71914j062899o06839
35835a633473L53897L45059p03232j585203j498410o24105M66021J173880J071261
35826b634305M27641J68788P58227J543900J657365R96382q0572j230281j788544
35817a81399j005714N83668J171196J70326n01481Q08750K567538K045588m40191
35808E218281j818156q14222M10859p7549j109723o60511Q20821J183704k50231
$$ y = [113541, 1790300, 3230708, 3368559, 2138143, 944577, 875952, 1555698, 2161413, 2571999, 3063313, 3782656, 4963951, 6705402, 8021037, 7266306, 4445262, 2028883, 2082528, 3338258, 2929911, 773005, 24402, 2532424, 5890406, 6579554, 4628149, 3064697, 3382571, 3890001, 2850784, 1085567, 304393, 408179, 36265, -1026634, -1633473, -1279576, -934517, -1637749, -3222952, -4721362, -5345467, -4879446, -3705566, -2634305, -2206664, -2037876, -1279649, 264251, 1921616, 2917998, 2837426, 1607145, -181399, -1187113, -603445, 567751, 738077, 236596, 1045346, 3612884, 5658472, 5218281, 3400125, 2585903, 2996762, 2919213, 1809490, 1148979, 1969800, 3153504, 2903273]
35799B903273j939598k224094j015547M91043J089761O47747J65280M31103P66450
35790A315418Q060j361891j508803J654J360134J177265L72893K66269L30119
35781A961118n16191j513990q84569J432501L497966L666318J938155o80757k945393
35772E955158l675477k423686N8813K504732L918338L492628R74699k097379k994070
35763E713756j036357J049098O74905j008872j155460L15038R55847j31646j344390
35754D031919j633665j665761j578481l78055J626146K363813J090666l29937
35746C526645l99668o0969m71280q28464r1522R18964R34534L08176j4684k50682
35736C571050q36023j044375l29707J44664p95060k139999k147354j089609n46670
$$ y = [2903273, 963675, -1260419, -2275966, -1784923, -695162, -47415, 117865, 548968, 1315418, 1323478, -38413, -1547216, -1545562, -185428, 991837, 1364730, 1630999, 1961118, 1444927, -69063, -953632, 478869, 3976835, 7643153, 9581308, 8900551, 5955158, 2279681, -144005, -85192, 2419540, 6337878, 9830506, 10805205, 8707826, 5713756, 4677399, 5726497, 6401402, 5392530, 4237070, 4552108, 5507955, 5376309, 4031919, 2398254, 732493, -845988, -1224043, 402103, 2765916, 3856582, 3526645, 3126977, 3066008, 2594728, 1766264, 1674742, 2593706, 3528240, 3836416, 3821732, 3571050, 2735027, 1690652, 1360945, 1505609, 710549, -1429450, -3576804, -4666413, -5213083]
35727e213083o92779l88841N32311J171581J423569J869268K041663R55380o23010
35718A076059o28896J218262K782812K466471R39595o21841k069951l163541k787963
35709g88993o80310J416863J795818J057453R59285J688066J798468O95812k33122
35700G709340N31449K411940L078866J080887k271233m125436l186242r47316
35692D282255M15308M51456J6795m94170j080811j024511L00541J690699J131914
35683E689476j189963k737488j962792l4210J354217J994275K119880J346371
35675F579766k8905m81043M02560P31044p05862j966327q63119J079380O10198
35666E357692j987167k970572p44860J819995J790577J36844m49408L86390R06216
$$ y = [-5213083, -5905862, -6294703, -5762392, -4590811, -3167242, -1297974, 743689, 1699069, 1076059, 447163, 1665425, 4448237, 6914708, 7854303, 7232462, 5162511, 1998970, -788993, -1469303, -52440, 1743378, 2800831, 3760116, 5448182, 7246650, 7942462, 7709340, 8240789, 10652729, 13731595, 14812482, 12541249, 8415813, 5229571, 4282255, 4697563, 5149019, 5165814, 4671644, 3590833, 2566322, 2866863, 4557562, 5689476, 4499513, 1762025, -200767, -234977, 1119240, 3113515, 5233395, 6579766, 6550861, 6069818, 6472378, 7203422, 6497560, 4531233, 3668114, 4747494, 5357692, 3370525, 399953, -344907, 1475088, 3265665, 3402509, 2953101, 3339491, 4245707]
35657D245707L15610n20786q29796p09372m05010p7373m9248k58065J09102J322888
35647C143657J967619N35467k049722l113316j677083K88726O64623j49939m13986
35638h03954J54070K40022p10845j477482q48272N39151R27147l30240j950026
35629d260429k182792o46723J485202K829647L000431K550773K063512J524683
35621F364304N58393q62623k069578k181345r82628P84452K074552K333386J569670
35612G588583K8389j755594k842915k574675j489412q91949j246210j626547j120240
35603e930570q8099N47964O58205P73517J036452J117441Q99099M72199k33769
35594g47561r81281p98038Q56359K748966K996123J489014j29497r03035j399682
$$ y = [4245707, 4561317, 4040531, 3210735, 2501363, 2096353, 2018980, 1969732, 1711667, 1820769, 3143657, 5111276, 5646743, 3597021, 483705, -1193378, -904652, -240029, -389968, -803954, -649884, -409862, -1120707, -2598189, -3446461, -2907310, -1980163, -2310403, -4260429, -6443221, -7089944, -5604742, -2775095, 225336, 2776109, 4839621, 6364304, 6922697, 6060074, 3990496, 1809151, 826523, 1610975, 3685527, 6018913, 7588583, 7616972, 5861378, 3018463, 443788, -1045624, -1937573, -3183783, -4810330, -5930570, -6018669, -5470705, -4812500, -4038983, -3002531, -1885090, -985991, -513792, -747561, -1728842, -2526880, -1670521, 1078445, 4074568, 5563582, 5434085, 4531050, 3131368]
35585C131368j922373j743750p84383k09216l83776q8937R89780J015755r29501
35576i25033k456682j032152J938177L032557J760544M54398o1284j085309k395341
35567g70125j912996J41535N71577j703055l366634j711167J232260K257319J867847
35558c393439K333521L118999K047178l20105j293547m95050j58105j101799j682255
35549i44602r91101p8012M65862J337381K352928K123758O47111k60501J02316
35540D755140L75710r2990j22480N86654K51062j917999l784456l296852j485054
35531d731265n23662m78471l2275Q47975J057048M20037n6166M61834K017873
35522a017072L835724M304193K353701m83475j223528M27781J312947m32981k427456
$$ y = [3131368, 1208995, -534755, -1319138, -1528354, -1912130, -2001067, -1011287, 4468, -925033, -3381715, -4413867, -2475690, 556867, 2317411, 2771809, 2710525, 1625216, -770125, -2683121, -2541586, -1970009, -3673064, -7039698, -8750865, -7518605, -5261286, -3393439, -1059918, 2059081, 4106259, 3786154, 2492607, 1997557, 1839452, 737653, -944602, -1935703, -2013715, -1547853, -210472, 2142456, 4266214, 4913325, 4652824, 4755140, 5130850, 5037860, 4915380, 5502034, 5753096, 3835097, 50641, -3246211, -4731265, -5254927, -5733398, -5765673, -4917698, -3860650, -3440613, -3496779, -3034945, -1017072, 2818652, 7122845, 9476546, 8993071, 7769543, 8197324, 9510271, 9077290, 6649834]
35513F649834j920424j20454J89683p40054p42536R2399m7284r60977q28277K27357
35503A799267M54731m6252K99661R78483m561j961337k048971l74741k07684k083154
35493c194558k318213O64506L059578J637448j025602r64628Q16591P07103j155823
35484a773598j563366l3407O48847m95106j109144L71452K405870L064322K410828
35475C926698J264139k04903j697582k353049j901166r89455p1268P63105R86964
35466b76517L04685r7093J029912K422055J542853j322746k854039j428854N57361
35457a22383N41554m95863k51642R54836J092747R8810j74066O25716O60334q77441
35447B052602k115742j237780P02365J246728O8014n88822Q88745L152477L570517
$$ y = [6649834, 4729410, 4608956, 4798639, 4058585, 3316049, 3408448, 3361164, 2400187, 1571910, 1799267, 2253998, 2207746, 2507407, 3485890, 3481329, 1519992, -528979, -903720, -1111404, -3194558, -5512771, -4848265, -1788687, -151239, -1176841, -2141469, -1324878, -617775, -1773598, -3336964, -3370371, -2721524, -3216630, -4325774, -3954322, -1548452, 1515870, 3926698, 5190837, 4985934, 3288352, 935303, -965863, -1955318, -2026586, -1263481, -276517, 28168, -68925, 960987, 3383042, 4925895, 3603149, 749110, -679744, -122383, 419171, -76692, -328334, 626502, 1719249, 1818059, 1643993, 2269709, 2930043, 2052602, -63140, -1300920, -598555, 648173, 716187, 127365, 1016110, 4168587, 7739104]
35438G739104J546126r06045j790572j237000o28145o73282j132084j638005j784628
35429e04531j027621L58162Q19429n65533k195344j730105M19654J486912N21744
35420b417233j62707J254747L089970K655428J94217j741933j886103j189461
35412b03075o63211k12345M39092J187649J921375K289310J449302o24382k092039
35403C491676j270112N75066N44695j604207k734970p20898K465451L417148J554928
35394E718777p97825j560906o08079R69631J865637J181540p60562k446993k851265
35385G09955k598695k602988k359113r73088P19697Q67355n80848j501877m71297
35376h790899J463372K510115K342127J742189J085188K07681p88415j437739
$$ y = [7739104, 9285230, 8379185, 6588613, 5351613, 4723468, 4050186, 2918102, 1280097, -504531, -1532152, -1173990, -354561, -920094, -3115438, -4845543, -4425889, -2938977, -2417233, -2579940, -1325193, 1764777, 4420205, 4614422, 2872489, 986386, -203075, -866286, -1078631, -639539, 548110, 2469485, 4758795, 6208097, 5583715, 3491676, 2221564, 2796630, 3341325, 1737118, -997852, -1718750, 746701, 4163849, 5718777, 4920952, 3360046, 2751967, 3721598, 5587235, 6768775, 6008213, 3561220, 709955, -1888740, -4491728, -6850841, -7823929, -7104232, -6236877, -6817725, -8319602, -8790899, -7327527, -4817412, -2475285, -733096, 352092, 559773, -228642, -1666381]
35368a666381j308381j42923J758681K996252J971499r28859l084903k614248
35360c019263o66827M76691O14570J152869K084710J781684o708j281725q66642
35351B69359l05701j147996j969451l17803L081717M440384J621178k985268n154968
35342b468549l382444Q3684K097215J630834J14900n34757R5269Q50733P05768
35333h07347M4436q8184M35141P75625N57429M14309Q15450J190371Q32959P2134
35323D242323k20002O6826K65614N3676k40865m70229r20249j442829j180970
35314A53295K30032J810490K349244J921689J398810P77308p52467k928527l959912
35305I99962k750940o39598J62433o47585j343991o40096P84075J354402M28079
$$ y = [-1666381, -2974762, -3117685, -1359004, 1637248, 3608747, 2679888, -405015, -3019263, -3686090, -3209399, -2594829, -1441960, 642750, 2424434, 2417726, 1136001, 269359, -36342, -1184338, -3153789, -3471592, -389875, 4050509, 5671687, 2686419, -2468549, -5850993, -5767309, -3670094, -2039260, -1924360, -2459117, -2363848, -1513115, -807347, -762911, -851095, -415954, 359671, 917100, 1331409, 2146859, 3337230, 4170189, 4242323, 4022321, 4089147, 4354761, 4408437, 4167572, 3697343, 2777094, 1334265, 153295, 383327, 2193817, 4543061, 6464750, 7863560, 8640868, 7888401, 4959874, 999962, -1750978, -2390576, -2228143, -2875728, -4219719, -4859815, -4075740, -2721338, -2293259]
35296b293259j156299j887530r63164P53564J485276P57512J98168J180735K503009
35287E78012K071449L64143o1556J343442K077887N67954j288620j204431K2627
35278D470907K96946k57543j71798K51014l52637j274718m94980J464285J686968
35269E618444m59363j915056n87312J375236J047325p39902r88760O31999J420878
35260E403489o8142j887689j586072M59562J767228J041144m27796p39890P4896
35251D036730L31337o32545j314128m27875P15119m1209k090824k473010j92685
35242b089090K164540K137992O29014p3346K96772M94834L14479L72340K02001
35233D449536j066624k460947j960760K50830J484099J85481j850777j900888
$$ y = [-2293259, -3449558, -5337088, -6300252, -5546688, -4061412, -3303900, -3105732, -1924997, 578012, 2649461, 3013604, 2952048, 4295490, 6373377, 6941331, 5652711, 4448280, 4470907, 4767853, 4510310, 4338512, 4589526, 4236889, 2962171, 2467191, 3931476, 5618444, 5159081, 3244025, 2656713, 4031949, 5079274, 4339372, 3350612, 3982611, 5403489, 5335347, 3447658, 1861586, 2321148, 4088376, 5129520, 4701724, 3961834, 4036730, 4368067, 3735522, 2421394, 1993519, 2708638, 2667429, 576605, -1896405, -2089090, 75450, 2213442, 2842456, 2769110, 3065882, 3560716, 3875195, 4247535, 4449536, 3382912, 921965, -1038795, -787965, 696134, 881615, -969162, -2870050]
35225b870050K70831K441066K640777R59157r92124j769703j302324o03355l18432
35216a544157K8219R06371J492461N75438j394861k373171j195266R16576J847961
35207g40429R80096m61409j086489p99814m93170n61433k38353J105922K384175
35198H9096J731663o54705k071100p90435J277563J121099j025437k072062o79357
35189c073675Q94191K98421j562589k099327o62903J026482J527991J232684J152538
35180a266187J312992J024748L01292J45508J065363J879387R58641j342463k667002
35171A412279j607809M55446J395421J124920J003165J339291J200372K69026
35163F592111q19292j789671k738646l011529j823163M9789J016709J128218J798038
$$ y = [-2870050, -2599219, -158153, 2482624, 3441781, 2449657, 679954, -622370, -1225725, -1544157, -1515938, -609567, 882894, 1458332, 63471, -2309700, -3504966, -2588390, -740429, 239667, -221742, -1308231, -2108045, -2601215, -3162648, -3401001, -2295079, 89096, 1820759, 1166054, -905046, -1695481, -417918, 703181, -322256, -2394318, -3073675, -2179484, -1881063, -3443652, -5542979, -6205882, -5179400, -3651409, -2418725, -1266187, 46805, 1071553, 1372845, 1518353, 2583716, 4463103, 5421744, 4079281, 1412279, -195530, 259916, 1655337, 2780257, 3783422, 5122713, 6323085, 6592111, 5772819, 3983148, 1244502, -1767027, -3590190, -3540401, -2523692, -1395474, 402564]
35154D02564K944007K721266P11173r63757p86827M418k52008j088175j249919
35145B442742r14067q25536o29247J14410M35577n79819j693815q81352J592943
35136i38164L187721K121730p98818l228532l303724j073023J297183J395769
35128a339858o14636j964150q44232J273416K036196J476722J173040J364739
35120B561237J027510J29466l10771j37609j45856m01089j89841M26389N89495
35111C548931J63682j07594J04545M52132O61642M48142o80020k245954k387928
35102d2422l64583J507029O59716j752544k354421o15565O03539k24943j162145
35093c746339l59594J056863J207309M00783J44751P20724J267428J230250O13889
$$ y = [402564, 3346571, 6067837, 6779010, 5815253, 5028426, 5032844, 4780836, 3692661, 2442742, 1528675, 703139, 73892, 188302, 623879, 44060, -1649755, -2531107, -938164, 2249557, 4371287, 3572469, 343937, -2959787, -4032810, -2735627, -1339858, -1954494, -3918644, -4762876, -3489460, -1453264, 23458, 1196498, 2561237, 3588747, 3718213, 3407442, 3269833, 3123977, 2722888, 2533047, 2959436, 3548931, 3712613, 3605019, 3709564, 4161696, 4823338, 5271480, 4591460, 2345506, -42422, -407005, 1100024, 1759740, 7196, -2347225, -2962790, -2359251, -2584194, -3746339, -4105933, -3049070, -1841761, -1440978, -1296227, -575503, 691925, 1922175, 2536064]
35084B536064l20092r22188o87189k20450m15198o50863L38741J701828J092277
35075B452930j258219j965301M53391K683893J183901k461941l675514j155323
35067c742183J935860K638021J356803N3377n87072j250486k299970k811758j390554
35058f097962J843474M367868L558064J01187k449044k145782q47547r02684j746311
35049d318737j636260r07681j008372j535883r18253O30938J438118J299025J534192
35040e422913K183480J715696p2121j246528o48042L36654o2390j519583k323364
35031g059111j583120R8737J548673K115982K167418K454649K725723J741250
35023D210201n31716j895341o83328J414171J433284n56712j763755j119576n08112
$$ y = [2536064, 2215972, 1293784, 606595, 386145, -29053, -679916, -341175, 1360653, 2452930, 1194711, -770590, -317199, 2366694, 3550595, 1088654, -2586860, -3742183, -1806323, 831698, 2188501, 2241878, 1654806, 404320, -1895650, -4707408, -6097962, -4254488, 113380, 3671444, 3772631, 1323587, -822195, -1669742, -2572426, -4318737, -5954997, -6862678, -7871050, -9406933, -10325186, -9694248, -8256130, -6957105, -5422913, -3239433, -1523737, -1595858, -2842386, -3490428, -3153774, -3216164, -4735747, -7059111, -8642231, -8543494, -6994821, -4878839, -2711421, -256772, 2468951, 4210201, 3678485, 1783144, 1099816, 2513987, 3947271, 3390559, 1626804, 507228, -884]
35014h84j010561r52149Q19866K305386J215449j282549k130295p75930L44441
35005a467226m35625j765633j300579J254835L810974M131127J992227p67146
34997E452954k119419j572401p9865J153785J328597K20460j358928j801683n52686
34988F70814P59036M02856p80395o40852O90427Q94560n72213j278056L23971
34979D70148K258956J946213j79282j889149k453965k603801k341155j033328
34971e825363Q54659K048900K210693J872972J092596k57685j255383o61852J192029
34962A271566K625875K604776J358537n98702k688019l830264l303662j945206
34954d505099j145832q04513L06011K260659L587901L244455J651695k45913j626606
$$ y = [-884, -1011445, -1963594, -1143728, 1161658, 2377107, 1094558, -1035737, -1811667, -1467226, -1902851, -3668484, -4969063, -3714228, 96746, 4227873, 6220100, 5452954, 3333535, 1761134, 1681269, 2835054, 4163651, 4384111, 3025183, 1223500, 670814, 1429850, 1832706, 1052311, 411459, 1101886, 1996446, 1424233, 146177, 470148, 2729104, 4675317, 4496035, 2606886, 152921, -2450880, -4792035, -5825363, -4970704, -2921804, -711111, 1161861, 2254457, 1996772, 741389, 79537, 1271566, 3897441, 6502217, 7860754, 7262052, 4574033, 743769, -2559893, -4505099, -5650931, -6455444, -6149433, -3888774, -300873, 2943582, 4595277, 4349364, 2722758]
34945B722758j629862j45157J211846O20559j255474j875310m27594J118755J152745
34936A493266N01626L26968L9306j034140j641053l80278J647743K196290J240021
34927D389749P27469J168482Q41420j065410k654695j926433K49472J347577O68068
34918C745699m7263M99948J202760L40614j586488k221942n77011J453279J576075
34909D385671J00981q45209n46053m07850j314220k100270j540217l26401K57989
34900b335579M64426J267763K264094K215906J255679O12850L04593p42719k007679
34891C299334j254813J782294L812085J985931k019274m081604k834855n02210
34883A86888R02344J600383K066120J576296j57540j768445j968235j209507m90125
$$ y = [2722758, 1092896, 947739, 2159585, 2780144, 1524670, -350640, -778234, 340521, 1493266, 1994892, 2321860, 2361166, 1327026, -314027, -694305, 953438, 3149728, 4389749, 5117218, 6285700, 7127120, 6061710, 3407015, 1480582, 1730054, 3077631, 3745699, 3698436, 4198384, 5401144, 5741758, 4155270, 1933328, 1356317, 2809596, 4385671, 4486652, 3641443, 3095390, 2687540, 1373320, -726950, -2267167, -2593568, -2335579, -1871153, -603390, 1660704, 3876610, 5132289, 5745139, 6049732, 5307013, 3299334, 2044521, 3826815, 7638900, 9624831, 7605557, 3523953, 689098, 186888, 1089232, 2689615, 4755735, 6332031, 6174491, 4406046, 2437811, 1228304, 738179]
34874G38179K19911J090953J223687m1868j494212j481605m12052l9579n90543
34865g87129n16661Q19000K068129J964913Q99998j34481p82533r34284m69608
34856B127344m4178p25064k025146j790776P36099L085477K445508m58793k165663
34847A184808q64165J664578K620325J333014n98817j388780p35447J95053J72427
34838C582996o76963j096218m76314K16892j98198j459443k315726k154257j354682
34829e931913m25603L59284P84992R31936J204317J417189N62089j480907k828317
34820e406933j762870N37539J366220M06575O5635J500788K686015J680646j86191
34811H87424l20671J201819J859688L77231j785768k717768k150555q73959M81259
$$ y = [738179, 958090, 2049043, 3272730, 3230862, 1736650, 255045, -157007, -196586, -787129, -1303790, -484790, 1583339, 3548252, 4448250, 4313769, 3531236, 2596952, 2127344, 2083166, 1358102, -667044, -2457820, -1721721, 1363756, 3809264, 3350471, 1184808, 320643, 1985221, 4605546, 5938560, 5339743, 3950963, 3215516, 3410569, 3582996, 2906033, 1809815, 1333501, 1550393, 1352195, -107248, -2422974, -4577231, -5931913, -6357516, -5998232, -5213240, -4281304, -3076987, -1659798, -1097709, -2578616, -5406933, -7169803, -6632264, -5266044, -4859469, -4793834, -3293046, -607031, 1073615, 887424, 566753, 1768572, 3628260, 4005491, 2219723, -498045, -2648600, -3522559, -3041300]
34802c041300J337825R95887m35347j646925j670766j265629j615720k048366
34794i390341o56104K556554M867891M188247J777156J18736o43000j924580l147531
$$ y = [-3041300, -1703475, -707588, -1142935, -2789860, -4460626, -5726255, -7341975, -9390341, -10046445, -7489891, -2622000, 1566247, 3343403, 3462139, 2819139, 894559, -2252972]
$$ [...]
##END NTUPLES=NMR SPECTRUM
##END=
