##TITLE=31Pdec_102-2025
CDCl3, 64 sc
 15.8.2025
##JCAMPDX= 6.0         $$ Bruker NMR JCAMP-DX V2.0
##DATA TYPE= NMR SPECTRUM
##DATA CLASS= NTUPLES
##ORIGIN= UXNMR, Bruker Analytische Messtechnik GmbH
##OWNER= root
$$ XWIN-NMR		Version 3.5
$$ Fri Aug 15 13:56:19 2025 Russian Standard Time (UT+4h)  she@DPX200
##.OBSERVE FREQUENCY= 81.013821
##.OBSERVE NUCLEUS= ^31P
##.ACQUISITION MODE= SIMULTANEOUS
##.ACQUISITION SCHEME= undefined
##.AVERAGES= 64
##.DIGITISER RES= 17
##SPECTROMETER/DATA SYSTEM= spect
##.PULSE SEQUENCE= zgpg30
##.SOLVENT NAME= DMSO
##.SHIFT REFERENCE= (INTERNAL, DMSO, 0, 198.062)
##AUDIT TRAIL= $$ (NUMBER, WHEN, WHO, WHERE, WHAT)
$$ ##TITLE= Audit trail, XWIN-NMR		Version 3.5
$$ ##JCAMPDX= 5.01
$$ ##ORIGIN= Bruker BioSpin GmbH
$$ ##OWNER= she
$$ F:/spectra/data/she/nmr/P31/2/pdata/1/auditp.txt
$$ ##AUDIT TRAIL=  $$ (NUMBER, WHEN, WHO, WHERE, WHAT)
(   1,<2025-08-15 13:55:06.76 +0400>,<she>,<DPX200>,
      <continue with go, POWCHK disabled, PULCHK disabled
       configuration hash MD5:
       00 E9 B6 7A A2 85 ED C7 34 08 36 98 17 FE 4E 26
       data hash MD5: 32K
       63 31 56 08 C5 67 A9 BC C1 76 D6 14 26 1E AC C3>)
(   2,<2025-08-15 13:55:09.12 +0400>,<she>,<DPX200>,
      <Start of raw data processing
       efp BC_mod = 2 LB = 1.5 FT_mod = 6 PKNL = 1 PHC0 = 1751.966 PHC1 = 6.499474 SI = 64K 
       data hash MD5: 64K
       E6 11 7E CF 01 F9 61 E6 FF AA 71 13 51 C5 76 48>)
(   3,<2025-08-15 13:55:26.35 +0400>,<she>,<DPX200>,
      <pk PHC0 = -170.1344 PHC1 = 0 
       data hash MD5: 64K
       2D F4 91 3C A5 81 C7 1E 9B 79 3E 8C 08 C6 8D 1A>)
(   4,<2025-08-15 13:55:50.70 +0400>,<she>,<DPX200>,
      <pk PHC0 = -153.3915 PHC1 = 0 
       data hash MD5: 64K
       85 94 2A 0F E6 13 EE BA B4 EC 99 64 0C 44 31 84>)
(   5,<2025-08-15 13:55:54.32 +0400>,<she>,<DPX200>,
      <abs ABSG = 5 
       data hash MD5: 64K
       E5 17 AF A3 A6 9C BE 7C 02 2E 9E 15 D4 66 D7 F0>)
$$ ##END=
$$ 
$$ hash MD5
$$ BB 9A 6E 01 D6 02 C2 7B 9F 1B 0B FD 72 0E C9 28
##$RELAX= 
##$RELAX= 
##$RELAX= 
##$RELAX= 
##$RELAX= 
##$RELAX= 
##$RELAX= 
##$RELAX= 
$$ Bruker specific parameters
$$ --------------------------
##$DU= <F:/spectra>
##$EXPNO= 2
##$NAME= <P31>
##$PROCNO= 1
##$TYPE= <nmr>
##$USER= <she>
##$AMP= (0..31)
100 100 100 100 100 100 100 100 100 100 100 100 100 100 100 100 100 100 
100 100 100 100 100 100 100 100 100 100 100 100 100 100 
##$AQSEQ= 0
##$AQ_mod= 1
##$AUNM= <au_zg>
##$AUTOPOS= <>
##$BF1= 81.014009
##$BF2= 200.13
##$BF3= 200.13
##$BF4= 200.13
##$BF5= 200.13
##$BF6= 200.13
##$BF7= 200.13
##$BF8= 200.13
##$BYTORDA= 1
##$CFDGTYP= 0
##$CFRGTYP= 5
##$CHEMSTR= <none>
##$CNST= (0..31)
1 1 145 1 1 1 1 1 1 1 1 1 1 1 1 1 1 1 1 1 1 1 1 1 1 1 1 1 1 1 1 1 
##$CPDPRG= <waltz16>
##$CPDPRG1= <>
##$CPDPRG2= <waltz16>
##$CPDPRG3= <>
##$CPDPRG4= <mlev>
##$CPDPRG5= <mlev>
##$CPDPRG6= <mlev>
##$CPDPRG7= <mlev>
##$CPDPRG8= <mlev>
##$CPDPRGB= <>
##$CPDPRGT= <>
##$D= (0..31)
0 1 0 0 0 0 0 0 0 0.06 0 0.03 2e-05 3e-06 0 0 0.0002 0 0 0 0 0 0 0 0 0 
$$ [...]
##$SUBNAM3= <"">
##$SUBNAM4= <"">
##$SUBNAM5= <"">
##$SUBNAM6= <"">
##$SUBNAM7= <"">
##$SUBNAM8= <"">
##$SUBNAM9= <"">
##$SW= 400.765351723535
##$SWIBOX= (0..15)
0 1 3 0 0 0 0 0 0 0 0 0 0 0 0 0 
##$SW_h= 32467.5324675325
##$TD= 32768
##$TD0= 1
##$TE= 0
##$TE2= 300
##$TE3= 300
##$TEG= 300
##$TL= (0..7)
0 120 53 12 22 120 120 120 
##$TP= (0..7)
150 150 150 150 150 150 150 150 
##$TP07= 0
##$TPNAME0= <>
##$TPNAME1= <>
##$TPNAME2= <>
##$TPNAME3= <>
##$TPNAME4= <>
##$TPNAME5= <>
##$TPNAME6= <>
##$TPNAME7= <>
##$TPOAL= (0..7)
0.5 0.5 0.5 0.5 0.5 0.5 0.5 0.5 
##$TPOFFS= (0..7)
0 0 0 0 0 0 0 0 
##$TUNHIN= 0
##$TUNHOUT= 0
##$TUNXOUT= 0
##$USERA1= <user>
##$USERA2= <user>
##$USERA3= <user>
##$USERA4= <user>
##$USERA5= <user>
##$V9= 5
##$VALIST= <valist>
##$VCLIST= <CCCCCCCCCCCCCCC>
##$VD= 0
##$VDLIST= <DDDDDDDDDDDDDDD>
##$VPLIST= <PPPPPPPPPPPPPPP>
##$VTLIST= <TTTTTTTTTTTTTTT>
##$WBST= 1024
##$WBSW= 4
##$XGAIN= (0..3)
0 0 0 0 
##$XL= 0
##$YL= 0
##$YMAX_a= 4040
##$YMIN_a= -18044
##$ZGOPTNS= <>
##$ZL1= 120
##$ZL2= 120
##$ZL3= 120
##$ZL4= 120
##$ABSF1= 198.0616
##$ABSF2= -202.7028
##$ABSG= 5
##$ABSL= 3
##$ALPHA= 0
##$AQORDER= 0
##$ASSFAC= 0
##$ASSFACI= 0
##$ASSFACX= 0
##$ASSWID= 0
##$AUNMP= <proc_1d>
##$AZFE= 0.1
##$AZFW= 0.5
##$BCFW= 0
##$BC_mod= 2
##$BYTORDP= 0
##$COROFFS= 0
##$CY= -3
##$DATMOD= 1
##$DC= 0
##$DFILT= <>
##$DTYPP= 0
##$F1P= 0
##$F2P= 0
##$FCOR= 1
##$FTSIZE= 65536
##$FT_mod= 6
##$GAMMA= 0
##$GB= 0
##$INTBC= 1
##$INTSCL= 9.790993e-09
##$ISEN= 30
##$LB= 1.5
##$LEV0= 0
##$LPBIN= 0
##$MAXI= 10000
##$MC2= 0
##$MEAN= 0
##$ME_mod= 0
##$MI= 50
##$NCOEF= 0
##$NC_proc= -9
##$NLEV= 6
##$NOISF1= 182.463
##$NOISF2= 159.3651
##$NSP= 0
##$NTH_PI= 0
##$NZP= 0
##$OFFSET= 198.0616
##$PC= 4
##$PHC0= 1428.441
##$PHC1= 6.499474
##$PH_mod= 1
##$PKNL= yes
##$PPARMOD= 0
##$PSCAL= 0
##$PSIGN= 0
##$REVERSE= no
##$SF= 81.0140089999434
##$SI= 65536
##$SIGF1= 159.3651
##$SIGF2= -187.1042
##$SINO= 113.3802
##$SIOLD= 16384
##$SREGLST= <1H.CDCl3>
##$SSB= 0
##$STSI= 65536
##$STSR= 0
##$SW_p= 32467.5324675325
##$SYMM= 0
##$S_DEV= 0
##$TDeff= 32768
##$TDoff= 0
##$TI= <>
##$TILT= no
##$TM1= 0
##$TM2= 0
##$TOPLEV= 0
##$USERP1= <user>
##$USERP2= <user>
##$USERP3= <user>
##$USERP4= <user>
##$USERP5= <user>
##$WDW= 1
##$XDIM= 65536
##$YMAX_p= 81448575
##$YMIN_p= -410728272
$$ End of Bruker specific parameters
$$ ---------------------------------
##NTUPLES= NMR SPECTRUM
##VAR_NAME=  FREQUENCY,     SPECTRUM/REAL,   SPECTRUM/IMAG
##SYMBOL=    X,             R,               I
##VAR_TYPE=  INDEPENDENT,   DEPENDENT,       DEPENDENT
##VAR_FORM=  AFFN,          ASDF,            ASDF
##VAR_DIM=   65536,         65536,           65536
##UNITS=     HZ,            ARBITRARY UNITS, ARBITRARY UNITS
##FACTOR=    0.49542278885378, 1,            1
##FIRST=     16045.7642231865, 0,            0
##LAST=      -16421.768244346, 0,            0
##MIN=       -16421.768244346, -410728272,   0
##MAX=       16045.7642231865, 81448575,     0
$$ Real data points
##PAGE= N=1
##DATA TABLE= (X++(R..R)), XYDATA
$$ [...]
$$ plain form
7365 -6417917 -2006112 2201371 4003802 5969115 9667770 12354532 10782194 5770414
7357 5770414 1325456 370161 2371918 4500585 4437474 2407729 836771 1807087 4588572
7348 4588572 5652454 1433527 -8107854 -18089433 -21657590 -15789696 -4420642 4863667
7340 4863667 7111734 2768545 -4208986 -9080306 -8333782 -2010900 5539133 9313214
7332 9313214 8395423 5491618 2487558 -800245 -3926004 -5454083 -5699831 -6277229 -6277199
7323 -6277199 -2889598 2914394 5628551 2328609 -3441322 -7412005 -9974610 -12391945
7315 -12391945 -11911463 -5796214 2396037 5886918 2850327 -2829353 -7640041 -10790139
7307 -10790139 -11605685 -9557826 -6784227 -6127796 -6536940 -4657686 -1110930 -446250 -3828066
$$ packed form
7365f417917M411805M207483J802431J965313L698655K686762j572338n011780
7357E770414m444958r55295K001757K128667o3111k029745j570958R70316K781485
7348D588572J063882m218927r541381r981579l568157N867894J1369054R284309
7340D863667K248067m343189o977531m871320P46524O322882P550033L774081
7332I313214r17791k903805l004060l287803l125759j528079k45748n77398L0
7323f277199L387601N803992K714157l299942n769931l970683k562605k417335
7315a2391945M80482O115249Q192251L490881l036591n679680m810688l150098
7307a0790139q15546K047859K773599O56431m09144J879254L546756O64680l381816
$$ plain form
7298 -3828066 -6370612 -3864252 1413194 3964892 1591741 -3292114 -6624361 -5249152
7290 -5249152 1405597 10292186 16633216 17975172 15234968 9704603 1609448 -7422997
7282 -7422997 -13321328 -13276196 -9145441 -5538838 -5469376 -8783653 -13426602 -17065856 -18593404
7273 -18593404 -18922491 -19310543 -18744093 -14944081 -8528448 -3669150 -3071167 -4417263 -3826952
7264 -3826952 -1185077 408185 -418989 -1505810 -527622 1704374 2306309 127586 -2378087
7255 -2378087 -1786874 1696576 3557903 269045 -5742051 -8694306 -6593141 -2917123
7247 -2917123 -990876 -137558 1270449 2550749 3166077 5402337 10758987 15458610 13973758
7238 13973758 6869033 1154926 1910001 6725887 9817945 8859212 5710644 2477954
$$ packed form
7298c828066k542546K506360N277446K551698k373151m883855l332247J375209
7290e249152O654749Q886589O341030J341956k740204n530365q095155r032445
7282g422997n898331M5132M130755L606603O9462l314277m642949l639254j527548
7273a8593404l29087l88052N66450L800012O415633M859298N97983j346096N90311
7264c826952K641875J593262q27174j086821R78188K231996O01935k178723k505673
7255b378087N91213L483450J861327l288858o011096k952255K101165L676018
7247b917123J926247Q53318J408007J280300O15328K236260N356650M699623j484852
7238A3973758p104725n714107P55075M815886L092058r58733l148568l232690
$$ plain form
7230 2477954 -416283 -2870353 -4110246 -3405145 -679005 3459756 7276397 8028391 4340361
7221 4340361 -1298357 -4206849 -2492005 1236666 4182982 7466830 13717515 21896919
7213 21896919 27588541 28381375 26124492 23462663 21149377 19735491 20582435 23060346
7205 23060346 23492882 19675127 14507202 12415140 13816135 15766032 16225769 14614641
7197 14614641 10104054 3304310 -1776177 -1871192 310237 -322653 -3028073 -2196682 2989641
7188 2989641 5999732 2317848 -4030763 -6549584 -4346104 -600673 2743616 4343678
7180 4343678 1179192 -7548071 -16189273 -17771447 -12814616 -8467079 -9100082 -12305721
7172 -12305721 -14673105 -16780293 -20190752 -22843407 -20800240 -13723758 -6113538 -2480324
$$ packed form
7230B477954k894237k454070j239893P05101K726140M138761L816641P51994l688030
7221D340361n638718k908492J714844L728671K946316L283848O250685Q179404
7213B1896919N691622P92834k256883k661829k313286j413886Q46944K477911
7205B3060346M32536l817755n167925k092062J400995J949897M59737j611128
7197A4614641m510587o799744n080487r5015K181429o32890k705420Q31391N186323
7188B989641L010091l681884o348611k518821K203480L745431L344289J600062
7180D343678l164486q727263q641202j582174M956831M347537o33003l205639
7172a2305721k367384k107188l410459k652655K043167P076482P610220L633214
$$ plain form
7164 -2480324 -2363443 -1183028 3943932 10486279 13700857 12420329 9476005 7093721
7156 7093721 5173197 4384104 6851733 11907885 14982779 13685814 11846045 14021424
7148 14021424 18642794 20556246 18256326 14328632 10361815 6120345 2930294 3090059
7140 3090059 5742813 7351086 6482709 4586281 2405548 -240887 -1488254 721920
7132 721920 3333104 196650 -8828919 -15908329 -15016063 -9197586 -4970821 -3776703 -2972562
7123 -2972562 -1607843 -195897 2837425 8931537 14345101 12574969 2785597 -7983848
7115 -7983848 -12392953 -9900945 -5350232 -3200757 -4658648 -8133330 -10290961 -8061102
7107 -8061102 -2067450 2375485 96817 -7607296 -13577608 -12980970 -9137901 -9022183 -14089375
$$ packed form
7164b480324J16881J180415N126960O542347L214578j280528k944324k382284
7156G093721j920524p89093K467629N056152L074894j296965j839769K175379
7148A4021424M621370J913452k299920l927694l966817m241470l190051J59765
7140C090059K652754J608273q68377j896428k180733k646435j247367K210174
7132G21920K611184l136454r025569p079410Q92266N818477M226765J194118Q04141
7123b972562J364719J411946L033322O094112N413564j770132r789372j0769445
7115g983848m409105K492008M550713K149475j457891l474682k157631K229859
7107h061102N993652M442935k278668p704113n970312N96638L843069J15718n067192
$$ plain form
7098 -14089375 -18691298 -17697047 -12133482 -5716783 713064 8048117 14541178 16703641
7090 16703641 13933051 8800371 3190157 -2282690 -5275525 -2486167 5296001 12389390
7082 12389390 14242435 11723698 8149390 4883787 1711057 -838233 -1693586 -365839
7074 -365839 3378781 9315240 15306901 18073387 16498882 12417669 7711693 3114043
7066 3114043 107699 337303 2012326 918739 -3108094 -4945660 -2080498 654292
7058 654292 -1888247 -7287387 -9531510 -7859466 -6244819 -6102665 -5217776 -3132318 -2314235
7049 -2314235 -3955979 -7016734 -11244833 -16839085 -21396114 -21824327 -19449970 -18704153 -20399264
7040 -20399264 -20827349 -17988941 -14008324 -10672614 -7570542 -5757447 -7864958 -12579572
$$ packed form
7098a4089375m601923R94251N563565O416699O429847P335053O493061K162463
7090A6703641k770590n132680n610214n472847k992835K789358P782168P093389
7082A2389390J853045k518737l574308l265603l172730k549290q55353J327747
7074c65839L744620N936459N991661K766486j574505m081213m705976m597650
7066C114043l006344K29604J675023j093587m026833j837566K865162K734790
7058F54292k542539n399140k244123J672044J614647J42154Q84889K085458Q18083
7049b314235j641744l060755m228099n594252m557029m28213K374357P45817j695111
7040b0399264m28085K838408L980617L335710L102072J813095k107511m714614
$$ plain form
7032 -12579572 -14322041 -11146192 -7859206 -7978593 -7813796 -3177922 2618021 3436419 -114485
7023 -114485 -2202457 -1196047 -912804 -2526050 -1834025 3324892 8233352 7513125 3150260
7014 3150260 2426425 8632229 16700553 18587182 11602493 796816 -6232275 -6121271
7006 -6121271 -1599039 1918094 383807 -6990937 -17277537 -25065353 -26765507 -24545543
6998 -24545543 -23529957 -24324405 -21872427 -13772656 -5573251 -3427510 -4508065 -897248
6990 -897248 7655338 11579219 4367933 -7620614 -12438337 -6897024 743046 1794446
6982 1794446 -3038309 -6217168 -3406678 1751336 3189154 486710 -1166742 1288189
6974 1288189 4676479 5333723 5839588 11613099 21774300 28481012 26753290 20834839
$$ packed form
7032a2579572j742469L175849L286986j19387J64797M635874N795943Q18398l550904
7023a14485k087972J006410K83243j613246O92025N158917M908460p20227m362865
7014C150260p23835O205804Q068324J886629o984689j0805677p029091J11004
7006f121271M522232L517133j534287p374744j0286600p787816j700154K219964
6998b4545543J015586p94448K451978Q099771Q199405K145741j080555L610817
6990h97248Q552586L923881p211286j1988547m817723N541313P640070J051400
6982A794446m832755l178859K810490N158014J437818k702444j653452K454931
6974A288189L388290O57244N05865N773511J0161201O706712j727722n918451
$$ plain form
6966 20834839 18181302 20110223 21618606 18596271 11781820 4360063 -1019666 -2618607
6958 -2618607 20173 4845888 8358655 9294816 10092658 13405964 18042052 19905692 16711271
6949 16711271 10232982 3639497 -1832663 -6578719 -10365154 -12252128 -12402488 -12059374
6941 -12059374 -11553858 -10238505 -8834717 -9496987 -12213445 -13445907 -10668353 -6563742
6933 -6563742 -5769326 -8336449 -9605844 -6484329 -725837 4477704 7977391 9479206
6925 9479206 7872896 3169214 -1558134 -2584662 649479 5610376 9756616 11959939
6917 11959939 11542204 8080193 2789437 -1272131 -1594690 1412749 5329828 9089321
6909 9089321 14154727 21145574 26449308 24988668 16785035 7811449 2935068 1198289
$$ packed form
6966B0834839k653537J928921J508383l022335o814451p421757n379729j598941
6958b618607K638780M825715L512767R36161P97842L313306M636088J863640l194421
6949A6711271o478289o593485n472160m746056l786435j886974j50360L43114
6941a2059374N05516J315353J403788o62270k716458j232462K777554M104611
6933f563742P94416k567123j269395L121515N758492N203541L499687J501815
6925I479206j606310m703682m727348j026528L234141M960897M146240K203323
6917A1959939m17735l462011n290756m061568l22559L007439L917079L759493
6909I089321N065406O990847N303734j460640q203633q973586m876381j736779
$$ plain form
6901 1198289 435250 2668482 10072072 18115864 19183751 12944049 7093681 6617149 7868606
6892 7868606 5299260 -1159720 -8175774 -13884785 -17643601 -18974005 -19690582 -23068700
6884 -23068700 -28085446 -29049471 -24126414 -18873224 -17087785 -14249945 -6314252 822009
6876 822009 -749161 -7652246 -9746223 -5729096 -3613772 -5935821 -5846271 -486278 2518130
6867 2518130 -2775327 -10516128 -11518073 -5432121 1752762 6901838 9886967 9056114
6859 9056114 3634065 -2169845 -4030765 -4686198 -10247330 -20377006 -27483639 -25324827
6851 -25324827 -14415307 -164601 10156655 10341042 504897 -10913785 -14939590 -11532357
6843 -11532357 -7405036 -5902383 -4537050 -1908486 -491110 -1183784 -943043 1723679
$$ packed form
6901A198289p63039K233232P403590Q043792J067887o239702n850368m76532J251457
6892G868606k569346o458980p016054n709011l758816j330404p16577l378118
6884b3068700n016746r64025M923057N253190J785439K837840P935693P136261
6876H22009j571170o903085k093977M017127K115324k322049Q9550N359993L004408
6867B518130n293457p740801j001945O085952P184883N149076K985129q30853
6859I056114n422049n803910j860920o55433n561132j0129676p106633K158812
6851b5324827J0909520J4250706J0321256J84387r836145j1418682m025805L407233
6843a1532357M127321J502653J365333K628564J417376o92674K40741K666722
$$ plain form
6835 1723679 3769961 2871351 1392294 1967913 2876632 1424297 -1068546 -1573814 -464486
6826 -464486 -292161 -832574 525440 3725794 5161673 2635697 -1650894 -4359390 -5326916
6817 -5326916 -7091476 -10977802 -14861093 -14815810 -8766317 1219253 10258638 14739149 15143520
6808 15143520 14422808 13813772 11397298 5400674 -2117710 -6528506 -5718351 -2331996 -34460
6799 -34460 954640 2805555 5675148 7087185 5679843 2733808 -650942 -4838101 -8766815
6790 -8766815 -9086880 -4726246 413830 2371412 2204243 2545572 1751373 -3301142 -10111462
6781 -10111462 -12583834 -10434411 -10052150 -14011875 -16186268 -11365523 -4313780 -3188039
6773 -3188039 -7007402 -6404788 3499692 16750595 24400803 24378925 21424543 20286666 21725671
$$ packed form
6835A723679K046282q98610j479057N75619R08719j452335k492843n05268J109328
6826d64486J72325n40413J358014L200354J435879k525976m286591k708496r67526
6817e326916j764560l886326l883291M5283O049493R985570R039385M480511M04371
6808A5143520p20712o09036k416474n996624p518384m410796Q10155L386355K297536
6799c4460R89100J850915K869593J412037j407342k946035l384750m187159l928714
6790h766815l20065M360634N140076J957582j67169L41329p94199n052515o810320
6781a0111462k472372K149423L82261l959725k174393M820745P051743J125741
6773c188039l819363O02614R904480J3250903P650208k1878k954382j137877J439005
$$ plain form
6764 21725671 23748226 24052162 21045274 14216413 4837660 -3798309 -8137279 -7708172
6756 -7708172 -6394276 -8564481 -13458307 -15382022 -10676617 -2446462 3755313 7126157
6748 7126157 11100583 16178381 17458136 11242467 1224235 -5135479 -5534001 -4989921
6740 -4989921 -8416792 -13720500 -14611031 -9158987 -2604105 -984394 -4431106 -8486797
6732 -8486797 -10054721 -9228832 -6314655 -822752 5745883 9311543 7480026 2677987
6724 2677987 -639058 -578899 1619910 3844746 4157504 1109421 -4802231 -10757879 -14319182
6715 -14319182 -15526602 -14885983 -11106680 -3476392 4822200 9089445 8540058 6377150
6707 6377150 4617907 2279124 -742458 -1735869 924891 4740962 6360205 5969839 6028505
$$ packed form
6764B1725671K022555L03936l006888o828861r378753q635969m338970M29107
6756g708172J313896k170205m893826j923715M705405Q230155O201775L370844
6748G126157L974426N077798J279755o215669j0018232o359714l98522N44080
6740d989921l426871n303708q90531N452044O554882J619711l446712m055691
6732h486797j567924Q25889K914177N491903O568635L565660j831517m802039
6724B677987l317045O0159K198809K224836L12758l048083n911652n955648l561303
6715a4319182j207420O40619L779303P630288Q298592M267245n49387k162908
6707F377150j759243k338783l021582r93411K660760L816071J619243l90366N8666
$$ plain form
6698 6028505 7071644 7330164 5718426 2820418 -644083 -4018003 -5577908 -3816845
6690 -3816845 -545166 -388944 -5552720 -12317444 -14486245 -9993670 -2759101 2092385
6682 2092385 3654044 5135375 8885965 12818904 12758800 8017451 3139408 3160817 8047328
6673 8047328 13178060 14723994 12726828 9097295 5145804 2111361 1761866 4408006
6665 4408006 7749680 9665333 10800373 12231765 12214166 8486774 2800633 -723715 -1452044
6656 -1452044 -2157416 -2891712 -254516 5477828 8174737 4523424 -56963 741542 4377492
6647 4377492 3850978 -915267 -3295709 -571535 2952515 3880483 3755713 3554630 830839
6638 830839 -4786557 -8961412 -8936269 -7734905 -8924461 -11754088 -14534117 -17657352 -19395755
$$ packed form
6698F028505J043139K58520j611738k898008l464501l373920j559905J761063
6690c816845L271679J56222n163776o764724k168801M492575P234569M851486
6682B092385J561659J481331L750590L932939o0104m741349m878043K1409M886511
6673H047328N130732J545934j997166l629533l951491l034443l49495K646140
6665D408006L341674J915653J135040J431392j7599l727392n686141l524348p28329
6656a452044p05372p34296K637196N732344K696909l651313m580387P98505L635950
6647D377492n26514m766245k380442K724174L524050R27968j24770k01083k723791
6638H30839n617396m174855K5143J201364j189556k829627k780029l123235j738403
$$ plain form
6629 -19395755 -14277777 -1225224 11313673 14839971 11918399 11079279 13692456 13829315
6621 13829315 9543773 5556866 4126638 1557408 -3709103 -6714571 -3627256 1612581
6613 1612581 2646691 -955965 -4601249 -5184936 -3163532 -53601 2992471 5103294
6605 5103294 6116325 6080662 3606295 -2925667 -11243895 -15247748 -11755265 -5165777 -2562684
6596 -2562684 -5232043 -7604145 -4368782 3316220 9245108 9222732 6243031 7554558 15659404
6587 15659404 23936601 23843793 15252157 5863624 948129 -1312599 -3406899 -3278674 1064234
6578 1064234 6252495 7524981 5331777 3614571 3461380 2906930 1854799 2662645 5798581
6569 5798581 8605606 8875551 6834617 3282631 -1631806 -7252571 -12033053 -14726331
$$ packed form
6629a9395755N117978J3052553J2538897L526298k921572q39120K613177J36859
6621A3829315m285542l986907j430228k569230n266511l005468L087315N239837
6613A612581J034110l602656l645284n83687K021404L109931L046072K110823
6605E103294J013031l5663k474367o531962q318228m003853L492483O589488K603093
6596b562684k669359k372102L235363P685002N928888k2376k979701J311527Q104846
6587A5659404Q277197r2808q591636r388533m915495k260728k094300J28225M342908
6578A064234N188261J272486k193204j717206j53191n54450j052131Q07846L135936
6569E798581K807025K69945k040934l551986m914437n620765m780482k693278
$$ plain form
6561 -14726331 -14767431 -12166253 -8653899 -7640667 -10404871 -13286437 -11835180 -7187029
6553 -7187029 -4634917 -5777920 -6269486 -2669217 2471280 4829064 4299625 3393577 2019254
6544 2019254 -1854275 -6950653 -8328143 -3434545 4436946 10349737 13012087 13759944
6536 13759944 12357659 7358837 386970 -3650959 -2252154 1330862 2540801 1256597
6528 1256597 420975 733545 525727 253262 2578561 7004621 8809182 5783054 2467940
6519 2467940 4296809 10100551 14327940 14964076 14802368 15420680 14639533 11080474 7155396
6510 7155396 5008194 2232962 -4995711 -15280748 -21497421 -17977033 -6853512 4021507
6502 4021507 9122894 9833747 10571340 12213146 11860524 8583068 5682792 5416619 4520685
$$ packed form
6561a4726331m1100K601178L512354J013232k764204k881566J451257M648151
6553g187029K552112j143003m91566L600269N140497K357784n29439r06048j374323
6544B019254l873529n096378j377490M893598P871491N912791K662350P47857
6536A3759944j402285m998822o971867m037929J398805L583016J209939j284204
6528A256597q35622L12570k07818k72465K325299M426060J804561l026128l315114
6519B467940J828869N803742M227389O36136j61708O18312p81147l559059l925078
6510G155396k147202k775232p228673j0285037o216673L520388J1123521J0875019
6502D021507N101387P10853P37593J641806l52622l277456k900276k66173q95934
$$ plain form
6493 4520685 -1538228 -11300599 -18161630 -18540647 -15909072 -15910988 -20272476 -26680287 -32091479
6484 -32091479 -34311609 -32177171 -26477402 -20079019 -15569920 -13088508 -11337903 -9875148
6476 -9875148 -9125176 -8829479 -8175437 -7567737 -8856687 -12998732 -17961625 -19675553 -15524041
6467 -15524041 -7294782 -668239 -937056 -8269306 -17214409 -21580129 -19984036 -16219299
6459 -16219299 -14375102 -14661340 -14441669 -12137376 -8723195 -5895618 -4472854 -4759981 -6702590
6450 -6702590 -8787670 -8322744 -4350880 422429 1963208 -1086595 -6403643 -10202827
6442 -10202827 -9774920 -5124618 621778 3526119 2778258 1074866 203609 -1132349 -3157417
6433 -3157417 -2357893 2726432 6022136 558601 -10443375 -16152090 -12654986 -7874745
$$ packed form
6493D520685o058913r762371o861031l79017K631575j916m361488o407811n411192
6484c2091479k220130K134438N699769O398383M509099K481412J750605J462755
6476i875148P49972K95697O54042O07700j288950m142045m962893j713928M151512
6467a5524041Q229259O626543k68817p332250q945103m365720J596093L764737
6459a6219299J844197k86238K19671K304293L414181K827577J422764k87127j942609
6450f702590k085080M64926L971864M773309J540779l049803n317048l799184
6442a0202827M27907M650302N746396K904341p47861j703392q71257j335958k025068
6433c157417P99524N084325L295704n463535j1001976n708715L497104M780241
$$ plain form
6425 -7874745 -9400128 -14011463 -13689299 -6974093 678928 4384260 3136106 -1513563
6417 -1513563 -6026604 -6693538 -4304732 -4004650 -7325334 -8545735 -3309705 3536109 4370828
6408 4370828 -651359 -5612840 -7840511 -7927880 -4141064 4583006 11893416 9599892 -62946
6399 -62946 -6701104 -6950966 -7967402 -13710175 -17719685 -14257853 -7985571 -5970576 -6535736
6390 -6535736 -3305868 3976363 9731847 11127010 10193731 8681711 5982084 1799785
6382 1799785 -2920769 -7561628 -11821886 -14818399 -16026598 -16090717 -15604386 -14807296 -14970276
6373 -14970276 -17024033 -18016711 -13113061 -2950215 5465834 7813494 7729637 9591954
6365 9591954 10988284 7467265 793461 -3649746 -5180285 -7367788 -10711440 -11901428
$$ packed form
6425g874745j525383m611335L22164O715206P653021L705332j248154m649669
6417a513563m513041o66934K388806L00082l320684j220401N236030O845814Q34719
6408D370828n022187m961481k227671q7369L786816Q724070P310410k293524r662838
6399f2946o638158k49862j016436n742773m009510L461832O272282K014995n65160
6390f535736L229868P282231N755484J395163r33279j512020k699627m182299
6382A799785m720554m640859m260258k996513j208199o4119M86331P97090j62980
6373a4970276k053757r92678M903650J0162846Q416049K347660q3857J862317
6365I591954J396330l521019o673804m443207j530539k187503l343652j189988
$$ plain form
6357 -11901428 -10124491 -8456414 -8284391 -7205948 -3725467 67321 2168383 3705983
6349 3705983 6316132 8760921 8294163 4371001 -673831 -4519473 -7153429 -9268823
6341 -9268823 -8983279 -2934990 7524793 14233518 10734697 1265767 -4393243 -4273042
6333 -4273042 -5230002 -9996761 -12158431 -7623070 -2152869 -1299828 -954375 3885127 8031890
6324 8031890 4164848 -3070947 -2700307 5265417 9807531 5707765 -910251 -4765458
6316 -4765458 -8047235 -12283077 -13885301 -11602535 -9134730 -6162137 3869846 21347595
6308 21347595 34517990 33296864 22532560 14124055 11402249 9066723 4225780 -831267
6300 -831267 -4373159 -6137222 -4022168 3098749 10038393 9509994 2068903 -3868501 -2827103
$$ packed form
6357a1901428J776937J668077J72023J078443L480481L792788K101062J537600
6349C705983K610149K444789m66758l923162n044832l845642k633956k115394
6341i268823K85544O048289J0459783O708725l498821r468930n659010J20201
6333d273042r56960m766759k161670M535361N470201Q53041L45453M839502M146763
6324H031890l867042p235795L70640P965724M542114m099766o618016l855207
6316d765458l281777m235842j602224K282766K467805K972593J0031983J7477749
6308B1347595J3170395j221126j0764304q408505k721806k335526m840943n057047
6300h31267l541892j764063K115054P120917O939644n28399p441091n937404J041398
$$ plain form
6291 -2827103 1729213 3301872 62556 -4859467 -7567641 -6276910 -2104788 1916876
6283 1916876 3868223 5038517 7744260 11740393 14550187 14580164 11937687 7059452 927292
6274 927292 -3923186 -5133931 -3267507 -926913 622159 2253100 5014585 9282789
6266 9282789 15164033 21460183 24684838 21687856 13606305 5301726 566530 -620409
6258 -620409 -198112 715737 2242843 4790788 8154909 10938222 11228175 8806121 6104650
6249 6104650 5671863 7130628 8023563 7262651 6157915 6090847 6694344 6713096 5627103
6240 5627103 3949432 2409072 1163937 -99742 -1144881 -777775 1547338 4112232
6232 4112232 4547280 2958487 1355858 -139948 -3624341 -9026561 -12784317 -13016451 -12719782
$$ packed form
6291b827103M556316J572659l239316m922023k708174J290731M172122M021664
6283A916876J951347J170294K705743L996133K809794K9977k642477m878235o132160
6274I27292m850478j210745J866424K340594J549072J630941K761485M268204
6266I282789N881244O296150L224655k996982q081551q304579m735196j186939
6258f20409M22297R13849J527106K547945L364121K783313K89953k422054k701471
6249F104650m32787J458765Q92935p60912j104736o7068O03497J8752j085993
6240E627103j677671j540360j245135j263679j045139L67106K325113K564894
6232D112232M35048j588793j602629j495806l484393n402220l757756k32134K96669
$$ plain form
6223 -12719782 -14488736 -14921527 -9093494 728429 6355188 4454653 1150694 3387857
6215 3387857 9381046 11402391 6377491 -293962 -1897111 1734407 5326734 5288788 3007757
6206 3007757 1306023 576731 -193585 -933323 -1326079 -2410423 -4556878 -5328587 -2890486
6197 -2890486 -419371 -2511283 -7268324 -7174567 860367 11307177 17699246 19301493
6189 19301493 17571839 11933909 3720349 -769287 2711214 9539228 12267431 10668028
6181 10668028 9754205 10558393 10006054 8327026 8873733 10712077 8886710 2987435 -1536620
6172 -1536620 -2020012 -1635903 -1815822 1220708 8857482 15341690 15225456 10692464 7012645
6163 7012645 4941485 2282401 -574469 -1623015 -1464144 -2482688 -5578540 -10436010
$$ packed form
6223a2719782j768954m32791N828033R821923N626759j900535l303959K237163
6215C387857N993189K021345n024900o671453j603149L631518L592327l7946k281031
6206C007757j701734p29292p70316p39738l92756j084344k146455p71709K438101
6197b890486K471115k091912m757041R3757Q034934J0446810O392069J602247
6189A9301493j729654n637930q213560m489636L480501O828014K728203j599403
6181A0668028r13823Q04188n52339j679028N46707J838344j825367n899275m524055
6172a536620m83392L84109j79919L036530P636774O484208j16234m532992l679819
6163G012645k071160k659084k856870j048546J58871j018544l095852m857470
$$ plain form
6155 -10436010 -16188053 -19140131 -14030915 -1755163 8253082 8792317 4673620 5511172
6147 5511172 11563287 14318793 10034154 4490476 3178031 4251281 3929290 2493366
6139 2493366 1194535 -1579338 -6642592 -10473236 -10051483 -8541349 -11385024 -18134514
6131 -18134514 -22552569 -20590185 -14799179 -10578750 -10654807 -13588015 -15696871 -14070523
6123 -14070523 -8997460 -3400688 888148 5169409 10792486 15582139 15856832 11205634
6115 11205634 4708789 -862289 -4163266 -3460467 2054018 8615271 10198941 6648165
6107 6648165 5378695 11647007 20551100 23160843 18260930 12723876 11133750 10770866
6099 10770866 7805875 3145349 -443903 -2977320 -5696261 -7517620 -6348832 -2514705
$$ packed form
6155a0436010n752043k952078N109216J2275752J0008245N39235m118697Q37552
6147E511172O052115K755506m284639n543678j312445J073250l21991j435924
6139B493366j298831k773873n063254l830644M21753J510134k843675o749490
6131a8134514m418055J962384N791006M220429p6057k933208k108856J626348
6123a4070523N073063N596772M288836M281261N623077M789653K74693m651198
6115A1205634o496845n571078l300977P02799N514485O561253J583670l550776
6107F648165j269470O268312Q904093K609743m899913n537054j590126l62884
6099A0770866k964991m660526l589252k533417k718941j821359J168788L834127
$$ plain form
6091 -2514705 1525484 3447954 1308323 -5871094 -14771231 -17564274 -9578524 3672250
6083 3672250 11559083 10472053 6603637 6179121 8036769 8337404 7897802 10007446 13277659
6074 13277659 12222862 5421389 -1444566 -2894587 -938003 -1880150 -7312663 -12020573
6066 -12020573 -11339482 -7248674 -5046132 -6211239 -7524398 -6180338 -2509444 2180623
6058 2180623 7016684 10214127 9900076 7718379 7980388 10848274 10043406 1246943 -9949585
6049 -9949585 -13538248 -7612142 -529447 -288320 -6104624 -11677110 -12982077 -10874487
6041 -10874487 -8726876 -9592563 -13967606 -18730028 -19510636 -15158863 -8834963 -4369105
6033 -4369105 -3061816 -4231086 -6713065 -8935669 -9448096 -8684815 -8974491 -11727855 -15367431
$$ packed form
6091b514705M040189J922470k139631p179417q900137k793043P985750J3250774
6083C672250P886833j087030l868416m24516J857648L00635m39602K109644L270213
6074A3277659j054797o801473o865955j450021J956584r42147n432513m707910
6066a2020573O81091M090808K202542j165107j313159J344060L670894M690067
6058B180623M836061L197443l14051k181697K62009K867886q04868q796463j1196528
6049i949585l588663N926106P082695K41127n816304n572486j304967K107590
6041a0874487K147611q65687m375043m762422p80608M351773O323900M465858
6033d369105J307289j169270k481979k222604n12427P63281k89676k753364l639576
$$ plain form
6024 -15367431 -16652483 -13669598 -7787976 -3287531 -3989442 -8796137 -11719041 -8351616
6016 -8351616 -1281299 3079098 1583808 -4380346 -12496249 -19889804 -21372286 -13361832
6008 -13361832 -299733 8297338 8747155 6279334 5805904 5482147 2510401 -260734
6000 -260734 1509985 6475748 9456186 8289634 4724959 218726 -5391078 -12075671
5992 -12075671 -19240578 -26015577 -30170900 -28935347 -22757397 -15525237 -9175807 -1705874
5984 -1705874 7059963 12399339 11490129 8956414 10325445 13521095 12981016 9471493 8863219
5975 8863219 12457136 15401541 14562499 11611796 7940779 2755581 -2542688 -3795754
5967 -3795754 116119 5433405 9024460 11438786 13154373 12511739 9559937 7755821
$$ packed form
6024a5367431j285052K982885N881622M500445p01911m806695k922904L367425
6016h351616P070317M360397j495290n964154q115903p393555j482482Q010454
6008a3361832J3062099Q597071M49817k467821m73430l23757k971746k771135
6000b60734J770719M965763K980438j166552l564675m506233n609804o684593
5992a2075671p164907o774999m155323J235553O177950P232160O349430P469933
5984a705874Q765837N339376r09210k533715J369031L195650n40079l509523o08274
5975H863219L593917K944405q39042k950703l671017n185198n298269j253066
5967c795754L911873N317286L591055K414326J715587o42634k951802j804116
$$ plain form
5959 7755821 9086083 10683609 8913398 4448220 1128021 1549928 5118203 8742254
5951 8742254 8882619 4985936 1045715 1312521 4817034 7363787 8221199 10032065 11888036
5942 11888036 8518119 -1178770 -10044428 -10921103 -5362961 -372811 677899 151463
5934 151463 1357315 5318012 11062521 16239312 18378998 17682460 17332598 19132148 20275971
5925 20275971 16502781 7342923 -3449497 -11673232 -15710143 -17026389 -18541058 -21237541
5917 -21237541 -22344422 -19000708 -13317978 -10184715 -9856537 -7544343 -1843579 1811461
5909 1811461 -780952 -6076285 -8657995 -9249624 -11496759 -14193875 -13027895 -8251939
5901 -8251939 -4373222 -2748007 -268607 4295397 8021001 9049080 9487658 11318970
$$ packed form
5959G755821J330262J597526j770211m465178l320199M21907L568275L624051
5951H742254J40365l896683l940221K66806L504513K546753Q57412J810866J855971
5942A1888036l369917r696889q865658q76675N558142M990150J050710n26436
5934A51463J205852L960697N744509N176791K139686o96538l49862J799550J143823
5925B0275971l773190r159858j0792420q223735m036911j316246j514669k696483
5917b1237541j106881L343714N682730L133263L28178K312194N700764L655040
5909A811461k592413n295333k581710n91629k247135k697116J165980M775956
5901h251939L878717J625215K479400M564004L725604J028079M38578J831312
$$ plain form
5893 11318970 12912179 11564285 7288509 2882812 1874013 6440378 15068183 22206119
5885 22206119 22789146 17471793 11331782 7749203 6203869 5664951 6580450 8793339 10498077
5876 10498077 10326293 8316781 4521296 -916030 -6257375 -9623426 -12003719 -15498590
5868 -15498590 -18348932 -15787891 -7064810 2289457 7043236 7615055 7075748 6795930 7725221
5859 7725221 11941138 18922753 23376475 21414389 16864879 16611771 20869040 23167078
5851 23167078 19838910 14416161 11513716 10979538 10377454 9657843 10299323 11856991 12132691
5842 12132691 9879666 5665197 1081955 -1713831 -1321810 462200 -641518 -5957054
5834 -5957054 -10664340 -9068595 -2377373 2085714 -232771 -6123696 -9669437 -9490548
$$ packed form
5893A1318970J593209j347894m275776m405697j008799M566365Q627805P137936
5885B2206119N83027n317353o140011l582579j545334n38918R15499K212889J704738
5876A0498077j71784k009512l795485n437326n341345l366051k380293l494871
5868a5498590k850342K561041Q723081R354267M753779N71819n39307k79818R29291
5859G725221M215917O981615M453722j962086m549510k53108M257269K298038
5851B3167078l328168n422749k902445n34178o02084p19611O41480J557668K75700
5842A2132691k253025m214469m583242k795786L92021J784010j103718n315536
5834e957054m707286J595745O691222M463087k318485n890925l545741J78889
$$ plain form
5826 -9490548 -8704256 -9322513 -9465941 -6326423 -309151 4527068 4056363 -1723437 -8047981
5817 -8047981 -9388048 -4091736 5228515 14741491 20998357 20549900 11740688 -1826593
5809 -1826593 -12717017 -16744146 -16451726 -15838594 -14783559 -11776775 -9061721 -10151341
5801 -10151341 -13580247 -14168593 -10389656 -5883673 -3357224 -1664112 135125 608110
5793 608110 -304713 186091 2843178 3910669 675602 -3611838 -3916797 -309602 2729008
5784 2729008 2400879 6546 -1598621 -425070 3734364 8611763 10760414 9427309
5776 9427309 7794576 8574959 10168979 9479811 6792224 5010382 5097003 5007426 2837800
5767 2837800 -780188 -2978938 -529828 6887784 14227757 14529765 6948877 -1117007
$$ packed form
5826i490548P86292o18257j43428L139518O017272M836219m70705n779800o324544
5817h047981j340067N296312R320251R512976O256866m48457q809212j3567281
5809a826593j0890424m027129K92420O13132J055035L006784K715054j089620
5801a0151341l428906n88346L778937M505983K526449J693112J799237M72985
5793F08110r12823M90804K657087J067491l235067m287440l04959L607195L038610
5784B729008l28129k394333j605167J173551M159434M877399K148651j333105
5776I427309j632733P80383J594020o89168k687587j781842Q6621q9577k169626
5767B837800l617988k198750K449110P417612P339973L02008p580888q065884
$$ plain form
5759 -1117007 -2394110 2150619 6129696 5922066 2841370 -111007 157058 5820158 14248169
5750 14248169 17514123 11010444 907555 -2405762 2942091 9797847 12943375 13633069
5742 13633069 13146923 9556353 3437480 316901 3579868 9437258 12322430 11556081
5734 11556081 9772254 8443253 7960406 8667779 8747482 4487058 -3928963 -10057724 -8634620
5725 -8634620 -3085503 -1526108 -6668944 -13519899 -16346958 -14338178 -10230590 -6338876
5717 -6338876 -3098200 -144191 2354364 3843071 4868272 7026492 9745255 8646436
5709 8646436 730136 -9184749 -11906173 -5178076 2882993 4111791 -48836 -2590609
5701 -2590609 -978449 1472511 2186803 2527779 4636148 8335608 11250054 10263087 4055672
$$ packed form
5759a117007j277103M544729L979077k07630l080696k952377K68065N663100Q428011
5750A4248169L265954o503679j0102889l313317N347853O855756L145528O89694
5742A3633069m86146l590570o118873l120579L262967N857390K885172p66349
5734A1556081j783827j329001m82847P07373P9703m260424q416021o128761J423104
5725h634620N549117J559395n142836o850955k827059K008780M107588L891714
5717f338876L240676K954009K498555J488707J025201K158220K718763j098819
5709H646436p916300r914885k721424O728097Q061069J228798m160627k541773
5701b590609J612160K450960P14292L40976K108369L699460K914446r86967o207415
$$ plain form
5692 4055672 -4016119 -7735156 -5425490 -3203585 -7037312 -13466323 -13267978 -4061856
5684 -4061856 5944741 8308916 4288034 1831607 5358027 11615777 14804657 13189285
5676 13189285 9975877 8836324 9834715 10256855 8688687 6673806 6004975 6127411 5390779
5667 5390779 3432296 801307 -2524795 -6350994 -8888415 -8381253 -5961617 -4951088
5659 -4951088 -6942257 -9838849 -10070609 -5814803 2064107 11168878 18919900 23023203
5651 23023203 21543313 13974538 3164362 -5020790 -6170484 -1629468 3348616 5586899
5643 5586899 5923448 5349672 2739030 -1951495 -5186036 -3400767 2161372 6273157 4784412
5634 4784412 -2135058 -10529816 -15368636 -14224151 -9626196 -6741833 -7909413 -10613496
$$ packed form
5692D055672q071791l719037K309666K221905l833727o429011J98345R206122
5684d061856J0006597K364175m020882k456427L526420O257750L188880j615372
5676A3189285l213408j139553R98391M22140j568168k014881o68831J22436p36632
5667E390779j958483k630989l326102l826199k537421N07162K419636J010529
5659d951088j991169k896592k31760M255806P878910R104771P751022M103303
5651B3023203j479890p568775j0810176q185152j149694M541016M978084K238283
5643E586899L36549n73776k610642m690525l234541J785269N562139M111785j488745
5634D784412o919470q394758m838820J144485M597955K884363j167580k704083
$$ plain form
5626 -10613496 -11129053 -8422236 -4270815 -1714977 -3460381 -9092486 -13849627 -13505332
5618 -13505332 -10441876 -10606948 -14324326 -15820143 -13032772 -11013069 -12581390 -12866862
5610 -12866862 -8253952 -4081557 -6475746 -11777796 -11980558 -6777666 -1959785 1107404
5602 1107404 5381306 9261276 7362989 520210 -3622899 -1412669 2933172 5498426
5594 5498426 7018183 7143497 2305932 -7142409 -14433106 -15239256 -13460258 -13952073 -14576071
5585 -14576071 -10460254 -2536792 3173484 2996100 -1171046 -4641601 -3670781 1860919
5577 1860919 7667964 8601161 4019009 -2132681 -6471473 -8421354 -7714335 -4136515 -405821
5568 -405821 -558998 -4109701 -6320841 -5611963 -5719410 -8681389 -10979283 -9412706 -6099619
$$ packed form
5626a0613496n15557K706817M151421K555838j745404n632105m757141L44295
5618a3505332L063456j65072l717378j495817K787371K019703j568321k85472
5610a2866862M612910M172395k394189n302050k02762N202892M817881L067189
5602A107404M273902L879970j898287o842779m143109K210230M345841K565254
5594E498426J519757J25314m837565r448341p290697q06150J778998m91815o23998
5585a4576071M115817P923462N710276j77384m167146l470555R70820N531700
5577A860919N807045R33197m582152o151690m338792j949881P07019L577820L730694
5568d05821j53177l550703k211140P08878j07447k961979k297894J566577L313087
$$ plain form
5559 -6099619 -4733716 -6083663 -9473718 -13839876 -15009096 -7981142 4375029 10903080
5551 10903080 5340088 -5266222 -10394327 -9022065 -6810048 -5522270 -3025940 -617994
5543 -617994 -2351006 -8237931 -14609766 -20011860 -24693062 -25767923 -19682597 -9156493
5535 -9156493 -1509094 63757 -1624517 -3798154 -5727638 -5206169 281797 8005327
5527 8005327 11648691 9836638 7507898 7593579 7178427 3903871 381327 -861408 -1904046
5518 -1904046 -5219924 -8769404 -9096846 -6516184 -3658770 -946119 3100232 8173196
5510 8173196 11523896 10663907 5517804 -1174528 -4983213 -3133802 2216055 5766269
5502 5766269 5074406 2861986 2460512 3453788 3545227 2444551 1355201 -19920 -3106756
$$ packed form
5559f099619J365903j349947l390055m366158j169220P027954J2356171O528051
5551A0903080n562992j0606310n128105J372262K212017J287778K496330K407946
5543f17994j733012n886925o371835n402094m681202j074861O085326J0526104
5535i156493P647399J572851j688274k173637j929484N21469N487966P723530
5527H005327L643364j812053k328740Q5681m15152l274556l522544j242735j042638
5518a904046l315878l549480l27442K580662K857414K712651M046351N072964
5510H173196L350700q59989n146103o692332l808685J849411N349857L550214
5502E766269o91863k212420m01474R93276R1439j100676j089350j375121l086836
$$ plain form
5493 -3106756 -7138527 -8429732 -4007926 4712009 12680270 15872040 14895631 13276844
5485 13276844 12329676 9534428 3168465 -3409323 -4905433 -971059 3050621 2843148
5477 2843148 41780 -858663 1452280 4217736 5093717 5304180 7185261 9573496 8019367
5468 8019367 918235 -6473118 -7160882 -968734 5528771 7549896 6008053 2038437
5460 2038437 -6094661 -16833319 -21987526 -16158246 -5912729 -2378961 -6878260 -11458986
5452 -11458986 -12271292 -13428798 -16668156 -16457417 -9273140 -238817 4583807 6484033
5444 6484033 8886205 8932954 1647987 -9919933 -16035470 -12028253 -3236031 2863164
5436 2863164 5071046 7082822 10715342 13246883 10938652 3738730 -3987077 -7476981
$$ packed form
5493c106756m031771j291205M421806Q719935P968261L191770r76409j618787
5485A3276844r47168k795248o365963o577788j496110L934374M021680k07473
5477B843148k801368r00443K310943K765456Q75981K10463J881081K388235j554129
5468H019367p101132p391353o87764O192148O497505K021125j541843l969616
5460B038437q133098j0738658n154207N829280J0245517L533768m499299m580726
5452a1458986q12306j157506l239358K10739P184277R034323M822624J900226
5444F484033K402172M6749p284967j1567920o115537M007217Q792222O099195
5436B863164K207882K011776L632520K531541k308231p199922p725807l489904
$$ plain form
5428 -7476981 -6117655 -3335510 -2151954 -2278062 -2007758 -1096670 -203048 1346331 5068100
5419 5068100 10368392 13603006 11345689 4573413 -1474538 -2616028 -329355 574099
5411 574099 -1519464 -3645159 -3988499 -5114557 -8937584 -12189488 -11241022 -8772637 -10165558
5402 -10165558 -14468176 -14835345 -8224159 837593 7283686 11254910 15006697 18510763
5394 18510763 20466357 20334826 17523009 11574567 4525930 -37226 -1318223 -1511264
5386 -1511264 -1241312 1098984 4825220 6574328 5684204 5066285 5446887 4385496 2776935
5377 2776935 5628211 13019453 17002727 12356661 4465208 871194 605113 -1311680
5369 -1311680 -3646235 -1462405 4064755 6656653 4565409 1576480 -1246643 -7284798
$$ packed form
5428g476981J359326K782145J183556j26108K70304R11088Q93622J549379L721769
5419E068100N300292L234614k257317o772276o047951j141490K286673R03454
5411E74099k093563k125695l43340j126058l823027l251904R48466K468385j392921
5402a0165558m302618l67169O611186R061752O446093L971224L751787L504066
5394A8510763J955594j31531k811817n948442p048637m563156j280997j93041
5386a511264K69952K340296L726236J749108q90124o17919L80602j061391j608561
5377B776935K851276P391242L983274m646066p891453l594014k66081j916793
5369a311680k334555K183830N527160K591898k091244k988929k823123o038155
$$ plain form
5361 -7284798 -16701484 -23619213 -23329655 -17757782 -11774252 -7730019 -5353807 -4087789
5353 -4087789 -3794379 -4669210 -6798475 -8579728 -6716892 12635 8131004 12877764 12857185
5344 12857185 9213887 2758860 -4808345 -9351105 -8139431 -3528268 751371 4397359
5336 4397359 7559108 6674124 -465787 -8029121 -7901049 -1221759 2988910 535075 -3785650
5327 -3785650 -5046221 -3753560 -1155659 3756737 10089888 14186708 15514781 17697816
5319 17697816 21408589 22259495 18403906 14045176 12133724 9763412 4908191 1887416
5311 1887416 5090226 11908296 16771273 18117966 16939180 12962865 7479584 5653622
5303 5653622 9981038 14815047 13586074 8622761 7211834 10095554 11173764 7881284
$$ packed form
5361g284798r416686o917729K89558N571873N983530M044233K376212J266018
5353d087789K93410q74831k129265j781253J862836O729527Q118369M746760k0579
5344A2857185l643298o455027p567205m542760J211674M611163M279639L645988
5336D397359L161749q84984p139911p563334J28072O679290M210669k453835m320725
5327c785650j260571J292661K597901M912396O333151M096820J328073K183035
5319A7697816L710773Q50906l855589m358730j911452k370312m855221l020775
5311A887416L202810O818070M862977J346693j178786l976315n483281j825962
5303E653622M327416M834009j228973m963313j410927K883720J078210l292480
$$ plain form
5295 7881284 4468523 3972051 3622629 904535 -910247 3019410 12006375 20081143 22500216
5286 22500216 20329734 18599096 20132080 21448276 16398501 4663751 -6058083 -8896706
5278 -8896706 -6384705 -6239238 -10119855 -11731591 -6665120 651818 2270080 -3836131
5270 -3836131 -12171635 -16185942 -14296312 -9848883 -6512443 -4507068 -1741834 1993351
5262 1993351 4065341 3032923 1202144 1065247 1409349 75666 -1139932 1556188 7684661
5253 7684661 12534503 13978210 15058196 18391248 21900970 22437614 20453711 18218103
5245 18218103 15867271 12558273 9923432 10698752 14254805 16725644 16057843 14310987
5237 14310987 14038881 14537607 13017033 8050951 635936 -6898539 -11603728 -10670675 -3564230
$$ packed form
5295G881284l412761m96472l49422k718094j814782L929657Q986965Q074768K419073
5286B2500216k170482j730638J532984J316196n049775j1734750j0721834k838623
5278h896706K512001J45467l880617j611736N066471P316938J618262o106211
5270c836131q335504m014307J889630M447429L336440K005375K765234L735185
5262A993351K071990j032418j830779j36897L44102j333683j215598K696120O128473
5253G684661M849842J443707J079986L333052L509722N36644j983903k235608
5245A8218103k350832l308998k634841P75320L556053K470839o67801j746856
5237A4310987k72106M98726j520574m966082p415015p534475m705189R33053P106445
$$ plain form
5228 -3564230 6582617 15116469 19531157 20202556 18398037 15579735 14143096 15738311
5220 15738311 17999351 15980569 8718955 1713338 305309 2820712 3390090 -256296
5212 -256296 -5376767 -8982702 -9648706 -5549226 4026645 14718635 19876232 18900731 18055014
5203 18055014 20890556 22878375 18915786 11529720 6764442 5175212 2517721 -2138260
5195 -2138260 -4514809 -1519848 4801152 10519569 13803803 14875707 14655223 14377155 14790195
5186 14790195 15278218 14966757 14130254 12818488 9125534 1527573 -7388456 -12411274 -11390079
5177 -11390079 -7219647 -3869029 -2747486 -3527352 -6076316 -10070460 -14060722 -16283482
5169 -16283482 -16005825 -13777248 -11031286 -9441481 -9760850 -11210029 -12598692 -13531498 -13575259
$$ packed form
5228c564230J0146847Q533852M414688O71399j804519k818302j436639J595215
5220A5738311K261040k018782p261614p005617j408029K515403N69378l646386
5212b56296n120471l605935o66004M099480R575871J0691990N157597r75501q45717
5203A8055014K835542J987819l962589p386066m765278j589230k657491m655981
5195b138260k376549K994961O321000N718417L284234J071904k20484k78068M13040
5186A4790195M88023l11461q36503j311766l692954p597961q916029n022818J021195
5177a1390079M170432L350618J121543p79866k548964l994144l990262k222760
5169a6283482K77657K228577K745962J589805l19369j449179j388663r32806m3761
$$ plain form
5160 -13575259 -11188097 -5434464 1367192 4729042 2456544 -3097946 -7697962 -9213941
5152 -9213941 -8636011 -8029707 -8085616 -7399415 -3993311 2206485 8261920 9628890 3180238
5143 3180238 -9643898 -21564325 -23119773 -11024557 6756468 17417326 16011788 9168388
5135 9168388 5378725 5585023 5809817 4829220 4352891 3822195 495290 -5342125 -9646623
5126 -9646623 -9921879 -8055296 -7046329 -7465044 -7965162 -7416714 -6007970 -5493705 -8019736
5117 -8019736 -13330615 -18077222 -19685800 -19741570 -21397649 -24791322 -27574841 -28509656 -27513879
5108 -27513879 -23748278 -17537984 -13059330 -14510811 -19602556 -21150635 -15766050 -7312691
5100 -7312691 -1365976 19221 -2284915 -6075578 -7882641 -5465809 -1523233 -1176967
$$ packed form
5160a3575259K387162N753633O801656L361850k272498n554490m600016j515979
5152i213941N77930O06304n5909O86201L406104O199796O055435J366970o448652
5143C180238j2824136j1920427j555448J2095216J7781025J0660858j405538o843400
5135I168388l789663K06298K24794r80597m76329n30696l326905n837415m304498
5126i646623k75256J866583J008967m18715n00118N48448J408744N14265k526031
5117h019736n310879m746607j608578n5770j656079l393673k783519r34815R95777
5108b7513879L765601O210294M478654j451481n091745j548079N384585Q453359
5100g312691N946715J385197k304136l790663j807063K416832L942576L46266
$$ plain form
5092 -1176967 -4523136 -5570062 -185930 8662275 15372062 17624340 15797021 10456332
5084 10456332 3593441 -555305 641091 4889036 7518656 5994826 1051998 -4280310
5076 -4280310 -6067143 -3166157 -633276 -5489143 -17238878 -26777154 -27285829 -21966115
5068 -21966115 -17657201 -15237599 -11202644 -5410909 -1509252 -1047834 -1991653 -2303829 -1150142
5059 -1150142 2228705 6893384 8821260 5522316 1001280 1427274 6391474 9390353
5051 9390353 7131010 3299356 2005811 2284615 1205399 -1481339 -4464800 -7786173
5043 -7786173 -11935923 -15818260 -17763705 -17433152 -15488243 -12768864 -10661272 -10411575 -11010931
5034 -11010931 -9821888 -6674347 -5170059 -7982573 -12779113 -15288246 -15057691 -15302738
$$ packed form
5092a176967l346169j046926N384132Q848205O709787K252278j827319n340689
5084A0456332o862891m148746J196396M247945K629620j523830m942828n332308
5076d280310j786833K900986K532881m855867j1749735r538276n08675N319714
5068b1966115M308914K419602M034955N791735L901657M61418r43819l12176J153687
5059a150142L378847M664679J927876l298944m521036M25994M964200K998879
5051I390353k259343l831654j293545K78804j079216k686738k983461l321373
5043g786173m149750l882337j945445L30553J944909K719379K107592K49697n99356
5034a1010931J189043L147541J504288k812514m796540k509133K30555k45047
$$ plain form
5026 -15302738 -17562374 -19392390 -17768850 -12440880 -5128472 2569655 9215385 13067340
5018 13067340 13366825 11641072 10531934 11441946 13739607 15429586 13919380 7518046
5010 7518046 -2079938 -9615915 -10688701 -6205374 -591888 3926113 8548706 13402375
5002 13402375 15455099 12717640 7754704 4619804 4159597 4484882 4300618 3553974 2477554
4993 2477554 2218610 4650382 9291934 12524908 12507029 12394509 15290741 18584654 17779128
4984 17779128 13816752 11243930 10479296 8012319 4007954 3185399 6894089 10313777
4976 10313777 9734533 7429195 6729495 6951149 6221781 5404142 5984269 6962875 6505229
4967 6505229 4394208 1247835 -2094328 -3485851 -1128682 2858638 4431104 3930428
$$ packed form
5026a5302738k259636j830016J623540N327970P312408P698127O645730L851955
5018A3067340K99485j725753j109138R10012K297661J689979j510206o401334
5010G518046r597984p535977j072786M483327N613486M518001M622593M853669
5002A3402375K052724k737459m962936l134900m60207L25285j84264p46644j076420
4993B477554k58944K431772M641552L232974j7879j12520K896232L293913q05526
4984A7779128l962376k572822p64634k466977m004365q22555L708690L419688
4976A0313777n79244k305338o99700K21654p29368q17639N80127R78606m57646
4967F505229k111021l146373l342163j391523K357169L987320J572466n00676
$$ plain form
4959 3930428 5757791 10795140 14706185 15413288 15955885 17196953 14472142 5821067 -2714895
4950 -2714895 -5418903 -5037916 -6615280 -8229607 -4983629 1480065 5009069 4367815 3537865
4941 3537865 3728746 1804998 -3278428 -8197902 -10168055 -9736946 -7950400 -4237197 1864058
4932 1864058 8768134 13055099 11475307 4436836 -2354727 -2786289 2761917 9284819
4924 9284819 15587540 24374665 33115774 33757739 25523110 19031066 21288435 24803054
4916 24803054 19822288 10186525 7029819 11730926 15439878 12690275 6267674 445501
4908 445501 -2787699 -2628991 -1000431 -2331551 -6496061 -7053521 -2276440 -444091 -6210432
4899 -6210432 -10318193 -3643415 6712076 8155008 2065669 -1638965 -2577522 -6602626
$$ packed form
4959C930428J827363N037349L911045P07103N42597J241068k724811q651075q535962
4950b714895k704008L80987j577364j614327L245978O463694L529004o41254q29950
4941C537865J90881j923748n083426m919474j970153M31109J786546L713203O101255
4932A864058O904076M286965j579792p038471o791563m31562N548206O522902
4924I284819O302721Q787125Q741109O41965q234629o492044K257369L514619
4916B4803054m980766r635763l156706M701107L708952k749603o422601n822173
4908D45501l233200J58708J628560j331120m164510n57460M777081J832349n766341
4899f210432m107761O674778J0355491J442932o089339l704634r38557m025104
$$ plain form
4891 -6602626 -9998652 -4208705 7304336 13615372 14123950 15283045 14780954 7508228
4883 7508228 1354990 6044587 12788522 9038877 5272214 17224467 30326454 20890326
4875 20890326 5744296 16949980 21890541 -63264883 -245851873 -402663728 -410728272
4868 -410728272 -293919103 -179194082 -135405533 -124644150 -100022822 -72853719 -65994690
4861 -65994690 -65055038 -49865446 -32505762 -31539098 -38163582 -36438349 -33083735 -40500966
4853 -40500966 -49758609 -45977161 -35315338 -33087435 -37271806 -35692613 -29597912 -29406992
4845 -29406992 -34422047 -35647050 -33175917 -33791819 -35843507 -32114695 -24281886 -20566812
4837 -20566812 -21815244 -22042701 -19649497 -16916721 -12118170 -3319902 3672130 2397910
$$ packed form
4891f602626l396026N789947J1513041O311036N08578J159095n02091p272726
4883G508228o153238M689597O743935l749645l766663J1952253J3101987r436128
4875B0890326j5146030J1205684M940561q5155424j82586990j56811855q064544
4868d10728272J16809169J14725021M3788549J0761383K4621328K7169103O859029
4861f5994690R39652J5189592J7359684R66664o624484J725233L354614p417231
4853d0500966r257643L781448J0661823K227903m184371J579193O094701J90920
4845b9406992n015055j225003K471133o15902k051688L728812P832809L715074
4837b0566812j248432k27457K393204K732776M798551Q798268O992032j274220
$$ plain form
4829 2397910 -2523007 -1790839 3491792 4351182 -880804 -5345206 -6299169 -7786209 -10690157
4820 -10690157 -10641764 -7284980 -6689398 -12197994 -19422126 -21992394 -17482162 -7616968 2875673
4811 2875673 8622097 9109797 9746449 13171410 13380282 4418750 -9295352 -18939838 -23970568
4802 -23970568 -29982380 -36397566 -36290797 -28398374 -20103891 -17027127 -17175642 -16890216 -15834236
4793 -15834236 -14459165 -12332789 -10366917 -9822807 -8770585 -4600834 166501 231565 -4345927
4784 -4345927 -8089584 -8315563 -7686191 -8367627 -9378275 -10133560 -11118375 -10878736 -7955188
4775 -7955188 -5691916 -8961414 -15967826 -19742371 -18080980 -15135736 -12655370 -7493623
4767 -7493623 386669 5354473 4665268 2453897 1693631 -830051 -7206273 -12826275 -13668059
$$ packed form
4829B397910m920917P32168N282631Q59390n231986m464402r53963j487040k903948
4820a0690157M8393L356784N95582n508596p224132k570268M510232R865194J0492641
4811B875673N746424M87700O36652L424961K08872q961532j3714102r644486n030730
4802b3970568o011812o415186J06769P892423Q294483L076764j48515K85426J055980
4793a5834236J375071K126376J965872N44110J052222M169751M767335O5064m577492
4784d345927l743657k25979O29372o81436j010648p55285r84815K39639K923548
4775g955188K263272l269498p006412l774545J661391K945244K480366N161747
4767g493623P880292M967804o89205k211371p60266k523682o376222n620002q41784
$$ plain form
4758 -13668059 -13357599 -16477131 -19405144 -15288019 -5709876 -14067 -3142279 -10126078
4750 -10126078 -13562220 -11643123 -6937680 -1162563 5394360 10576817 10020777 1837328
4742 1837328 -9612124 -17117469 -18327329 -17722234 -19569029 -21696028 -19180849 -12007307
4734 -12007307 -5076166 -1737847 -1353046 -2513390 -4284199 -4425183 -970818 3793952
4726 3793952 5033680 1743286 -2369388 -4733197 -6345505 -7665466 -6713746 -2882999
4718 -2882999 1188760 3006584 2197181 -1346918 -7145248 -11474935 -10025598 -4447762
4710 -4447762 -1263167 -2736389 -4012159 -1094299 3949297 8080398 11662653 14648674
4702 14648674 14416946 11342473 10555330 13370319 12962823 4674532 -4960505 -7226403 -5021295
$$ packed form
4758a3668059L10460l119532k928013M117125R578143N695809l128212o983799
4750a0126078l436142J919097M705443N775117O556923N182457n56040q183449
4742A837328j1449452p505345j209860O05095j846795k126999K515179P173542
4734a2007307O931141L338319L84801j160344j770809j40984L454365M764770
4726C793952J239728l290394m112674k363809j612308j319961R51720L830747
4718b882999M071759J817824q09403l544099n798330m329687J449337N577836
4710d447762L184595j473222j275770K917860N043596M131101L582255K986021
4702A4648674k31728l074473p87143K814989m07496q288291r635037k265898K205108
$$ plain form
4693 -5021295 -8508360 -18821060 -25575984 -21673468 -12439080 -7028537 -6863943 -6702342
4685 -6702342 -3508791 -160912 -1401236 -8427890 -17341610 -22283506 -20376538 -13454012
4677 -13454012 -5001581 2888780 8668204 10009169 5944860 -984452 -7034014 -10733875
4669 -10733875 -12486516 -12509558 -11237874 -9845455 -8099345 -3818916 2984493 7785906
4661 7785906 6438434 279030 -6633276 -12766209 -18053681 -20598597 -19226123 -17005867
4653 -17005867 -17055897 -16947948 -13102859 -8749683 -10203838 -15793067 -16594561 -9717410 -3200481
4644 -3200481 -4576318 -11217894 -16097211 -17300382 -16807095 -14570437 -9831305 -5556349
4636 -5556349 -5747132 -9374632 -11650976 -10800735 -9548978 -10067319 -11194791 -11304162 -11018204
$$ packed form
4693e021295l487065j0312700o754924L902516R234388N410543J64594J61601
4685f702342L193551L347879j240324p026654q913720m941896J906968O922526
4677a3454012Q452431P890361N779424J340965m064309o929312o049562l699861
4669a0733875j752641k3042J271684J392419J746110M280429O803409M801413
4661G785906j347472o159404o912306o132933n287472k544916J372474K220256
4653a7005867n0030J07949L845089M353176j454155n589229q01494O877151O516929
4644c200481j375837o641576m879317j203171M93287K236658M739132M274956
4636e556349j90783l627500k276344Q50241J251757n18341j127472j09371K85958
$$ plain form
4627 -11018204 -11946046 -14379522 -17019327 -18059146 -16321915 -12054914 -6671540 -1492098
4619 -1492098 2765833 5298351 5415729 3951776 2887893 2636997 1323006 -1920695 -4543590
4610 -4543590 -3419126 816115 4213066 3979249 918833 -2440478 -4643579 -5816555
4602 -5816555 -6309152 -5681872 -3453860 -835510 -700039 -4560811 -10017821 -12887908 -11881217
4593 -11881217 -9379636 -7448917 -5391618 -2187369 830651 1496863 -108309 -1432927
4585 -1432927 289474 5853173 12815833 16257809 12894641 5112910 -1251822 -3808074
4577 -3808074 -5430698 -7979340 -7828830 -781820 10908291 19913233 21180025 15475308
4569 15475308 7202053 1448075 1568858 6372968 10585467 10792800 9449510 10068661 10867892
$$ packed form
4627a1018204r27842k433476k639805j039819J737231M267001N383374N179442
4619a492098M257931K532518J17378j463953j063883k50896j313991l243701k622895
4610d543590J124464M235241L396951k33817l060416l359311k203101j172976
4602e816555m92597O27280K228012K618350J35471l860772n457010k870087J006691
4593a1881217K501581J930719K057299L204249L018020O66212j605172j324618
4585a432927J722401N563699O962660L441976l363168p781731o364732k556252
4577c808074j622624k548642J50510P047010J1690111R004942J266792n704717
4569A5475308q273255n753978J20783M804110M212499K07333j343290O19151P99231
$$ plain form
4560 10867892 7946404 3138162 2583167 7252803 10985055 9630698 6652230 7033740
4552 7033740 10490796 13917756 16213699 16900374 13788396 6528986 -266487 -1960126
4544 -1960126 9381 985417 -39541 -866010 -1499307 -3805090 -6452659 -5521344 -626918
4535 -626918 4075342 5677629 5198445 3952602 1677421 -691573 -875086 472857 -376667
4526 -376667 -4082118 -6277789 -4511233 -3012283 -6800707 -14151903 -18879838 -17852179
4518 -17852179 -12581173 -5501987 1340223 5481516 5996351 5472330 6674585 8260839
4510 8260839 7095585 3462894 199118 -2012251 -3994764 -3676405 2321774 12265478
4502 12265478 19539693 20622527 18481916 16785305 15449496 13982120 14406494 17305487
$$ packed form
4560A0867892k921488m808242n54995M669636L732252j354357k978468L81510
4552G033740L457056L426960K295943O86675l111978p259410o795473j693639
4544a960126J969507R76036j024958q26469o33297k305783k647569R31315M894426
4535f26918M702260J602287m79184j245843k275181k368994j83513J347943q49524
4526c76667l705451k195671J766556J498950l788424p351196m727935J027659
4518a7852179N271006P079186O842210M141293N14835n24021J202255J586254
4510H260839j165254l632691l263776k211369j982513L18359N998179R943704
4502A2265478P274215J082834k140611j696611j335809j467376M24374K898993
$$ plain form
4494 17305487 18447685 13286366 2838149 -7844058 -15044855 -17693707 -15934786 -11865472
4486 -11865472 -9694214 -11242368 -12357228 -7623787 1641850 7643787 4952132 -3455000
4478 -3455000 -9759023 -9220599 -4007969 -238737 -1552655 -5417793 -6455159 -3225149
4470 -3225149 493131 1759011 2501673 5334567 8688014 9842366 10274663 13215822 17211124
4461 17211124 17311032 12621724 7652958 5336847 3520636 -14766 -3685442 -5755338
4453 -5755338 -7716382 -10677168 -11788832 -8409456 -3535919 -2512588 -5270759 -6287779
4445 -6287779 -2517427 2613359 4311075 2238002 -602378 -2265600 -2915730 -3342677 -4899799
4436 -4899799 -9413824 -16055173 -19211923 -13654351 -2653848 3274451 -1685105 -11478155
$$ packed form
4494A7305487J142198n161319j0448217j0682207p200797k648852J758921M069314
4486a1865472K171258j548154j114860M733441R265637O001937k691655q407132
4478c455000o304023N38424N212630L769232j313918l865138j037366L230010
4470c225149L718280J265880P42662K832894L353447J154352M32297K941159L995302
4461A7211124R9908m689308m968766k316111j816211l535402l670676k069896
4453e755338j961044k960786j111664L379376M873537J023331k758171j017020
4445f287779L770352N130786J697716k073073k840380j663222o50130m26947j557122
4436d899799m514025o641349l156750N557572J1000503N928299m959556r793050
$$ plain form
4428 -11478155 -16647297 -16721963 -18317637 -22439891 -21546055 -11580762 -29347 3219209
4420 3219209 -1303828 -4838658 -2896343 647637 1274020 -463361 -2338901 -4791004
4412 -4791004 -9123479 -14065109 -16787757 -16387032 -14656807 -13544995 -12635127 -9685139 -4128298
4403 -4128298 723893 999441 -2330207 -4505341 -4179003 -5350508 -9923328 -13185319 -10893589
4394 -10893589 -6456463 -5347717 -6016161 -3375609 1204058 1463272 -3167469 -6756575
4386 -6756575 -6727338 -6279067 -6264898 -3588861 323236 -1123101 -8108159 -11308444 -5765183
4377 -5765183 657831 -430326 -4678851 -2305960 7120982 16074965 20991510 23733502
4369 23733502 23902380 18796954 10331704 4439075 3672823 6139736 10274085 14493455
$$ packed form
4428a1478155n169142p4666j595674m122254Q93836R965293J1551415L248556
4420C219209m523037l534830J942315L543980O26383j737381j875540k452103
4412d791004m332475m941630k722648M00725J730225J111812R09868K949988N556841
4403d128298M852191K75548l329648k175134L26338j171505m572820l261991K291730
4394a0893589M437126J108746o68444K640552M579667K59214m630741l589106
4386f756575K9237M48271J4169K676037L912097j446337o985058l200285N543261
4377e765183O423014j088157m248525K372891R426942Q953983M916545K741992
4369B3733502J68878n105426q465250n892629p66252K466913M134349M219370
$$ plain form
4361 14493455 14157430 6279676 -3786323 -7740299 -5748092 -5105653 -8283809 -10768909
4353 -10768909 -11149298 -14070089 -20489539 -23234698 -16516736 -3984023 6281973 9966362
4345 9966362 7403510 1617259 -2267369 -1117567 724638 -3944866 -13322832 -16873407
4337 -16873407 -10667251 -4207553 -6572381 -13389112 -14865814 -10566972 -7571037 -8004550
4329 -8004550 -7372998 -3531166 645186 3087288 4459809 4462249 1885578 -1842562 -4126737
4320 -4126737 -5437769 -7027053 -5705457 2795335 15345355 22752831 20881481 14998409
4312 14998409 11565026 10965840 10511495 9596841 8385313 4900714 -2518706 -11158884 -15293638
4303 -15293638 -11773841 -3316079 3742916 5264688 3499264 4524381 10543000 16560416
$$ packed form
4361A4493455l36025p877754j0065999l953976J992207O42439l178156k485100
4353a0768909l80389k920791o419450k745159O717962J2532713J0265996L684389
4345I966362k562852n786251l884628J149802J842205m669504r377966l550575
4337a6873407O206156O459698k364828o816731j476702M298842K995935m33513
4329h004550O31552L841832M176352K442102J372521K440k576671l728140k284175
4320d126737j311032j589284J321596Q500792J2550020P407476j871350n883072
4312A4998409l433383n99186m54345r14654j211528l484599p419420q640178m134754
4303a5293638L519797Q457762P058995J521772j765424J025117O018619O017416
$$ plain form
4295 16560416 16567264 10661176 3084172 -4112524 -10773901 -13976095 -9895960 -645390 6431079
4286 6431079 7681397 6651160 7424995 9450930 10947384 12568908 14774422 15592295 14138851
4277 14138851 12986567 13984091 14776060 12559363 8554711 5673899 4263643 3267983 3285769
4268 3285769 5237216 7956287 10219442 13266629 18010039 21407569 19367578 12713504
4260 12713504 7180156 7455199 13130107 20060024 24144874 24454016 23686590 24511191 25388072
4251 25388072 22841332 18346698 18268501 24381910 29378444 26398731 19030816 15985609
4243 15985609 18717720 21043261 19458241 16518830 13908602 9437780 2721979 -2559573
4235 -2559573 -4855369 -7685172 -12937341 -15966558 -11789583 -2976173 3129221 3284292
$$ packed form
4295A6560416O848n906088p577004p196696o661377l202194M080135R250570P076469
4286F431079J250318j030237P73835K025935J496454J621524K205514Q17873j453444
4277A4138851j152284R97524P91969k216697m004652k880812j410256r95660J7786
4268C285769J951447K719071K263155L047187M743410L397530k039991o654074
4260A2713504n533348K75043N674908O929917M084850L09142p67426Q24601Q76881
4251B5388072k546740m494634p8197O113409M996534k979713p367915l045207
4243A5985609K732111K325541j585020k939411k610228m470822o715801n281552
4235b559573k295796k829803n252169l029217M176975Q813410O105394J55071
$$ plain form
4227 3284292 556558 -1250725 -1640256 -1745205 -1440397 695572 5435035 11512250 16315944
4218 16315944 18283856 18202758 17385091 15610019 12726248 11122134 13152250 16006162 13213638
4209 13213638 3159201 -7125723 -9429549 -3583996 3437220 6069206 4748083 2511081
4201 2511081 289591 -2886956 -6474865 -7466869 -3844216 2029301 5508335 5489432 5816713
4192 5816713 9622080 14901723 18110802 19482877 21087311 21753944 18759233 13572626
4184 13572626 10850468 11854450 13785287 15653913 19381651 24399191 26883256 26065223
4176 26065223 26173064 30210997 36419142 42182089 46269654 46065376 38821031 27754064
4168 27754064 20657812 20064949 21049502 20679188 21853648 24962451 24715758 19812960 16838510
$$ packed form
4227C284292k727734j807283l89531j04949L04808K135969M739463O077215M803694
4218A6315944J967912q1098q17667j775072k883771j604114K030116K853912k792524
4209A3213638j0054437j0284924k303826N845553P021216K631986j321123k237002
4201B511081k221490l176547l587909r92004L622653N873517L479034j8903L27281
4192E816713L805367N279643L209079J372075J604434O66633k994711n186607
4184A3572626k722158J003982J930837J868626L727738N017540K484065q18033
4176B6065223J07841M037933O208145N762947M087565k04278p244345j1066967
4168B7754064p096252n92863R84553l70314J174460L108803k46693m902798k974450
$$ plain form
4159 16838510 19118348 20893622 18734599 18700533 24563564 29568849 29101429 30304941 38079406
4150 38079406 43523285 39736506 36385865 42251724 47299497 42584816 40981328 46673287
4142 46673287 18181765 -90949210 -249460695 -353788091 -339092258 -249799550 -173834938
4135 -173834938 -140030458 -116363376 -82845705 -56884930 -51444548 -52042066 -44681843 -35888475
4127 -35888475 -33905057 -33174931 -28082310 -23657499 -23389430 -22193353 -19276742 -22883622
4119 -22883622 -34398336 -41932609 -37877755 -29720915 -25391564 -20939258 -11979704 -5097189
4111 -5097189 -7007506 -12253312 -12426063 -9462176 -9701954 -12234921 -13185051 -14759843 -19717149
4102 -19717149 -22612377 -17063814 -7415545 -3273581 -5907345 -9350605 -11734597 -15862765
$$ packed form
4159A6838510K279838J775274k159023l4066N863031N005285m67420J203512P774465
4150C8079406N443879l786779l350641N865859N047773m714681j603488N691959
4142D6673287k8491522j09130975j58511485j04327396J4695833Q9292708P5964612
4135a73834938L3804480K3667082L3517671K5960775N440382n97518P360223Q793368
4127c5888475J983418P30126N092621M424811K68069J196077K916611l606880
4119b2883622j1514714p534273M054854Q156840M329351M452306Q959554O882515
4111e097189j910317n245806j72751K963887k39778k532967r50130j574792m957306
4102a9717149k895228N548563R648269M141964k633764l443260k383992m128168
$$ plain form
4094 -15862765 -20558684 -20846537 -16231013 -10945329 -6504918 -1265593 3177249 2462329
4086 2462329 -3292272 -9025337 -12092767 -14620739 -18020631 -20204280 -19159195 -15513169
4078 -15513169 -11300307 -9201269 -11980625 -19076234 -24978352 -24909174 -20953524 -18694542
4070 -18694542 -19246986 -19006192 -16109475 -12429100 -9540143 -6961983 -4527654 -3252534
4062 -3252534 -3917084 -6891571 -12018411 -16716130 -16961497 -12940556 -10258404 -11851891 -12694060
4053 -12694060 -7479067 441375 4114754 3639028 4462035 7371411 8034252 5269344 1750003
4044 1750003 -3168943 -13033962 -25777581 -33499177 -32862299 -29058239 -27347367 -26929447
4036 -26929447 -25425924 -23352879 -21396682 -18534302 -15425832 -14823673 -16404878 -16027384
$$ packed form
4094a5862765m695919k87853M615524N285684M440411N239325M442842p14920
4086B462329n754601n733065l067430k527972l399892k183649J045085L646026
4078a5513169M212862K099038k779356p095609n902118O9178L955650K258982
4070a8694542n52444K40794K896717L680375K888957K578160K434329J275120
4062c252534o64550k974487n126840m697719k45367M020941K682152j593487q42169
4053a2694060N214993P920442L673379m75726Q23007K909376O62841k764908l519341
4044A750003m918946r865019j2743619p721596O36878L804060J710872M17920
4036b6929447J503523K073045J956197K862380L108470O02159j581205L77494
$$ plain form
4028 -16027384 -12115809 -7762077 -4548758 140944 7049502 11897366 11868773 10576139
4020 10576139 12900076 18632482 24169244 26739944 24522663 16940238 7678125 3126814
4012 3126814 4961351 8442451 10340935 13053737 17604474 18808898 12745013 4005015
4004 4005015 -598362 -1721685 -4639229 -9756471 -12697728 -12355377 -12541112 -15679460 -19797404
3995 -19797404 -22157815 -22274565 -21164818 -20140358 -19828509 -18650487 -14005334 -6767835
3987 -6767835 -1785264 -1350688 -1464048 2084549 7330502 9933804 10090183 10770509 11703599
3978 11703599 10296939 6623270 2725992 -905343 -3400186 -962872 7593236 15140873
3970 15140873 13328938 4406165 -1286637 569139 4084046 3718226 1267462 49761
$$ packed form
4028a6027384L911575M353732L213319M689702O908558M847864k8593j292634
4020A0576139K323937N732406N536762K570700k217281p582425r262113m551311
4012C126814J834537L481100J898484K712802M550737J204424o063885q739998
4004D005015m603377j123323k917544n117242k941257L42351j85735l138348m117944
3995a9797404k360411j16750J109747J024460L11849J178022M645153P237499
3987f767835M982571M34576j13360L548597N245953K603302J56379O80326R33090
3978A1703599j406660l673669l897278l631335k494843K437314Q556108P547637
3970A5140873j811935q922773n692802J855776L514907l65820k450764j217701
$$ plain form
3962 49761 -860411 -3141071 -5581146 -7400679 -10314551 -13856788 -13397748 -6993522 -375116
3953 -375116 -500206 -6524861 -11248890 -10013806 -4867584 -1015771 -1767364 -6121158 -9489860
3944 -9489860 -7780856 -1967702 2689982 2610287 -915389 -4856976 -7708104 -8569414 -6549340
3935 -6549340 -3170573 -2201708 -4649944 -6858960 -6178972 -5374341 -7998770 -12226158 -13560981
3926 -13560981 -11826821 -10804925 -11583305 -10736615 -5618253 2145949 9367478 14595680
3918 14595680 17644703 18308403 17037840 15274502 13672488 10907229 5456147 -1763966
3910 -1763966 -7430121 -8849213 -6895536 -5352848 -6516852 -7786150 -4237676 4939037
3902 4939037 14306761 17637088 14174210 8252927 4111894 2731089 2562402 1249975
$$ packed form
3962D9761r10172k280660k440075j819533k913872l542237M59040O404226O618406
3953c75116j25090o024655m724029J235084N146222L851813p51593m353794l368702
3944i489860J709004N813154M657684p9695l525676l941587k851128q61310K020074
3935f549340L378767R68865k448236k209016O79988Q04631k624429m227388j334823
3926a3560981J734160J021896p78380Q46690N118362P764202P221529N228202
3918A4595680L049023O63700j270563j763338j602014k765259n451082p220113
3910a763966n666155j419092J953677J542688j164004j269298L548474R176713
3902D939037R367724L330327l462878n921283m141033j380805j68687j312427
$$ plain form
3894 1249975 -2832140 -8857790 -13693122 -15358588 -15674567 -17430840 -19589534 -18221216
3886 -18221216 -12567075 -7019026 -5346605 -5489366 -2944654 1963361 3700804 -1098477
3878 -1098477 -8889819 -13647801 -13903821 -12709762 -11808061 -9487922 -4922641 -1240290 -1869334
3869 -1869334 -5726915 -8642674 -8553547 -6814095 -4982252 -2994560 -770951 543740 -338616
3860 -338616 -3595512 -8006922 -10940028 -9594877 -4000958 2197415 5895534 8032840
3852 8032840 10331130 10603043 5882717 -753394 -2267718 2565537 7047612 6176374 2983231
3843 2983231 2300123 3370130 2859077 948563 -398211 -1813756 -4077293 -4223796 269478
3834 269478 5524877 5471978 921593 -1369791 1798602 7215242 11668653 14952607 15700733
$$ packed form
3894A249975m082115o025650m835332j665466l15979j756273k158694J368318
3886a8221216N654141N548049J672421j42761K544712M908015J737443m799281
3878a098477p791342m757982k56020J194059R01701K320139M565281L682351o29044
3869a869334l857581k915759Q9127J739452J831843J987692K223609J314691q82356
3860c38616l256896m411410k933106J345151N593919O198373L698119K137306
3852H032840K298290K71913m720326o636111j514324M833255M482075q71238l193143
3843B983231o83108J070007n11053j910514j346774j415545k263537j46503M493274
3834B69478N255399n2899m550385k291384L168393N416640M453411L283954P48126
$$ plain form
3825 15700733 10897091 2217505 -2761127 527046 7450594 10264611 6793135 -315292
3817 -315292 -9079986 -18048631 -23336662 -21805204 -17039754 -16875586 -23341994 -28985572 -25840708
3808 -25840708 -15619182 -7727705 -7869601 -11876126 -11923176 -6274418 -130196 2157933
3800 2157933 2111301 3314386 5619671 5651682 1515778 -5333133 -11857745 -15110203 -13552503
3791 -13552503 -9119295 -6727730 -9191082 -13867541 -16860170 -18425718 -20439598 -20637257
3783 -20637257 -14910374 -4747964 3332690 6073178 5481985 2190340 -6042795 -16826268
3775 -16826268 -21451422 -15539815 -6000220 -2219278 -4651194 -7231646 -6938182 -5129811
3767 -5129811 -2780982 -566167 -1132789 -5193065 -7609516 -3734392 2342855 2896331 -1420009
$$ packed form
3825A5700733m803642q679586m978632L288173O923548K814017l471476p108427
3817c15292q764694q968645n288031J531458M765450J64168o466408n643578L144864
3808b5840708J0221526P891477j41896m006525m7050N648758O144222K288129
3800B157933m6632J203085K305285L2011m135904o848911o524612l252458J557700
3791a3552503M433208K391565k463352m676459k992629j565548k013880j97659
3783b0637257N726883J0162410Q080654K740488n91193l291645q233135j0783473
3775a6826268m625154N911607R539595L780942k431916k580452K93464J808371
3767e129811K348829K214815n66622m060276k416451L875124O077247N53476m316340
$$ plain form
3758 -1420009 -2447938 2527116 6702060 4395617 -1481765 -5525840 -7279188 -9039186
3750 -9039186 -11092729 -12646590 -13828864 -14188441 -12758895 -11318028 -13159003 -16823286
3742 -16823286 -16318866 -10130943 -4389859 -3718949 -4904365 -4153369 -4369436 -8619651 -11495414
3733 -11495414 -5267121 7948798 18033868 19667559 16276669 12246232 8532688 6008543
3725 6008543 6048298 6931274 6015913 5946617 11495025 19040917 17474495 3144257 -13462554
3716 -13462554 -20902615 -20311506 -19839583 -21123266 -19140158 -12698010 -7090270 -6393688 -9285499
3707 -9285499 -13031568 -16299198 -16960298 -11992267 -1842774 8202016 12908523 11334710
3699 11334710 5437223 -2785870 -11311775 -17675438 -20684340 -21513610 -21788603 -21492392 -19697478
$$ packed form
3758a420009j027929M975054M174944k306443n877382m044075j753348j759998
3750i039186k053543j553861j182274l59577J429546J440867j840975l664283
3742a6823286N04420O187923N741084O70910j185416P50996k16067m250215k875763
3733a1495414O228293J3215919J0085070J633691l390890m030437l713544k524145
3725F008543L9755Q82976r15361o9296N548408P545892j566422j4330238j6606811
3716a3462554p440061N91109M71923j283683J983108O442148N607740O96582k891811
3707i285499l746069l267630o61100M968031J0149493J0044790M706507j573813
3699A1334710n897487q223093q525905o363663l008902q29270k74993K96211J794914
$$ plain form
3690 -19697478 -16361275 -12443636 -9025493 -7001557 -6733141 -7207939 -6398925 -3472783 -198450
3681 -198450 725322 -1349518 -4158537 -4452414 -558996 6446033 13442427 17198604 16212377
3672 16212377 11188703 4137013 -2685612 -7143046 -7451777 -3168171 3537582 8238481
3664 8238481 7381372 2053197 -1999801 489334 8811075 16729022 18755799 15382786
3656 15382786 11848197 12348957 15887120 17732021 15064199 10906025 11017562 16216629
3648 16216629 20191275 17620842 12406358 13038151 19979359 23479679 16372042 3982498
3640 3982498 -2839596 -774889 4879360 9359217 12463912 14098717 11938581 5294226
3632 5294226 -2614999 -7950974 -9333620 -7253969 -3483986 -1444274 -3640252 -7771856
$$ packed form
3690a9697478L336203L917639L418143K023936K68416m74798Q09014K926142L274333
3681a98450R23772k074840k809019k93877L893418P005029O996394L756177r86227
3672A6212377n023674p051690o822625m457434l08731M283606O705753M700899
3664H238481q57109n328175m052998K489135Q321741P917947K026777l373013
3656A5382786l534589N00760L538163J844901k667822m158174J11537N199067
3648A6216629L974646k570433n214484O31793O941208L500320p107637j2389544
3640C982498o822094K064707N654249M479857L104695J634805k160136o644355
3632E294226p909225n335975j382646K079651L769983K039712k195978m131604
$$ plain form
3624 -7771856 -8668871 -5127256 -1472054 -1129414 -2322396 -2074193 -948873 -1042973 -1943513
3615 -1943513 -1655255 107954 1790894 1688246 -1542420 -7662052 -12677685 -11145612 -3140347
3606 -3140347 4305707 5999652 5734847 10428066 19657443 26237223 25939920 21251363 15673252
3597 15673252 9798168 4178860 1102040 1125130 1421062 -167026 -2470243 -4510195 -8297158
3588 -8297158 -14744376 -19229475 -15723000 -5172093 4065151 5568158 2182290 1924690
3580 1924690 7819996 14502754 15457955 11180713 7815638 8921395 12058605 14070621
3572 14070621 15871959 19270820 21865908 19258353 11480092 3373847 -1509959 -3996012
3564 -3996012 -5907627 -7140933 -7313233 -7259813 -7175449 -5667104 -2336299 809081 2140482
$$ packed form
3624g771856q97015L541615L655202L42640j192982K48203J125320r4100r00540
3615a943513K88258J763209J682940j02648l230666o119632n015633J532073Q005265
3606c140347P446054J693945k64805M693219R229377O579780k97303m688557n578111
3597A5673252n875084n619308l076820K3090K95932j588088k303217k039952l786963
3588h297158o447218m485099L506475J0550907R237244J503007l385868k57600
3580A924690N895306O682758R55201m277242l365075J105757L137210K012016
3572A4070621J801338L398861K595088k607555p778261q106245m883806k486053
3564c996012j911615j233306j72300N3420Q4364J508345L330805L145380J331401
$$ plain form
3555 2140482 2549858 3135504 2904345 846384 -1693985 -3124992 -4292841 -6276570 -7083471
3546 -7083471 -4066232 1072101 3528618 2046982 693243 2715250 5975557 6885138
3538 6885138 6313016 8086912 12448066 14529620 10345457 2058115 -4266746 -5109310 -2450760
3529 -2450760 -972119 -3574705 -9417762 -15091093 -17308442 -15173685 -10430013 -5682986
3521 -5682986 -2721763 -2564850 -5788152 -11266426 -15245397 -13933743 -7615244 -522140
3513 -522140 3950483 6099041 7396767 7793789 7440725 8651831 12896851 17022815 16017479
3504 16017479 9516698 2443888 -1220853 -2240577 -2790419 -2502394 -5818 3653585
3496 3653585 5730948 5206090 3509373 2043940 640114 -1121100 -2174602 -757624
$$ packed form
3555B140482M09376N85646k31159k057961k540369j431007j167849j983729q06901
3546g083471L017239N138333K456517j481636j353739K022007L260307R09581
3538F885138n72122J773896M361154K081554m184163q287342o324861q42564K658550
3529b450760J478641k602586n843057n673331k217349K134757M743672M747027
3521e682986K961223J56913l223302n478274l978971J311654O318499P093104
3513e22140M472623K148558J297726L97022l53064J211106M245020M125964j005336
3504A6017479o500781p072810l664741j019724n49842K88025K496576L659403
3496C653585K077363n24858j696717j465433j403826j761214j053502J416978
$$ plain form
3488 -757624 2708829 4423022 672310 -6957386 -11836483 -9587119 -3714823 -1619148
3480 -1619148 -6059147 -13344470 -19001279 -21380581 -19627781 -12655998 -2188620 6551497
3472 6551497 9893713 9531834 9384311 10593188 11468151 10479810 7343874 2705647 -1560528
3463 -1560528 -3256574 -2417836 -1249222 -574712 1090742 3703379 4299950 1701247 -678226
3454 -678226 477883 4159088 8569441 14805394 22286847 24535105 16526053 4232432
3446 4232432 -992637 2466832 4822026 -50437 -5789499 -3917577 3513416 7762319
3438 7762319 5997826 3605377 5352517 9939092 13634436 14856169 13699193 9930711
3430 9930711 3569750 -3562162 -8332968 -8621963 -5094810 -503427 3239000 7168292
$$ packed form
3488g57624L466453J714193l750712p629696m879097K249364N872296K095675
3480a619148m439999p285323n656809k379302J752800O971783J0467378Q740117
3472F551497L342216l61879j47523J208877Q74963r88341l135936m638227m266175
3463a560528j696046Q38738J168614O74510J665454K612637N96571k598703k379473
3454f78226J156109L681205M410353O235953P481453K248258q009052j2293621
3446D232432n225069L459469K355194m872463n739062J871922P430993M248903
3438G762319j764493k392449J747140M586575L695344J221733j156976l768482
3430I930711o360961p131912m770806k88995L527153M591383L742427L929292
$$ plain form
3422 7168292 13659214 22744053 31045848 34487533 31276755 22763690 12920318 6532069
3414 6532069 5680146 7752063 8739436 8205045 8471515 9293641 7221000 1251200 -4814450
3405 -4814450 -7732189 -9031975 -11178106 -12729609 -10934800 -6923966 -4466514 -4765663
3397 -4765663 -5856903 -6204932 -5664912 -3665773 263914 4488557 6708515 7117671 7452795
3388 7452795 7484086 5469870 1715254 -1476436 -3193154 -4068870 -3397720 64472 4230989
3379 4230989 4885040 1776146 -724573 -661840 -1673231 -6386044 -10980847 -10579473 -6853768
3370 -6853768 -5153304 -5873148 -4248812 1469849 7074534 8927805 8725466 9374734 10138259
3361 10138259 9381430 9171562 12496309 17018390 16491640 9272604 1283474 -1642725 -997193
$$ packed form
3422G168292O490922R084839Q301795L441685l210778q513065r843372o388249
3414F532069q51923K071917R87373n34391K66470Q22126k072641n969800o065650
3405d814450k917739j299786k146131j551503J794809M010834K457452k99149
3397d765663j091240l48029N40020J999139L929687M224643K219958M09156L35124
3388G452795L1291k014216l754616l191690j716718q75716O71150L462192M166517
3379D230989O54051l108894k500719O2733j011391m712813m594803M01374L725705
3370f853768J700464p19844J624336N718661N604685J853271k02339O49268P63525
3361A0138259p56829k09868L324747M522081n26750p219036p989130k926199O45532
$$ plain form
3352 -997193 -1913027 -4720796 -4860899 -803283 2957828 2631117 687489 1349192 3489974
3343 3489974 2600836 -1346358 -2995901 612297 5671720 7159226 5409770 4141588
3335 4141588 4243707 3344151 907539 -1418 2836258 7049074 8197597 5094218 1190917
3326 1190917 847969 5062026 10881054 14352192 13661097 9760248 4857901 916585 -983977
3317 -983977 -1176664 -1635474 -4500968 -9549676 -13855014 -14729486 -12312887 -8463809 -4058265
3308 -4058265 1172342 6708469 11052023 13736714 15930236 18362175 19955928 19448542
3300 19448542 17320669 14922570 12390862 8885956 4763225 2053229 2215862 4295388
3292 4295388 5969185 5889303 4358813 2182007 -152043 -2006871 -2150588 513377 5728805
$$ packed form
3352i97193r15834k807769j40103M057616L761111l26711j943628O61703K140782
3343C489974q89138l947194j649543L608198N059423J487506j749456j268182
3335D141588J02119q99556k436612r08957K837676M212816J148523l103379l903301
3326A190917l42948M214057N819028L471138o91095l900849m902347l941316j900562
3317i83977j92687m58810k865494n048708m305338q74472K416599L849078M405544
3308d058265N230607N536127M343554K684691K193522K431939J593753n07386
3300A9448542k127873k398099k531708l504906m122731k709996J62633K079526
3292D295388J673797p9882j530490k176806k334050j854828j43717K663965N215428
$$ plain form
3283 5728805 11634260 15888829 17259250 16273969 14199507 11299442 6615399 -13312
3275 -13312 -6350701 -9434366 -8754527 -6321895 -3393020 854615 6325927 9932568 8978792
3266 8978792 5328387 3220268 3445324 3023947 881977 -65264 1828865 3272193 801186
3257 801186 -3295668 -3762848 68322 3520458 3332468 1450735 1255145 3334775 6509575
3248 6509575 10190577 13638001 15105111 14224726 13768108 16350063 20112230 20397676 15850055
3239 15850055 10405388 8238913 8530987 6965382 1812688 -3354258 -3934273 -376346
3231 -376346 1870640 -772354 -4900197 -4212650 1797428 6493870 4833701 584447 1690708
3222 1690708 9688205 17381635 17629016 11457660 5755184 4847821 6760941 7367153 5954426
$$ packed form
3283E728805N905455M254569J370421r85281k074462k900065m684043o628711
3275a3312o337389l083665O79839K432632K928875M247635N471312L606641r53776
3266H978792l650405k108119K25056m21377k141970r47241J894129J443328k471007
3257H01186m096854m67180L831170L452136j87990j881733j95590K079630L174800
3248F509575L681002L447424J467110q80385m56618K581955L762167K85446m547621
3239A5850055n444667k166475K92074j565605n152694n166946n80015L557927
3231c76346K246986k642994m127843O87547O010078M696442j660169m249254J106261
3222A690708P997497P693430K47381o171356n702476r07363J913120O06212j412727
$$ plain form
3213 5954426 5490184 8144522 12047407 13192435 9879558 4153010 -935515 -3921100
3205 -3921100 -4443845 -2255233 1629046 4235443 3484442 1381383 2280407 7882509 15520682
3196 15520682 21144642 22270110 18545359 11947042 6365106 4075056 2091686 -4868483
3188 -4868483 -16712725 -26581931 -29036848 -26352564 -23794430 -21630269 -16002066 -6098290
3180 -6098290 3987089 10183769 11353909 7448526 -996518 -10638239 -16482117 -17002182
3172 -17002182 -15269787 -13778234 -11553715 -8208502 -6879127 -9455119 -11728670 -8084464
3164 -8084464 20278 5095937 3690167 1085934 3915095 11212318 15798020 13257364
3156 13257364 6875673 3568963 6399874 11491583 11989005 5368796 -3206374 -6106924
$$ packed form
3213E954426m64242K654338L902885J145028l312877n726548n088525k985585
3205c921100n22745K188612L884279K606397p51001k103059Q99024N602102P638173
3196A5520682N623960J125468l724751o598317n581936k290050j983370o960169
3188d868483j1844242r869206k454917K684284K558134K164161N628203R903776
3180f098290J0085379O196680J170140l905383q445044r641721n843878n20065
3172a7002182J732395J491553K224519L345213J329375k575992k273551L644206
3164h084464Q104742N075659j405770k604233K829161P297223M585702k540656
3156A3257364o381691l306710K830911N091709M97422o620209q575170k900550
$$ plain form
3148 -6106924 -2317086 765619 -3425845 -11376769 -13056277 -4564080 6861332 12114614
3140 12114614 10763057 9045521 10207880 11806543 11935348 12734837 15922768 18875193
3132 18875193 17965544 13314196 7769232 3305678 699710 267985 -91575 -5169183 -16603695
3123 -16603695 -28212246 -31787653 -27147151 -21717058 -19960502 -18578405 -13791362 -7784052
3115 -7784052 -4152114 -1308392 4280490 10569130 11415818 5728389 343027 1966549
3107 1966549 9192652 14576053 12981883 5977845 -1333837 -6031806 -9298363 -13324180
3099 -13324180 -17570834 -19165638 -16703389 -12190099 -8744205 -7629537 -8173718 -9246253
3091 -9246253 -9880711 -9665772 -9457306 -10406040 -11481900 -9933978 -5666234 -2854905 -4574979
$$ packed form
3148f106924L789838L082705m191464p950924j679508Q492197J1425412N253282
3140A2114614j351557j717536J162359J598663J28805P99489L187931K952425
3132A8875193r09649m651348n544964m463554k605968m31725l59560n077608j1434512
3123a6603695j1608551l575407M640502N430093J756556J382097M787043O007310
3115g784052L631938K843722N588882O288640Q46688n687429n385362J623522
3107A966549P226103N383401j594170p004038p311682m697969l266557m025817
3099a3324180m246654j594804K462249M513290L445894J114668n44181j072535
3091i246253o34458K14939K08466r48734j075860J547922M267744K811329j720074
$$ plain form
3082 -4574979 -7485491 -5229787 3392223 12746477 16850706 14801831 9778548 5701897
3074 5701897 5329407 8356496 10029556 4602046 -7611355 -18636605 -20603738 -13844781
3066 -13844781 -5322698 -484556 646254 236024 -693461 -1174790 1004255 6507094 11537537
3057 11537537 11124345 5880102 2398251 5073677 10269020 11838742 10334097 11712711
3049 11712711 17118612 19850152 14880613 6295903 1306861 948318 1653232 2652157 5359910
3040 5359910 7034853 2191945 -8866610 -18824548 -22114412 -19857325 -14806332 -7132756
3032 -7132756 2042396 8211473 8665514 6556514 6098751 6782154 5926460 4084951 3928118
3023 3928118 5862267 8459836 11463098 14862359 16595131 14565613 9676952 4109740
$$ packed form
3082d574979k910512K255704Q622010R354254M104229k048875n023283m076651
3074E701897l72490L027089J673060n427510j2213401j1025250j967133O758957
3066a3844781Q522083M838142J130810m10230r29485m81329K179045N502839N030443
3057A1537537m13192n244243l481851K675426N195343J569722j504645J378614
3049A1712711N405901K731540m969539q584710m989042l58543P04914R98925K707753
3040E359910J674943m842908j1058555r957938l289864K257087N050993P673576
3032g132756R175152O169077M54041k109000m57763O83403q55694j841509j56833
3023C928118J934149K597569L003262L399261J732772k029518m888661n567212
$$ plain form
3015 4109740 -1449933 -5893714 -5715146 676374 8478659 11012317 7751785 3702284
3007 3702284 2097031 2401979 4279496 7753496 9618176 5825153 -1401264 -4543738
2999 -4543738 -881137 3538085 2534279 -2270791 -5227699 -4281432 -1284892 2073131
2991 2073131 5016380 6670845 7411946 9225699 12212107 13100857 9854314 5161423 2468801
2982 2468801 1317008 31889 51312 2882047 4926287 1015499 -7377567 -12828185 -11402317
2973 -11402317 -6486210 -2109098 2356876 8151822 12256386 10836634 5098463 -606939
2965 -606939 -5245666 -11143728 -17575381 -19277977 -13824841 -6746797 -5144891 -8059662
2957 -8059662 -8204753 -3293693 -37575 -4377180 -12767620 -17761631 -18396732 -18784064 -18797832
$$ packed form
3015D109740n559673m443781J78568O391520P802285K533658l260532m049501
3007C702284j605253L04948J877517L474000J864680l793023p226417l142474
2999d543738L662601M419222j003806m805070k956908R46267K996540L358023
2991B073131K943249J654465P41101J813753K986408Q88750l246543m692891k692622
2982B468801j151793j285119J9423K830735K044240l910788q393066n450618J425868
2973a1402317M916107M377112M465974N794946M104564j419752n738171n705402
2965f06939m638727n898062o431653j702596N453136P078044J601906k914771
2957h059662j45091M911060L256118m339605q390440m994011o35101l87332j3768
$$ plain form
2948 -18797832 -14153976 -6007021 -2177525 -5883728 -10398434 -9149811 -4733041 -2593121
2940 -2593121 -1785624 992563 2956608 -874943 -8105631 -11557245 -9921521 -7793426
2932 -7793426 -6246680 -2248527 2496897 1704065 -4504523 -7960860 -5289452 -3835102
2924 -3835102 -10093465 -19993414 -26226485 -28046246 -27394487 -22225849 -11855473 -3646470
2916 -3646470 -5250548 -13220308 -17642131 -15630117 -12037677 -9158292 -5132077 -1770107
2908 -1770107 -3989615 -9922441 -10515751 -1973684 8683126 13410988 11714739 6380167
2900 6380167 -2321604 -13471415 -21985625 -23351154 -18487578 -10591898 -1104544 8189834
2892 8189834 13743060 14660159 14196385 13371815 8269358 -1945473 -10167447 -10938920 -9944967
$$ packed form
2948a8797832M643856Q146955L829496l706203m514706J248623M416770K139920
2940b593121Q07497K778187J964045l831551p230688l451614J635724K128095
2932g793426J546746L998153M745424p92832o208588l456337K671408J454350
2924c835102o258363r899949o233071j819761O51759N168638J0370376Q209003
2916c646470j604078p969760m421823K012014L592440K879385M026215L361970
2908a770107k219508n932826n93310Q542067J0656810M727862j696249n334572
2900F380167q701771j1149811q514210j365529M863576P895680R487354R294378
2892H189834N553226R17099m63774q24570n102457j0214831q221974p71473R93953
$$ plain form
2883 -9944967 -15914742 -26293551 -29908100 -22836998 -12866598 -7400225 -5074939 -1739797
2875 -1739797 2353049 5119452 7223677 10098736 12832513 14264262 15465271 17482018
2867 17482018 19000226 18516530 16635498 14257360 10709885 5685585 1052082 -1269555
2859 -1269555 -1710080 -1773907 -1839550 -1600208 -1349336 -1680108 -2895932 -4990252 -6819170
2850 -6819170 -5788060 -965921 3703598 2771648 -3538657 -9041684 -9299586 -5745502 -1089916
2841 -1089916 4441025 9804623 11232914 7986250 6023792 10585472 17663672 18392177
2833 18392177 10490959 -62939 -7929863 -13048536 -15762244 -13285766 -4256726 6574014
2825 6574014 11643145 7677828 -1918133 -10637628 -13913827 -11999000 -9084677 -9032377 -11553205
$$ packed form
2883i944967n969775j0378809l614549P071102R970400N466373K325286L335142
2875a739797M092846K766403K104225K875059K733777J431749J201009K016747
2867A7482018J518208m83696j881032k378138l547475n024300m633503k321637
2859a269555m40525o3827o5643K39342K50872l30772j215824k094320j828918
2850f819170J031110M822139M669519r31950o310305n503027k57902L554084M655586
2841a089916N530941N363598J428291l246664j962458M561680P078200P28505
2833A8392177p901218j0553898p866924n118673k713708K476478R029040J0830740
2825F574014N069131l965317r595961q719495l276199J914827K914323N2300k520828
$$ plain form
2816 -11553205 -13234860 -12208314 -10455361 -10965467 -13554858 -14467586 -10449302 -3176116
2808 -3176116 1224436 -1700973 -9631873 -16494747 -20067347 -23070460 -26105045 -24411132
2800 -24411132 -15013122 -3271137 2449605 530471 -3862345 -6430688 -6455609 -3604616
2792 -3604616 1896690 6262762 5477216 2287265 3797304 10578293 14329011 9212973
2784 9212973 56406 -4447562 -2180494 2695176 6403922 7364074 4389967 -2161917
2776 -2161917 -9167295 -14190042 -18059769 -20887998 -18925437 -10252961 -838999 1242715
2768 1242715 -3401366 -6468141 -3571044 1141912 2755135 1815398 537671 -1623175
2760 -1623175 -4921439 -6146197 -2980128 1232028 1565256 -1325711 -2561760 -744317
$$ packed form
2816a1553205j681655J026546J752953n10106k589391r12728M018284P273186
2808c176116M400552k925409p930900o862874l572600l003113l034585J693913
2800b4411132R398010J1741985N720742j919134m392816k568343k4921K850993
2792c604616N501306M366072p85546l189951J510039O780989L750718n116038
2784I212973r156567m503968K267068M875670L708746R60152k974107o551884
2776b161917p005378n022747l869727k828229J962561Q672476R413962K081714
2768A242715m644081l066775K897097M712956J613223r39737j277727k160846
2760a623175l298264j224758L166069M212156L33228k890967j236049J817443
$$ plain form
2752 -744317 278292 -2092143 -5034642 -4433626 -207481 4708600 8536673 11206314 12081076
2743 12081076 10102677 6103256 2491519 121245 -2582668 -6765929 -11252187 -14308455
2735 -14308455 -15493209 -14746514 -11610877 -6816339 -2582180 763175 6470667 16705918
2727 16705918 27617435 32710553 30711201 26461192 23971367 22491115 20259946 18076359
2719 18076359 17090920 16249273 14377998 12520448 12039772 12328165 12149119 11192089 8744452
2710 8744452 3412092 -3770529 -8569031 -8492279 -6372302 -6525813 -9473831 -12859727 -15001119
2701 -15001119 -14620673 -9980707 -2268882 2600876 314257 -5240039 -6527181 -2555538
2693 -2555538 549888 -1034045 -3904132 -2806756 3146722 10576948 14872429 12963352
$$ packed form
2752g44317J022609k370435k942499O01016M226145M916081L828073K669641Q74762
2743A2081076j978399l999421l611737k370274k703913m183261m486258l056268
2735a4308455j184754P46695L135637M794538M234159L345355N707492J0235251
2727A6705918J0911517N093118j999352m250009k489825j480252k231169k183587
2719A8076359r85439q41647j871275j857550m80676K88393j79046r57030k447637
2710H744452n332360p182621m798502P6752K119977j53511k948018l385896k141392
2701a5001119L80446M639966P711825M869758k286619n554296j287142L971643
2693b555538L105426j583933k870087J097376N953478P430226M295481j909077
$$ plain form
2685 12963352 6567715 2443098 5349718 11088769 11344394 5256246 182518 109385 246020
2676 246020 -3948817 -8929298 -9039669 -5377864 -3248576 -4141016 -5480875 -5939422 -6001864
2667 -6001864 -4962262 -2001419 895311 1249221 373033 1588366 5109288 8286695 9932208
2658 9932208 10717035 10193437 7317859 3467709 1237316 454480 -1275829 -4518055 -7877635
2649 -7877635 -11188048 -14840821 -16321369 -11965953 -2895433 4797693 6865286 4582596
2641 4582596 1085816 -2048886 -3517128 -1730487 2308938 4721528 3395589 401822
2633 401822 -1620233 -2538016 -2730648 -1408396 943365 1576120 -701400 -3702481 -6167419
2624 -6167419 -10223935 -16178635 -18639235 -13028109 -3733231 21934 -4156299 -9759231
$$ packed form
2685A2963352o395637m124617K906620N739051K55625o088148n073728p3133J36635
2676B46020m194837m980481j10371L661805K129288q92440j339859m58547o2442
2667f001864J039602K960843K896730L53910q76188J215333L520922L177407J645513
2658I932208P84827n23598k875578l850150k230393p82836j730309l242226l359580
2649g877635l310413l652773j480548M355416R070520P693126K067593k282690
2641D582596l496780l134702j468242J786641M039425K412590j325939k993767
2633D01822k022055r17783j92632J322252K351761O32755k277520l001081k464938
2624f167419m056516n954700k460600N611126R294878L755165m178233n602932
$$ plain form
2616 -9759231 -11219675 -10180076 -10171855 -10363227 -8364089 -5742384 -6099440 -8939195 -9688383
2607 -9688383 -6165546 -1760025 -843920 -3223978 -5069737 -4312068 -3035524 -4381058 -8785558
2598 -8785558 -14163396 -18486068 -20653715 -19672265 -15312895 -9984498 -7731701 -9879881
2590 -9879881 -12924699 -12303507 -7694171 -3483729 -4485403 -11790237 -21723030 -27992329
2582 -27992329 -26360589 -18817038 -12122723 -10786840 -12735736 -13402612 -11950030 -10513460
2574 -10513460 -9054240 -5326102 107305 3101089 1452278 -2007534 -3146063 -655419
2566 -655419 4394613 9886490 12351941 9021738 2269550 -1359787 965158 4644512
2558 4644512 4417114 1199298 -1328834 -3139909 -5966886 -8230777 -7999067 -8829135 -15425990
$$ packed form
2616i759231j460444J039599Q221j91372J999138K621705l57056k839755p49188
2607i688383L522837M405521R16105k380058j845759P57669J276544j345534m404500
2598h785558n377838m322672k167647R81450M359370N328397K252797k148180
2590i879881l044818O21192M609336M210442j001674p304834r932793o269299
2582b7992329J631740P543551O694315J335883j948896o66876J452582J436570
2574a0513460J459220L728138N433407K993784j648811l459812j138529K490644
2566f55419N050032N491877K465451l330203o752188l629337K324945L679354
2558D644512k27398l217816k528132j811075k826977k263891K31710q30068o596855
$$ plain form
2549 -15425990 -23981919 -24545285 -14463137 -2297052 4235411 7205504 11368921 14933241
2541 14933241 13836594 10554130 11119837 15420888 17402995 14437305 10271316 8177312
2533 8177312 6835707 4579592 2968008 3755425 5643776 6292528 5222078 3174006 885563
2524 885563 -146776 1829281 5798419 7645027 4922953 345484 -1561962 -111088
2516 -111088 1305659 -123514 -3751313 -7034150 -8028096 -5814614 -87824 8003876 14785563
2507 14785563 15741581 9972048 2364152 -891840 629413 1285637 -2853038 -8666259
2499 -8666259 -10780030 -9357206 -9537084 -14074556 -19998070 -22504174 -19545023 -13011202
2491 -13011202 -7856832 -8865076 -15069020 -18911036 -15222234 -9422873 -10821622 -18511435
$$ packed form
2549a5425990q555929n63366J0082148J2166085O532463K970093M163417L564320
2541A4933241j096647l282464N65707M301051J982107k965690m165989k094004
2533H177312j341605k256115j611584P87417J888351O48752j070450k048072k288443
2524H85563j032339J976057L969138J846608k722074m577469j907446J450874
2516a11088J416747j429173l627799l282837r93946K213482N726790Q091700O781687
2507A4785563R56018n769533p607896l255992J521253O56224m138675n813221
2499h666259k113771J422824j79878m537472n923514k506104K959151O533821
2491a3011202N154370j008244o203944l842016L688802N799361j398749p689813
$$ plain form
2483 -18511435 -21723841 -15695814 -8517865 -7647057 -7626721 1005823 15750224 24109197
2475 24109197 19729327 8631124 -500738 -5215214 -7551758 -9583527 -12756228 -17088911
2467 -17088911 -19115098 -14496894 -4673865 2298319 -328282 -11183622 -22837382 -28495869
2459 -28495869 -26187646 -19141699 -13271815 -12176140 -13585554 -12325039 -6913677 -1069254
2451 -1069254 1382774 433646 -1689027 -3279119 -3440128 -1946990 207210 1839505 3422630
2442 3422630 5988370 8356005 7966949 4556141 495624 -2342133 -3256299 -818585 5773790
2433 5773790 13204064 16078472 13437123 9370826 6339478 2425728 -3217606 -7093266
2425 -7093266 -6373043 -3207312 -1119225 -701880 -1642136 -5023122 -10139716 -12709387 -10142160
$$ packed form
2483a8511435l212406O028027P177949Q70808K0336Q632544J4744401Q358973
2475B4109197m379870j1098203r131862m714476k336544k031769l172701m332683
2467a7088911k026187M618204R823029O972184k626601j0855340j1653760n658487
2459b8495869K308223P045947N869884J095675j409414J260515N411362N844423
2451a069254K452028r49128k122673j590092j61009J493138K154200J632295J583125
2442C422630K565740K367635l89056l410808m060517k837757r14166K437714O592375
2433E773790P430274K874408k641349m066297l031348l913750n643334l875660
2425g093266P20223L165731K088087M17345r40256l380986n116594k569671K567227
$$ plain form
2416 -10142160 -5419055 -2189330 73669 1644699 -2191416 -14702992 -29213273 -34543441
2408 -34543441 -28495707 -19432255 -14424089 -12260537 -9003469 -3964027 2038698 8782215
2400 8782215 14107342 13921049 8043842 2459743 2437879 6141545 7949014 5558481 848348
2391 848348 -3973924 -7669279 -8902452 -7277863 -5005873 -4871815 -6541073 -6825159 -3658441
2382 -3658441 1636819 5913913 6720144 3485246 -2173241 -6728904 -6447405 -259695 8524889
2373 8524889 14141855 13423331 9211272 7301527 9339903 10725517 7190439 1301414
2365 1301414 -638210 3097868 8170636 10782369 11879421 13948781 17199537 20496646
2357 20496646 23176843 24210245 22039295 16917713 11169487 5830992 -157967 -5807851
$$ packed form
2416a0142160M723105L229725K262999J571030l836115j2511576j4510281n330168
2408c4543441O047734R063452N008166K163552L257068N039442O002725O743517
2400H782215N325127j86293n877207n584099k1864L703666J807469k390533m710133
2391H48348m822272l695355j233173J624589K271990J34058j669258k84086L166718
2382c658441N295260M277094Q06231l234898n658487m555663K81499O187710Q784584
2373H524889N616966p18524m212059j909745K038376J385614l535078n889025
2365A301414j939624L736078N072768K611733J097052K069360L250756L297109
2357B0496646K680197J033402k170950n121582n748226n338495n988959n649884
$$ [...]
##END NTUPLES=NMR SPECTRUM
##END=
