##TITLE=31Pdec_102-2024
 DMSO-d6, 24 sc
 5.12.2024
##JCAMPDX= 6.0         $$ Bruker NMR JCAMP-DX V2.0
##DATA TYPE= NMR SPECTRUM
##DATA CLASS= NTUPLES
##ORIGIN= UXNMR, Bruker Analytische Messtechnik GmbH
##OWNER= root
$$ XWIN-NMR		Version 3.5
$$ Thu Dec  5 14:19:33 2024 Russian Standard Time (UT+4h)  she@DPX200
##.OBSERVE FREQUENCY= 81.013821
##.OBSERVE NUCLEUS= ^31P
##.ACQUISITION MODE= SIMULTANEOUS
##.ACQUISITION SCHEME= undefined
##.AVERAGES= 24
##.DIGITISER RES= 17
##SPECTROMETER/DATA SYSTEM= spect
##.PULSE SEQUENCE= zgpg30
##.SOLVENT NAME= DMSO
##.SHIFT REFERENCE= (INTERNAL, DMSO, 0, 198.062)
##AUDIT TRAIL= $$ (NUMBER, WHEN, WHO, WHERE, WHAT)
$$ ##TITLE= Audit trail, XWIN-NMR		Version 3.5
$$ ##JCAMPDX= 5.01
$$ ##ORIGIN= Bruker BioSpin GmbH
$$ ##OWNER= she
$$ F:/spectra/data/she/nmr/P31/2/pdata/1/auditp.txt
$$ ##AUDIT TRAIL=  $$ (NUMBER, WHEN, WHO, WHERE, WHAT)
(   1,<2024-12-05 14:17:59.25 +0400>,<she>,<DPX200>,
      <created by zg, POWCHK disabled, PULCHK disabled
       configuration hash MD5:
       00 E9 B6 7A A2 85 ED C7 34 08 36 98 17 FE 4E 26
       data hash MD5: 32K
       64 44 78 B6 82 92 E1 30 4B 21 E0 AE 50 2A 30 82>)
(   2,<2024-12-05 14:18:01.71 +0400>,<she>,<DPX200>,
      <Start of raw data processing
       efp BC_mod = 2 LB = 1.5 FT_mod = 6 PKNL = 1 PHC0 = 2275.077 PHC1 = 72.8883 SI = 64K 
       data hash MD5: 64K
       74 FF A3 C8 B9 58 7C 5C 9B 1F 4C C6 1D D9 C1 F2>)
(   3,<2024-12-05 14:18:35.23 +0400>,<she>,<DPX200>,
      <pk PHC0 = -599.5457 PHC1 = 1407.399 
       data hash MD5: 64K
       24 7A 8E D1 7A 63 46 C9 01 BB 7C 9A 3C 8C F5 8B>)
(   4,<2024-12-05 14:18:59.81 +0400>,<she>,<DPX200>,
      <pk PHC0 = 1.400461 PHC1 = 0 
       data hash MD5: 64K
       CF D6 72 C4 AF C3 CA 69 E7 86 23 8C 63 FC 70 57>)
(   5,<2024-12-05 14:19:04.12 +0400>,<she>,<DPX200>,
      <abs ABSG = 5 
       data hash MD5: 64K
       01 2E F0 07 CC 6D 73 23 75 1D 84 48 DD 30 72 E2>)
$$ ##END=
$$ 
$$ hash MD5
$$ FC 66 30 AB 74 86 DE 56 DC DF 4C 5D FD EE 1D 96
##$RELAX= 
##$RELAX= 
##$RELAX= 
##$RELAX= 
##$RELAX= 
##$RELAX= 
##$RELAX= 
##$RELAX= 
$$ Bruker specific parameters
$$ --------------------------
##$DU= <F:/spectra>
##$EXPNO= 2
##$NAME= <P31>
##$PROCNO= 1
##$TYPE= <nmr>
##$USER= <she>
##$AMP= (0..31)
100 100 100 100 100 100 100 100 100 100 100 100 100 100 100 100 100 100 
100 100 100 100 100 100 100 100 100 100 100 100 100 100 
##$AQSEQ= 0
##$AQ_mod= 1
##$AUNM= <au_zg>
##$AUTOPOS= <>
##$BF1= 81.014009
##$BF2= 200.13
##$BF3= 200.13
##$BF4= 200.13
##$BF5= 200.13
##$BF6= 200.13
##$BF7= 200.13
##$BF8= 200.13
##$BYTORDA= 1
##$CFDGTYP= 0
##$CFRGTYP= 5
##$CHEMSTR= <none>
##$CNST= (0..31)
1 1 145 1 1 1 1 1 1 1 1 1 1 1 1 1 1 1 1 1 1 1 1 1 1 1 1 1 1 1 1 1 
##$CPDPRG= <waltz16>
##$CPDPRG1= <>
##$CPDPRG2= <waltz16>
##$CPDPRG3= <>
##$CPDPRG4= <mlev>
##$CPDPRG5= <mlev>
##$CPDPRG6= <mlev>
##$CPDPRG7= <mlev>
##$CPDPRG8= <mlev>
##$CPDPRGB= <>
##$CPDPRGT= <>
##$D= (0..31)
0 1 0 0 0 0 0 0 0 0.06 0 0.03 2e-05 3e-06 0 0 0.0002 0 0 0 0 0 0 0 0 0 
$$ [...]
##$SUBNAM3= <"">
##$SUBNAM4= <"">
##$SUBNAM5= <"">
##$SUBNAM6= <"">
##$SUBNAM7= <"">
##$SUBNAM8= <"">
##$SUBNAM9= <"">
##$SW= 400.765351723535
##$SWIBOX= (0..15)
0 1 3 0 0 0 0 0 0 0 0 0 0 0 0 0 
##$SW_h= 32467.5324675325
##$TD= 32768
##$TD0= 1
##$TE= 0
##$TE2= 300
##$TE3= 300
##$TEG= 300
##$TL= (0..7)
0 120 53 12 22 120 120 120 
##$TP= (0..7)
150 150 150 150 150 150 150 150 
##$TP07= 0
##$TPNAME0= <>
##$TPNAME1= <>
##$TPNAME2= <>
##$TPNAME3= <>
##$TPNAME4= <>
##$TPNAME5= <>
##$TPNAME6= <>
##$TPNAME7= <>
##$TPOAL= (0..7)
0.5 0.5 0.5 0.5 0.5 0.5 0.5 0.5 
##$TPOFFS= (0..7)
0 0 0 0 0 0 0 0 
##$TUNHIN= 0
##$TUNHOUT= 0
##$TUNXOUT= 0
##$USERA1= <user>
##$USERA2= <user>
##$USERA3= <user>
##$USERA4= <user>
##$USERA5= <user>
##$V9= 5
##$VALIST= <valist>
##$VCLIST= <CCCCCCCCCCCCCCC>
##$VD= 0
##$VDLIST= <DDDDDDDDDDDDDDD>
##$VPLIST= <PPPPPPPPPPPPPPP>
##$VTLIST= <TTTTTTTTTTTTTTT>
##$WBST= 1024
##$WBSW= 4
##$XGAIN= (0..3)
0 0 0 0 
##$XL= 0
##$YL= 0
##$YMAX_a= 9013
##$YMIN_a= -3595
##$ZGOPTNS= <>
##$ZL1= 120
##$ZL2= 120
##$ZL3= 120
##$ZL4= 120
##$ABSF1= 198.0616
##$ABSF2= -202.7028
##$ABSG= 5
##$ABSL= 3
##$ALPHA= 0
##$AQORDER= 0
##$ASSFAC= 0
##$ASSFACI= 0
##$ASSFACX= 0
##$ASSWID= 0
##$AUNMP= <proc_1d>
##$AZFE= 0.1
##$AZFW= 0.5
##$BCFW= 0
##$BC_mod= 2
##$BYTORDP= 0
##$COROFFS= 0
##$CY= -3
##$DATMOD= 1
##$DC= 0
##$DFILT= <>
##$DTYPP= 0
##$F1P= 0
##$F2P= 0
##$FCOR= 1
##$FTSIZE= 65536
##$FT_mod= 6
##$GAMMA= 0
##$GB= 0
##$INTBC= 1
##$INTSCL= 9.790993e-09
##$ISEN= 30
##$LB= 1.5
##$LEV0= 0
##$LPBIN= 0
##$MAXI= 10000
##$MC2= 0
##$MEAN= 0
##$ME_mod= 0
##$MI= 50
##$NCOEF= 0
##$NC_proc= -7
##$NLEV= 6
##$NOISF1= 182.463
##$NOISF2= 159.3651
##$NSP= 0
##$NTH_PI= 0
##$NZP= 0
##$OFFSET= 198.0616
##$PC= 4
##$PHC0= 1676.932
##$PHC1= 1480.287
##$PH_mod= 1
##$PKNL= yes
##$PPARMOD= 0
##$PSCAL= 0
##$PSIGN= 0
##$REVERSE= no
##$SF= 81.0140089999434
##$SI= 65536
##$SIGF1= 159.3651
##$SIGF2= -187.1042
##$SINO= 113.3802
##$SIOLD= 16384
##$SREGLST= <1H.CDCl3>
##$SSB= 0
##$STSI= 65536
##$STSR= 0
##$SW_p= 32467.5324675325
##$SYMM= 0
##$S_DEV= 0
##$TDeff= 32768
##$TDoff= 0
##$TI= <>
##$TILT= no
##$TM1= 0
##$TM2= 0
##$TOPLEV= 0
##$USERP1= <user>
##$USERP2= <user>
##$USERP3= <user>
##$USERP4= <user>
##$USERP5= <user>
##$WDW= 1
##$XDIM= 65536
##$YMAX_p= 405007252
##$YMIN_p= -122931080
$$ End of Bruker specific parameters
$$ ---------------------------------
##NTUPLES= NMR SPECTRUM
##VAR_NAME=  FREQUENCY,     SPECTRUM/REAL,   SPECTRUM/IMAG
##SYMBOL=    X,             R,               I
##VAR_TYPE=  INDEPENDENT,   DEPENDENT,       DEPENDENT
##VAR_FORM=  AFFN,          ASDF,            ASDF
##VAR_DIM=   65536,         65536,           65536
##UNITS=     HZ,            ARBITRARY UNITS, ARBITRARY UNITS
##FACTOR=    0.49542278885378, 1,            1
##FIRST=     16045.7642231865, 0,            0
##LAST=      -16421.768244346, 0,            0
##MIN=       -16421.768244346, -122931080,   0
##MAX=       16045.7642231865, 405007252,    0
$$ Real data points
##PAGE= N=1
##DATA TABLE= (X++(R..R)), XYDATA
$$ [...]
$$ plain form
40264 511142 574261 -495716 -1704246 -2005956 -1120716 434496 1656642 1716286 816848
40255 816848 142878 475906 1184514 1176701 484500 31843 7863 -423986 -1555318 -2321310
40245 -2321310 -1681538 -74801 1211130 1586209 1367462 927376 487184 464669 1117810
40236 1117810 1940139 2272192 2451082 3354208 4690759 4920446 3417128 1672757 1454296
40227 1454296 2499442 3085915 2394175 1109801 -126540 -1527390 -3103634 -3971465 -3477466
40218 -3477466 -2327577 -1757866 -1876488 -1571037 -56068 2025174 3197145 2601158 768376
40209 768376 -926441 -1537735 -1259542 -813614 -353866 533299 1715609 2131415 1062812
40200 1062812 -655050 -1415985 -692472 550347 1235402 1235164 896941 268595 -676963 -1493415
$$ packed form
40264E11142O3119j069977j208530l01710Q85240J555212J222146N9644q99438
40255H16848o73970L33028P08608p813o92201m52657k3980m31849j131332p65992
40245b321310O39772J606737J285931L75079k18747m40086m40192k2515O53141
40236A117810Q22329L32053J78890R03126J336551K29687j503318j744371k18461
40227A454296J045146N86473o91740j284374j236341j400850j576244q67831M93999
40218c477466J149889N69711j18622L05451J514969K081242J171971n95987j832782
40209G68376j694817o11294K78193M45928M59748Q87165J182310M15806j068603
40200A062812j717862p60935P23513J242819O85055k38l38223o28346r45558q16452
$$ plain form
40190 -1493415 -1573836 -942989 -316026 -331203 -944508 -1554753 -1571029 -954889 -350319 -504083
40180 -504083 -1351337 -1896959 -1331044 -87483 624118 259589 -532153 -806266 -261529
40171 -261529 779008 1782436 2183876 1665137 613876 -91019 -108843 -57092 -520042
40162 -520042 -1133714 -1269571 -1188470 -1646093 -2557371 -3049725 -2911084 -2952287 -3561223 -3851935
40152 -3851935 -2919712 -1239437 -26915 333729 444149 784826 1235437 1547226 1577483
40143 1577483 1126949 206835 -593138 -707263 -572310 -1228630 -2757269 -3882754 -3560049
40134 -3560049 -2355089 -1659361 -1888880 -2123251 -1496134 -358697 257902 85180 29308
40125 29308 909867 2132253 2233923 790943 -930585 -1577505 -1261675 -910875 -776348
$$ packed form
40190a493415q0421O30847O26963j5177o13305o10245j6276O16140O04570j53764
40180e04083q47254n45622N65915J243561P11601l64529p91742k74113N44737
40171b61529J040537J003428M01440n18739j051261p04895j7824N1751m62950
40162e20042o13672j35857Q1101m57623r11278m92354J38641m1203o08936k90712
40152c851935R32223J680275J212522L60644J10420L40677M50611L11789L0257
40143A577483m50534r20114p99973j14125J34953o56320j528639j125485L22705
40134c560049J204960O95728k29519k34371O27117J137437O16599j72722n5872
40125B9308Q80559J222386J01670j442980j721528o46920L15830L50800J34527
$$ plain form
40116 -776348 -537151 -360428 -633148 -883083 -312192 604999 507705 -627995 -1201202 -477393
40106 -477393 214527 -296247 -1113689 -904196 -135629 -42015 -340030 129334 1082207 1131302
40096 1131302 248749 -121548 419724 546188 -448799 -1434756 -1390762 -985092 -1186238 -1664548
40086 -1664548 -1759696 -1859085 -2437990 -2650557 -1428945 544466 1501601 1031403 433827
40077 433827 589106 833999 345366 -483054 -712712 -223912 244087 96797 -519275 -973610
40067 -973610 -776310 -68439 453092 283931 -246320 -368396 106254 505254 86975 -1211704
40057 -1211704 -2881694 -4339078 -5154211 -5096509 -4268519 -3163592 -2401517 -2271062 -2454404
40048 -2454404 -2263959 -1358853 -245965 225192 -45388 -233454 249848 903615 915990
$$ packed form
40116g76348K39197J76723k72720k49935N70891R17191r7294j135700n73207P23809
40106d77393O91920n10774q17442K09493P68567R3614k98015M69364R52873M9095
40096A131302q82553l70297N41272J26464r94987r85957M3994M05670k01146m78310
40086a664548r5148r9389n78905k12567J221612J973411R57135m70198n97576
40077D33827J55279K44893m88633q28420k29658M88800M67999j47290o16072m54335
40067i73610J97300P07871N21531j69161n30251j22076M74650L99000m18279j298679
40057a211704j669990j457384q15133N7702Q27990J104927P62075J30455j83342
40048b454404J90445R05106J112888M71157k70580j88066M83302O53767J2375
$$ plain form
40039 915990 386456 102241 335009 619481 662757 667285 615477 14845 -1281799 -2587262
40029 -2587262 -3130619 -2905800 -2449056 -2130926 -1950396 -1676897 -943773 411250 1835247
40020 1835247 2321253 1514403 164082 -830153 -1328436 -1515261 -1176374 -134108 995893
40011 995893 1316346 771025 43704 -501043 -970030 -1121540 -376889 1089094 2117442
40002 2117442 1884022 844118 -51788 -503480 -744749 -822275 -605383 -177403 342688
39993 342688 1104905 2140110 2928710 2902309 2165070 1186292 37001 -1393597 -2608802
39984 -2608802 -2789499 -1998942 -1368524 -1782648 -2891819 -3662994 -3434289 -2249808 -712951
39975 -712951 216419 -155550 -1426593 -2312155 -2039120 -1096532 -288638 354969 1168794
$$ packed form
40039I15990n29534k84215K32768K84472M3276M528n1808o00632j296644j305463
40029b587262n43357K24819M56744L18130J80530K73499P33124J355023J423997
40020A835247M86006q06850j350321r94235m98283j86825L38887J042266J130001
40011I95893L20453n45321p27321n44747m68987j51510P44651J465983J028348
40002B117442k33420j039904q95906m51692k41269p7526K16892M27980N20091
39993C42688P62217J035205P88600k6401p37239r78778j149291j430598j215205
39984b608802j80697P90557O30418m14124j109171p71175K28705J184481J536857
39975g12951R29370l71969j271043q85562K73035R42588Q07894O43607Q13825
$$ plain form
39966 1168794 1890604 1892208 1129485 178192 -523293 -872699 -758251 -197552 300004 176162
39956 176162 -460918 -1179151 -2038630 -3217240 -4019660 -3431198 -1839709 -1012234 -1825628
39947 -1825628 -3043175 -3060218 -1981820 -1081426 -895895 -890977 -601722 -80998 605857 1420701
39937 1420701 1945920 1741330 1110522 812070 1030558 1329257 1568384 2031564 2526423
39928 2526423 2245062 921796 -536745 -1066170 -654402 -136664 -148978 -664227 -1263494
39919 -1263494 -1494236 -1175559 -660960 -607783 -1209585 -1848540 -1805205 -1160899 -662050 -726468
39909 -726468 -905316 -485349 499243 1075877 303932 -1624932 -3496517 -4313396 -4072017
39900 -4072017 -3173633 -1664874 327128 1833145 1681786 -34294 -1941113 -3023949
$$ packed form
39966A168794P21810J604p62723r51293p01485l49406J14448N60699M97556j23842
39956A76162o37080p18233q59479j178610q02420N88462J591489Q27475q13394
39947a825628j217547j7043J078398R00394J85531M918K89255N20724O86855Q14844
39937A420701N25219k04590o30808k98452K18488K98699K39127M63180M94859
39928B526423k81361j323266j458541n29425M11768N17738j2314n15249n99267
39919a263494k30742L18677N14599N3177o01802o38955M3335O44306M98849o4418
39909g26468j78848M19967R84592N76634p71945j928864j871585q16879K41379
39900d072017Q98384J508759J992002J506017j51359j716080j906819j082836
$$ plain form
39892 -3023949 -3521176 -3911173 -3888745 -3004365 -1708198 -950171 -997160 -1300012 -1376546 -1250722
39882 -1250722 -1105601 -1019614 -1040552 -1127200 -1042346 -622165 -77309 259005 342972 282302
39872 282302 -5286 -599220 -1208048 -1429874 -1270034 -983631 -538463 274762 1274772
39863 1274772 1961698 2168729 2148141 1987301 1485208 726900 231242 277941 531131 604461
39853 604461 598464 743051 838914 477069 -320388 -1018541 -1112502 -575032 182716 663357
39843 663357 649658 311441 -67221 -405648 -727079 -841790 -447452 416566 1327359 1976602
39833 1976602 2400606 2626581 2501827 2116968 2001874 2484030 3095993 3091345 2442571 1828754
39823 1828754 1590753 1228896 260677 -787441 -817433 358564 1473429 1129800 -563137
$$ packed form
39892c023949m97227l89997K2428Q84380J296167P58027m6989l02852p6534J25824
39882a250722J45121Q5987k0938q6648Q4854M20181N44856L36314Q3967o0670
39872B82302k87588n93934o08828k21826J59840K86403M45168Q13225J000010
39863A274772O86926K07031k0588j60840n02093p58308m95658M6699K53190P3330
39853F04461n997J44587R5863l61845p97457o98153r3961N37470P57748M80641
39843F63357j3699l38217l78662l38427l21431j14711L94338Q64018R10793O49243
39833A976602M24004K25975j24754l84859j15094M82156O11963m648o48774o13817
39823A828754k38001l61857r68219j048118k9992J175997J114865l43629j692937
$$ plain form
39814 -563137 -2175618 -2740157 -2729211 -3010883 -3490937 -3440321 -2768489 -2132345 -1877859 -1708133
39804 -1708133 -1478626 -1460960 -1550603 -1088327 10492 724426 259968 -663497 -719739 209317
39794 209317 1037799 1107841 857128 795245 733568 382217 22939 101568 532984 800241
39784 800241 524502 -282540 -1277043 -1886213 -1597889 -402242 1112068 2143145 2085833
39775 2085833 784705 -1190310 -2592447 -2406601 -921409 501320 878188 421866 -161242
39766 -161242 -541259 -595540 -34383 1116554 2001254 1638137 120403 -1404455 -1969018
39757 -1969018 -1609536 -1016088 -813541 -1220264 -1984009 -2503115 -2303449 -1531826 -787151
39748 -787151 -435480 -341775 -316576 -506322 -1140115 -2070193 -2793468 -2919686 -2509353 -1931895
$$ packed form
39814e63137j612481n64539J0946k81672m80054N0616O71832O36144K54486J69726
39804a708133K29507J7666q9643M62276J098819P13934m64458r23465n6242R29056
39794B09317Q28482P0042k50713o1883o1677l51351l59278P8629M31416K67257
39784H00241k75739q07042r94503o09170K88324J195647J514310J031077n7312
39775B085833j301128j975015j402137J85846J485192J422729L76868m56322n83108
39766a61242l80017n4281N61157J150937Q84700l63117j517734j524858n64563
39757a969018L59482N93448K02547m06723p63745n19106J99666P71623P44675
39748g87151L51671R3705K5199j89746o33793r30078p23275j26218M10333N77458
$$ plain form
39738 -1931895 -1452936 -1041112 -603856 -278861 -316688 -748395 -1403574 -2187473 -3000524 -3437676
39728 -3437676 -3094123 -2288587 -1899693 -2237703 -2732372 -3111939 -4040191 -5783836 -7022859
39719 -7022859 -6264637 -4121476 -2780359 -3122677 -3748197 -3275491 -2266423 -2000696 -2375637
39710 -2375637 -2199249 -1059378 206604 759448 586461 64484 -590324 -1264360 -1788917
39701 -1788917 -2033079 -1997097 -1806845 -1654690 -1567952 -1242286 -471506 264078 234257 -420909
39691 -420909 -810999 -797404 -1324914 -2616158 -3203396 -1971556 -264360 -328293 -2080559
39682 -2080559 -3189137 -2401096 -1029063 -654091 -986488 -933908 -522590 -565457 -1185691
39673 -1185691 -1786089 -2052674 -2074424 -1789374 -1124601 -465815 -291711 -510060 -724605 -925117
$$ packed form
39738a931895M78959M11824M37256L24995l7827m31707o55179p83899q13051m37152
39728c437676L43553Q05536L88894l38010m94669l79567r28252j743645j239023
39719g022859P58222K143161J341117l42318o25520M72706J009068K65727l74941
39710b375637J76388J139871J265982N52844j72987n21977o54808o74036n24557
39701a788917k44162L5982J90252J52155Q6738L25666P70780P35584k9821o55166
39691d20909l90090J3595n27510j291244n87238J231840J707196o3933j752266
39682b080559j108578P88041J372033L74972l32397N2580M11318m2867o20234
39673a185691o00398k66585k1750K85050O64773O58786J74104k18349k14545k00512
$$ plain form
39663 -925117 -1311082 -1634777 -1380974 -577272 100515 84409 -549314 -1260157 -1513119 -1185584
39653 -1185584 -702152 -581194 -742539 -634130 -164560 94136 -62333 17886 705214 1193796
39643 1193796 645039 -321319 -388026 479330 991789 481297 -271551 -427525 -272713 -506657
39633 -506657 -1127045 -1602557 -1633552 -1253403 -591145 50532 254429 15033 -106642 312423
39623 312423 992935 1391182 1394120 1251092 1073239 751321 237840 -324335 -653441 -441214
39613 -441214 336565 1151423 1328223 889138 626045 1112083 2014008 2660298 2896109 2970438
39603 2970438 2897853 2472007 1819180 1439755 1565952 1735394 1162328 -470340 -2552549
39594 -2552549 -3911054 -3826476 -2748770 -1811923 -1608514 -1718653 -1501343 -949696 -535286
$$ packed form
39663i25117l85965l23695K53803Q03702O77787j6106o33723p10843k52962L27535
39653a185584M83432J20958j61345J08409M69570K58696j56469Q0219O87328M88582
39643A193796n48757r66358o6707Q67356N12459n10492p52848j55974J54812k33944
39633e06657o20388m75512l0995L80149O62258O41677K03897k39396j21675M19065
39623C12423O80512L98247K938j43028j77853l21918n13481n62175l29106K12227
39613d41214P77779Q14858J76800m39085k63093M86038R01925O46290K35811P4329
39603B970438p2585m25846o52827l79425J26197J69442n73066j632668k082209
39594b552549j358505Q4578J077706R36847K03409j10139K17310N51647M14410
$$ plain form
39585 -535286 -546338 -883313 -1250722 -1244532 -485049 970607 2457502 3232759 3123167 2511524
39575 2511524 1878933 1532061 1491712 1346580 466631 -1253259 -3006160 -3785275 -3390156
39566 -3390156 -2440551 -1570963 -1007262 -821845 -1114780 -1829071 -2682664 -3377363 -3708434
39557 -3708434 -3515895 -2770969 -1706906 -682269 39690 271119 -83703 -700072 -801556
39548 -801556 34184 1135524 1322041 242797 -1330495 -2512074 -3004182 -2733111 -1583916
39539 -1583916 31736 959237 388580 -1066186 -2009535 -1892213 -1390672 -1176374 -1040072
39530 -1040072 -572375 -105933 -316622 -1107917 -1601873 -1364745 -1031459 -1321893 -1884156
39521 -1884156 -1749657 -801548 -75988 -388759 -1256870 -1625329 -1232007 -650590 -239868
$$ packed form
39585e35286j1052l36975l67409O190P59483J455656J486895P75257j09592o11643
39575B511524o32591l46872m0349j45132q79949j719890j752901p79115L95119
39566c390156R49605Q69588N63701J85417k92935p14291q53593o94699l31071
39557c708434J92539P44926J064063J024637P21959K31429l54822o16369j01484
39548h01556Q35740J101340J86517j079244j573292j181579m92108K71071J149195
39539a583916J615652R27501n70657j454766r43349J17322N01541K14298J36302
39530a040072M67697M66442k10689p91295m93956K37128L33286k90434n62263
39521a884156J34499R48109P25560l12771q68111l68459L93322N81417M10722
$$ plain form
39512 -239868 169166 472256 -23619 -1644546 -3576971 -4630650 -4513809 -3790216 -2785609
39503 -2785609 -1314703 396815 1345633 883898 -230694 -579788 282296 1511373 2183676
39494 2183676 2173947 1766817 1097237 328864 -123805 -4849 445926 898161 1354575 1838626
39484 1838626 2036420 1704971 1147834 826550 760432 736345 753472 736735 253992 -729327
39474 -729327 -1196458 -161981 1736200 2741938 2103654 730728 -296888 -775431 -766189
39465 -766189 -166549 617723 639681 -351749 -1534972 -2324325 -2986611 -3436317 -2749007 -796931
39455 -796931 892471 1120138 750997 1096986 1619681 934438 -695336 -1764701 -1933056
39446 -1933056 -2039813 -1969731 -658380 1583398 2853167 2352892 1451970 1325559 1301002
$$ packed form
39512b39868M09034L03090m95875j620927j932425j053679J16841P23593J004607
39503b785609J470906J711518R48818m61735j114592l49094Q62084J229077O72303
39494B183676r729m07130o69580p68373m52669J18956M50775M52235M56414M84051
39484A838626J97794l31449n57137l21284o6118k4087J7127j6737m82743r83319
39474g29327m67131J034477J898181J005738o38284j372926j027616m78543R242
39465g66189N99640P84272K1958r91430j183223p89353o62286m49706O87310J952076
39455g96931J689402K27667l69141L45989N22695o85243j629774j069365j68355
39446a933056j06757P0082J311351K241778J269769n00275r00922j26411k4557
$$ plain form
39437 1301002 536865 -280053 -196679 311771 239748 -321552 -702192 -959515 -1423233 -1642232
39427 -1642232 -1039234 -89471 312407 203717 194524 256707 26942 -128469 377469 1053556
39417 1053556 829524 -245123 -1037387 -1077626 -1057457 -1441215 -1770605 -1680314 -1529340 -1551842
39407 -1551842 -1299783 -489448 331699 524324 179013 -297484 -865203 -1583167 -2128471
39398 -2128471 -2180299 -1992174 -2048234 -2345115 -2487843 -2356130 -2213981 -2203095 -2144179 -1892078
39388 -1892078 -1543849 -1165624 -581247 345617 1351012 1953424 2027453 1986937 2273880 2813213
39378 2813213 3130836 2873322 2010646 690078 -792210 -1981059 -2601180 -2851251 -2984047
39369 -2984047 -2734649 -1736456 -427345 228879 55195 -127998 98866 19861 -1020784
$$ packed form
39437A301002p64137q16918Q3374N08450p2023n61300l80640k57323m63718k18999
39427a642232O02998R49763M01878j08690r193O2183k29765j55411N05938O76087
39417A053556k24032j074647p92264m0239K0169l83758l29390R0291J50974k2502
39407a551842K52059Q10335Q21147J92625l45311m76497n67719p17964n45304
39398b128471n1828J88125n6060k96881j42728J31713J42149J0886N8916K52101
39388a892078L48229L78225N84377R26864J005395O02412P4029m0516K86943N39333
39378B813213L17623k57514q62676j320568j482288j188849o20121k50071j32796
39369b984047K49398R98193J309111O56224j73684j83193K26864p9005j040645
$$ plain form
39360 -1020784 -2474429 -3311841 -3216821 -2359956 -703823 1555363 3447575 4174858 4205379
39351 4205379 4434410 4662003 4032224 2672343 1596839 1037648 180954 -1243590 -2332627
39342 -2332627 -2368182 -1814036 -1530475 -1815495 -2551599 -3469246 -3925284 -3269710 -1861537
39333 -1861537 -966774 -1226579 -1923196 -2139307 -1906837 -1762535 -1850635 -1953766 -1861419 -1341725
39323 -1341725 -312010 689661 850266 140755 -688665 -1341854 -2263570 -3412632 -3879931
39314 -3879931 -3294566 -2525209 -2273253 -2036501 -1305653 -677512 -684505 -537515 624694 2039426
39304 2039426 2348470 1733518 1463218 1685093 1331801 164352 -743249 -837328 -939588
39295 -939588 -1780610 -2906362 -3616983 -3930090 -3972231 -3360992 -1979262 -674859 -382942
$$ packed form
39360a020784j453645q37412R5020Q56865J656133K259186J892212P27283L0521
39351D205379K29031K27593o29779j359881j075504n59191q56694j424544j089037
39342b332627l5555N54146K83561k85020p36104r17647m56038O55574J408173
39333a861537Q94763k59805o96617k16111K32470J44302q8100j03131R2347N19694
39323a341725J029715J001671J60605p09511q29420o53189r21716j149062m67299
39314c879931N85365P69357K51956K36752P30848O28141o993J46990J162209J414732
39304B039426L09044o14952k70300K21875l53292j167449r07601r4079j02260
39295i39588q41022j125752p10621l13107m2141O11239J381730J304403K91917
$$ plain form
39286 -382942 -967037 -1594100 -1928780 -2312634 -2950083 -3554811 -3874745 -4109582 -4538036 -4903150
39276 -4903150 -4531425 -3261191 -1993448 -1814171 -2577509 -3001039 -2366111 -1366317 -838320
39267 -838320 -531034 47655 359433 -397860 -1722204 -2290168 -1788467 -1015797 -340047
39258 -340047 512713 1108787 364036 -1585530 -3019146 -2843817 -1953850 -1639070 -1813841
39249 -1813841 -1740343 -1463103 -1454626 -1647901 -1876834 -2579313 -3985894 -5200896 -5202159 -4315237
39239 -4315237 -3635831 -3377958 -2879156 -1940808 -1040775 -367261 290285 749325 544729
39230 544729 -165098 -737340 -1078017 -1579021 -2024295 -1644861 -481987 328081 1217
39221 1217 -1040744 -2125118 -3223947 -4361838 -4953161 -4461852 -3204393 -1873287 -711495
$$ packed form
39286c82942n84095o27063l34680l83854o37449o04728l19934k34837m28454l65114
39276d903150L71725J270234J267743J79277p63338m23530O34928R99794N27997
39267h38320L07286N78689L11778p57293j324344n67964N01701P72670O75750
39258c40047Q52760N96074p44751j949566j433616J75329Q89967L14780j74771
39249a813841P3498K77240Q477j93275k28933p02479j406581j215002j263Q86922
39239d315237O79406K57873M98802R38348R00033O73514O57546M59040k04596
39230E44729p09827n72242l40677n01004m45274L79434J162874Q10068l26864
39221A217j041961j084374j098829j137891n91323M91309J257459J331106J161792
$$ plain form
39212 -711495 243025 540991 -285431 -1866292 -3167799 -3539667 -3184982 -2636242 -2143649
39203 -2143649 -1593561 -776230 254366 975673 776571 -219135 -988782 -696265 202404
39194 202404 425908 -543956 -1807376 -2147960 -1404030 -442319 -20502 -100201 -279447 -476698
39184 -476698 -884014 -1419644 -1628572 -1242164 -572312 -131013 12663 284158 1066078 2261033
39174 2261033 3315046 3542367 2598644 925570 -347934 -309232 831334 1968409 2312201
39165 2312201 2144793 2273159 2972009 3680496 3643988 2675895 1310514 342411 244666 906480
39155 906480 1732108 1911825 844526 -1298135 -3403380 -4266141 -3853950 -3366588 -3732048
39146 -3732048 -4416859 -4168618 -2607140 -502902 1288895 2474731 2974268 2678027 1754443
$$ packed form
39212g11495R54520K97966q26422j580861j301507l71868L54685N48740M92593
39203b143649N50088Q17331J030596P21307j99102r95706p69647K92517Q98669
39194B02404K23504r69864j263420l40584P43930R61711M21817p9699j79246j97251
39184d76698m07316n35630k08928L86408O69852M41299J43676K71495P81920J194955
39174B261033J054013K27321r43723j673074j273504L8702J140566J137075L43792
39165B312201j67408J28366O98850P08487l6508r68093j365381r68103r7745O61814
39155I06480Q25628J79717j067299k142661k105245q62761M12191M87362l65460
39146c732048o84811K48241J561478K104238J791797J185836M99537k96241r23584
$$ plain form
39137 1754443 677669 -229986 -911074 -1263817 -1251117 -1267988 -1703067 -2093049 -1538074 -149019
39127 -149019 824775 681633 130683 -110683 -589314 -2026013 -3719392 -4282439 -3642455
39118 -3642455 -3091245 -3353022 -3688783 -3148683 -1831788 -541557 171110 267154 -12825
39109 -12825 -324334 -437863 -434979 -493674 -550855 -470261 -358935 -288560 67056 947351 1892156
39098 1892156 2330691 2567304 3249253 3947030 3448022 1714443 319018 312954 758565
39089 758565 279469 -837983 -1239989 -612240 69407 175933 106514 245180 285915 -83647
39079 -83647 -625789 -1052150 -1456827 -1887860 -2018461 -1631672 -995796 -390852 293041 1016944
39069 1016944 1075785 -152683 -2033396 -3005634 -2366574 -1167869 -856169 -1391242 -1414730
$$ packed form
39137A754443j076774r07655o81088l52743J2700j6871m35079l89982N54975J389055
39127a49019R73794j43142n50950k41366m78631j436699j693379n63047O39984
39118c642455N51210k61777l35761N40100J316895J290231P12667R6044k79979
39109a2825l11509j13529K884n8695n7181Q0594J11326P0375L55616Q80295R44805
39098A892156M38535K36613O81949O97777m99008j733579j395425o064M45611
39089G58565m79096j117452m02006O27749O81647J06526o9419J38666M0735l69562
39079h3647n42142m26361m04677m31033j30601L86789O35876O04944O83893P23903
39069A016944N8841j228468j880713r72238O39060J198705L11700n35073k3488
$$ plain form
39060 -1414730 -250590 1064175 1156655 112497 -806162 -885471 -519549 -103387 607744
39051 607744 1630385 2128994 1443029 251467 -120106 630276 1535305 1724746 1332485
39042 1332485 932405 714595 561815 572904 1127340 2454336 4227678 5596433 5793058
39033 5793058 4908522 3886828 3459760 3260135 2370856 612460 -1178628 -2090289 -1864970
39024 -1864970 -735918 837470 2086841 2164923 879941 -1045593 -2700116 -3746538
39016 -3746538 -4310507 -4438360 -3972874 -2816937 -1113752 725926 2102530 2581278 2342368
39007 2342368 2086106 2312667 2839308 3149361 3018931 2612670 2115442 1524074 833287
38998 833287 294799 341401 1120591 2142271 2663076 2520157 2235167 2091473 1628395 561016
$$ packed form
39060a414730J164140J314765R2480j044158r18659p9309L65922M16162P11131
39051F07744J022641M98609o85965j191562l71573P50382R05029J89441l92261
39042A332485m00080k17810j52780J1089N54436J326996J773342J368755J96625
39033E793058q84536j021694m27068j99625q89279j758396j791088r11661K25319
39024a864970J129052J573388J249371P8082j284982j925534j654523j046422
39016c746538n63969j27853M65486J155937J703185J839678J376604M78748k38910
39007B342368k56262K26561N26641L10053j30430m06261m97228n91368o90787
38998H33287n38488M6602P79190J021680N20805j42919k84990j43694m63078j067379
$$ plain form
38988 561016 -313278 -3368 1129453 1751617 1509226 1480589 2335938 3131665 2638547 1072382
38978 1072382 -291943 -672168 -212058 641237 1429116 1722786 1581800 1638013 2081986
38969 2081986 2031032 738212 -982968 -1588681 -895993 -264413 -619880 -1337430 -1393741
38960 -1393741 -731211 11022 470596 748280 1033129 1444612 1972341 2354265 2329534 2134036
38950 2134036 2310994 2856012 3033675 2328083 1159150 334796 143809 310903 520843
38941 520843 615454 506425 249273 42622 -147520 -786011 -2213858 -3940901 -4874853
38932 -4874853 -4429446 -3220729 -2423561 -2426200 -2363980 -1204466 871462 2581677 3037670
38923 3037670 2616565 2176092 2009849 1983250 2086359 2196630 1808408 820051 175813 746945
$$ packed form
38988E61016q74294L09910J132821O22164k42391k8637Q55349P95727m93118j566165
38978A072382j364325l80225M60110Q53295P87879K93670j40986N6213M43973
38969B081986n0954j292820j721180o05713O92688O31580l55467p17550n6311
38960a393741O62530P42233M59574K77684K84849M11483N27729L81924k4731j95498
38950B134036J76958N45018J77663p05592j168933q24354j90987J67094K09940
38941E20843R4611j09029k57152k06651j90142o38491j427847j727043r33952
38932d874853M45407J208717P97168k639O2220J159514K075928J710215M55993
38923C037670m21105m40473j66243k6599J03109J10271l88222r88357o44238N71132
$$ plain form
38913 746945 1867268 2117474 1432458 1121506 1663589 1897089 906269 -589584 -1480991
38904 -1480991 -1749344 -1799595 -1373470 -266839 708978 762319 521296 1066134 1970901 1763879
38894 1763879 263615 -979106 -851733 -63007 144516 -333605 -758672 -839382 -986580
38885 -986580 -1548112 -2320816 -2791296 -2656842 -2160230 -1911467 -2247975 -2885863 -3380707 -3641311
38875 -3641311 -3644571 -3074910 -1928033 -1153265 -1747658 -3225164 -3947010 -3161988 -1786524
38866 -1786524 -841658 -125398 911894 1842329 1790511 846440 -26667 -396338 -843868
38857 -843868 -1912286 -3189607 -3729199 -3086845 -1738470 -592545 -169840 -230541 -238590
38848 -238590 -127436 -327941 -974975 -1501013 -1327108 -639048 -61794 223101 561974 1136327
$$ packed form
38913G46945J120323K50206o85016l10952N42083K33500r90820j495853q91407
38904a480991k68353n0251M26125J106631R75817N3341k41023N44838R04767k07022
38894A763879j500264j242721J27373P88726K07523m78121m25067q0710j47198
38885i86580n61532p72704m70480J34454M96612K48763l36508o37888m94844k60604
38875c641311l260N69661J146877P74768n94393j477506p21846P85022J375464
38866a786524R44866P16260J037292R30435n1818r44071q73107l69671m47530
38857h43868j068418j277321n39592O42354J348375J145925M22705o0701q049
38848b38590J11154k00505o47034n26038J73905O88060N77254K84895L38873N74353
$$ plain form
38838 1136327 1699004 2067863 2433045 2964632 3408135 3315299 2556745 1461637 526438
38829 526438 53502 -12909 50959 92606 234671 553826 713004 220383 -896996 -1997109
38819 -1997109 -2550514 -2646350 -2530126 -2021284 -936652 87613 -35374 -1397721 -2644143
38810 -2644143 -2475166 -1212735 -283868 -402791 -965261 -1199674 -1171826 -1418002 -2162806
38801 -2162806 -3209285 -4157403 -4475438 -3841607 -2727295 -2135856 -2376122 -2618645 -2135046
38792 -2135046 -1367350 -1052080 -837197 211016 1985181 3339851 3742946 3806827 3897080
38783 3897080 3347385 1742968 109161 -148074 915833 1873403 1695567 665007 -455017
38774 -455017 -1378809 -2126837 -2469415 -2091869 -1172632 -337777 62411 306005 701990 925638
$$ packed form
38838A136327N62677L68859L65182N31587M43503r2836p58554j095108r35199
38829E26438m72936o6411O3868M1647J42065L19155J59178m92621j117379j100113
38819a997109n53405r5836J16224N08842J084632J024265j22987j362347j246422
38810b644143J68977J262431R28867j18923n62470k34413K7848k46176p44804
38801b162806j046479r48118l18035O33831J114312N91439k40266k42523M83599
38792b135046P67696L15270K14883J048213J774165J354670M03095O3881R0253
38783C897080n49695j604417j633807k57235J063907R57570j77836j030560j120024
38774d55017r23792p48028l42578L77546R19237Q34855M00188K43594L95985K23648
$$ plain form
38764 925638 437451 -484357 -774016 52225 1114317 1285419 649063 149806 125880 86072
38754 86072 -157525 -151954 193905 225276 -396634 -1072586 -1282247 -1469217 -2111771 -2480021
38744 -2480021 -1371630 1011129 2877156 2842127 1505925 611580 927655 1447106 763578
38735 763578 -1116434 -2749239 -3010117 -2317449 -1765135 -1581885 -1169123 -321579 558605
38726 558605 1395023 2507300 3552077 3504823 2184792 809818 419762 659235 774445
38717 774445 793663 826948 249023 -1151294 -2045304 -1115723 770647 1535931 771256 -18710
38707 -18710 167 -8382 -583805 -810183 -32776 720425 221781 -1070344 -1819330 -1768066
38697 -1768066 -1667702 -1731567 -1402568 -537736 228093 394275 100027 -354868 -833991 -1128824
$$ packed form
38764I25638m88187r21808k89659Q26241J062092J71102o36356m99257k3926l9808
38754H6072k43597N571L45859L1371o21910o75952k09661j86970o42554l68250
38744b480021J108391K382759J866027l5029j336202q94345L16075N19451o83528
38735G63578j880012j632805k60878O92668N52314J83250M12762Q47544Q80184
38726E58605Q36418J112277J044777m7254j320031j374974l90056K39473J15210
38717G74445J9218L3285n77925j400317q94010R29581J886370P65284p64675p89966
38707a8710J8877q549n75423k26378P77407P53201m98644j292125p48986N1264
38697a768066J00364o3865L28999Q64832P65829J66182k94248m54895m79123k94833
$$ plain form
38687 -1128824 -1008349 -664041 -639547 -1175607 -1983061 -2696246 -3117064 -2952386 -1862996
38678 -1862996 -103371 1259568 1250272 98468 -844868 -429225 1135882 2510977 2590942
38669 2590942 1562518 561866 389401 768847 904982 508825 20622 -90670 58365
38660 58365 -9766 -448640 -868977 -877571 -657368 -766592 -1374509 -1999687 -2169447 -2071817
38650 -2071817 -2249270 -2807074 -3293710 -3318565 -2917427 -2272158 -1437182 -487424 342743 846923
38640 846923 1006306 871070 477585 -19193 -333584 -318686 -138091 -76400 -247124 -491879
38630 -491879 -480464 15253 797387 1322277 1357798 1419944 2160898 3366437 4031382 3539367
38620 3539367 2340987 1276309 622945 106416 -447990 -865766 -972260 -940453 -1203676
$$ packed form
38687a128824J20475L44308K4494n36060q07454p13185m20818J64678J089390
38678a862996J759625J362939r296j151804r43336M15643J565107J375095P9965
38669B590942j028424j000652j72465L79446J36135l96157m88203j11292J49035
38660E8365o8131m38874m20337q594K20203j09224o07917o25178j69760R7630
38650b071817j77453n57804m86636k4855M01138O45269Q34976R49758Q30167N04180
38640H46923J59383j35236l93485m96778l14391J4898J80595O1691j70724k44755
38630d91879J1415M95717P82134N24890L5521O2146P40954J205539O64945m92015
38620C539367j198380j064678o53364n16529n54406m17776j06494L1807k63223
$$ plain form
38611 -1203676 -2006764 -3033536 -3627664 -3522925 -3157065 -3037375 -3093670 -3070160 -3214994 -3875361
38601 -3875361 -4583826 -4444258 -3520024 -2911186 -3128201 -3289054 -2482595 -1139000 -310190
38592 -310190 -198227 -236460 -219963 -470094 -1048361 -1599888 -1962652 -2294792 -2575707 -2509381
38582 -2509381 -1960923 -1097315 -156595 567856 711259 278903 -89037 148417 582062
38573 582062 359355 -543374 -1258449 -1276971 -1006413 -830197 -322072 1063965 2905077
38564 2905077 3978237 3488974 1853848 285324 -242207 321587 1245977 1728288 1464692
38555 1464692 680484 -129882 -455101 -115986 393271 191061 -1038565 -2569880 -3419666
38546 -3419666 -3409279 -3118237 -3015451 -3083695 -3176732 -3273662 -3342884 -3246717 -2792235 -1794709
$$ packed form
38611a203676q03088j026772n94128J04739L65860J19690n6295K3510j44834o60367
38601c875361p08465J39568R24234O08838k17015j60853Q06459J343595Q28810
38592c10190J11963l8233J6497k50131n78267n51527l62764l32140k80915O6326
38582b509381N48458Q63608R40720P24451J43403m32356l67940K37454M33645
38573E82062k22707r02729p15075j8522K70558J76216N08125J386037J841112
38564B905077J073160m89263j635126j568524n27531N63794R24390M82311k63596
38555A464692p84208q10366l25219L39115N09257k02210j229626j531315q49786
38546c419666J0387K91042J02786o8244r3037r6930o9222R6167M54482R97526
$$ plain form
38536 -1794709 -361909 766572 732372 -179967 -439764 854268 2557542 2871878 1694726
38527 1694726 445102 -100095 -367048 -457623 245111 1466845 1641678 68906 -1795227
38518 -1795227 -2319380 -1920467 -2017900 -2607899 -2419056 -1092987 305720 934739 994501
38509 994501 739916 -94168 -1464947 -2607317 -2970854 -2857244 -2700988 -2404131 -1869349
38500 -1869349 -1574934 -2012358 -2937267 -3709095 -4101702 -4338567 -4577808 -4789410 -4948913
38491 -4948913 -4971647 -4625899 -3850102 -2962287 -2213038 -1377391 -242879 714517 759109 -9657
38481 -9657 -614787 -435615 57057 86324 -422561 -1081002 -1863418 -2992145 -4111168 -4352739
38471 -4352739 -3510971 -2578941 -2631418 -3490103 -4038165 -3724890 -3150069 -3028843 -3152410 -2818114
$$ packed form
38536a794709J432800J128481l4200r12339k59797J294032J703274L14336j177152
38527A694726j249624n45197k66953r0575P02734J221734J74833j572772j864133
38518a795227n24153L98913r7433n89999J88843J326069J398707O29019N9762
38509I94501k54585q34084j370779j142370l63537J13610J56256K96857N34782
38500a869349K94415m37424r24909p71828l92607k36865k39241k11602j59503
38491d948913k2734L45748P75797Q87815P49249Q35647J134512R57396M4592p68766
38481i657o05130J79172M92672K9267n08885o58441p82416j128727j119023k41571
38471d352739Q41768R32030n2477q58685n48062L13275N74821J21226j23567L34296
$$ plain form
38461 -2818114 -1965484 -1270402 -1078676 -827351 104197 1326386 1792021 1177199 330106
38452 330106 115861 329040 221205 -270973 -520223 -328470 -280095 -759177 -1268905 -1142553
38442 -1142553 -464999 154540 359886 175002 -266758 -623297 -329483 711652 1669307
38433 1669307 1629249 687775 -415782 -1458640 -2665534 -3666200 -3648960 -2768238 -2316370
38424 -2316370 -2949553 -3601721 -2862668 -831967 1079438 1725880 972810 -679678 -2478666
38415 -2478666 -3662361 -3968700 -3806299 -3552677 -3017193 -2025609 -1028389 -454118 75080
38406 75080 1013687 1741197 1217708 -317887 -1464133 -1638377 -1788742 -2676561 -3526863
38397 -3526863 -3176263 -1773314 -407678 424641 978816 1175274 488156 -904516 -1793592
$$ packed form
38461b818114Q52630O95082J91726K51325R31548J222189M65635o14822q47093
38452C30106k14245K13179j07835m92178k49250J91753M8375m79082n09728J26352
38442a142553O77554O19539K05346j84884m41760l56539K93814J041135R57655
38433A669307m0058r41474j103557j042858j206894j000666J7240Q80722M51868
38424b316370o33183o52168P39053K030701J911405O46442p53070j652488j798988
38415b478666j183695l06339J62401K53622N35484R91584R97220N74271N29198
38406G5080R38607P27510n23489j535595j146246j74244j50365q87819q50302
38397c526863L50600J402949J365636Q32319N54175J96458o87118j392672q89076
$$ plain form
38388 -1793592 -1282422 50706 831436 456755 -438636 -921640 -757800 -484296 -817465
38379 -817465 -2063023 -3863038 -5376556 -5849943 -5186644 -3978795 -2964378 -2485930 -2420328
38370 -2420328 -2444547 -2284721 -1854288 -1283021 -749707 -265332 205113 397021 -94490 -1071159
38360 -1071159 -1553303 -835674 526251 1359770 1339569 1119554 1068749 765828 3999 -593203
38350 -593203 -546585 -441927 -1146473 -2535858 -3728933 -4303662 -4564968 -4774416 -4803141 -4500343
38340 -4500343 -3828069 -2682053 -1108264 386245 1268559 1610831 1743570 1503633 593203
38331 593203 -438982 -542334 353275 1159408 1318362 1748068 3399718 5541922 6399120
38322 6399120 5296887 3421785 2401975 2656260 3299279 3332421 2636481 1789130 1138049
$$ packed form
38388a793592N11170J333128P80730l74681q95391m83004J63840K73504l33169
38379h17465j245558j800015j513518m73387O63299J207849J014417M78448O5602
38370b420328k4219J59826M30433N71267N33314M84375M70445J91908m91511r76669
38360a071159m82144P17629J361925Q33519k0201k20015n0805l02921p61829n97202
38350e93203M6618J04658p04546j389385j193075n74729k61306k09448k8725L02798
38340d500343O72274J146016J573789J494509Q82314L42272J32739k39937r10430
38331E93203j032185j03352Q95609Q06133J58954M29706J651650K142204Q57198
38322F399120j102233j875102j019810K54285O43019L3142o95940q47351o51081
$$ plain form
38313 1138049 452356 -349016 -625111 207291 1569105 2209701 1819228 1297569 1227975
38304 1227975 1024836 86769 -1059009 -1510052 -1298764 -1196525 -1627184 -2431099 -3272018
38295 -3272018 -3608341 -2761283 -836444 865210 1295070 1127344 1690590 2742506 2698904
38286 2698904 1140412 -383516 -559090 -26970 -120597 -957448 -1749884 -2161902 -2239107
38277 -2239107 -1612396 -46612 1491125 1590375 296312 -868093 -1018288 -985294 -1789505
38268 -1789505 -2974445 -3266549 -2339378 -1073508 -308477 -103299 -167637 -299216 -257566
38259 -257566 175791 707490 555656 -642633 -2202907 -3035881 -2773382 -1954964 -1257307
38250 -1257307 -925456 -902352 -1072079 -1249453 -1265853 -1224403 -1382123 -1624384 -1400462 -461907
$$ packed form
38313A138049o85693q01372k76095Q32402J361814O40596l90473n21659o9594
38304A227975k03139r38067j145778m51043K11288J02239m30659q03915q40919
38295c272018l36323Q47058J924839J701654M29860j67726N63246J051916m3602
38286B698904j558492j523928j75574N32120r3627q36851p92436m12018p7205
38277b239107O26711J565784J537737R9250j294063j164405j50195L2994q04211
38268a789505j184940k92104R27171J265870P65031K05178o4338j31579M1650
38259b57566M33357N31699j51834j198289j560274q32974K62499Q18418O97657
38250a257307L31851K3104j69727j77374j6400M1450j57720k42261K23922R38555
$$ plain form
38240 -461907 631140 1104261 829687 176908 -730657 -1944782 -2926777 -2677337 -1012859
38231 -1012859 883912 1718921 1504945 1202823 1315417 1534610 1584819 1575068 1413931 694653
38221 694653 -451081 -1042505 -376036 926941 1580571 1125008 245929 -209566 4232
38212 4232 629367 1170046 1063432 177493 -759054 -791197 25248 590520 222709 -451218
38202 -451218 -506230 -79030 -75639 -851189 -1885434 -2654527 -3153526 -3495711 -3558463 -3195327
38192 -3195327 -2423629 -1327416 -129297 658223 633510 120907 -126266 34747 -54666
38183 -54666 -780033 -1574976 -1712671 -1258522 -708106 -101511 828299 1844048 2247508 1756761
38173 1756761 808574 -40354 -526122 -489988 140304 1017013 1521632 1463618 1194250 858916
$$ packed form
38240d61907J093047M73121k74574o52779r07565j214125r81995K49440J664478
38231a012859J896771Q35009k13976l02122J12594K19193N0209r751j61137p19278
38221F94653j145734n91424O66469J302977O53630m55563q79079m55495K13798
38212D232O25135N40679j06614q85939r36547l2143Q16445N65272l67811o73927
38202d51218n5012M27200L391p75550j034245p69093m98999l42185o2752L63136
38192c195327P71698J096213J198119P87520k4713n12603k47173J61013q9413
38183e4666p25367p94943j37695M54149N50416O06595R29810J015749M03460m90747
38173A756761r48187q48928m85768L6134O30292Q76709N04619n8014k69368l35334
$$ plain form
38163 858916 125058 -976461 -1552685 -878631 423327 1006329 474534 -331198 -709373
38154 -709373 -867578 -1039009 -739113 385980 1547659 1533991 266874 -1088402 -1509433
38145 -1509433 -962825 71537 1152100 1816994 1733394 1246349 1171729 1680540 1984331
38136 1984331 1570631 1122558 1527892 2414195 2469905 1069358 -1073052 -2756640 -3229979
38127 -3229979 -2455662 -1132809 -409406 -912103 -2029427 -2702784 -2801589 -2978002 -3259036
38118 -3259036 -2818500 -1441422 -233573 -233397 -989768 -1238489 -583215 190043 304027 -61847
38108 -61847 -50281 877302 2208707 2710149 1797130 474989 328773 1566634 2849568
38099 2849568 3240435 3326974 3851253 4199969 3266523 1257908 -425288 -929802 -724486
$$ packed form
38163H58916p33858j101519n76224O74054J301958N83002n31795q05732l78175
38154g09373j58205j71431K99896J125093J161679j3668j267117j355276m21031
38145a509433N46608J034362J080563O64894q3600m87045p4620N08811L03791
38136A984331m13700m48073M05334Q86303N5710j400547k142410j683588m73339
38127c229979P74317J322853P23403n02697j117324o73357r8805j76413k81034
38118c259036M40536J377078J207849J76p56371k48721O55274P73258J13984l65874
38108f1847J1566R27583J331405N01442r13019j322141j46216J237861J282934
38099B849568L90867Q6539N24279L48716r33446k008615j683196n04514K05316
$$ plain form
38090 -724486 -726255 -1342916 -2313571 -2941531 -2605123 -1482981 -508845 -192080 29770 712806
38080 712806 1364073 1360006 1257924 1981867 3123138 3421069 2727930 2023295 1505229 329091
38070 329091 -1419937 -2204012 -1279399 -1091 183845 -158436 386243 1712555 2399267
38061 2399267 1800795 646644 -230295 -629819 -514718 164622 1031197 1438197 1259067
38052 1259067 1022205 1210432 1841985 2672074 3378366 3656391 3539074 3433457 3406329 2732055
38042 2732055 786362 -1774860 -3421413 -3366125 -2257108 -1268223 -992183 -1205917 -1225892
38033 -1225892 -478521 842789 1711371 1278619 -118136 -1379422 -1909218 -1922025 -1679628
38024 -1679628 -1164767 -523518 -90935 166625 566690 927251 605151 -422423 -1281332
$$ packed form
38090g24486j769o16661r70655o27960L36408J122142R74136L16765K21850O83036
38080G12806O51267m067j02082P23943J141271K97931o93139p04635n18066j176138
38070C29091j749028p84075R24613J278308J84936l42281N44679J326312O86712
38061B399267n98472j154151q76939l99524J15101O79340Q66575M07000j79130
38052A259067k36862J88227O31553Q30089P06292K78025j17317j05617k7128o74274
38042B732055j945693k561222j646553N5288J109017R88885K76040k13734j9975
38033a225892P47371J321310Q68582m32752j396755j261286n29796j2807K42397
38024a679628N14861O41249M32583K57560M00065L60561l22100j027574q58909
$$ plain form
38015 -1281332 -1444855 -1534687 -2240783 -3042349 -2883297 -1839168 -1156437 -1530264 -2169778
38006 -2169778 -1983532 -1101059 -577352 -840287 -1177759 -917576 -432928 -424607 -644905 -211407
37996 -211407 804382 1054466 -321700 -2301415 -3065233 -2080806 -402844 780205 1096175
37987 1096175 680422 -165166 -908060 -1137812 -1134070 -1433777 -1777988 -1287183 132982 1414853
37977 1414853 1710433 1344524 943514 457394 -265069 -660488 -142323 798279 1109419
37968 1109419 645072 298105 661766 1264238 1305743 677942 57872 228867 1348063
37959 1348063 2718962 3361065 2924128 1853323 609180 -797729 -2264268 -3212410 -3278250
37950 -3278250 -2861333 -2367532 -1473137 -17499 872271 -196307 -2755458 -4570292 -4170110
$$ packed form
38015a281332j63523q9832p06096q01566J59052J044129O82731l73827o39514
38006b169778J86246Q82473N23707k62935l37472K60183M84648Q321k20298M33498
37996b11407J015789K50084j376166j979715p63818R84427J677962J183049L15970
37987A096175m15753q45588p42894k29752L742k99707l44211M90805J420165J281871
37977A414853K95580l65909m01010m86120p22463l95419N18165R40602L11140
37968A109419m64347l46967L63661O02472M1505o27801o20070J70995J119196
37959A348063J370899O42103m36937j070805j244143j406909j466539r48142o5840
37950c278250M16917M93801Q94395J455638Q89770j068578k559151j814834M00182
$$ plain form
37941 -4170110 -2336716 -727468 25361 277632 271076 -90741 -719417 -1241402 -1307464 -743686
37931 -743686 287701 1069844 785520 -415984 -1251071 -668040 931585 2215948 2346809
37922 2346809 1560185 722697 665433 1531459 2403548 2052359 458780 -989059 -1318459
37913 -1318459 -1258701 -1917200 -2908896 -2988680 -2084645 -1291138 -947578 -227921 1086085 1905811
37903 1905811 1584423 1081134 1396853 1858265 1182564 -397696 -1406789 -1259631 -811980
37894 -811980 -689864 -321791 826502 1991211 1942308 680602 -483832 -509046 341184
37885 341184 1185395 1704081 2161846 2500673 2097630 706520 -820790 -1294961 -548214
37876 -548214 439324 725594 229279 -618079 -1406041 -1729650 -1277679 -365865 95431 -345199
$$ packed form
37941d170110J833394J609248P52829K52271o556l61817o28676n21985o6062N63778
37931g43686J031387P82143k84324j201504q35087N83031J599625J284363J30861
37922B346809p86624q37488n7264Q66026Q72089l51189j593579j447839l29400
37913a318459N9758o58499r91696p9784R04035P93507L43560P19657J314006Q19726
37903A905811l21388n03289L15719M61412o75701j580260j009093J47158M47651
37894h11980J22116L68073J148293J164709m8903j261706j164434k5214Q50230
37885C41184Q44211N18686M57765L38827m03043j391110j527310m74171P46747
37876e48214R87538K86270m96315q47358p87962l23609M51971R11814M61296m40630
$$ plain form
37866 -345199 -1027014 -1058497 -485327 -9500 132868 305620 640580 809546 648077 338447
37856 338447 -129451 -1030519 -2221725 -2969497 -2789138 -2026664 -1300878 -771953 -324168
37847 -324168 -112359 -419842 -1082503 -1490590 -1253716 -642105 -267417 -408331 -721017 -628559
37837 -628559 35290 853997 1291514 1146897 499513 -477438 -1399862 -1680416 -1084660 -120011
37827 -120011 540514 843805 1086329 1087647 374072 -801955 -1421562 -947693 35858 752902
37817 752902 1180464 1643402 2037397 2041296 1747290 1521129 1448398 1377170 1320336 1393052 1510626
37806 1510626 1536394 1589232 1841444 2126768 2088413 1659290 1157226 964311 1207466 1558512
37796 1558512 1311255 73452 -1450359 -1900351 -860829 470809 709061 -63833 -665772
$$ packed form
37866c45199o81815l1483N73170M75827J42368J72752L34960J68966j61469l09630
37856C38447m67898r01068j191206p47772J80359P62474P25786N28925M47785
37847c24168K11809l07483o62661m08087K36874O11611L74688j40914l12686R2458
37837f28559O63849Q18707M37517j44617o47384r76951r22424k80554N95756R64649
37827a20011O60525L03291K42524J318p13575j176027o19607M73869R83551P17044
37817G52902M27562M62938L93995L899k94006k26161p2731p1228n6834P2716J17574
37806A510626K5768N2838K52212K85324l8355m29123n02064j92915K43155L51046
37796A558512k47257j237803j523811m49992J039522J331638K38252p72894o01939
$$ plain form
37787 -665772 -457406 140683 599215 945718 1352962 1652306 1526381 943620 282583 53929
37777 53929 322314 390532 -452425 -1678212 -1724520 27666 2189682 3042834 2625810 2173647
37767 2173647 2101874 1878044 1549784 1837371 2610180 2755365 1931401 1112513 921024 760834
37757 760834 253127 164796 937831 1499950 789230 -429432 -620956 258716 929288 841216
37747 841216 665361 790616 641727 -235173 -1396704 -2155927 -2305833 -1946863 -1200354
37738 -1200354 -318108 377842 765941 781937 181849 -982105 -1859000 -1568901 -428420
37729 -428420 431040 698783 1187114 2281260 3093109 2692449 1386814 150726 -582750
37720 -582750 -912624 -823895 -324579 125747 72096 -243912 -289168 -150548 -357972 -875213
$$ packed form
37787f65772K08366N98089M58532L46503M07244K99344j25925n82761o61037k28654
37777E3929K68385O8218q42957j225787m6308J752186K162016Q53152m17024m52163
37767B173647p1773k23830l28260K87587P72809J45185q23964q18888j91489j60190
37757G60834n07707q8331P73035N62119p10720j218662j91524Q79672O70572q8072
37747H41216j75855J25255j48889q76900j161531p59223j49906L58970P46509
37738a200354Q82246O95950L88099J5996o00088j163954q76895K90099J140481
37729d28420Q59460K67743M88331J094146Q11849m00660j305635j236088p33476
37720e82750l29874Q8729M99316M50326n3651l16008m5256J38620k07424n17241
$$ plain form
37710 -875213 -979251 -278717 710285 1224087 1100784 793380 834283 1414295 2239616 2731414
37700 2731414 2608684 2282439 2376238 2874778 3149759 2869361 2379089 1986243 1397190 294666
37690 294666 -887197 -1300405 -683584 381976 1141015 1236964 720549 -78138 -655910
37681 -655910 -688085 -363218 -101028 51372 375283 804598 778086 23616 -869828 -1025232
37671 -1025232 -269490 702469 1038856 431009 -726307 -1654851 -1797436 -1304500 -838465
37662 -838465 -790437 -861875 -539458 257258 1177289 1809917 1808955 945549 -578510 -2044837
37652 -2044837 -2822754 -2969270 -2957761 -3011166 -3054502 -3099858 -3194786 -3116531 -2634822 -2041391
37642 -2041391 -1913294 -2320850 -2737510 -2796190 -2710243 -2884704 -3484349 -4360919 -4986353 -4581298
$$ packed form
37710h75213j04038P00534R89002N13802j23303l07404M0903N80012Q25321M91798
37700B731414j22730l26245R3799M98540K74981k80398m90272l92846n89053j102524
37690B94666j181863m13208O16821J065560P59039R5949n16415p98687n77772
37681f55910l2175L24867K62190J52400L23911M29315k6512p54470q93444j55404
37671a025232P55742R71959L36387o07847j157316r28544j42585M92936M66035
37662h38465M8028p1438L22417P96716R20031O32628r62q63406j524059j466327
37652b044837p77917j46516J1509n3405m3336m5356r4928P8255M81709N93431
37642b041391J28097m07556m16660n8680Q5947j74461n99645q76570o25434M05055
$$ plain form
37632 -4581298 -2942429 -1123110 -525751 -1155564 -1570403 -865935 156189 357468 -36619
37623 -36619 -10813 514778 653511 133099 -172522 426536 1418298 1901472 1810196 1667938
37613 1667938 1474800 684842 -616111 -1306730 -550088 953114 1770660 1608777 1515762
37604 1515762 2151147 2855930 2908521 2728923 2987135 3313843 3032285 2609239 3017865 3901148
37594 3901148 3825842 2452563 1058821 616795 697667 710776 847360 1119091 782028 -337445
37584 -337445 -1037778 -306368 1180601 2103024 2216280 2032883 1617991 837127 120565
37575 120565 -168685 -542350 -1457045 -2198609 -1886530 -993675 -564725 -472794 93748 848539
37565 848539 733268 -176050 -750367 -801262 -1303362 -2378922 -2758206 -1845236 -815236
$$ packed form
37632d581298J638869J819319N97359o29813m14839P04468J022124K01279l94087
37623c6619K5806N25591J38733n20412l05621N99058R91762M83174r1276j42258
37613A667938j93138p89958j300953o90619P56642J503202Q17546j61883r3015
37604A515762O35385P04783N2591j79598K58212L26708k81558m23046M08626Q83283
37594C901148p5306j373279j393742m42026Q0872J3109J36584K71731l37063j119473
37584c37445p00333P31410J486969R22423J13256j83397m14892p80864p16562
37575A20565k89250l73665r14695p41564L12079Q92855M28950R1931N66542P54791
37565H48539j15271r09318n74317n0895n02100j075560l79284R12970J030000
$$ plain form
37556 -815236 -809760 -1276303 -1097310 -415080 -216412 -662131 -907437 -437827 253967 464710
37546 464710 239315 212167 628815 941255 708755 575477 1526702 3134121 3663013 2456749
37536 2456749 1080233 1177479 2229816 2636849 2116058 1607965 1516207 1566793 1853481 2489281
37526 2489281 2743462 2092416 1571269 2411867 3935395 4607196 4518031 4790888 5269474
37517 5269474 5195383 5530915 7890883 11662327 15112900 18842083 24771089 32155296 38537588
37508 38537588 44466113 52791170 63300399 73407174 84629260 102080954 126678352
37501 126678352 156185165 196355161 258869215 338218311 399534688 405007252 352617064
37494 352617064 277748381 216074801 175713762 146678140 122822305 105098713 92225110
$$ packed form
37556h15236N476m66543J78993O82230J98668m45719k45306M69610O91794K10743
37546D64710k25395k7148M16648L12440k32500j33278R51225J607419N28892j206264
37536B456749j376516R7246J052337M07033n20791n08093r1758N0586K86688O35800
37526B489281K54181o51046n21147Q40598J523528O71801q9165K72857M78586
37517E269474p4091L35532K359968L771444L450573L729183N929006P384207O382292
37508C8537588N928525Q325057J0509229J0106775J1222086J7451694K4597398
37501A26678352K9506813M0169996O2514054P9349096O1316377N472564n2390188
37494C52617064p4868683o1673580m0361039k9035622k3855835j7723592j2873603
$$ plain form
37487 92225110 80011583 68002177 58953316 52631192 46033059 38908767 33778722 30896542
37479 30896542 27879033 24202616 21802807 21032582 19897425 17772469 16417622 16611046
37471 16611046 16821657 16030817 15173640 14902881 14339511 13009062 11903385 11605554 11152713
37462 11152713 9724021 7935651 6632975 5776086 5228829 5313558 5898626 6194852 6079284
37453 6079284 6359753 7120712 7165044 5901257 4502517 4190108 4449657 4076251 3136816
37444 3136816 2657562 2860738 2906081 2266188 1420041 1077005 1325311 1687841 1659475 1103315
37434 1103315 335437 -115125 77644 776702 1418286 1305576 196862 -1157000 -1428154
37425 -1428154 -116546 1738261 2754764 2798151 2686875 2606547 1821704 78288 -1658673
$$ packed form
37487I2225110j2213527j2009406r048861o322124o598133p124292n130045k882180
37479C0896542l017509l676417k399809p70225j135157k124956j354847J93424
37471A6611046K10611p90840q57177k70759n63370j330449j105677k97831m52841
37462A1152713j428692j788370j302676q56889n47257Q4729N85068K96226j15568
37453F079284K80469P60959M4332j263787j398740l12409K59549l73406r39435
37444C136816m79254K03176M5343o39893q46147l43036K48306L62530k8366n56160
37434A103315p67878m50562J92769O99058O41584j12710j108714j353862k71154
37425a428154J311608J854807J016503M3387j11276q0328p84843j743416j736961
$$ plain form
37416 -1658673 -2305541 -1855623 -1035469 -272409 492571 1246313 1649436 1394789 682561
37407 682561 258846 782368 2007514 2892962 2846001 2517647 2843948 3619834 3774994 2927581
37397 2927581 1812073 1094854 632163 186438 69826 557206 1243061 1581250 1711184
37388 1711184 2172110 2974443 3498424 3346488 2877784 2688733 2773851 2507016 1494013
37379 1494013 139426 -904265 -1597262 -2305724 -2848661 -2505076 -1161844 325091 1303659
37370 1303659 2058417 2815583 2917872 1921690 771096 678556 1305395 1339223 610196 267284
37360 267284 877264 1693393 1984808 1832511 1338799 290688 -987603 -1624247 -1522993
37351 -1522993 -1569098 -2002724 -1813773 -514027 670673 446290 -592903 -810111 251765
$$ packed form
37416a658673o46868M49918Q20154P63060P64980P53742M03123k54647p12228
37407F82561m23715N23522J225146Q85448m6961l28354L26301P75886J55160q47413
37397B927581j115508p17219m62691m45725j16612M87380O85855L38189J29934
37388A711184M60926Q02333N23981j51936m68704j89051Q5118k66835j013003
37379A494013j354587j043691o92997p08462n42937L43585J343232J486935R78568
37370A303659P54758P57166J02289r96182j150594r2540O26839L3828p29027l42912
37360B67284O09980Q16129K91415j52297m93712j048111j278291o36644J01254
37351a522993m6105m33626J88951J299746J184700k24383j039193k17208J061876
$$ plain form
37342 251765 1579008 2212423 2032506 1257625 120024 -965035 -1595569 -1757842 -1595131
37333 -1595131 -1041813 -152015 529471 500428 -21309 -465516 -710759 -1015681 -1396855 -1589630
37323 -1589630 -1454907 -1040536 -499085 -264818 -870649 -2150173 -3117015 -3182570 -2974120
37314 -2974120 -3289719 -3796559 -3635696 -2883243 -2383949 -2348863 -2172257 -1633897 -1281149 -1434824
37304 -1434824 -1661017 -1487572 -963806 -295317 447206 1053908 1210304 1020839 965563 1173022
37294 1173022 1288325 1217816 1393842 2053482 2821075 3279929 3408934 3166759 2265839 830368
37284 830368 -249326 -245954 410318 657260 174994 -316388 -116260 615218 1239727 1487241
37274 1487241 1598157 1730402 1559135 684594 -630519 -1437538 -1058128 50380 704173
$$ packed form
37342B51765J327243O33415j79917p74881j137601j085059o30534j62273J62711
37333a595131N53318Q89798O81486k9043n21737m44207k45243l04922l81174j92775
37323a589630J34723M14371N41451K34267o05831j279524r66842o5555K08450
37314b974120l15599n06840J60863P52453M99294L5086J76606N38360L52748j53675
37304a434824k26193J73445N23766O68489P42523O06702J56396j89465n5276K07459
37294A173022J15303p0509J76026O59640P67593M58854J29005k42175r00920j435471
37284H30368j079694L372O56272K46942m82266m91382K00128P31478O24509K47514
37274A487241J10916J32245j71267q74541j315113q07019L79410J108508O53793
$$ plain form
37265 704173 332125 -368677 -307499 650560 1514465 1371536 462959 -202079 -140823 162600
37255 162600 217792 342324 978826 1625978 1348869 323640 -118066 667187 1654596 1639607
37245 1639607 943735 771509 1382421 1892717 1689122 1122480 811397 1022421 1747502
37236 1747502 2678833 3080655 2398380 1079949 133650 -195764 -616397 -1563611 -2550592
37227 -2550592 -2985679 -2930804 -2702973 -2327528 -1775647 -1258009 -929376 -709991 -650487 -1006664
37217 -1006664 -1695347 -2174492 -2153065 -1924405 -1713027 -1258368 -418615 398222 887710 1372653
37207 1372653 2073731 2358889 1499992 -78834 -1084549 -856330 36348 718909 968198
37198 968198 1100016 1332519 1508377 1301073 609439 -201369 -544457 -208828 415109 805860
$$ packed form
37265G04173l72048p00802O1178R58059Q63905j42929r08577o65038O1256L03423
37255A62600N5192J24532O36502O47152k77109j025229m41706P85253R87409j4989
37245A639607o95872j72226O10912N10296k03595n66642l11083K11024P25081
37236A747502R31331M01822o82275j318431r46299l29414m20633r47214r86981
37227b550592m35087N4875K27831L75445N51881N17638L28633K19385N9504l56177
37217a006664o88683m79145K1427K28660K11378M54659Q39753Q16837M89488M84943
37207A372653P01078K85158q58897j578826j005715K28219Q92678O82561K49289
37198I68198J31818K32503J75858k07304o91634q10808l43088L35629O23937L90751
$$ plain form
37188 805860 798295 486706 -30383 -546283 -697299 -395612 -104646 -288055 -708675 -650381
37178 -650381 215564 1484167 2476983 2796166 2502487 1981411 1563473 1133948 317601
37169 317601 -780999 -1378951 -952179 -98195 65811 -727879 -1634337 -1810059 -1324165
37160 -1324165 -851490 -844116 -1192178 -1462065 -1302737 -745738 -201033 -92583 -479415 -1056780
37150 -1056780 -1447728 -1467541 -1268991 -1277953 -1749186 -2319835 -2341976 -1784291 -1357968 -1500235
37140 -1500235 -1751499 -1553352 -1120832 -906237 -688147 -32315 650046 474851 -539721
37131 -539721 -1408480 -1591409 -1576670 -1840206 -2114359 -2091568 -2082043 -2451093 -2990869 -3335987
37121 -3335987 -3486683 -3477744 -3073670 -2310946 -1858436 -2277076 -3289110 -4225207 -4730385 -4577911
$$ packed form
37188H05860p565l11589n17089n15900j51016L01687K90966j83409m20620N8294
37178f50381Q65945J268603R92816L19183k93679n21076m17938m29525q16347
37169C17601j098600n97952M26772Q53984J64006p93690r06458j75722M85894
37160a324165M72675P374l48062k69887J59328N56999N44705J08450l86832n77365
37150a056780l90948j9813J98550q962m71233n70649k2141N57685M26323j42267
37140a500235k51264J98147M32520K14595K18090O55832O82361j75195j014572
37131e39721q68759j82929J4739k63536k74153K2791R525l69050n39776l45118
37121c335987j50696Q939M04074P62724M52510m18640j012034r36097n05178J52474
$$ plain form
37111 -4577911 -3455410 -1705078 -701345 -1459979 -3132775 -3883190 -3122699 -1878127 -1030655
37102 -1030655 -380122 340206 739628 628190 608129 1088006 1488655 1194721 619898 485299
37092 485299 629722 503545 378037 927878 1820272 1918043 977880 37872 -156652 -61192
37082 -61192 -211250 -181541 618228 1841717 2689213 2977822 3004731 2827271 2468773 2412475
37072 2412475 2973524 3456352 2924677 1698142 1053121 1367578 1614596 991192 64006
37063 64006 -201070 277866 954700 1451437 1439926 408407 -1612894 -3534853 -4261240
37054 -4261240 -3995709 -3752137 -3829089 -3613602 -2772058 -1744232 -962378 -353524 198155
37045 198155 562018 736529 886569 780047 -149794 -1789851 -2962999 -2614352 -1102692
$$ packed form
37111d577911J122501J750332J003733p58634j672796p50415P60491J244572Q47472
37102a030655O50533P20328L99422j11438k0061M79877M00649k93934n74823j34599
37092D85299J44423j26177j25508N49841Q92394R7771r40163r40008j94524R5460
37082f1192j50058K9709P99769J223489Q47496K88609K6909j77460l58498n6298
37072B412475N61049M82828n31675j226535o45021L14457K47018o23404r27186
37063F4006k65076M78936O76834M96737j1511j031519k021301j921959p26387
37054d261240K65531K43572p6952K15487Q41544J027826P81854O08854N51679
37045A98155L63863J74511J50040j06522r29841j640057j173148L48647J511660
$$ plain form
37036 -1102692 143201 112626 -938519 -1955098 -2118460 -1522092 -997685 -1183716 -1760180
37027 -1760180 -1874118 -1322097 -828912 -958162 -1277288 -1028202 -206342 580748 1042937
37018 1042937 1357293 1521300 1264211 709918 471102 759124 924668 386621 -309617
37009 -309617 -9586 1478729 2942263 3186685 2470074 2030344 2397997 2810018 2426986
37000 2426986 1561324 1264873 1983970 3085179 3627927 3231621 2195616 1082667 248933
36991 248933 -353282 -849896 -902559 86223 1888755 3071722 2443588 663560 -444766
36982 -444766 -180142 322252 -177847 -1521118 -2768059 -3415357 -3365962 -2481245 -1027186
36973 -1027186 -39012 -318130 -1330006 -1894322 -1739670 -1567869 -1760479 -1933696 -1807619
$$ packed form
37036a102692J245893l0575j051145j016579j63362N96368N24407j86031n76464
37027a760180j13938N52021M93185j29250l19126K49086Q21860P87090M62189
37018A042937L14356J64007k57089n54293k38816K88022J65544n38047o96238
37009c09617L00031J488315J463534K44422p16611m39730L67653M12021l83032
37000B426986q65662k96451P19097J101209N42748l96306j036005j112949q33734
36991B48933o02215m96614n2663R88782J802532J182967o28134j780028j108326
36982d44766K64624N02394n00099j343271j246941o47298M9395Q84717J454059
36973a027186R88174k79118j011876n64316J54652J71801j92610j73217J26077
$$ plain form
36964 -1807619 -1653967 -1664559 -1582032 -1230595 -830576 -513895 -48769 664698 1297296 1616923
36954 1616923 1920060 2582336 3451228 4001004 3913587 3294220 2498377 1914208 1706026 1593625
36944 1593625 1080566 93389 -753648 -717541 311598 1702468 2680768 2987393 2957064
36935 2957064 2914740 2564225 1277272 -888978 -2869358 -3645567 -3295035 -2548979 -1677732
36926 -1677732 -479125 876486 1811128 2112435 1966710 1245912 -316895 -2099512 -2769935
36917 -2769935 -1961111 -900037 -767160 -1163337 -908644 212552 1256972 1313147 287490
36908 287490 -1163538 -1994293 -1479281 -65554 927647 927114 824076 1495605 2359425 2311263
36898 2311263 1475836 901250 918220 994570 970996 1177927 1380958 886292 -162673 -776666
$$ packed form
36964a807619J53652j0592Q2527L51437M00019L16681M65126P13467O32598L19627
36954A616923L03137O62276Q68892N49776q7417o19367p95843n84169k08182j12401
36944A593625n13059r87177q47037L6107J029139J390870R78300L06625l0329
36935B957064m2324l50515j286953k166250j980380p76209L50532P46056Q71247
36926a677732J198607J355611R34642L01307j45725p20798j562807j782617o70423
36917b769935Q08824J061074J32877l96177K54693J121196J044420N6175j025657
36908B87490j451028q30755N15012J413727R93201n33j03038O71529Q63820m8162
36898B311263q35427n74586J6970P6350k3574K06931K03031m94666j048965o13993
$$ plain form
36888 -776666 -605511 -266384 27000 855134 2191522 2974576 2770657 2547505 2848739
36879 2848739 2473865 319021 -2422262 -3477541 -2418582 -869972 -91735 103642 63811
36870 63811 -428345 -1140217 -1056496 138232 1238699 1041476 -17414 -594173 -288927
36861 -288927 103751 -107507 -815761 -1638722 -2369155 -2788873 -2651612 -2089368 -1602246 -1408946
36851 -1408946 -1166265 -590910 -18165 46639 -281983 -418133 -227910 -282225 -944764 -1631059
36841 -1631059 -1463463 -523447 67278 -562350 -2032222 -3213772 -3476071 -3159053 -2924384
36832 -2924384 -2933937 -2803189 -2301810 -1883911 -2209387 -3079324 -3324422 -2213846 -613470
36823 -613470 14336 -377616 -391289 650029 1614506 1289259 213227 -262332 -82903
$$ packed form
36888g76666J71155L39127K93384Q28134J336388P83054k03919k23152L01234
36879B848739l74874k154844k741283j055279J058959J548610P78237J95377l9831
36870F3811m92156p11872Q3721J194728J100467j97223j058890n76759L05246
36861b88927L92678k11258p08254q22961p30433m19718J37261N62244M87122J93300
36851a408946K42681N75355N72745O4804l28622j36150J90223n4315o62539o86295
36841a631059J67596R40016N90725o29628j469872j181550k62299L17018K34669
36832b924384r553J30748N01379M17899l25476q69937k45098J110576J600376
36823f13470O27806l91952j3673J041318R64477l25247j076032m75559J79429
$$ plain form
36814 -82903 -383401 -1521492 -2511268 -2558129 -2064083 -1794303 -1940608 -2326513 -2686268 -2389596
36804 -2389596 -783929 1657892 3311339 3149037 1909484 987663 835000 1050313 1270759
36795 1270759 1117355 -36154 -2128265 -3712377 -3419476 -1896364 -1032614 -1308124 -1293947
36786 -1293947 -83474 1183174 995778 -390734 -1493176 -1582105 -1104822 -556151 5272
36777 5272 393737 197097 -536242 -1136195 -1088277 -578040 -122428 -27771 -346661 -1013617
36767 -1013617 -1796970 -2313087 -2266565 -1624789 -590400 442536 1003610 915842 538820
36758 538820 336608 204636 -395259 -1553841 -2600950 -2893049 -2531367 -1993369 -1427918
36749 -1427918 -795877 -455881 -949719 -2128391 -3054398 -3058233 -2512557 -2205936 -2215365 -1868092
$$ packed form
36814h2903l00498j138091r89776m6861M94046K69780j46305l85905l59755K96672
36804b389596J605667K441821J653447j62302j239553r21821j52663K15313K20446
36795A270759j53404j153509k092111j584112K92901J523112Q63750k75510J4177
36786a293947J210473J266648j87396j386512j102442q8929M77283N48671N61423
36777E272L88465j96640p33339n99953M7918N10237M55612R4657l18890o66956
36767a013617p83353n16117M6522O41776J034389J032936N61074q7768l77022
36758E38820k02212j31972n99895j158582j047109k92099L61682N37998N65451
36749a427918O32041L39996m93838j178672r26007l835N45676L06621r429L47273
$$ plain form
36739 -1868092 -798054 390384 725379 -52210 -1195616 -1661030 -992047 402482 1654379
36730 1654379 2103219 1743148 1154564 969189 1309630 1714929 1600160 759485 -534929
36721 -534929 -1766011 -2421018 -2194452 -1209025 -37127 718124 930866 896197 786858
36712 786858 463445 -68036 -369541 -66227 590587 1031377 1102405 1072396 990618 582978
36702 582978 -92006 -423653 -23668 661545 929820 764393 732859 1062535 1322964 1135561
36692 1135561 797923 914713 1558326 2083518 1865263 1089717 605287 930104 1649756
36683 1649756 2060394 2187502 2628943 3370090 3429319 2062300 -182196 -2104028 -3160286
36674 -3160286 -3580550 -3540879 -2981837 -2145947 -1564588 -1418630 -1457175 -1565831 -1845356 -2128799
$$ packed form
36739a868092J070038J188438L34995p77589j143406m65414O68983J394529J251897
36730A654379M48840l60071n88584j85375L40441M05299j14769q40675j294414
36721e34929j231082o55007K26566R85427J171898P55251K12742l4669j09339
36712G86858l23413n31481l01505L03314O56814M40790P1028l0009q1778m07640
36702E82978o74984l31647L99985O85213K68275j65427l1534L29676K60429j87403
36692A135561l37638J16790O43613N25192k18255p75546m84430L24817P19652
36683A649756M10638J27108M41441P41147N9229j367019k244496j921832j056258
36674c160286m20264L9671N59042Q35890N81359J45958l8545j08656k79525k83443
$$ plain form
36664 -2128799 -2073206 -1787654 -1672222 -1540277 -712337 788955 2013762 2449744 2713848
36655 2713848 3297691 3538480 2738032 1576306 1280946 1808185 2036877 1632469 1529767
36646 1529767 2361141 3379397 3347337 1889807 -285252 -1995054 -2329452 -1435776 -701942
36637 -701942 -1492093 -3486988 -4920264 -4681853 -3483985 -2625301 -2367132 -2102664 -1526285
36628 -1526285 -911389 -535301 -437228 -576494 -793078 -824512 -745950 -1099590 -2123185 -3118882
36618 -3118882 -3135394 -2134834 -975563 -329479 -104048 106468 478974 922203 1198573
36609 1198573 1024627 339875 -514526 -1138757 -1542380 -2002875 -2558557 -2966543 -3076153
36600 -3076153 -2903461 -2445239 -1814267 -1435933 -1603367 -1890333 -1598502 -847467 -562622
$$ packed form
36664b128799N5593K85552J15432J31945Q27940J501292J224807M35982K64104
36655B713848N83843K40789q00448j161726k95360N27239K28692m04408j02702
36646A529767Q31374J018256l2060j457530k175059j709802l34398Q93676P33834
36637g01942p90151j994895j433276K38411J197868Q58684K58169K64468N76379
36628a526285O14896L76088R8073j39266k16584l1434P8562l53640j023595r95697
36618c118882j6512J000560J159271O46084K25431K10516L72506M43229K76370
36609A198573j73946o84752q54401o24231m03623m60495n55682m07986j09610
36600c076153J72692M58222O30972L78334j67434k86966K91831P51035K84845
$$ plain form
36591 -562622 -1141841 -1771113 -1485344 -381772 750325 1558787 2181418 2413497 1677926
36582 1677926 16173 -1524191 -1895143 -1135149 -125103 524208 974516 1610461 2366602
36573 2366602 2814973 2791844 2670248 2881462 3293793 3301762 2557380 1358554 163624 -1006728
36563 -1006728 -2332022 -3497330 -3740123 -2759222 -1223751 -116859 207754 93371 -33640
36554 -33640 15301 345654 1031118 1932715 2706417 3026876 2660148 1485900 -174221 -1346889
36544 -1346889 -1091151 420756 1953305 2584332 2618251 2829475 3260592 3298967 2665323
36535 2665323 1718389 832206 -8308 -918131 -1781135 -2276565 -2041090 -953878 438777
36526 438777 1041023 290833 -983335 -1375715 -551948 517697 965048 908479 749226
$$ packed form
36591e62622n79219o29272K85769J103572J132097Q08462O22631K32079p35571
36582A677926j661753j540364l70952P59994J010046O49311M50308O35945P56141
36573B366602M48371k3129j21596K11214M12331P969p44382j198826j194930j170352
36563a006728j325294j165308k42793R80901J535471J106892L24613j14383j27011
36554c3640M8941L30353O85464R01597P73702L20459l66728j174248j660121j172668
36544a346889K55738J511907J532549O31027L3919K11224M31117L8375o33644
36535B665323r46934q86183q40514r09823q63004m95430K35475J087212J392655
36526D38777O02246p50190j274168l92380Q23767J069645M47351n6569j59253
$$ plain form
36517 749226 398861 -304379 -1015489 -1297123 -1214042 -1013565 -591745 185359 936115 1106076
36507 1106076 681334 97935 -371230 -701419 -803439 -604502 -290926 -69978 88310
36498 88310 74811 -615031 -2140136 -3631997 -4048998 -3567917 -3277279 -3510754 -3429618 -2453459
36488 -2453459 -1140857 -191048 555961 1411807 1822378 1038432 -450308 -1119633 -216736
36479 -216736 1319635 2047852 1648467 966937 767904 1014534 1376898 1850086 2454114
36470 2454114 2683518 1937855 536564 -347841 -57161 797525 1316839 1449869 1562174
36461 1562174 1456427 730822 -234703 -682103 -690355 -842838 -733626 743730 3208792
36452 3208792 4415847 3047382 669047 -395202 -177942 -446746 -1578650 -2040259 -1118859
$$ packed form
36517G49226l50365p03240p11110k81634Q3081K00477M21820P77104P50756J69961
36507A106076m24742n83399m69165l30189j02020J98937L13576K20948J58288
36498H8310j3499o89842j525105j491861m17001M81081K90638k33475Q1136R76159
36488b453459J312602R49809P47009Q55846M10571p83946j488740o69325R02897
36479b16736J536371P28217l99385o81530j99033K46630L62364M73188O04028
36470B454114K29404p45663j401291q84405K90680Q54686N19314J33030J12305
36461A562174j05747p25605r65525m47400q252j52483J09212J477356K465062
36452C208792J207055j368465k378335j064249K17260k68804j131904m61609R21400
$$ plain form
36443 -1118859 -253179 -798263 -1923730 -1969672 -973455 -466814 -1139399 -2004774 -1950475 -1064451
36433 -1064451 -116826 467490 668507 467912 -99013 -765878 -1275398 -1598593 -1706681
36424 -1706681 -1467227 -1050819 -1004033 -1432611 -1528319 -635578 496581 519204 -434987 -622575
36414 -622575 884324 2726549 3110621 2285561 1930643 2546880 2915595 2182648 1071317
36405 1071317 573096 626139 781400 1180539 1982192 2572622 2346051 1760986 1614447 1635591
36395 1635591 900896 -490751 -1304394 -911170 -149625 -72894 -659514 -1259215 -1632156
36386 -1632156 -1914619 -2014443 -1723121 -1242155 -1047543 -1286340 -1698296 -2067453 -2401913 -2713662
36376 -2713662 -2922602 -2929007 -2529330 -1419113 316063 1805215 2037424 1060680 84606
$$ packed form
36443a118859Q65680n45084j125467m5942R96217N06641o72585q65375N4299Q86024
36433a064451R47625N84316K01017k00595n66925o66865n09520l23195j08088
36424a706681K39454M16408M6786m28578r5708Q92741J132159K2623r54191j87588
36414f22575J506899J842225L84072q25060l54918O16237L68715p32947j111331
36405A071317m98221N3043J55261L99139Q01653N90430k26571n85065j46539K1144
36395A635591p34695j391647q13643L93224P61545P6731n86620n99701l72941
36386a632156k82463r9824K91322M80966J94612k38797m11956l69157l34460l11749
36376b713662k08940o405L99677J110217J735176J489152K32209r76744r76074
$$ plain form
36367 84606 135691 992167 1739499 1936002 1716747 1101829 -15675 -1210574 -1646220 -1143827
36357 -1143827 -530060 -558903 -1019481 -1331752 -1468991 -1677933 -1754659 -1403275 -1052207 -1432865
36347 -1432865 -2385776 -2927519 -2599857 -1955085 -1534179 -1194504 -776055 -626667 -943024
36338 -943024 -1230728 -1004775 -543100 -390722 -524533 -537444 -299205 27809 256951 60167
36328 60167 -884304 -2080869 -2150576 -398029 1950850 2981698 2364850 1519130 1591901
36319 1591901 2182971 2214929 1291568 -99857 -1196418 -1501351 -1073525 -440909 -41709
36310 -41709 150163 241782 60264 -331312 -195088 1009254 2560667 3165546 2609143 1851678
36300 1851678 1579658 1667718 2068650 3021622 4059435 4004084 2583470 1092017 723324
$$ packed form
36367H4606N1085Q56476P47332J96503k19255o14918j117504j194899m35646N02393
36357a143827O13767k8843m60578l12271j37239k08942p6726L51384L51068l80658
36347a432865r52911n41743L27662O44772M20906L39675M18449J49388l16357
36338i43024k87704K25953M61675J52378j33811j2911K38239L27014K29142j96784
36328F0167r44471j196565o9707J752547K348879J030848o16848q45720P2771
36319A591901N91070L1958r23361j391425j096561l04933M27826O32616L99200
36310d1709J91872R1619j81518l91576J36224J204342J551413O04879n56403p57465
36300A851678k72020Q8060M00932R52972J037813n5351j420614j491453l68693
$$ plain form
36291 723324 1060181 1003265 480780 301019 750962 1241952 1164162 439393 -580907 -1249427
36281 -1249427 -959318 94961 790190 265331 -1064162 -2224689 -2983965 -3662924 -4003300
36272 -4003300 -3277933 -1615990 -275700 -178959 -776842 -832572 34831 1040418 1306818
36263 1306818 839372 356156 408626 919105 1529009 2032359 2253190 1882950 944315 147897
36253 147897 77792 148353 -731918 -2398120 -3409254 -3132958 -2655119 -2881218 -2915861 -1546326
36243 -1546326 526996 1432727 661242 -624650 -1593194 -2487965 -3279550 -3198595 -2181371
36234 -2181371 -1430567 -1715809 -2139703 -1478133 41682 1208257 1488430 1345933 1313704
36225 1313704 1570259 2144962 2779734 2804279 1876486 684258 195754 340481 216068
$$ packed form
36291G23324L36857n6916n22485j79761M49943M90990p7790p24769j020300o68520
36281a249427K90109J054279O95229n24859j329493j160527p59276o78959l40376
36272d003300P25367J661943J340290R6741n97883n5730Q67403J005587K66400
36263A306818m67446m83216N2470N10479O09904N03350K20831l70240r38635p96418
36253A47897p0105P0561q80271j666202j011134K76296M77839k26099l4643J369535
36243a546326K073322R05731p71485j285892r68544q94771p91585Q0955J017224
36234b181371P50804k85242m23894O61570J519815J166575K80173j42497l2229
36225A313704K56555N74703O34772K4545r27793j192228m88504J44727j24413
$$ plain form
36216 216068 -423240 -783208 -383739 63237 -284966 -1063398 -1198464 -478807 183171 94734
36206 94734 -384799 -682851 -1023337 -1946380 -3157367 -3635471 -2927989 -1689283 -746103
36197 -746103 -209854 157746 209586 -456878 -1900703 -3761142 -5533414 -6576522 -6201865
36188 -6201865 -4317389 -1855809 -84217 471472 134213 -600831 -1360038 -1746593 -1544720
36179 -1544720 -1075331 -884385 -1105483 -1484425 -1801773 -1773507 -857322 1071302 2999571
36170 2999571 3580900 2682649 1366823 358744 -542128 -1443785 -1847716 -1584922 -1348486
36161 -1348486 -1718068 -2341101 -2572405 -2277886 -1591636 -628405 86811 -253850 -1533305
36152 -1533305 -2422010 -2046620 -1178665 -909450 -947335 -363370 618903 968873 700109 956975
$$ packed form
36216B16068o39308l59968L99469M46976l48203p78432j35066P19657O61978q8437
36206I4734m79533k98052l40486r23043j210987m78104P07482J238706R43180
36197g46103N36249L67600N1840o66464j443825j860439j772272j043108L74657
36188f201865J884476K461580J771592N55689l37259p35044p59207l86555K01873
36179a544720M69389J90946k21098l78942l17348K8266R16185J928624J928269
36170B999571N81329q98251j315826j008079r00872r01657m03931K62794K36436
36161a348486l69582o23033k31304K94519O86250R63231P15216l40661j279455
36152a533305q88705L75390Q67955K69215l7885N83965R82273L49970k68764K56866
$$ plain form
36142 956975 2153264 3246141 3177283 2099162 896522 328544 867781 2486558 4210910
36133 4210910 4659833 3504661 1845136 834377 558515 596590 938595 1736133 2638080
36124 2638080 3021300 2663802 1768349 562976 -740211 -1803134 -2321648 -2195077 -1389887
36115 -1389887 55133 1693011 2747980 2896091 2680584 2790512 3153223 3081073 2131028
36106 2131028 519350 -1130830 -2171624 -2254905 -1578893 -687869 159177 1189939 2497403
36097 2497403 3585927 3930361 3704399 3458490 3229251 2506177 1097690 -442809 -1401311
36088 -1401311 -1603193 -1406852 -1255426 -1378799 -1745816 -2112114 -2151119 -1688312 -924818 -433350
36078 -433350 -737616 -1672233 -2286528 -1761196 -424448 583232 745063 729423 1274642
$$ packed form
36142I56975J196289J092877o8858j078121j202640n67978N39237J618777J724352
36133D210910M48923j155172j659525j010759k75862L8075L42005P97538R01947
36124B638080L83220l57498q95453j205373j303187j062923n18514J26571Q05190
36115a389887J445020J637878J054969J48111k15507J09928L62711p2150r50045
36106B131028j611678j650180j040794q3281O76012Q91024Q47046J030762J307464
36097B497403J088524L44434k25962k45909k29239p23074j408487j540499r58502
36088a401311k01882J96341J51426j23373l67017l66298l9005M62807P63494M91468
36078d33350l04266r34617o14295N25332J336748J007680J61831j5640N45219
$$ plain form
36069 1274642 2123653 2560182 2472950 2212656 1802885 1115796 577999 761722 1319541 1308455
36059 1308455 724282 699910 1778642 2954934 3090445 2472236 2103341 2061019 1608448
36050 1608448 636827 -102723 -247208 -331865 -787833 -1231259 -1166762 -786331 -572897 -528907
36040 -528907 -296527 216230 766320 1138125 1167027 576453 -701084 -2023542 -2346392
36031 -2346392 -1295465 296314 1184428 963234 306582 -8260 -13367 -278257 -943184
36022 -943184 -1488578 -1574534 -1630783 -2191287 -2952529 -3114692 -2614397 -2343942 -2898468 -3648029
36012 -3648029 -3476658 -2130912 -450945 529596 413578 -384149 -959121 -638952 269015
36003 269015 654971 -123737 -1379298 -1887261 -1289110 -227324 649558 1149638 1117907
$$ packed form
36069A274642Q49011M36529q7232k60294m09771o87089n37797J83723N57819j1086
36059A308455n84173k4372J078732J176292J35511o18209l68895m2322m52571
36050A608448r71621p39550j44485q4657m55968m43426O4497L80431K13434M3990
36040e28907K32380N12757N50090L71805K8902n90574j277537j322458l22850
36031b346392J050927J591779Q88114k21194o56652l14842n107k64890o64927
36022i43184n45394q5956n6249n60504p61242j62163N00295K70455n54526p49561
36012c648029J71371J345746J679967R80541j16018p97727n74972L20169R07967
36003B69015L85956p78708j255561n07963N98151J061786Q76882N00080l1731
$$ plain form
35994 1117907 336797 -949320 -1982060 -2214699 -1715632 -782536 352380 1346287 1851596
35985 1851596 1983096 2141047 2230676 1743892 866712 674809 1677396 2899121 3152691
35976 3152691 2635982 2389712 2612999 2560675 1976713 1598460 2044343 2954070 3469986 3042647
35966 3042647 1679832 -33475 -1101737 -933075 -120707 170496 -306492 -660034 -255564
35957 -255564 452166 812727 953200 1347859 2022816 2749817 3520669 4239334 4390714 3655843
35947 3655843 2510776 1603827 883708 1403 -780422 -891931 -448894 -73021 172205
35938 172205 727351 1391689 1286758 293740 -455615 -103134 736365 1018124 809546 860351
35928 860351 1095477 648379 -631379 -1693088 -1579849 -502407 685314 1495620 1933157
$$ packed form
35994A117907p81110j286117j032740k32639M99067R33096J134916R93907N05309
35985A851596J31500J57951Q9629m86784q77180j91903J002587J221725K53570
35976C152691n16709k46270K23287n2324n83962l78253M45883R09727N15916m27339
35966C042647j362815j713307j068262J68662Q12368K91203m76988l53542M04470
35957b55564P07730L60561J40473L94659O74957P27001P70852P18665J51380p34871
35947C655843j145067r06949p20119q82305p81825j11509M43037L75873K45226
35938A72205N55146O64338j04931r93018p49355L52481Q39499K81759k08578N0805
35928H60351K35126m47098j279758j061709J13239J077442J187721Q10306M37537
$$ plain form
35919 1933157 2106134 2169687 2368538 2731511 2886500 2473176 1591546 624604 -177468 -707892
35909 -707892 -852309 -644733 -390381 -323987 -312367 -192684 -186162 -572063 -1106572 -1232075
35899 -1232075 -838226 -428999 -554310 -1389921 -2731538 -3971381 -4253536 -3263644 -1833363
35890 -1833363 -1136271 -1281401 -1397168 -1105127 -953720 -1127014 -817101 426234 1653796
35881 1653796 1799986 1317683 1380094 1891740 1624731 299125 -787499 -592464 256784
35872 256784 489875 -83487 -549416 -191710 753858 1487093 1432044 719640 11725 -279214
35862 -279214 -509088 -1202987 -2072019 -2245772 -1558406 -912069 -1064791 -1655231 -1816008 -1238451
35852 -1238451 -220545 838421 1515966 1424497 775302 503231 1196723 2186770 2352350
$$ packed form
35919A933157J72977O3553J98851L62973J54989m13324q81630r66942q02072n30424
35909g07892j44417K07576K54352O6394J1620J19683O522l85901n34509j25503
35899a232075L93849M09227j25311q35611j341617j239843k82155R89892J430281
35890a833363O97092j45130j15767K92041J51407j73294L09913J243335J227562
35881A653796J46190m82303O2411N11646k67009j325606j086624J95035Q49248
35872B56784K33091n73362m65929L57706R45568P33235n5049p12404p07915k90939
35862b79214k29874o93899q69032j73753O87366O46337j52722n90440j60777N77557
35852a238451J017906J058966O77545r1469o49195k72071O93492R90047J65580
$$ plain form
35843 2352350 1616656 937377 916158 1170439 1152125 865759 533244 161842 -194891 -230888
35833 -230888 123713 355133 -7910 -617916 -673847 -49055 435624 50885 -906928 -1554350
35823 -1554350 -1564346 -1419941 -1553275 -1749741 -1660074 -1480308 -1648903 -2065413 -2120514 -1482689
35813 -1482689 -421481 653781 1533647 2065204 2174864 2141553 2326824 2472418 1855229
35804 1855229 434494 -769273 -918525 -449900 -305324 -488664 -154888 1017233 2272840
35795 2272840 2675241 2041799 920710 35822 -216137 -52525 -71363 -465980 -664343
35786 -664343 -146518 626186 690561 -137072 -1117699 -1696506 -2026353 -2286622 -2264061 -1933702
35776 -1933702 -1760404 -1950161 -1965395 -1330704 -459558 -62131 -90293 17699 258066 47505
$$ packed form
35843B352350p35694o79279k1219K54281j8314k86366l32515l71402l56733l5997
35833b30888L54601K31420l63043o10006n5931O24792M84679l84739r57813o47422
35823a554350r996J44405j33334j96466Q9667J79766j68595m16510n5101O37825
35813a482689J061208J075262Q79866N31557J09660l3311J85271J45594o17189
35804A855229j420735j203767j49252M68625J44576j83340L33776J172121J255607
35795B272840M02401o33442j121089q84888k51959J63612j8838l94617j98363
35786f64343N17825P72704O4375q27633r80627n78807l29847k60269K2561L30359
35776a933702J73298j89757j5234O34691Q71146L97427k8162J07992K40367k10561
$$ plain form
35766 47505 -661269 -1064148 -678855 -214228 -670801 -1890594 -2660308 -2229792 -1132309
35757 -1132309 -331878 -111184 -205322 -595757 -1478692 -2514449 -2826073 -2050184 -928546
35748 -928546 -468331 -801202 -1242322 -1234277 -787174 -115164 656116 1336743 1626239 1445023
35738 1445023 1138006 1168241 1623447 2054131 1805577 617548 -1025642 -2272721 -2755967
35729 -2755967 -2917579 -3326394 -3854940 -3826225 -2912637 -1604916 -749549 -794039 -1500356 -2251390
35719 -2251390 -2599449 -2579916 -2508439 -2525042 -2458489 -2093962 -1375060 -387065 582917 1033096
35709 1033096 709919 86740 -115028 87502 62896 -232496 -34754 877611 1524119 1076479
35699 1076479 78560 -500073 -704209 -1111932 -1547101 -1425207 -953305 -799098 -874114 -637364
$$ packed form
35766D7505p08774m02879L85293M64627m56573j219793p69714M30516J097483
35757a132309Q00431K20694r4138l90435q82935j035757l11624P75889J121638
35748i28546M60215l32871m41120Q045M47103O72010P71280O80627K89496j81216
35738A445023l07017L0235M55206M30684k48554j188029j643190j247079m83246
35729b755967j61612m08815n28546K8715R13588J307721Q55367m4490p06317p51034
35719b251390l48059J9533P1477j6603O6553L64527P18902R87995R69982M50179
35709A033096l23177o23179k01768K02530k4606k95392J97742R12365O46508m47640
35699A076479r97919n78633k04136m07723m35169J21894M71902J54207p5016K36750
$$ plain form
35689 -637364 -316648 -523671 -900272 -637033 -221866 -945914 -2478999 -2803114 -1197490
35680 -1197490 461356 349035 -899217 -1604260 -1492721 -1306480 -1048744 -224857 824850
35671 824850 1345701 1528074 2097401 2848110 2892842 2202004 1629498 1419318 877399 -299535
35661 -299535 -1377904 -1546765 -782474 420687 1540470 2143672 2121849 1914300 1999607
35652 1999607 2167124 1788652 757680 -350544 -987462 -1023288 -561280 133843 647339
35643 647339 836454 1105678 1855084 2895937 3791001 4357229 4378075 3436788 1761454
35634 1761454 625713 958245 2031789 2540146 2473553 2701939 3116411 2703445 1421929
35625 1421929 494828 566700 886506 673282 94330 -488965 -1081708 -1431110 -970708 107796
$$ packed form
35689f37364L20716k07023l76601K63239M15167p24048j533085l24115J605624
35680a197490J658846j12321j248252p05043J11539J86241K57736Q23887J049707
35671H24850N20851J82373N69327P50709M4732o90838n72506k10180n41919j176934
35661b99535j078369j68861P64291J203161J119783O03202k1823k07549Q5307
35652A999607J67517l78472j030972j108224o36918l5826M62008O95123N13496
35643F47339J89115K69224P49406J040853Q95064N66228K0846r41287j675334
35634A761454j135741L32532J073544N08357o6593K28386M14472m12966j281516
35625A421929r27101P1872L19806k13224n78952n83295n92743l49402M60402J078504
$$ plain form
35615 107796 763135 563979 215499 193076 7444 -602925 -972336 -770566 -779858 -1444904
35605 -1444904 -1727027 -570094 1329285 2406047 2206610 1322069 -16170 -1928146 -3806464
35596 -3806464 -4551814 -3887464 -2510934 -1080807 44215 296543 -747544 -2429592 -3371163
35587 -3371163 -2989680 -1985757 -1253239 -972861 -864289 -705853 -473402 -427966 -1059380
35578 -1059380 -2479827 -3953958 -4515539 -3933595 -2608308 -795538 1381324 3349010
35570 3349010 4338437 4275535 3785817 3305872 2781109 2175762 1611443 1025976 367179 76055
35560 76055 617632 1524259 1747961 1119296 644975 1099378 2067430 2692487 2667802 2129058
35550 2129058 1240065 333444 -101340 -26521 8109 -292571 -497085 -220443 162001 86720
$$ packed form
35615A07796O55339j99156l48480k2423j85632o10369l69411K01770r292o65046
35605a444904k82123J156933J899379J076762j99437q84541j338239j911976j878318
35596c806464p45350O64350J376530J430127J125022K52328j044087j682048r41571
35587c371163L81483J003923P32518K80378J08572J58436K32451M5436o31414
35578a059380j420447j474131n61581N81944J325287J812770K176862J967686
35570C349010R89427o2902m89718m79945n24763o05347n64319n85467o58797k91124
35560G6055N41577R06627K23702o28665m74321M54403R68052O25057k4685n38744
35550B129058q88993r06621m34784P4819L4630l00680k04514K76642L82444p5281
$$ plain form
35540 86720 -364267 -770243 -1134398 -1689591 -2163638 -1916554 -834404 405035 1051849
35531 1051849 977460 662424 762168 1620409 2891917 3653008 3209081 1893417 848947
35522 848947 897919 1745263 2378870 2147838 1318924 613309 397728 480880 560062 536823
35512 536823 368404 19642 -242274 38947 709493 778430 -353608 -1747035 -1858702
35503 -1858702 -567950 638156 646629 -70680 -607104 -988659 -1609234 -2037173 -1443282
35494 -1443282 44161 1346531 1753279 1449940 750288 -307138 -1318278 -1279376 343036
35485 343036 2626355 3858886 3193334 1342223 -318648 -1036423 -1042299 -943599 -1044411
35476 -1044411 -1277628 -1582384 -2081611 -2791825 -3319157 -3107077 -2101027 -1048379 -917853
$$ packed form
35540H6720m50987m05976l64155n55193m74047K47084J082150J239439O46814
35531A051849p4389l15036R9744Q58241J271508P61091m43927j315664j044470
35522H48947M8972Q47344O33607k31032q28914p05615k15581Q3152P9182k3239
35512E36823j68419l48762k61916K81221O70546O8937j132038j393427j11667
35503a858702J290752J206106Q473p17309n36424l81555o20575m27939N93891
35494a443282J487443J302370M06748l03339o99652j057426j011140L8902J622412
35485C43036K283319J232531o65552j851111j660871p17775n876R8700j00812
35476a044411k33217l04756m99227p10214n27332K12080J006050J052648J30526
$$ plain form
35467 -917853 -1898231 -3054051 -3161838 -1943654 -329826 584737 684881 796559 1674109
35458 1674109 3260165 4837211 5613736 5194827 3818651 2258055 1291585 1161858 1625342
35449 1625342 2421833 3410567 4279251 4513436 3835826 2475788 929259 -317264 -794840
35440 -794840 -163229 1427306 3248138 4448280 4557617 3614016 2078845 656206 -123747
35431 -123747 -255421 4378 640306 1669631 2499024 2231090 895869 -317691 -559021
35422 -559021 -442048 -1007555 -2068604 -2501902 -1976506 -1397804 -1488133 -1810468 -1619717 -1007317
35412 -1007317 -594435 -483971 -204093 376972 709573 385297 -93061 185646 1305730
35403 1305730 2210393 1872246 539833 -566441 -733384 -459640 -536265 -903756 -866921
$$ packed form
35467i17853r80378j155820j07787J218184J613828R14563J00144J11678Q77550
35458A674109J586056J577046P76525m18909j376176j560596r66470j29727M63484
35449A625342P96491R88734Q68684K34185o77610j360038j546529j246523m77576
35440g94840O31611J590535J820832J200142J09337r43601j535171j422639p79953
35431a23747j31674K59799O35928J029325Q29393k67934j335221j213560k41330
35422e59021J16973n65507j061049m33298N25396N78702r0329l22335J90751O12400
35412a007317M12882J10464K79878N81065L32601l24276m78358K78707J120084
35403A305730R04663l38147j332413j106274j66943K73744p6625l67491L6835
$$ plain form
35394 -866921 -207297 472436 600398 431461 732692 1837155 3285282 4441436 5223566
35385 5223566 5953472 6567008 6452963 5357672 4027230 3390693 3358621 3153596 2706751
35376 2706751 2747527 3286383 3091788 1387928 -751927 -1650198 -1116821 -281438 274057
35367 274057 994936 1980870 2383132 1654744 522196 63737 320327 391787 -370542 -1718754
35357 -1718754 -2893295 -3320442 -3001701 -2397337 -1881881 -1319908 -360491 890962 1811757
35348 1811757 1942208 1465102 948357 846315 1252244 1839876 2015592 1430322 395485
35339 395485 -455972 -893883 -1186575 -1548406 -1864178 -1923435 -1565172 -692995 421817 1024213
35329 1024213 663794 -23147 -48174 480248 536063 -138912 -621995 -440226 -466382 -1454964
$$ packed form
35394h66921O59624O79733J27962j68937L01231J104463J448127J156154P82130
35385E223566P29906O13536j14045j095291j330442o36537l2072k05025m46845
35376B706751M0776N38856j94595j703860k139855q98271N33377Q35383N55495
35367B74057P20879R85934M02262p28388j132548m58459K56590P1460p62329j348212
35357a718754j174541m27147L18741O04364N15456N61973R59417J251453R20795
35348A811757J30451m77106n16745j02042M05929N87632J75716n85270j034837
35339C95485q51457m37911k92692l61831l15772n9257L58263Q72177J114812O02396
35329A024213l60419o86941k5027N28422N5815o74975m83083J81769k6156r88582
$$ plain form
35319 -1454964 -2669946 -2970493 -2537329 -2384995 -2614586 -2340262 -1201142 126895 959336
35310 959336 1255456 1209444 1015281 1076690 1627663 2079561 1598751 454502 -112595 406616
35300 406616 1162869 1403100 1579640 2362838 3384418 3833262 3739012 3743687 3927135 3755105
35290 3755105 3059076 2263119 1669514 1245736 1115778 1500474 2048987 1980044 1151612 310009
35280 310009 -66869 -485294 -1475706 -2550385 -2885316 -2623251 -2571524 -2754127 -2310514 -1074185
35270 -1074185 -257271 -884027 -2179649 -2374863 -878154 1123770 2196795 2089011 1507085
35261 1507085 1103480 1027398 1098468 1083410 955758 996129 1415310 1881751 1837832 1362686
35251 1362686 1182053 1583712 1905428 1523622 794060 394953 204993 -338709 -1020147
$$ packed form
35319a454964j214982l00547M33164J52334k29591K74324J139120J328037Q32441
35310I59336K96120m6012j94163O1409N50973M51898m80810j144249n67097N19211
35300D06616P56253K40231J76540P83198J021580M48844r4250M675J83448j72030
35290C755105o96029p95957n93605m23778j29958L84696N48513o8943q28432q41603
35280C10009l76878m18425r90412j074679l34931K62065N1727j82603M43613J236329
35270a074185Q16914o26756j295622j95214J496709K001924J073025j07784n81926
35261A507085m03605p6082P1070j5058j27652M0371M19181M66441m3919m75146
35251A362686j80633M01659L21716l81806p29562l99107j89960n43702o81438
$$ plain form
35242 -1020147 -941248 76247 1031541 974010 38780 -1033169 -1768211 -1961187 -1418102
35233 -1418102 -313559 532140 336557 -772301 -1934834 -2473032 -2329301 -1819996 -1320711
35224 -1320711 -1023087 -668103 262413 1721770 2762054 2578136 1696511 1440547 2218845
35215 2218845 3055809 2991871 2247254 1620694 1346109 1129607 924497 975118 1186161 1055691
35205 1055691 355755 -511481 -964859 -787989 -161688 573663 1088850 1224687 1096585
35196 1096585 897710 577474 -62670 -901233 -1404201 -1180811 -446881 255277 660774
35187 660774 912172 1195650 1482952 1632764 1560252 1236004 626867 -224188 -993209 -1035448
35177 -1035448 165165 2272136 4008917 4232212 3150535 2099966 2033303 2677997 3301997
$$ packed form
35242a020147P8899J017495R55294n7531r35230j071949p35042j92976N43085
35233a418102J104543Q45699j95583j108858j162533n38198J43731N09305M99285
35224a320711K97624L54984R30516J459357J040284j83918q81625k55964P78298
35215B218845Q36964o3938p44617o26560k74585k16502k05110N0621K11043j30470
35205A055691o99936q67236m53378J76870O26301P35351N15187J35837j28102
35196A096585j98875l20236o40144q38563n02968K23390P33930P02158M05497
35187F60774K51398K83478K87302J49812p2512l24248o09137q51055p69021m2239
35177a035448J200613K106971J736781K23295j081677j050569o6663O44694O24000
$$ plain form
35168 3301997 3638835 3613492 2834618 1199438 -375074 -784692 -179279 372175 601109
35159 601109 1270190 2446977 2843670 1657478 46692 -298934 600228 1317564 1121754
35150 1121754 596928 375048 442190 725205 1226812 1404893 551746 -846171 -1227149
35141 -1227149 -16284 1413052 1597426 938259 829797 1485796 1803774 1134722 68209
35132 68209 -592084 -688242 -338266 486529 1633399 2552092 2786825 2414734 1847898 1494628
35122 1494628 1642359 2237725 2681558 2314724 1310218 670209 1097068 2199303 2996695
35113 2996695 2846273 1705561 -31945 -1616309 -2260400 -1810438 -857340 105576 1251041
35104 1251041 2737873 3890423 3729165 2192013 266111 -1027900 -1316721 -743122 166389
$$ packed form
35168C301997L36838k5343p78874j635180j574512m09618O05413N51454K28934
35159F01109O69081J176787L96693j186192j610786l45626Q99162P17336j95810
35150A121754n24826k21880O7142K83015N01607J78081q53147j397917l80978
35141a227149J210865J429336J84374o59167j08462O55999L17978o69052j066513
35132F8209o60293r6158L49976Q24795J146870R18693K34733l72091n66836l53270
35122A494628J47731N95366M43833l66834j004506o40009M26859J102235P97392
35113B996695j50422j140712j737506j584364o44091M49962R53098R62916J145465
35104A251041J486832J152550j61258j537152j925902j294011k88821N73599R09511
$$ plain form
35095 166389 544140 -162599 -1407281 -2042609 -1773020 -1432937 -1575054 -1602215 -885735 -66689
35085 -66689 -378767 -1956412 -3588837 -4078685 -3255066 -1758196 -444768 41491 -258152
35076 -258152 -508867 32661 1015029 1422192 980714 445955 376418 368637 -192156 -1267886
35066 -1267886 -2375434 -3013798 -2559049 -554516 2266209 3997407 3509702 1903440 1098685
35057 1098685 1401092 1578460 1081909 765541 1143887 1320529 454373 -682287 -645153
35048 -645153 692492 2063169 2474990 2054658 1282156 311403 -650407 -1012952 -440749
35039 -440749 471800 706117 6156 -809679 -839272 -114611 621006 967794 1256659 1787238
35029 1787238 2163086 1827501 986790 387766 191894 -284145 -1475920 -2785942 -3313089
$$ packed form
35095A66389L77751p06739j244682o35328K69589L40083j42117k7161P16480Q19046
35085f6689l12078j577645j632425m89848Q23619J496870J313428M86259k99643
35076b58152k50715N41528R82368M07163m41478n34759o9537p781n60793j075730
35066a267886j107548o38364M54749K004533K820725J731198m87705j606262q04755
35057A098685L02407J77368m96551l16368L78346J76642q66156j136660L7134
35048f45153J337645J370677M11821m20332p72502r70753r61810l62545N72203
35039d40749R12549K34317o99961q15835k9593P24661P35617L46788K88865N30579
35029A787238L75848l35585q40711n99024j95872m76039j191775j310022n27147
$$ plain form
35020 -3313089 -2975118 -2409981 -1997951 -1512130 -692472 278421 946011 964028 311900 -607029
35010 -607029 -1111098 -786477 42000 594381 466368 64466 186122 1195463 2525841
35001 2525841 3006669 1974164 192503 -709030 -22232 1214161 1642445 1405111 1735139
34992 1735139 2941767 3859093 3541740 2526715 1819846 1401047 565798 -719911 -1723993
34983 -1723993 -2043525 -1952284 -1639007 -902596 175849 956876 1033643 804238 844626 1109954
34973 1109954 1196353 1036957 789166 290410 -675553 -1596319 -1473895 -162233 1120710
34964 1120710 1122621 55490 -765502 -570349 161925 581618 416272 -95618 -622451 -782387
34954 -782387 -278504 569867 837512 72470 -929860 -1031477 -210940 586151 929857
$$ packed form
35020c313089L37971N65137M12030M85821Q19658R70893O67590J8017o52128r18929
35010f07029n04069L24621Q28477N52381j28013m01902J21656J009341J330378
35001B525841M80828j032505j781661r01533O86798J236393M28284k37334L30028
34992A735139J206628R17326l17353j015025p06869m18799q35249j285709j004082
34983a723993l19532R1241L13277P36411J078445P81027P6767k29405M0388K65328
34973A109954Q6399j59396k47791m98756r65963r20766J22424J311662J282943
34964A120710J911j067131q20992J95153P32274M19693j65346n11890n26833j59936
34954g82387N03883Q48371K67645p65042j002330j01617Q20537P97091L43706
$$ plain form
34945 929857 1344605 2108126 2575710 2255216 1775952 1974070 2524347 2422812 1586300 966155
34935 966155 1013307 985638 125339 -1235073 -2208053 -2397809 -1909734 -851805 508970
34926 508970 1426247 1245457 249398 -621441 -876982 -804623 -696231 -319647 627393 1918131
34916 1918131 2891320 2977756 2112941 878786 190590 460226 1047126 951717 83154 -670121
34906 -670121 -718239 -465611 -436869 -401554 38759 513245 306170 -524895 -1202125 -1323466
34896 -1323466 -1225003 -1242388 -1280681 -1245372 -1281270 -1339601 -1019336 -145975 860953 1469988
34886 1469988 1608994 1567766 1608931 1832811 2165941 2376145 2353138 2354423 2579297 2572896 1711383
34875 1711383 391777 -66846 856489 1960264 1740724 218661 -1322101 -1981383 -1856375
$$ packed form
34945I29857M14748P63521M67584l20494m79264J98118N50277j01535q36512o20145
34935I66155M7152k7669q60299j360412r72980j89756M88075J057929J360775
34926E08970R17277j80790r96059q70839k55541P2359J08392L76584R47040J290738
34916A918131R73189Q6436q64815j234155o88196K69636N86900r5409q68563p53275
34906f70121m8118K52628K8742L5315M40313M74486k07075q31065o77230j21341
34896a323466R8463j7385l8293L5309l5898n8331L20265Q73361J006928O09035
34886A469988J39006m1228M1165K23880L33130K10204k3007J285K24874o401q61513
34875A711383j319606m58623R23335J103775k19540j522063j540762o59282J25008
$$ plain form
34866 -1856375 -1327174 -635779 -170492 -380113 -1204412 -2101592 -2744025 -3218124 -3474797
34857 -3474797 -3102597 -1854748 -81896 1487673 2218756 1941977 1180560 827682 1148980
34848 1148980 1282385 298067 -1383296 -2333255 -1867201 -700080 255946 927783 1592694
34839 1592694 2124192 2294051 2327755 2570992 2847282 2582902 1470208 -144178 -1320132
34830 -1320132 -1031895 817432 2781587 2992028 1257431 -599716 -937068 -137713 350916
34821 350916 155426 224478 1244651 2725629 3666773 3448816 2019154 -211913 -2487578
34812 -2487578 -4069370 -4640205 -4338803 -3654255 -3356960 -3945578 -4782912 -4435525 -2518836
34803 -2518836 -577399 -235972 -1012557 -1122154 -96160 833227 981957 1265673 2403968
$$ packed form
34866a856375N29201O91395M65287k09621q24299q97180o42433m74099k56673
34857c474797L72200J247849J772852J569569P31083k76779p61417l52878L21298
34848A148980J33405r84318j681363r49959M66054J167121R56026O71837O64911
34839A592694N31498J69859L3704K43237K76290k64380j112694j614386j175954
34830a320132K88237J849327J964155K10441j734597j857147l37352P99355M88629
34821C50916j95490O9052J020173J480978R41144k17957j429662k231067k275665
34812b487578j581792n70835L01402O84548K97295n88618q37334L47387J916689
34803b518836J941437L41427p76585j09597J025994R29387J48730K83716J138295
$$ plain form
34794 2403968 3411436 2915779 1168887 -311910 -666033 -309359 142024 686939 1586031
34785 1586031 2756229 3693934 3808360 2902155 1492120 476588 292197 578806 772106
34776 772106 690547 399187 -42336 -420449 -432694 -278228 -697844 -1942482 -3151322 -3348212
34766 -3348212 -2682596 -2017727 -1617240 -1059510 -308355 37391 -288430 -759337 -855794 -736681
34756 -736681 -769115 -846222 -569776 149428 990319 1572177 1709680 1441594 932595 279862
34746 279862 -542910 -1392500 -1754765 -1204399 -49382 862255 1013074 529839 -354389
34737 -354389 -1614934 -3034070 -3991716 -4005382 -3185500 -1936936 -570540 560239 1015488
$$ packed form
34794B403968J007468m95657j746892j480797l54123L56674M51383N44915Q99092
34785A586031J170198R37705J14426r06205j410035j015532j84391K86609J93300
34776G72106q1559k91360m41523l78113j2245J54466m19616j244638j208840j96890
34766c348212O65616O64869M00487N57730P51155L45746l25821m70907r6457J19113
34756g36681l2434p7107K76446P19204Q40891N81858J37503k68086n08999o52733
34746B79862q22772q49590l62265N50366J155017R11637J50819m83235q84228
34737c54389j260545j419136r57646j3666Q19882J248564J366396J130779M55249
$$ [...]
##END NTUPLES=NMR SPECTRUM
##END=
