##TITLE=31Pdec_101-2025
CDCl3, 24 sc
 11.8.2025
##JCAMPDX= 6.0         $$ Bruker NMR JCAMP-DX V2.0
##DATA TYPE= NMR SPECTRUM
##DATA CLASS= NTUPLES
##ORIGIN= UXNMR, Bruker Analytische Messtechnik GmbH
##OWNER= root
$$ XWIN-NMR		Version 3.5
$$ Mon Aug 11 14:44:27 2025 Russian Standard Time (UT+4h)  she@DPX200
##.OBSERVE FREQUENCY= 81.013821
##.OBSERVE NUCLEUS= ^31P
##.ACQUISITION MODE= SIMULTANEOUS
##.ACQUISITION SCHEME= undefined
##.AVERAGES= 24
##.DIGITISER RES= 17
##SPECTROMETER/DATA SYSTEM= spect
##.PULSE SEQUENCE= zgpg30
##.SOLVENT NAME= CDCl3
##.SHIFT REFERENCE= (INTERNAL, CDCl3, 0, 198.062)
##AUDIT TRAIL= $$ (NUMBER, WHEN, WHO, WHERE, WHAT)
$$ ##TITLE= Audit trail, XWIN-NMR		Version 3.5
$$ ##JCAMPDX= 5.01
$$ ##ORIGIN= Bruker BioSpin GmbH
$$ ##OWNER= she
$$ F:/spectra/data/she/nmr/P31/2/pdata/1/auditp.txt
$$ ##AUDIT TRAIL=  $$ (NUMBER, WHEN, WHO, WHERE, WHAT)
(   1,<2025-08-11 14:43:26.37 +0400>,<she>,<DPX200>,
      <created by zg, POWCHK disabled, PULCHK disabled
       configuration hash MD5:
       00 E9 B6 7A A2 85 ED C7 34 08 36 98 17 FE 4E 26
       data hash MD5: 32K
       44 F5 F6 36 1A 0B FB 2D 3C 9F C8 E4 E1 A0 55 81>)
(   2,<2025-08-11 14:43:29.07 +0400>,<she>,<DPX200>,
      <Start of raw data processing
       efp BC_mod = 2 LB = 1.5 FT_mod = 6 PKNL = 1 PHC0 = 1768.057 PHC1 = 64.09937 SI = 64K 
       data hash MD5: 64K
       3C AD C0 26 96 07 AF D0 C7 0A 54 0F 17 CC AA 40>)
(   3,<2025-08-11 14:43:51.01 +0400>,<she>,<DPX200>,
      <pk PHC0 = -15.26333 PHC1 = 38.8 
       data hash MD5: 64K
       4F F2 4E 2D 7A 8E 16 86 50 B3 7B C5 47 64 A7 40>)
$$ ##END=
$$ 
$$ hash MD5
$$ 14 1C DB E7 A1 FF A5 64 01 45 68 DB 8B 0D 02 1E
##$RELAX= 
##$RELAX= 
##$RELAX= 
##$RELAX= 
##$RELAX= 
##$RELAX= 
##$RELAX= 
##$RELAX= 
$$ Bruker specific parameters
$$ --------------------------
##$DU= <F:/spectra>
##$EXPNO= 2
##$NAME= <P31>
##$PROCNO= 1
##$TYPE= <nmr>
##$USER= <she>
##$AMP= (0..31)
100 100 100 100 100 100 100 100 100 100 100 100 100 100 100 100 100 100 
100 100 100 100 100 100 100 100 100 100 100 100 100 100 
##$AQSEQ= 0
##$AQ_mod= 1
##$AUNM= <au_zg>
##$AUTOPOS= <>
##$BF1= 81.014009
##$BF2= 200.13
##$BF3= 200.13
##$BF4= 200.13
##$BF5= 200.13
##$BF6= 200.13
##$BF7= 200.13
##$BF8= 200.13
##$BYTORDA= 1
##$CFDGTYP= 0
##$CFRGTYP= 5
##$CHEMSTR= <none>
##$CNST= (0..31)
1 1 145 1 1 1 1 1 1 1 1 1 1 1 1 1 1 1 1 1 1 1 1 1 1 1 1 1 1 1 1 1 
##$CPDPRG= <waltz16>
##$CPDPRG1= <>
##$CPDPRG2= <waltz16>
##$CPDPRG3= <>
##$CPDPRG4= <mlev>
##$CPDPRG5= <mlev>
##$CPDPRG6= <mlev>
##$CPDPRG7= <mlev>
##$CPDPRG8= <mlev>
##$CPDPRGB= <>
##$CPDPRGT= <>
##$D= (0..31)
0 1 0 0 0 0 0 0 0 0.06 0 0.03 2e-05 3e-06 0 0 0.0002 0 0 0 0 0 0 0 0 0 
0 0 0 0 0 0 
##$DATE= 1754909005
##$DBL= (0..7)
120 120 120 11 120 120 24 19 
##$DBP= (0..7)
150 150 150 150 150 150 150 150 
##$DBP07= 0
##$DBPNAM0= <>
##$DBPNAM1= <>
##$DBPNAM2= <>
##$DBPNAM3= <>
##$DBPNAM4= <>
##$DBPNAM5= <>
##$DBPNAM6= <>
##$DBPNAM7= <>
##$DBPOAL= (0..7)
0.5 0.5 0.5 0.5 0.5 0.5 0.5 0.5 
##$DBPOFFS= (0..7)
$$ [...]
##$SUBNAM3= <"">
##$SUBNAM4= <"">
##$SUBNAM5= <"">
##$SUBNAM6= <"">
##$SUBNAM7= <"">
##$SUBNAM8= <"">
##$SUBNAM9= <"">
##$SW= 400.765351723535
##$SWIBOX= (0..15)
0 1 3 0 0 0 0 0 0 0 0 0 0 0 0 0 
##$SW_h= 32467.5324675325
##$TD= 32768
##$TD0= 1
##$TE= 0
##$TE2= 300
##$TE3= 300
##$TEG= 300
##$TL= (0..7)
0 120 53 12 22 120 120 120 
##$TP= (0..7)
150 150 150 150 150 150 150 150 
##$TP07= 0
##$TPNAME0= <>
##$TPNAME1= <>
##$TPNAME2= <>
##$TPNAME3= <>
##$TPNAME4= <>
##$TPNAME5= <>
##$TPNAME6= <>
##$TPNAME7= <>
##$TPOAL= (0..7)
0.5 0.5 0.5 0.5 0.5 0.5 0.5 0.5 
##$TPOFFS= (0..7)
0 0 0 0 0 0 0 0 
##$TUNHIN= 0
##$TUNHOUT= 0
##$TUNXOUT= 0
##$USERA1= <user>
##$USERA2= <user>
##$USERA3= <user>
##$USERA4= <user>
##$USERA5= <user>
##$V9= 5
##$VALIST= <valist>
##$VCLIST= <CCCCCCCCCCCCCCC>
##$VD= 0
##$VDLIST= <DDDDDDDDDDDDDDD>
##$VPLIST= <PPPPPPPPPPPPPPP>
##$VTLIST= <TTTTTTTTTTTTTTT>
##$WBST= 1024
##$WBSW= 4
##$XGAIN= (0..3)
0 0 0 0 
##$XL= 0
##$YL= 0
##$YMAX_a= 19997
##$YMIN_a= -21546
##$ZGOPTNS= <>
##$ZL1= 120
##$ZL2= 120
##$ZL3= 120
##$ZL4= 120
##$ABSF1= 0
##$ABSF2= 0
##$ABSG= 0
##$ABSL= 0
##$ALPHA= 0
##$AQORDER= 0
##$ASSFAC= 0
##$ASSFACI= 0
##$ASSFACX= 0
##$ASSWID= 0
##$AUNMP= <proc_1d>
##$AZFE= 0.1
##$AZFW= 0.5
##$BCFW= 0
##$BC_mod= 2
##$BYTORDP= 0
##$COROFFS= 0
##$CY= -3
##$DATMOD= 1
##$DC= 0
##$DFILT= <>
##$DTYPP= 0
##$F1P= 0
##$F2P= 0
##$FCOR= 1
##$FTSIZE= 65536
##$FT_mod= 6
##$GAMMA= 0
##$GB= 0
##$INTBC= 1
##$INTSCL= 9.790993e-09
##$ISEN= 30
##$LB= 1.5
##$LEV0= 0
##$LPBIN= 0
##$MAXI= 10000
##$MC2= 0
##$MEAN= 0
##$ME_mod= 0
##$MI= 50
##$NCOEF= 0
##$NC_proc= -8
##$NLEV= 6
##$NOISF1= 182.463
##$NOISF2= 159.3651
##$NSP= 0
##$NTH_PI= 0
##$NZP= 0
##$OFFSET= 198.0616
##$PC= 4
##$PHC0= 1752.794
##$PHC1= 102.8994
##$PH_mod= 1
##$PKNL= yes
##$PPARMOD= 0
##$PSCAL= 0
##$PSIGN= 0
##$REVERSE= no
##$SF= 81.0140089999434
##$SI= 65536
##$SIGF1= 159.3651
##$SIGF2= -187.1042
##$SINO= 113.3802
##$SIOLD= 16384
##$SREGLST= <1H.CDCl3>
##$SSB= 0
##$STSI= 65536
##$STSR= 0
##$SW_p= 32467.5324675325
##$SYMM= 0
##$S_DEV= 0
##$TDeff= 32768
##$TDoff= 0
##$TI= <>
##$TILT= no
##$TM1= 0
##$TM2= 0
##$TOPLEV= 0
##$USERP1= <user>
##$USERP2= <user>
##$USERP3= <user>
##$USERP4= <user>
##$USERP5= <user>
##$WDW= 1
##$XDIM= 65536
##$YMAX_p= 499881552
##$YMIN_p= -63829660
$$ End of Bruker specific parameters
$$ ---------------------------------
##NTUPLES= NMR SPECTRUM
##VAR_NAME=  FREQUENCY,     SPECTRUM/REAL,   SPECTRUM/IMAG
##SYMBOL=    X,             R,               I
##VAR_TYPE=  INDEPENDENT,   DEPENDENT,       DEPENDENT
##VAR_FORM=  AFFN,          ASDF,            ASDF
##VAR_DIM=   65536,         65536,           65536
##UNITS=     HZ,            ARBITRARY UNITS, ARBITRARY UNITS
##FACTOR=    0.49542278885378, 1,            1
##FIRST=     16045.7642231865, 0,            0
##LAST=      -16421.768244346, 0,            0
##MIN=       -16421.768244346, -63829660,    0
##MAX=       16045.7642231865, 499881552,    0
$$ Real data points
##PAGE= N=1
##DATA TABLE= (X++(R..R)), XYDATA
$$ [...]
41022A988127O39104J172942J733453R16891j269167k642847j398471J183158
$$ 1988127 2627231 3800173 5533626 6450517 5181350 2538503 1140032 2323190
41014B323190K108898O81869o57402p2563R45002J0495k393417l573668k431507
$$ 2323190 4432088 5113957 4456555 4383992 5328994 5339489 2946072 -627596 -3059103
41005c059103n97202K37115K95515N69169J166960J572907J588110J325865Q66213
$$ -3059103 -3656305 -3419190 -3123675 -2554506 -1387546 185361 1773471 3099336 3965549
40996C965549L39390j21395o44478j282405j501244q26928R6678J72767l82720
$$ 3965549 4304939 4183544 3539066 2256661 755417 -71511 25167 197934 -184786
40987a84786k11986R48758J566532N09671j242749j960502j292060j67904N91030
$$ -184786 -396772 551986 2118518 2628189 1385440 -575062 -1867122 -2035026 -1443996
40978a443996O77951O6077o97368n97085N56618J540929J293274M10033J10648
$$ -1443996 -766045 -699968 -1397336 -1994421 -1437803 103126 1396400 1806433 1917081
40969A917081L98366M32713J57724J78324L50265k1698o24853k77883J078963
$$ 1917081 2315447 2748160 2905884 3084208 3434473 3412775 2787922 2510039 3589002
40960C589002J889997J057556n65676j447071j309805j044699j232187j489204
$$ 3589002 5478999 6536555 5970879 4523808 3214003 2169304 937117 -552087
40952e52087j118589j3436J007912Q10501p05662k009929j502208K83815J114573
$$ -552087 -1670676 -1684112 -676200 134301 -571361 -2581290 -4083498 -3799683 -2685110
40943b685110Q2877j043368m31253J001265R55570o50759j402783O6878K074859
$$ -2685110 -2602233 -3645601 -4076854 -3075589 -2120019 -2770778 -4173561 -4106683 -2031824
40934b031824K325926R32605k85917m96399k69850J00082Q96382J620374J120108
$$ -2031824 294102 1226707 940790 444391 174541 274623 1171005 2791379 3911487
40925C911487m37527j304328o42013J67846k49134j091946q70825R2775M46587
$$ 3911487 3473960 2169632 1527619 1695465 1446331 354385 -516440 -423665 22922
40916B2922K73447O91322J364069P05410j216096k207738j124060M53785P52034
$$ 22922 296369 987691 2351760 3057170 1841074 -366664 -1490724 -1036939 -284905
40907b84905K90020N08151J335082J670679J307689Q55881M22484k47534q06292
$$ -284905 5115 513266 1848348 3519027 4826716 5682597 6105081 5857547 5051255
40898E051255p33112l59859l68404o17793m86649l5902J45665m1487k22472l02811
$$ 5051255 4318143 3958284 3589880 2972087 2485438 2449536 2595201 2553714 2331242 2028431
40888B028431m81031q29638j376396k047438k160924r85573O62164P87385q75596
$$ 2028431 1547400 717762 -658634 -2706072 -4866996 -5852569 -5190405 -4403020 -5278616
40879e278616j919692o21998J405396J789167J010634J027379J631108J114950
$$ -5278616 -7198308 -7820306 -6414910 -4625743 -3615109 -2587730 -956622 158328
40871A58328k69107o95512k19452n48147j382344n01497J977209L012138J429306
$$ 158328 -110779 -806291 -1025743 -1573890 -2956234 -3457731 -1480522 1531616 2960922
40862B960922j51951K14670P60497l72974j537054m81910J505852J547147l32218
$$ 2960922 2808971 3023641 3784138 3411164 1874110 1392200 2898052 4445199 4112981
40853D112981j709782j691057j416591j340021p59826K19514O80748P22611J172547
$$ 4112981 2403199 712142 -704449 -2044470 -2804296 -2584782 -1904034 -1181423 -8876
40844h876J617415P85487j095783k221732j637486j70057J063762J602756J221295
$$ -8876 1608539 2394026 1298243 -923489 -2560975 -2731032 -1667270 -64514 1156781
40835A156781P9908p96037n91903m4222l18963r78222p04644L49788Q05906M09074
$$ 1156781 1236689 440652 -151251 -195473 -514436 -1492658 -2197302 -1847514 -1041608 -632534
40825f32534J73029K78419o8643n54096K51246K272613L320485J928869p89380
$$ -632534 -459505 -181086 -249729 -803825 -552579 1720034 5040519 6969388 6180008
40816F180008k828533l382316k692741j314872j64172O7336K6026Q43743J935546
$$ 6180008 3351475 -30841 -2723582 -4038454 -4202626 -4135290 -4109264 -3265521 -1329975
40807a329975J470958m98051j502763k15389J490741J386728N062o83859k28337
$$ -1329975 140983 -357068 -1859831 -2075220 -584479 802249 807311 123452 -104885
40798a04885L86481O26453N54964K7615p27678o26038O68019J575647O89388q48146
$$ -104885 281596 908049 1463013 1490628 762950 136912 804931 2380578 3069966 2221820
40788B221820r22396K59097N51667o95547j760412j367665l96882m7138M7085
$$ 2221820 1299424 1558521 2110188 1414641 -345771 -1713436 -2110318 -2157456 -2110371
40779b110371P44793J565029J260289j74951j221454p41453N68752J146886O71834
$$ -2110371 -1365578 199451 1459740 1284789 63335 -678118 -109366 1037520 1709354
40770A709354L96929J079626J471628j2911k563704l532148j997266j04924J1296
$$ 1709354 2106283 3185909 4657537 4644626 2080922 -1451226 -3448492 -3553416 -3542120
40761c542120q90278p24182O87861J686018J385321M41523n00166j414777j942463
$$ -3542120 -4432398 -5156580 -4468719 -2782701 -1397380 -955857 -1456023 -2870800 -4813263
40752d813263j408086j06165P09902M67378j53779m91778o14933m99019K90091
$$ -4813263 -6221349 -6327514 -5617612 -5150234 -5304013 -5795791 -6410724 -6909743 -6619652
40743f619652J565515K226711J657488N87025m5567k68267m37054k44434O44208
$$ -6619652 -5054137 -2827426 -1169938 -582913 -628480 -896747 -1333801 -1578235 -934027
40734i34027J458110R45226q74509k466233k537252j417580l61397K9409J63972
$$ -934027 524083 1469309 594800 -1871433 -4408685 -5826265 -6187662 -6158253 -5994281
40725e994281N04755R29126J173394J302926J341776R45124N9352n09164n1142
$$ -5994281 -5489526 -4560400 -3387006 -2084080 -742304 202820 262172 -246992 -298134
40716b98134P78630P59249J31620M40742J950939K723559J277729j058875j849780
$$ -298134 480496 1239745 1371365 1812107 3763046 6486605 7764334 6705459 4855679
40707D855679q07881J48497l01766j488525k112179j750192q48391j32921j31127
$$ 4855679 4047798 4196295 3894529 2406004 293825 -1456367 -2304758 -2437679 -2568806
40698b568806n92507n39133M10361J159027N11949r59639j586033q58476K26898
$$ -2568806 -3161313 -3700446 -3290085 -2131058 -1619109 -2578748 -4164781 -5023257 -4796359
40689d796359R09813J379428J714478J480818O58681j46033n89358o67482j6702
$$ -4796359 -3886546 -2507118 -792640 688178 1346859 1200826 611468 -56014 -72716
40680g2716J537371K809466K267816L90640p43576n80840q44180k427252l618189
$$ -72716 1464655 4274121 6541937 6932577 6189001 5608161 4763981 2336729 -1281460
40671a281460k766501r23549p2962j15851L90422J430648J619771P50705K48688
$$ -1281460 -4047961 -4971510 -5044472 -5160323 -4769901 -3339253 -1719482 -968777 -720089
40662g20089Q87285J647705J319713Q9598r88027j322356j104098p46337m21008
$$ -720089 167196 1814901 3134614 3224212 2236185 913829 -190269 -936606 -1357614
40653a357614q5242J75800O9627l32210k62772O97647J440640M73917j571215
$$ -1357614 -1442856 -1267056 -1197429 -1529639 -1792411 -1094764 345876 819793 -751422
40644g51422k170287l61324J662129J624742L18244K459Q90090J279369M49071
$$ -751422 -2921709 -3283033 -1620904 3838 322082 324541 1214631 2494000 2943071
40635B943071p15296j635826k486893k795463j669601K99720J235469N29804m25625
$$ 2943071 2227775 591949 -1894944 -4690407 -6360008 -6060288 -4824819 -4295015 -4720640
40626d720640m71708J380M52697J173014K085684K148656R64994k92356n56323
$$ -4720640 -5192348 -5190968 -4738271 -3565257 -1479573 669083 1634077 1341721 785398
40617G85398l34197n43327r53150q12369j26356O36457J271609J449671N82937
$$ 785398 451201 -92126 -1045276 -1857645 -1984001 -1347544 -75935 1373736 1956673
40608A956673r88011j691341o97079P46939J099210O65088O02333P48796J72975
$$ 1956673 968662 -722679 -1419758 -672819 426391 1091479 1693812 2442608 2615583
40599B615583p25553o00752M78656Q95623j7937r65284p14876J62596L09084n73286
$$ 2615583 1890030 1289278 1767934 2663557 2645620 1680336 965460 1128056 1437140 863854
40589H63854j555767j599058m28096J236187K119380J560683L20488k73066R9188
$$ 863854 -691913 -2290971 -2719067 -1482880 636500 2197183 2517671 2244605 2343793
40580B343793O27123O20357P6717p80604j542449j369838P0463J451891R75844
$$ 2343793 2970916 3591273 3667990 2887386 1344937 -24901 45562 1497453 2473297
40571B473297j048251k259050j326187M89304J454748J436108R13148l81822k312857
$$ 2473297 1425046 -834004 -2160191 -1670887 -216139 1219969 2133117 1751295 -561562
40562e61562l174030j588345J178919K620488K198186J404709J065315N73716
$$ -561562 -3735592 -5323937 -4145018 -1524530 673656 2078365 3143680 3717396
40554C717396k42769n41461j41668J0251l85802l96908K85881N38567k39020q91580
$$ 3717396 3474627 2933166 2791498 2801749 2415947 2019039 2304920 2843487 2604467 1712887
40544A712887l95006L72291J16661p15791p97725j22018K46948J11612K71413
$$ 1712887 1317881 1690172 1806833 1091042 293317 171299 418247 529859 801272
40535H01272R53798J526657J686974J699364J544019R84581L28074m5217o12476
$$ 801272 1755070 3281727 4968701 6668065 8212084 9196665 9524739 9479522 8867046
40526H867046j788929k429325j081099J277997J872815J6701j754702j397916
$$ 8867046 7078117 4648792 3567693 4845690 6718505 6735206 4980504 3582588
40518C582588j48973j48496j151392j563028j304643j347789j345839k07633J409134
$$ 3582588 3433615 3285119 2133727 570699 -733944 -2081733 -3427572 -3635205 -2226071
40509b226071J691391P63481O81699J881756K117099M400k543827k957432j416884
$$ -2226071 -534680 228801 910500 2792256 4909355 4913755 2369928 -587504 -2004388
40500b004388N3959O04824Q44429J008839P50396L56822M83889P99807L44992
$$ -2004388 -1950429 -1345605 -501176 507663 1258059 1614881 2098770 2898577 3243569
40491C243569q18596j630675j639676j304559p65549L04259J554419K057141J737291
$$ 3243569 2424973 794298 -845378 -2149937 -2915486 -2611227 -1056808 1000333 2737624
40482B737624J362369R74340j12194j473150j553938j56304Q89462N19691J3117
$$ 2737624 4099993 5074333 4962139 3488989 1935051 1778747 2668209 3187900 3201017
40473C201017M06025L24855j512904l320255k523783k3811Q97048l97573j173957
$$ 3201017 3607042 3931897 2418993 -901262 -3425045 -3448856 -2551808 -2949381 -4123338
40464d123338K1085J273780J007204O33751J526924K022539J63610k449008k650211
$$ -4123338 -4102253 -2828473 -1821269 -1187518 339406 2361945 2525555 76547 -2573664
40455b573664n25408Q96013M09782k9288Q72225J571452N88191p80213m71499
$$ -2573664 -3099072 -2203059 -1793277 -1822565 -950340 621112 1209303 429090 -42409
40446d2409J063617J484587j54333k260867k722202j080028J271457K427825J575191
$$ -42409 1021208 2505795 2351462 90595 -2631607 -3711635 -2440178 -12353 1562838
40437A562838l39240j553077j144977M44567K218635L231782K689129O53136j262058
$$ 1562838 1223598 -329479 -1474456 -1029889 1188746 4420528 7109657 7762793 6500735
40428F500735j266289J45315N17349j183146l070329l174423k112035j441940
$$ 6500735 5234446 5379761 5897110 4713964 1643635 -1530788 -3642823 -5084763
40420e084763q84554P33949K782547L454480K669709J996901J765545P09482j155655
$$ -5084763 -5969317 -5235368 -2452821 1001659 3671368 5668269 7433814 8143296 6987641
40411F987641j842836o05597M29746n86811k249438k001098J2226J306013O85010
$$ 6987641 5144805 4539208 4968954 4382143 2132705 131607 143833 1449846 2134856
40402B134856n41397r57130q36225j012087j265667p14345P37021K001526J862704
$$ 2134856 1593459 636329 -199896 -1211983 -2477650 -3191995 -2454974 -453448 1409256
40393A409256K96334j298063j421888j07222J189159J419593R67795N43951N5928
$$ 1409256 1705590 407527 -1014361 -1121583 67576 1487169 2454964 2998915 3054843
40384C054843o36349p95634J28459J149133Q98675j86017l60009P90380J783717
$$ 3054843 2418494 1622860 1751319 2900452 3799127 3613110 3253101 4043481 5827198
40375E827198J584201R43232P89593O89990j56182j459572k382314k751336k817332
$$ 5827198 7411399 8354631 9144224 9834214 9678032 8218460 5836146 3084810 267478
40366B67478k490410j716675j021308q02414o20935j1227O01080O63826N08730
$$ 267478 -2222932 -3939607 -4960915 -5763329 -6384264 -6395491 -5794411 -5130585 -4621855
40357d621855N75109L62462n01328q03049Q48684L348096L809730J371355j527781
$$ -4621855 -4046746 -3684284 -4185612 -4988661 -4139977 -791881 3017849 4389204 2861423
40348B861423k417219j643928q47505k21073R32995J960567J362313n51181j461052
$$ 2861423 444204 -1199724 -2047229 -2268302 -1335307 625260 1987573 1436392 -24660
40339b4660p6278K042102K517437J039511p15303j403820j216673r49517q33454
$$ -24660 -100938 1941164 4458601 5498112 4782809 3378989 2162316 1212799 379345
40330C79345n67842J3755O41463P72495j4259j465344k433038j762701K07657
$$ 379345 -188497 -174742 466721 1239216 1224957 -240387 -2673425 -4436126 -4228469
40321d228469J556854R17513o25056p80551Q43609K174874J646853L12442r9340
$$ -4228469 -2671615 -1754102 -2379158 -3159709 -2316100 -141226 1505627 1818069 1718729
40312A718729N1751p03532j943758j626990N14903K102658J472220j066k06932
$$ 1718729 1770480 1066948 -876810 -2503800 -1988897 113761 1585981 1584915 1377983
40303A377983O49980R19758K73165k39977k69541m83020r62992q84433L7927R96297
$$ 1377983 2027963 2947721 3220886 2980909 2711368 2228348 1265356 380923 418850 1415147
40293A415147J191655O02820l45903j074391r96954k60381K318q11678j439727
$$ 1415147 2606802 3209622 2863719 1789328 792374 531993 534311 -277367 -1717094
40284a717094k67890K135385L541721K980124J459171j90139k181824m065463
$$ -1717094 -1984984 150401 3692122 6672246 8131417 7941278 5759454 1693991
40276A693991m262443k354105j21498Q82429J272063K053984K448881J235606
$$ 1693991 -2568452 -4922557 -5044055 -4161626 -2889563 -835579 1613302 2848908
40268B848908q24565j826220j393764p49523m85303m6762O11945O10515j98807
$$ 2848908 2024343 198123 -1195641 -1945164 -2430467 -2477229 -1865284 -1254769 -1453576
40259a453576n54428N08615K140873K569607J107236j164901k529676k263251
$$ -1453576 -2008004 -1499389 641484 3211091 4318327 3153426 623750 -1639501
40251a639501j221746p87495j248227j554200p61564Q26564K201599K714181K261953
$$ -1639501 -2861247 -3648742 -4896969 -6451169 -7212733 -6386169 -4184570 -1470389 791564
40242G91564J127615J07999O2346P47962Q71025n7217q03701k06803J017414J365964
$$ 791564 1919179 2027178 2089524 2837486 3708511 3651294 2847593 2640790 3658204 5024168
40232E024168O80147m8157l77665o20038q16716q02338r01584j351157j482382
$$ 5024168 5704315 5656158 5278493 4658455 3841739 3039401 2137817 786660 -695722
40223f95722p17109J95949L23847K36250Q59100J335331J78742j813879k247215
$$ -695722 -1412831 -1216882 -893035 -656785 202315 1537646 1716388 -97491 -2344706
40214b344706p81367M27677L47702M65254J651884K301553J149443l54304m39834
$$ -2344706 -3126073 -2698396 -2350694 -1885440 -233556 2067997 3217440 2863136 2423302
40205B423302R4711m26795j479613j354602k42643J81319k51861o3495J058306
$$ 2423302 2518013 2091218 611605 -742997 -985640 -804321 -1056182 -1119677 -61371
40196f1371J568661O10385o75016j055934q24070o61792k77144P02701J431357
$$ -61371 1507290 2117675 1442659 386725 -437345 -1099137 -1376281 -673580 757777
40187G57777P58410q88913j715492q25688N59887O55354n83892j432035o77679
$$ 757777 1516187 627274 -1088218 -1913906 -1354019 -698665 -1282557 -2714592 -3392271
40178c392271Q43179J496717R88335L25619J4999m03934q95292m56317J112930
$$ -3392271 -2549092 -1052375 -64040 261579 276578 -127356 -1022648 -1478965 -366035
40169c66035K156532J094908j269592k643710k113729q93362k55960K8342P59028
$$ -366035 1790497 2885405 1615813 -1027897 -3141626 -4034988 -4290948 -4262606 -3503578
40160c503578J738277J930451R28961l51307o31772K80546J271311J240678L76575
$$ -3503578 -1765301 165150 1094111 742804 111032 391578 1662889 2903567 3280142
40151C280142k48875j68005L925l38270q46755p16039K62922J429708J780675
$$ 3280142 3031267 2863262 2867187 2528917 1682162 966123 1229045 2658753 4439428
40142D439428P06156j371249l016548k965289j458362O6582O84020P87213J094097
$$ 4439428 5145584 3774335 757787 -2207502 -3665864 -3599282 -2915262 -2128049 -1033952
40133a033952J592651J807434J531510R44939M07875K98860O80407J164201J512963
$$ -1033952 558699 2366133 3897643 4842582 5250457 5549317 6229724 7393925 8906888
40124H906888K010520K570601K152410L12876j276801o72882J285046J958638
$$ 8906888 10917408 13488009 15640419 15953295 14676494 14003612 15288658 17247296
40116A7247296J012973R13384K619576L640213K028115k00314K269K153723L173892
$$ 17247296 18260269 19173653 21793229 25433442 27461557 27261243 27263512 29417235 32591127
40107C2591127J738655p21502k607870l445346l062448j607436k12106O1457l20439
$$ 32591127 34329782 33608280 31000410 27555064 24492616 22885180 22673074 22734531 22414092
40098B2414092l65918l79331j180268k225606k336166j709755j376139j241260
$$ 22414092 22048174 21668843 20488575 18262969 15926803 14217048 12840909 11599649
40090A1599649n87708R6682j20386n76626J6790J001228N69311j104346k031685
$$ 11599649 11011941 11108623 10988237 10411611 10428401 11429629 11998940 10894594 8862909
40081H862909j674719j481856j973635j879285o70622M69266Q30814J069459J325007
$$ 8862909 7188190 5706334 3732699 1853414 1182792 1652058 2482872 3552331 4877338
40072D877338P46339m30867o55205K81808O57155k09040p37518L7966P03220m3633
$$ 4877338 5623677 5192810 4537605 4819413 5476568 5267528 4530010 4567976 5271196 5227563
40062E227563j242467j528199j239920j136135p62632L13782J223263J272229
$$ 5227563 3985096 2456897 1216977 80842 -681790 -368008 855255 2127484
40054B127484J225316J679165J686941N20327o57983m62406O57051J450035J650766
$$ 2127484 3352800 5031965 6718906 7239233 6581250 6118844 6775895 8225930 9876696
40045I876696J407180M11992r64078j223107J5582Q96915J29109p49533J85763
$$ 9876696 11283876 11695868 10731790 9508683 9524265 10421180 10550289 9800756 9986519
40036I986519K173831L338995L790620M577646M809002K821396l16182j437193
$$ 9986519 12160350 15499345 19289965 23867611 28676613 31498009 31181827 29744634
40028B9744634L62363K414906K083630j16205j558610m52387K548139M855355
$$ 29744634 30106997 32521903 34605533 34489328 32930718 32478331 35026470 39881825
40020C9881825M226900J248200j028877o85121Q16467J015877j82686j089509
$$ 39881825 44108725 45356925 44328048 43642927 44459394 45475271 45292585 44203076
40012D4203076j044941p80806p19490p14079r33883j463285j680330j410830j692616
$$ 44203076 43158135 42377329 41657839 40943760 40009877 38546592 36866262 35455432 33762816
40003C3762816k892473l403534k107941o94837j204106k628748k670276j662375
$$ 33762816 30870343 27466809 25358868 24664031 23459925 20831177 18160901 16498526
39995A6498526j633445k368826j874751l57072j28915j415172j756846j73749
$$ 16498526 14865081 12496255 10621504 10264432 10135517 8720345 6963499 6789750
39987F789750J322085J152481J03762r71841k376698l514194k622446J26496J975963
$$ 6789750 8111835 9264316 9368078 8396237 6019539 2505345 -117101 9395 1985358
39978A985358J399484N0051l54773m24305r02739q07661L53387R26753k35308
$$ 1985358 3384842 3434893 3080120 2655815 1753076 945415 1298802 2225555 1990247
39969A990247j509580r57458P27366J669430J551103J064032K81428n71525l59068
$$ 1990247 480667 -476791 250575 1920005 3471108 4535140 4816568 4245043 3885975
39960C885975J048105J664973J20018k039975k682851k102487j619579q70502
$$ 3885975 4934080 6599053 6719071 4679096 1996245 -106242 -1725821 -2596323
39952b596323R94514K765293K555917R08349J9061N16887J314549J990464K939750
$$ -2596323 -1601809 1163484 3719401 4627750 4646811 5163698 6478247 8468711 11408461
39943A1408461L660147L220756K097386J420757Q96054l16588j274681m19126
$$ 11408461 15068608 18289364 20386750 21807507 22703561 22386973 21112292 20693166
39935B0693166J282167J219053p14208j719308l68222J515517K179686K428481
$$ 20693166 21975333 23194386 22480178 20760870 20392648 21908165 24087851 26516332
39927B6516332L266748L427100J403172j559285k797137j941658j317543k610976
$$ 26516332 29783080 33210180 34613352 33054067 30256930 28315272 26997729 24386753
39919B4386753m657713n063374l165834o80282M40310J72122j9123M92839O21904
$$ 24386753 19729040 14665666 11499832 10819550 11259860 11431982 11412859 11905698 12527602
39910A2527602n22449j904270j866466n37151M34328K95084p4760Q9811L33724
$$ 12527602 12005153 10100883 8234417 7697266 8131594 8426678 8351918 8441729 8775453
39901H775453L8729n17976p05592l69894K67588Q58437Q26636k02084j549585
$$ 8775453 8814182 8296206 7590614 7220720 7488308 8346745 9173381 8971297 7421712
39892G421712j854736p61629M34845M03076m78315o83554L42378J326806P10549
$$ 7421712 5566976 4805347 5240192 5643268 5164953 4481399 4823777 6150583 6861132
39883F861132j292271k713343k076344j35705J157769J030154L45335p1778l15556
$$ 6861132 5568861 2855518 779174 643469 1801238 2831392 3176727 3104949 2789393
39874B789393m55149j41871K89784k17472j498655j629512L90666K676841K724534
$$ 2789393 2334244 2192373 2482157 2264685 766030 -863482 -472816 2204025 4928559
39865D928559O71097j287791j877862j469010o05507L35474N72695j61195o05021
$$ 4928559 5599656 4311865 2434003 964993 359486 694960 1267655 1106460 501439
39856E01439L38047J508696J129056j24637j59033Q84457R55817O5738N57947
$$ 501439 839486 2348182 3477238 3352601 3193568 4078025 5033842 5099580 5657527
39847E657527K617863K991435P611l149792k790550q5383R31691o84425k051437
$$ 5657527 8275390 11266825 11274436 8124644 5334094 5248711 6180402 5495977 3444540
39838C444540j237510K71046M30984m12282o34655M5763M02064l23619j275006
$$ 3444540 2207030 2478076 2909060 2496778 1862123 1907886 2309950 1986331 711325
39829G11325j025450N53744J878830J431598k77620j233091m56988Q73307J223257
$$ 711325 -314125 239619 2118449 3550047 3272427 2039336 1582348 2455655 3678912
39820C678912O44329J69531R1357o9770k94898P0341J106490J863706J475312
$$ 3678912 4323241 4492772 4584129 4514359 4219461 4289802 5396292 7259998 8735310
39811H735310K58129o76126p67260o31355j121560j923876j718799j05235J356216
$$ 8735310 8993439 8317313 7550053 6918698 5797138 3873262 2154463 2049228 3405444
39802C405444R96235m65051o27590J258393L096977K737167P53098o13774m83910
$$ 3405444 4401679 3936628 3309038 4567431 7664408 10401575 11154673 10540899 10056989
39793A0056989m6083n03045j519166k017001j723501j296196j130222o95614N54147
$$ 10056989 10010906 9507861 7988695 5971694 4248193 2951997 1821775 1126161 1680308
39784A680308J955533K087358O11799j106372j655741j096884k49993O09462J390396
$$ 1680308 3635841 5723199 6334998 5228626 3572885 2476001 2226008 2835470 4225866
39775D225866J428689M35642m69057j80635M91230M6715j048311r55457M54625
$$ 4225866 5654555 6090197 5621140 5440505 5931735 5978450 4930139 3974682 4429307
39766D429307J337008Q94028L98241O72752P98803J49652m64369o91177j481660
$$ 4429307 5766315 6660343 7058584 7731336 8530139 8679791 8215422 7524245 6042585
39757F042585k744600k356341O98718M020864M620445K643407L93105r93297j805228
$$ 6042585 3297985 941644 1640362 5661226 10281671 12925078 13318183 12324886 10519658
39748A0519658j862567p19642P77470J195787N21117j34747l61606m33339p9029
$$ 10519658 8657091 7937449 8714919 9910706 10431823 10297076 9935470 9502131 9423102
39739I423102R87143J786884J131278l28028q17784k3010P12529O57483N26891
$$ 9423102 10410245 12197129 13328407 13000379 12182595 12159585 12872114 13529597 14056488
39730A4056488R65031J629107J935722J580136L72637j338885k296198j563556
$$ 14056488 15021519 16650626 18586348 20166484 20539121 19200236 16904038 15340482
39722A5340482N8536R45828O54177o1224o70080j013740o24453N95604J510845
$$ 15340482 15399018 16344846 16999023 16937799 16267719 15253979 14629526 15225130 16735975
39713A6735975J124318L11791N50191J493504J679506J084945Q10798O53386m97507
$$ 16735975 17860293 18172084 18722275 20215779 21895285 22980230 23791028 24444414 23946907
39704B3946907j914921j422381J042837K935317L011852L154374M976011O881667
$$ 23946907 22031986 20609605 21652442 24587759 27599611 30753985 35729996 42611663
39696D2611663O244216K896950j121621l982801m837327l507635j002808N94298
$$ 42611663 48855879 51752829 50631208 46648407 41811080 38303445 37300637 37894935
39688C7894935J96118r78298j187723l84081M49528J218141K575726M438375N966458
$$ 37894935 38091053 37112755 35925032 35540951 35990479 37208620 39784346 44222721 50189179
39679E0189179O823744P470071Q312176R221852R774852R734183R807697J2012428
$$ 50189179 57012923 64482994 72795170 82017022 91791874 101526057 111333754 123346182
39671A23346182J8077250K6585496L2531989L1021571K1718704R638973J905283
$$ 123346182 141423432 168008928 200540917 231562488 253281192 262920165 264825448
39664B64825448L256270J2933019K4685781L0442982K5354145J0287818r401049
$$ 264825448 268081718 281014737 305700518 336143500 361497645 371785463 362384414
39657C62384414k6612954l5253527l3162973k3460347j1469812M52927J3386513
$$ 362384414 335771460 300517933 267354960 243894613 232424801 232877728 246264241
39650B46264241K6421418L3409600K8052531J1835316n290866j2774084p636043
$$ 246264241 272685659 306095259 334147790 345983106 340692240 327918156 320282113
39643C20282113M270784J3714662J5116807R787147L083169j505826n199456j1115737
$$ 320282113 324552897 338267559 353384366 363171513 366254682 364748856 359549400 348433663
39635C48433663j9806340k8231118l2440042l0801063k5348278k0301323j8350106
$$ 348433663 328627323 300396205 267956163 237155100 211806822 191505499 173155393
39628A73155393j8130372j6335917j2050851p074672k119593M044150J0338537
$$ 173155393 155025021 138689104 126638253 119563581 117443988 121488138 131826675
39621A31826675J1774507N200914n506913j3346038j5845854j5556690j4321383
$$ 131826675 143601182 148802096 143295183 129949145 114103291 98546601 84225218
39614H4225218j1332136o757745l022608j329488k52852R35021O48307j690928
$$ 84225218 72893082 66135337 63112729 61783241 61530389 62465410 63113717 61422789
39606F1422789l599557k916078q91573L64422J406761L667213N708616M539073
$$ 61422789 57823232 54907154 54015581 54380003 55786764 59453977 65162593 69701666
39598F9701666K87375l368406l842076k382026j482659j551825j323592k39997
$$ 69701666 69989041 66620635 62778559 60396533 58913874 57362049 56038457 55798460
39590E5798460R38716J360433R75208M48860O99171K197244M395752O322673P984637
$$ 55798460 56737176 58097609 59072817 59521677 60220848 62418092 66813844 73136517 81121154
39581H1121154J0308979J3111864J4372271J3142947J2465565J6891995K6334923
$$ 81121154 91430133 104541997 118914268 132057215 144522780 161414775 187749698
39574A87749698L4401101L4407705K5929374J4189994M699619P40502M490043
$$ 187749698 222150799 256558504 282487878 296677872 301377491 302117993 306608036
39567C06608036J6231440L1020919L9208575L3270426J4103763r987935k9483272
$$ 306608036 322839476 353860395 393068970 426339396 440443159 430455224 400971952
39560D00971952l8524886l6070778k4731171q523578R021497K4420172L2728546
$$ 400971952 362447066 326376288 301645117 293121539 302143036 326563208 359291754
39553C59291754K9345533J5076827k224536j3093284j3217513m798879O214048
$$ 359291754 388637287 403714114 401489578 388396294 375178781 370379902 376593950
39546C76593950J2887040J0665096J671783n850978n906781j778620j713654q765267
$$ 376593950 389480990 400146086 401817869 395966891 390060110 388281490 386567836 377802569
39538C77802569j8615868k6544696l1813882l4737137l4258184l0407915k5507236
$$ 377802569 359186701 332642005 300828123 266090986 231832802 201424887 175917651
39531A75917651k0787688j4777928o912980L05006M828517P591774Q947192N866647
$$ 175917651 155129963 140352035 133439055 133744061 138572578 146164352 155111544 160978191
39523A60978191l447754j4361620j9626024j7712873j3587903j1455153j0501364
$$ 160978191 157530437 143168817 123542793 105829920 92242017 80786864 70285500
39516G0285500q412308n534782l687802l047356k299764r95537j82438q18232
$$ 70285500 61873192 56338410 52650608 49603252 47303488 46307951 46125513 45307281
39508D5307281k399062l383866k869355j669361j310994j948537k125819r91119
$$ 45307281 42908219 39524353 36654998 34985637 33674643 31726106 29600287 28609168
39500B8609168L30668M39332k40048k64956N69786J059745L38601j250713k724114
$$ 28609168 28939836 29379168 29139120 28874164 29443950 30503695 30842296 29591583 26867469
39491B6867469l045750j668352N70249J656067N42440j437210k287789j800075
$$ 26867469 23821719 22153367 22723616 24379683 24922123 23484913 21197124 19397049
39483A9397049j129543p15035j42728M37757M36820J82357N99837J556025J933532
$$ 19397049 18267506 17552471 17409743 17847500 18284320 18466677 19066514 20622539 22556071
39474B2556071J387010P15705M64677M16546M72616P81681J019488Q20939Q33287
$$ 22556071 23943081 24658786 25123463 25540009 26012625 26794306 27813794 28634733 29468020
39465B9468020J887998L159461K819985P72819r72990j163208q54736j297769
$$ 29468020 31356018 34515479 37335464 38108283 37135293 35972085 35117349 33819580
39457C3819580j825478j096141O38832J858975J825633J173095O66016K65162
$$ 33819580 31994102 30897961 31536793 33395768 35221401 36394496 37060512 37325674
39449C7325674m68000j505686k125598j657466m97029P9102m42296r10714j00940
$$ 37325674 36857674 35351988 33226390 31568924 31071895 31150997 30708701 29797987 29697047
39440B9697047J295717J487754J53036j217026j585180j481316j512417j283365
$$ 29697047 30992764 32480518 32633554 31416528 29831348 28350032 26837615 25554250
39432B5554250n28525k5980m28737j132068j229617q35365n61431l30055L22113
$$ 25554250 25025725 24999745 24571008 23438940 22209323 21373958 20812527 20482472 20804585
39423B0804585J113962J099659q6544j549151j851215m64345J407764J817041
$$ 20804585 21918547 23018206 22931662 21382511 19531296 19066951 20474715 22291756
39415B2291756L10152j349718j471472p54380r86163k006600j931846l69256Q35678
$$ 22291756 22601908 21252190 19780718 19026338 18040175 16033575 14101729 13732473 14568151
39406A4568151O37367L32658R69555J340869J97172j305251j323204j46923P20701
$$ 14568151 15205518 15538176 16507731 17848600 18045772 16740521 15417317 15270394 15991095
39397A5991095J144353J765023J743810k60078l115679l901348j983531m8452
$$ 15991095 17135448 18900471 20644281 20384203 17268524 13367176 11383645 11335193
39389A1335193k14120j199615o74387J187858K173238J197178n43024j341983
$$ 11335193 11121073 9921458 9247071 10434929 12608167 13805345 13262321 11920338
39381A1920338p46539M90289J383461J432007Q11834P9634l73493n31149m71058
$$ 11920338 11173799 11664088 13047549 14479556 15291390 15371024 14997531 14466382 13995324
39372A3995324k10089N4900n6466n65640q69254m22812M08067O00970l03525j561180
$$ 13995324 13785235 13840135 13783669 13218029 12348775 11925963 12334030 12935000 12631475 11070295
39362A1070295k084600j744826j361709j398145j295930n02549M20915M91922
$$ 11070295 8985695 7240869 5879160 4481015 3185085 2682536 3103451 3595373
39354C595373j69401m14391L09066J235673J339284L84607j154731k407166k293533
$$ 3595373 3425972 3011581 3320647 4556320 5895604 6280211 5125480 2718314 424781
39345D24781m90984J551340J767607J10420j210805p25247M68272P61523M06281
$$ 424781 -66203 1485137 3252744 3363164 2152359 1427112 1895384 2656907 3063188
39336C063188M27916N21267j43680r82884q76494l45250p24383j524803r11158
$$ 3063188 3491104 4012371 3868691 2885807 2009313 1664063 939680 -585123 -1496281
39327a496281J127245K395652J763322O12574K12324k05029j439180k276014j269126
$$ -1496281 -369036 2026616 3789938 4402512 4614836 4409807 2970627 694613 -574513
39318e74513O47123J244902J21936r57761o23548O48691J653004J791406J109691
$$ -574513 72610 1317512 1439448 481687 -141861 506830 2159834 3951240 5060931
39309E060931J5640o98070l09306R39863J879661J686874P95998K36473L15642
$$ 5060931 5076571 4378501 4069195 5009058 6888719 8575593 9371591 9608064 9923706
39300I923706L63096k33771j156547j610258j396779j022982p85756m33100N2227
$$ 9923706 10286802 10053031 8896484 7286226 5889447 4866465 4080709 3647609 3699836
39291C699836J23217l65047o49607k88579j22585r61694k010755j929337r00574
$$ 3699836 3823053 3458006 2808399 2519820 2397235 1435541 -575214 -2504551 -3405125
39282c405125q7376M99970J655486K704515J935156k90087j273847J75760J875348
$$ -3405125 -3492501 -2992531 -1337045 1367470 3302626 3012539 1738692 1914452 3789800
39273C789800J576545M8979q03197q93348r53303m30174J075933J785684J20683
$$ 3789800 5366345 5415324 4612127 3718779 2765476 2335302 3411235 5196919 5317602
39264E317602j946165j246857J373657J861313p55235k681124j251030J019255
$$ 5317602 3371437 2124580 3498237 5359550 4604315 1923191 672161 1691416
39256A691416N54668j863057k706338j017565Q63635J117016L65053m5743L86203
$$ 1691416 2246084 383027 -2323311 -3340876 -2477241 -1360225 -995172 -1040915 -654712
39247f54712J462147K379804J875553j92847j783945r77523R70108J005744j220535
$$ -654712 807435 3187239 5062792 4869945 3086000 2108477 3078585 4084329 2863794
39238B863794k584886r12848K024388L155296J923403m1487j542419k302460j920673
$$ 2863794 278908 -633940 1390448 4545744 6469147 6427660 4885241 2582781 662108
39229F62108l28411J211293J321179M47924J3887L122p63200k074619k187844
$$ 662108 333697 1544990 2866169 3314093 3327980 3331102 2567902 493283 -1694561
39220a694561o72463O57087N38805Q2443N18088R18934K3383j039594k02164J970064
$$ -1694561 -2367024 -1709937 -1171132 -1088689 -570601 348333 371716 -667878 -870042 1100022
39210A100022K599618N45332k010646k596450j227513O42401K188386K993346
$$ 1100022 3699640 4244972 2234326 -362124 -1589637 -947236 1241150 4234496
39202D234496K218945k71815k670673k764451o02093J597976K129714J291020
$$ 4234496 6453441 6181626 3510953 746502 144409 1742385 3872099 5163119
39194E163119K37320m60053p77720p03753k97020J71860M56758M32246j4111o93624
$$ 5163119 5400439 4940386 4162666 3458913 3161893 3333753 3790511 4222757 4208646 3515022
39184C515022q30054J76201J627877K040278J048531o3458j79472K17654J45938
$$ 3515022 2684968 2861169 4489046 6529324 7577855 7514397 7334925 7552579 7698517
39175G698517k10111l6191M41546J41285j072026j991547j746390q53365j88328
$$ 7698517 7488406 7452215 7893761 8035046 6963020 4971473 3225083 2371718 2183390
39166B183390J76556N59248Q87708R98238J065985J066070M63460p52464j386281
$$ 2183390 2359946 2919194 3806902 4805140 5871125 6937195 7400655 6648191 5261910
39157E261910m74536J067605J511522P71388L42391P66285Q29238j76447j032620
$$ 5261910 4787374 5854979 7366501 8137889 8480280 9246565 10075803 9899356 8866736
39148H866736n40588L94453P2486j393562k283859j714804m96893L10885M48878
$$ 8866736 8326148 8720601 8793087 7399525 5115666 3400862 2903969 3214854 3663732
39139C663732N9788n88490q54777k30063P59012J085603P12920N03852N85894
$$ 3663732 3723520 3135030 2280253 2050190 2809202 3894805 4607725 5111577 5697471
39130E697471J10549r82938j336412j35114J379201J422841J3831j243426j302148
$$ 5697471 5808020 4825082 3488670 3353556 4732757 6155598 6169429 4926003 3623855
39121C623855o17556j27222j80975n76910j000845j144242o92865M69000J906684
$$ 3623855 3006299 2879077 2698102 2121192 1120347 -23895 -716760 -247760 1658924
39112A658924K591314J670557l74189j803779j515857m79610l77907j160583j237807
$$ 1658924 4250238 5920795 5546606 3742827 2226970 1747360 1369453 208870 -1028937
39103a028937p8478R16559N92502l43940o80070m51507l53214l38357J47902J132709
$$ -1028937 -1107415 -190856 401646 57706 -622364 -1073871 -1427085 -1765442 -1617540 -484831
39093d84831K108376K566079K113395Q18925k74160q8322P10070L38258j226241
$$ -484831 1623545 4189624 6303019 7121944 6847784 6759462 7469532 7807790 6581549
39084F581549j892258q39784m303o92142j140669K36135J456071L0822k273394
$$ 6581549 4689291 3849507 3845204 3153062 2012393 2248528 3704599 3735421 1462027
39075A462027j626806J663814L261010J306464j139216j160909J20003L76267
$$ 1462027 -164779 1499035 4760045 6066509 4927293 3766384 3886387 4262654
39067D262654k39780l29336R4725K41663K03601L00765J61749k50878j56145M72861
$$ 4262654 4022874 3693538 3788263 4029926 4233527 4534292 4696041 4445163 4289018 4761879
39057D761879N44540m2897j9014N49881k01239k213515k358082O23926L030193
$$ 4761879 5306419 5263522 5244508 5794389 5593150 3379635 1021553 1645479 4675672
39048D675672J359031j955957k075027P34774J815118l32524k125680j095363
$$ 4675672 6034703 4078746 2003719 2738493 4553611 4221087 2095407 1000044
39040A000044N68662K83348r10226q21404K85989R47642J220727J857294K333885
$$ 1000044 1568706 1852054 941828 120424 406413 1354055 2574782 4432076 6765961
39031F765961J796868P96763L07968R3730l64878m49586L86816J006328N177j955740
$$ 6765961 8562829 9359592 9667560 9761290 9396412 8946826 9333642 10339970 10345147 8389407
39021H389407k961075k434548j310551j68628J054675J852506J493566N58501
$$ 8389407 5428332 2993784 1683233 1514605 2569280 4421786 5915352 6473853
39013F473853M25211J095135J179124K84678l19850M2684K91105l70032q20303
$$ 6473853 6899064 7994199 9173323 9458001 9138151 9180835 9471940 9101908 8281605
39004H281605J42513J511979J365396j49370r37806k0736J248159J435122R18354
$$ 8281605 8424118 9936097 11301493 11152123 10214317 10193581 11441740 12876862 13795216
38995A3795216O31090K03777j226990l003264l312320j648351L41105Q89827Q7194
$$ 13795216 14426306 14630083 13403093 10399829 7087509 5439158 5780263 6670090 6757284
38986F757284o83002n28565L57539J321406J717328J076837m14143j670542j628536
$$ 6757284 6074282 5545717 5903256 7224662 8941990 10018827 9604684 7934142 6305606
38977F305606n41225J87243l04163j257178j326088m28693O1888q15451k104970
$$ 6305606 5764381 5951624 5647461 4390283 3064195 2635502 2697390 1881939 -223031
38968b23031k000869k68685J355743J518635R60797J017278J362152P28219o32012
$$ -223031 -2223900 -2492585 -1136842 381793 1342590 2359868 3722020 4450239 3818227
38959C818227j054451j28360O16292K27912k81615J3725K92583k72118o87568
$$ 3818227 2763776 2635416 3251708 3479620 3198005 3211730 3504313 3232195 2544627
38950B544627J80588J308129Q86608p74557j736503j361922p69783n81082j95163
$$ 2544627 2725215 4033344 4919952 4145395 2408892 1046970 277187 -303895 -499058
38941d99058N94554J075592R71528P65568N01034j98037q05018k92833Q95181
$$ -499058 95496 1171088 2142616 2908184 3409218 3211181 2406163 2113330 3008511
38932C008511J045551k09655j204849p58297K81791O98870N22060K18292j94332
$$ 3008511 4054062 3844407 2639558 1881261 2163052 2861922 3383982 3602274 3407942
38923C407942m41801O0520P60637J19209j842018k866103j539095O16796J498453
$$ 3407942 2966141 3026661 3787298 3906507 2064489 -801614 -2340709 -1723913 -225460
38914b25460J222228R54291N54280n75260j527998j028673K21509M58204l56988
$$ -225460 996768 1951059 2505339 1930079 402081 -626592 -405083 53121 -303867
38905c03867o23500L27258J541492K093156J827653Q10385l91419m08065J169065
$$ -303867 -927367 -600109 941383 3034539 4862192 5672577 5281158 4873093 6042158
38896F042158K313745R71560j529865j985667j15016R86876k95171j735282j064048
$$ 6042158 8355903 9327463 7797598 5811931 5696915 6683791 6388620 4653338 3589290
38887C589290N17928O32066m46012o14617N77185J630601J746813J631614J662288
$$ 3589290 4107218 4739284 4293272 3678655 4255840 5886441 7633254 9264868 10927156
38878A0927156J103761l70458j696689j652521l72042Q84571J115247M21705l48938
$$ 10927156 12030917 11660459 9963770 8311249 7939207 8823778 9939025 10360730 10011792
38869A0011792o24184o76198j017269j411276j105961j35159M56483J39825k09295
$$ 10011792 9387608 8711410 7694141 6282865 5176904 5041745 5498228 5638053 5428758
38860E428758K63639Q45930L11855r15252j082719L16303J641776J317005j35200
$$ 5428758 5692397 6538327 6850182 5934930 4852211 5168514 6810290 8127295 7992095
38851G992095j018577n90093O18611J917896K800211K609705J187338k12271j7662
$$ 7992095 6973518 6383425 7002036 8919932 11720143 14329848 15517186 15304915 15287253
38842A5287253J357829J702884J47292j306010n79950J338694J769324J70813
$$ 15287253 16645082 18347966 18495258 17189248 16609298 17947992 19717316 19888129
38834A9888129j329990j105992J96445J303855J850895J660336L01808j632217
$$ 19888129 18558139 17452147 17648592 18952447 20803342 22463678 22765486 21133269
38826B1133269k380618j357049k99479p84461j877340j795765p75802m25597r67576
$$ 21133269 18752651 17395602 17096123 16311662 14434322 12638557 11862755 11437158 10469582
38817A0469582j090616k67331N82263P44801N06602K30414k0580J12114J005448
$$ 10469582 9378966 9111635 9693898 10438699 10945301 11175715 11155135 11267249 12272697
38808A2272697K105675K336153J450301P3491j298675k344366k498050j718950
$$ 12272697 14378372 16714525 18164826 18238317 16939642 14595276 12097226 10378276
38800A0378276j040580r55575j53257K217055L969762K265693j791820l972276
$$ 10378276 9337696 8382121 8228864 10445919 14415681 16681374 14889554 10917278
38792A0917278k596499l38721L38337L07913R34129J217899j6218j534867j739559
$$ 10917278 8320779 7982058 8320395 8628308 9562437 10780336 10764118 9229251 7489692
38783G489692j379182j785946k062370o17276J765950K984084K778746K371266
$$ 7489692 6110510 4324564 2262194 1644918 3410868 6394952 9173698 11544964
38775A1544964J796484J98684j788646k574913k251298k227630k430210j412806
$$ 11544964 13341448 13540132 11751486 9176573 6925275 4697645 2267435 854629
38767H54629P00938J975178J700901J196838J082334L06507j244743j698897j28511
$$ 854629 1555567 3530745 5231646 6428484 7510818 7817325 6572582 4873685 4745174
38758D745174J597455J507460L42578J3355P23133J404295J833329K463741L001132
$$ 4745174 6342629 7850089 8192667 8206022 8929155 10333450 12166779 14630520 17631652
38749A7631652K916183K737081L143262L358660K265757P02840N94790J773535
$$ 17631652 20547835 23284916 26428178 29786838 32052595 32755435 33350225 35123760
38741C5123760J809043l61027k551782k233943J15123J946238J913276O96654
$$ 35123760 36932803 36571776 34019994 31786051 31901174 33847412 35760688 36457342
38733C6457342p75092k162535k846058j984707n9912R87249R8923j377970j571455
$$ 36457342 35682250 33519715 30673657 28688950 28629038 29616287 29715210 28337240 26765785
38724B6765785p14294n25574j341824j509192J4350J873237K008468K26270j903782
$$ 26765785 26051491 25525917 24184093 22674901 22689251 24562488 26570956 26797226 24893444
38715B4893444l107843l272317k537451p67068J719044L733748M229679L452148
$$ 24893444 21785601 18513284 15975833 15208765 16927809 20661557 24891236 28343384
38707B8343384K554484K104245J485640M8936j593249k137493j453447r78586
$$ 28343384 30897868 33002113 34487753 34536689 32943440 30805947 29352500 28373914
38699B8373914j737117k788855k611048j422530q07063j255949j606209j098827
$$ 28373914 26636797 23847942 21236894 19814364 19007301 17751352 16145143 15046316
38691A5046316m43079l14905l23627k96323j078365k806676l672158k025079J082831
$$ 15046316 14603237 14288332 13964705 13668382 12590017 9783341 6111183 4086104 5168935
38682E168935L060195K957714J971463J216096O70506K18028R2567R1601k56033
$$ 5168935 8229130 11186844 13158307 14374403 15044909 15262937 15355504 15447105 15191072
38673A5191072n05108L69744K104417K929182J802732j96547j271050p24291J155261
$$ 15191072 14685964 15055708 17160125 20089307 21892039 21695492 20424442 19700151 20855412
38664B0855412L928784O785513Q263554P375409M883996K641041J611493J110407
$$ 20855412 24784196 31569709 39833263 47208672 52092668 54733709 56345202 57455609
38656E7455609M5904j639379l084982l725970l820575l689456l049588j654906
$$ 57455609 57501513 55862134 52777152 49051182 45230607 41541151 38491563 36836657
38648C6836657j77774M01205J16004k46092o10687j478820k183886j074155J723484
$$ 36836657 36658883 37060088 37176092 36930000 36319313 34840493 32656607 31582452 33305936
38639C3305936L473457K183699o61608k382315k736857l178534l632531k664826
$$ 33305936 36779393 38963092 38301484 35919169 33182312 30003778 26371247 23706421
38631B3706421m10755J330008J934568K352207K481381R15548j960683l354599
$$ 23706421 23295666 24625674 26560242 28912449 31393830 32309378 30348695 26994096
38623B6994096j927273J7237j12915j572954j949219r34868k36175n66739q87840
$$ 26994096 25066823 25084060 24971145 23398191 21448972 20514104 20277929 19711190 18823350
38614A8823350m51284J61699K76182J94208O33409J671645K474248J994795J92387
$$ 18823350 18372066 18533765 18809947 19004155 19637564 21309209 23783457 25778252 25970639
38605B5970639j478203j423958J46184J413491J191516K3615j101629j912911
$$ 25970639 24492436 23068478 23214662 24628153 25819669 25843284 24741655 22828744
38597B2828744k337994k095051j434505j158112j285280q51700L71719J253991
$$ 22828744 20490750 18395699 16961194 15803082 14517802 13666102 14037821 15291812
38589A5291812J093281O43374N43264K41048m96832o39477J78587L79813j150927
$$ 15291812 16385093 17028467 17571731 17812779 17315947 16676470 16855057 17234870 16083943
38580A6083943k748618k111200K13559J634412J222229N23244R34428K165618
$$ 16083943 13335325 11224125 11437684 13072096 14294325 14817569 15751997 17917615
38572A7917615L268613L608270K928212J882822K152228M410294O554725N863088
$$ 17917615 21186228 24794498 27722710 29605532 31757760 36168054 42722779 48585867
38564D8585867K779651N12326O64473J355398L18825k060901l900504m544585
$$ 48585867 51365518 51877844 52542317 53897715 54216540 52155639 48255135 43710550
38556D3710550m811715n298539n581980m901987l088230r49047K20859o2832p85605
$$ 43710550 38898835 33600296 28018316 23116329 20028099 19079052 19299911 19237079 18451474
38547A8451474o43405K89377R07684P75564L39451l50043j639827k821963k325211
$$ 18451474 17808069 18097446 19005130 19780694 20120145 19770102 18130275 15308312 12983101
38538A2983101j03631J572562Q58202j121561j786492n67373O37279M51970m5433
$$ 12983101 12879470 14452032 15310234 14188673 12402181 11834808 12472087 12924057 12878624
38529A2878624P93510K360245K316296l653k159315j555404J092231K714149J959714
$$ 12878624 13672134 16032379 18348675 18345022 16185707 14630303 15722534 18436683 20396397
38520B0396397N61074L65291Q35707M86927o60333j422471j312767p67573j69854
$$ 20396397 20957471 21322762 22158469 22645396 21985063 20562592 19249825 18482252 18312398
38511A8312398K63560K29374j06821o594N97464P12924j9797m80949N5431O65607
$$ 18312398 18575958 18805332 18698511 18691917 19289381 20002305 19982508 19501559 19556990 20222597
38501B0222597O75495J097080K445850K993772J521981K3058P41133K100933J165337
$$ 20222597 20898092 21995172 24441022 27434794 28956775 28979833 29720966 31821899 32987236
38492C2987236r55364l40631L325541N896108M938779K757735K214053L367110
$$ 32987236 32031872 31691241 35016782 40912890 45851669 48609404 50823457 54190567
38484E4190567N590534R199631J3301700J5838510J7656337K2269024K8822971
$$ 54190567 59781101 68980732 82282432 98120942 115777279 138046303 166869274
38477A66869274K9866608K0572981O751550j348162m72312N941088J6596560L2290789
$$ 166869274 196735882 217308863 224060413 222712251 222239939 228181027 244777587 277068376
38469B77068376M6309949M4215464J9594591j4314683l5241929l3031495j5689736
$$ 277068376 323378325 367593789 387188380 372873697 337631768 304600273 288910537
38462B88910537L771831J9378057K9434275K9541273J6450469k497963j1824812
$$ 288910537 292682368 312060425 341494700 371035973 387486442 384988479 373163667
38455C73163667l510479J3976465K5994585K7754377K5182573K2294414J5025950
$$ 373163667 369653188 383629653 409624238 437378615 462561188 484855602 499881552
38448D99881552p72066k1092585l7151606m3504269l9808952k8338574j4283265
$$ 499881552 499109486 478016901 440865295 397361026 357552074 329213500 314930235
38441C14930235n941605q730924j8475040k4614576k1201196j2284063o112199
$$ 314930235 308988630 300257706 281782666 257168090 235966894 223682831 217570632
38434B17570632o620394j1162887j4111259j1656076m930085N96989L8911o074238
$$ 217570632 210950238 199787351 185676092 174020016 169089931 169686920 169725831 163651593
38426A63651593j2776926j6034073j5451123j2310084p876966m271881m060644
$$ 163651593 150874667 134840594 119389471 107079387 99202421 94930540 90869896
38419I0869896p132470r815922q915103n373514k407717j342450j216283j512017
$$ 90869896 83737426 73921504 65006401 59632887 57225170 55882720 54666437 53154420
38411E3154420k814568m698201n178933l249747n71426N70067J68652K8645P93656
$$ 53154420 50339852 45641651 40462718 37212971 36641545 37211612 37380264 37408909 38202565
38402C8202565J095465Q2687p76733L12840K653541L830824K905563J254239M35754
$$ 38202565 39298030 39380717 38603984 38916824 41570365 45401189 48306752 49560991 49996745
38393D9996745Q85119K582655N042134O569893N849279M602912N993675R742856
$$ 49996745 50881864 53464519 58506653 65076546 70925825 75528737 81522412 91265268
38385I1265268J2196265J2625646J5302903K2126687K7021264K2720014J1039787
$$ 91265268 103461533 116087179 131390082 153516769 180538033 203258047 214297834
38378B14297834J147081j181294K969858J1846676K4949187L6578815L5141260
$$ 214297834 215444915 214263621 217233479 229080155 254029342 290608157 325749417
38371C25749417J5380636j1860360k8085589k4865286r453671N836462J4813396
$$ 325749417 341130053 329269693 301184104 276318818 266865147 272701609 287515005
38364B87515005J7655714J5664940J0088548M434432L494585Q300541J3982320
$$ 287515005 305170719 320835659 330924207 335358639 338853224 347153765 361136085
38357C61136085J5037934J2313773J1918402J5941179J7050092N920885j6440289
$$ 361136085 376174019 388487792 400406194 416347373 433397465 439318350 422878061
38350D22878061l7276729m4017695l5493688k0886703j0512379q986785j4288601
$$ 422878061 385601332 341583637 306089949 285203246 274690867 265704082 251415481
38343B51415481k0216833k0745717j4794736p147131l596528n416571r153354
$$ 251415481 231198648 210452931 195658195 188511064 184914536 179497965 170344611
38336A70344611j0722673q637823m472610j765213l581008r353830j4493593j4649907
$$ 170344611 159621938 150984115 146511505 144746292 141165284 131811454 117317861 102667954
38328A02667954j0227302n542726l915416m923485o244732o597370o332206o066895
$$ 102667954 92440652 86897926 82982510 78059025 71814293 65216923 58884717 52817822
38320E2817822n550600m001696j496628M00335J33604j776616l148948k803849
$$ 52817822 47267222 43265526 41768898 42169233 42302837 40526221 37377273 34573424
38312C4573424j722406j246867j404475j595631j668521j520263p72674L59853
$$ 34573424 32851018 31604151 30199676 28604045 26935524 25415261 24642587 25002440
38304B5002440R65640Q67807R07492J149367L80739j658619l217240k921708j613387
$$ 25002440 25968080 26835887 27743379 28892746 29273485 27614866 24397626 21475918 19862531
38295A9862531n12688O27262J911201J815226m44444k681341k430840o20370Q2791
$$ 19862531 19349843 19977105 21888306 23703532 23259088 20577747 18146907 17526537 17609328
38286A7609328n21644n28093L19420M42532k59758j30071R72497J158624j29898
$$ 17609328 17087684 16559591 16879011 17321543 17061785 16931714 17904211 19062835 18932937
38277A8932937j088778p50503n33305j418061k035116j087321L45837N89889j04450
$$ 18932937 17844159 17093656 16560351 15142290 13107174 12019853 12365690 12955579 12851129
38268A2851129m31743k11166j76009m32688m30772M4733O92571J016694M65064
$$ 12851129 12419386 12208220 12032211 11599523 11168751 11213484 11906055 12922749 13387813
38259A3387813r22021j804449p52149J429948K068842N9552k496784l061875j737793
$$ 13387813 12465792 10661343 9909194 11339142 13407984 13467536 10970752 7908877 6171084
38250F171084l89544J45472M94989J066411J364674R12186m2718p70909o80442
$$ 6171084 5781540 5927012 6422001 7488412 8853086 9765272 9722554 8951645 8271203
38241H271203P6867N42559K0563q34132q02604J07862P72002Q11949R18103J140120
$$ 8271203 8348070 8890629 8911192 8077060 7274456 7382318 8154320 8966269 9884372 11024492
38231A1024492N75841o90199j131282j85629N65433j91250j455325j655845j042645
$$ 11024492 11600333 10910134 9778852 9593223 10158656 9967406 8512081 6856236 5813591
38222E813591p73364p95440l30662M08678O01998K26481k99415j048898j798375
$$ 5813591 5040227 4244787 3914125 4322803 4924801 5151282 4851867 3802969 2004594
38213B004594j375994N29994J998591J336388n6006L12720J866703J687494o99464
$$ 2004594 628600 1158594 3157185 4493573 4437567 4750287 6616990 8304484 7605020
38204G605020k366325j519729m2557o3168n76060L62268J941156J712532m58732
$$ 7605020 5238695 3718966 3676409 3613241 3037181 3399449 5340605 7053137 6594405
38195F594405k063578j549893j96055J09712o16368j025419n43497R3118R6939
$$ 6594405 4530827 2980934 2784879 2894591 2278223 1252804 709307 802425 899364
38186H99364l41871m15913K36581J048351J143799L79102m35852n04135m9424
$$ 899364 557493 141580 378161 1426512 2570311 2949413 2513561 2009426 1960002
38177A960002O915n86151q35155K26833J886589K162542K84400j904072j945405
$$ 1960002 1966917 1380766 545611 772444 2659033 4821575 5105975 3201903 1256498
38168A256498P4727J547501P54280j000235j458003m96604J96305j19140m85408
$$ 1256498 1331225 2878726 3633006 2632771 1174768 678164 874469 755329 269921
38159B69921k44160r7247n64882p92699K4952R86985O06883q00331j261862J04418
$$ 269921 25761 -71486 -636368 -1429067 -1404115 -417130 189753 -610578 -1872440 -1768022
38149a768022J667157J342178o18954j903557j102526N89742J119614K88378k56239
$$ -1768022 -100865 1241313 622359 -1281198 -2383724 -1793982 -674368 -385990 -642229
38140f42229M41797J326476J075025J43985m0247N91506O48271m07294j244059
$$ -642229 -200432 1126044 2201069 2345054 2304807 2896313 3544584 3137290 1893231
38131A893231o25186P29732J267320Q07523L65439J89685n20755j787052k191871
$$ 1893231 1268045 1997777 3265097 4072620 4438059 4627744 4106989 2319937 128066
38122A28066q13013J168246J750528M65456j382973k403044k200305j124764J21564
$$ 128066 -684947 483299 2233827 2699283 1316310 -1086734 -3287039 -4411803 -4290239
38113d290239P25373M34667l6077P9583N33559O92484P80639J297016J565413
$$ -4290239 -3564866 -3130199 -3166276 -3086693 -2553134 -1860650 -1080011 217005 1782418
38104A782418N04051j210593j678182p75699m24195j127234q15965J305072K420912
$$ 1782418 2286469 1075876 -602306 -1378005 -1802200 -2929434 -3745399 -2440327 -19415
38095a9415K25740k789118k607949J21245J129426p18482j979030n33115J259128
$$ -19415 206325 -2582793 -5190742 -5069497 -3940071 -4658553 -6637583 -7170698 -5911570
38086e911570R46216j74064O190O75103J74054n69161J95485J538967J286458
$$ -5911570 -4965354 -5139418 -5133228 -4458125 -4284071 -4853232 -4657747 -3118780 -1832322
38077a832322j82873o70399K3582Q0586q19706r51127K61881J162166N47258p47872
$$ -1832322 -2015195 -2685594 -2662012 -2581426 -3401132 -4352259 -4090378 -2928212 -2380954 -3128826
38067c128826j526422j605807j082824o416Q83875Q45071O98700J736614K997915
$$ -3128826 -4655248 -6261055 -7343879 -7350295 -6466420 -5621349 -4922649 -3186035 -188120
38058a88120K123684o17584j987540n85447Q40288k59150k136317j584502J007923
$$ -188120 1935564 1317980 -669560 -1255007 -414719 -673869 -2810186 -4394688 -3386765
38049c386765K439813J532713K19400P3695M63291M63434L13879K98372l1262
$$ -3386765 -946952 585761 805161 878856 1342147 1805581 2119460 2417832 2386570
38040B386570p49124j078603p32752n50151j099004j637455j152214L01662J772333
$$ 2386570 1637446 558843 -173909 -724060 -1823064 -3460519 -4612733 -4311071 -2538738
38031b538738K235878J040142j479534l482177k921659r5829K173476J846668
$$ -2538738 -302860 737282 -742252 -4224429 -7146088 -7241917 -5068441 -3221773
38023c221773J96236j36665J200851K101824J167421n73590j363612q01443L07771
$$ -3221773 -3025537 -3162202 -1961351 140473 1307894 734304 -629308 -1430751 -1122980
38014a122980J167844J388545Q68983p3845q72097j353155j729394j772367q42392
$$ -1122980 44864 1433409 2302392 2228547 1356450 3295 -1726099 -3498466 -4340858
38005d340858Q30863J858245J443790N74864N04281Q34911L48269q58706j522334
$$ -4340858 -3509995 -1651750 -207960 366904 871185 1706096 2054365 1195659 -326675
37996c26675j202478o34596k13607K91063M47179o36918k346465k534751l50434
$$ -326675 -1529153 -2163749 -2377356 -2086293 -1639114 -2276032 -4622497 -7157248 -7507682
37987g507682K341865L345135K656367J610206Q08704J50952k09759k99449p65405
$$ -7507682 -5165817 -1820682 835685 2445891 3254595 3405547 3195788 2896339 2130934
37978B130934j607984j538582n3670J028960j949j762995j494501P68326K183169
$$ 2130934 522950 -1015632 -1069302 -40342 -42291 -1805286 -3299787 -2531461 -348292
37969c48292J210553o39857j481137j209843m14216P27004J579904J032499n90092
$$ -348292 862261 222404 -1258733 -2468576 -2882792 -2155788 -575884 456615 -133477
37960a33477j283057j52752J143777R57888P2038Q5763P82905Q99352N23515Q07427
$$ -133477 -1416534 -1569286 -425509 532379 604417 690180 1473085 2372437 2895952 3703379
37950C703379J756801K068151J081832n14566j928800k981028l487920l012992
$$ 3703379 5460180 7528331 8610163 8095597 6166797 3185769 -302151 -3315143
37942c315143j536851K70298J605241K013312J522935P26728L97293N72082M79134
$$ -3315143 -4851994 -4581696 -2976455 -963143 559792 1286520 1683813 2255895 2735029
37933B735029j65464n21701m2711L11871n04662j603978j139934Q06711J977335
$$ 2735029 2569565 2047864 2005153 2317024 1812362 208384 -931550 -124839 1852496
37924A852496J002047p32520j137567k28963L29289j17898m36826K99244J263444
$$ 1852496 2854543 2122023 984456 755493 1084782 966884 530058 829302 2092746
37915B092746J060966k57455j360322j538540j323242j110400m67711N65640P99388
$$ 2092746 3153712 2896257 1535935 -2605 -1325847 -2436247 -2903958 -2338318 -1538930
37906a538930k81008j099993r6325J520923J236367q47470j965742q49624N99059
$$ -1538930 -1819938 -2919931 -3016256 -1495333 -258966 -1106436 -3072178 -3921802 -3322743
37897c322743O40100J76770M53359O13572m10852j486777j096620n9531L4954
$$ -3322743 -2682643 -2505873 -2052514 -1438942 -1849794 -3336571 -4433191 -4492722 -4457768
37888d457768j95058P32991J891684J172852p21072r15369Q80847J723443L22673
$$ -4457768 -4652826 -3919835 -2028151 -855299 -1576371 -2491740 -1610893 112550 435223
37879D35223q52975P1125J080089k54269k432948k156903N94051K618367K143749
$$ 435223 -417752 -346627 733462 479193 -1953755 -4110658 -3516607 -898240 1245509
37870A245509P17585K66772N59004L71187l94782p70404j29593J132748J967090
$$ 1245509 1963094 2229866 2788870 3160057 2765275 1994871 1865278 2998026 4965116
37861D965116J498457j07180j563135j711024q25965j71831l56551q23595j015012
$$ 4965116 6463573 6356393 4793258 3082234 2256269 2084438 1727887 904292 -110720
37852a10720j186640j634373j806429r94088L20132P04369l20192j318957o31122
$$ -110720 -1297360 -2931733 -4738162 -5732250 -5412118 -4707749 -5027941 -6346898 -6978020
37843f978020J299303K297924J349017R721J79269J376848J536378P9163j353699
$$ -6978020 -5678717 -3380793 -2031776 -2022055 -1842786 -465938 1070440 1149603 -204096
37834b04096j376168n55797q994L76148J196439J876097J152086r35987k703620
$$ -204096 -1580264 -2136061 -2145055 -1768907 -572468 1303629 2455715 1519728 -1183892
37825a183892k762455j575633o73098p47643j042880n84721M76016J171752J188717
$$ -1183892 -3946347 -5521980 -6195078 -6942721 -7985601 -8570322 -8094306 -6922554 -5733837
37816e733837J307645K053603K630090J985952M61379o73369j082404j526456
$$ -5733837 -4426192 -2372589 257501 2243453 2704832 2031463 949059 -577397
37808e77397k113677j817427k96533J093998J065198K21268L9747P17476J236626
$$ -577397 -2691074 -4508501 -4805034 -3711036 -2645838 -2424570 -2384823 -1667347 -430721
37799d30721J167113J081723J137717M81722j354028l205048l255217j234460
$$ -430721 736392 1818115 2955832 3437554 2083526 -1121522 -4376739 -5611199
37791e611199R39761J157104l70531j239433J17084K220160K370772L39545j229271
$$ -5611199 -4671438 -3514334 -3884865 -5124298 -5007214 -2787054 -416282 -76737 -1306008
37782a306008m25633J392287J644443J7796j426523j112632L92837J526762J502140
$$ -1306008 -1731641 -339354 1305089 1322885 -103638 -1216270 -823433 703329 2205469
37773B205469P42001J88793L84010R66038J122703O19203j5234m30291q76282
$$ 2205469 2947470 3136263 3520273 4486311 5609014 6228217 6212983 5782692 4906410
37764D906410j389502j478128j178466j364546k125332j987030j10334J762028
$$ 4906410 3516908 2038780 860314 -504232 -2629564 -4616594 -4726928 -2964900
37756b964900J409344m37149r52395N81622J795565J042982r7774N11632K178343
$$ -2964900 -1555556 -1992705 -2945100 -2363478 -567913 475069 377295 888927 3067270
37747C067270K515596R66281p44675j351840j459412j947677k411086j960174
$$ 3067270 5582866 6549147 5804472 4452632 2993220 1045543 -1365543 -3325717
37739c325717p85234k0927k03775n39797L2851J389212K288541J913775Q36376
$$ -3325717 -4110951 -4131878 -4335653 -4875450 -4842599 -3453387 -1164846 748929 1585305
37730A585305J43229Q5882J82842K95465P48959J455130J793961J515121R80730
$$ 1585305 1728534 1814416 1997258 2292723 3041682 4496812 6290773 7805894 8786624
37721H786624L62002n43086j442878j491185o14180K0148m25076j230054j336903
$$ 8786624 9148626 8605540 7162662 5671477 5057297 5077445 4652369 3422315 2085412
37712B085412j039950j285500j745372j016517J101169K733494J969994q24516
$$ 2085412 1045462 -240038 -1985410 -3001927 -1900758 832736 2802730 1978214
37704A978214l281517l372389j203817J297589K215017J216347m75532j426037
$$ 1978214 -1303303 -4675692 -5879509 -4581920 -2366903 -1150556 -1626088 -3052125
37696c052125j093847J61037J493776J846622O32120j265480j886374m67329J262040
$$ -3052125 -4145972 -3984935 -2491159 -644537 -12417 -1277897 -3164271 -3631600 -2369560
37687b369560J199087j38610k95913J376851K481562R77833j680387k390255n80637
$$ -2369560 -1170473 -1309083 -1604996 -228145 2253417 3231250 1550863 -839392 -1420029
37678a420029J251004J095903k03031p19111j56556L29569J96900N665j6532n74009
$$ -1420029 -169025 926878 723847 4736 -151820 177749 374649 380314 363782 -210227
37668b10227j966134l078594k577814p20586R02865J383317J403131J869062K414844
$$ -210227 -2176361 -5254955 -7832769 -8553355 -7650490 -6267173 -4864042 -2994980 -580136
37659e80136J950191L31599j287019j799051j260351n00848q5943L8771J34862
$$ -580136 1370055 1701654 414635 -1384416 -2644767 -3145615 -3231558 -3192787 -3057925
37650c057925K54433K67947J86767L21732R07004J509824J199104l17330k014052
$$ -3057925 -2803492 -2535545 -2348778 -2027046 -1120042 389782 1588886 1271556 -742496
37641g42496k567504j888033r66500l14657M77570J418249J479489J06913j405714
$$ -742496 -3310000 -5198033 -6164533 -6479190 -6001620 -4583371 -3103882 -2996969 -4402683
37632d402683j180227P95957K425609J825704o92267l027357l243154j176364
$$ -4402683 -5582910 -4786953 -2361344 -535640 -1227907 -4255264 -7498418 -8674782
37624h674782J470916K690505K108792J147355J037573J324795R38455l8085p45405
$$ -8674782 -7203866 -4513361 -2404569 -1257214 -219641 1105154 2043609 2005524 1260119
37615A260119j081289j452044j373503k9848J766739K030758M50796j010694j037149
$$ 1260119 178830 -1273214 -2646717 -2676565 -909826 1120932 1571728 561034 -476115
37606d76115o29730q75650r85804r1977P32547K26780o60564l63462L83325k71764
$$ -476115 -1105845 -1981495 -2967299 -3059276 -2326729 -2099949 -2760513 -3123975 -2740650 -3012414
37596c012414j873120k135859o60454N70503O19234P62485J616983J823189O84765
$$ -3012414 -4885534 -7021393 -7681847 -7111344 -6492110 -5729625 -4112642 -2289453 -1604688
37587a604688m00355n09155p65596j684690j413726J068095L149493J929839j100276
$$ -1604688 -2005043 -2514198 -3279794 -4964484 -6378210 -5310115 -2160622 -230783 -1331059
37578a331059j944564R6173J813195J177595k61627o94393o81885j111206j080739
$$ -1331059 -3275623 -3179450 -1366255 -188660 -450287 -1144680 -1826565 -2937771 -4018510
37569d018510K69097J631365J301990q0777n52777J22116L73921m07882r08637
$$ -4018510 -3749413 -2118048 -816058 -896835 -1449612 -1327496 -953575 -1361457 -2270094
37560b270094j03391J034818R29961l12215j036578l02878Q45284P88966m37822
$$ -2270094 -2373485 -1338667 -408706 -720921 -1757499 -2060377 -1215093 -426127 -863949
37551h63949j096240o4360J565544J906557P85455k51051l63090n32439j654207
$$ -863949 -1960189 -2024549 -459005 1447552 2233007 1981956 1618866 1086427 -567780
37542e67780k654590j782400O28624K088309J024458j082370j495112L01446J973883
$$ -567780 -3222370 -5004770 -4376146 -2287837 -1263379 -2345749 -3840861 -3539415 -1565532
37533a565532J364153q32566k158837j515980m0673R38002J382296J578517J140171
$$ -1565532 -201379 -1033945 -3192782 -4708762 -4749435 -3811433 -2429137 -850620 289551
37524B89551M0089m71884N58945J969311J836155L45694m26849L02541Q54497
$$ 289551 329640 -142244 416701 2386012 4222167 4567861 4141012 4443553 5298050
37515E298050k63466k052425k426648r49329Q91451J570565Q28508n31965j460004
$$ 5298050 5034584 2982159 555511 -393818 497633 2068198 2896706 2364741 904737
37506I04737j472505j023690q15457p32703j18096Q64639J158165M26658l52450
$$ 904737 -567768 -1591458 -2406915 -3139618 -3257714 -2393075 -1234910 -808252 -1160702
37497a160702m54030m13946p03899o09550M13695J313817Q52899k74630l69343
$$ -1160702 -1614732 -2028678 -2732577 -3342127 -2928432 -1614615 -761716 -1036346 -1405689
37488a405689O21284J105651M74214m1760L94390O91840m95993k538975l340732
$$ -1405689 -784405 321246 795460 753700 1148090 1839930 1343937 -1195038 -4535770
37479d535770j760088J135452L084532K609528K76035j777435j858324m16139
$$ -4535770 -6295858 -5160406 -2075874 533654 809689 -967746 -2826070 -3242209
37471c242209O15595J92958p29703o96944L38348J200844J136251M78416k30157
$$ -3242209 -2626614 -2433656 -3163359 -3860303 -3521955 -2321111 -1184860 -706444 -936601
37462i36601r49851j621147j566890k11219J691110K400739J224273m00350n78393
$$ -936601 -1886452 -3507599 -5074489 -5285708 -3594598 -1193859 30414 -369936 -948329
37453i48329O42861J481242R06689k22963p83100r23325j221083j290497l86323
$$ -948329 -305468 1175774 2082463 1859500 1076400 153075 -1068008 -2358505 -2744828
37444b744828J113947J964068J611786O00958m24362j216375j512705j073086
$$ -2744828 -1630881 333187 1944973 2545931 2121569 905194 -607511 -1680597
37436a680597k80992K3188m76467j225955j466791q44348M64555J703745J870734
$$ -1680597 -1961589 -1938401 -2414868 -3640823 -5107614 -5951962 -5487407 -3783662 -1912928
37427a912928P73026m42806n26666K84580O32374j93621j571924k376315j741248
$$ -1912928 -1139902 -1582708 -2109374 -1824794 -1192420 -1386041 -2957965 -5334280 -7075528
37418g075528N34592L316565M349384K531035k80058j243741j74587N49318k58788
$$ -7075528 -6540936 -3224371 1125013 3656048 3375990 2132249 1957662 2506980 2248192
37409B248192j066320m79856M94908L15652o49606j014308m67423L95935J226682
$$ 2248192 1181872 702016 1196924 1512576 862970 -151338 -618761 -222826 1003856
37400A003856J607898P58138j028513j820894n58526R88714O28301r05612j211669
$$ 1003856 2611754 3369892 2341379 520485 -38041 950673 1578974 673362 -538307
37391e38307q3595M32982l63588q21863O5842J073941J001633M72717M11172M27253
$$ -538307 -621902 -188920 -552508 -1374371 -1308529 -234588 767045 1239762 1650934 2078187
37381B078187r4661o60085n52360K6850O06842J141222J288854L15437j366076
$$ 2078187 1983526 1323441 771081 797931 1404773 2545995 3834849 4150286 2784210
37372B784210j978446q93702M1467q16963k221166j898360j11772Q28851J40478
$$ 2784210 805764 -87938 -46471 -863434 -3084600 -4982960 -5094732 -4265881 -4125403
37363d125403n76491p1768J040685J864847K405586K503857J342730r24612k417686
$$ -4125403 -4701894 -4773662 -3732977 -1868130 537456 3041313 4384043 3459431 1041745
37354A041745j688136K15208J056502K45722q06106r08741m97807n57529r65051
$$ 1041745 -646391 -431183 625319 871041 64935 -843806 -1341613 -1899142 -2864193
37345b864193o04373R22539K249520J530837j106877l100466k151790R97620L409205
$$ -2864193 -3468566 -2546027 -296507 1234330 127453 -2973013 -5124803 -4127183 -717978
37336g17978L358706J780197L03072o80649j359079j298507j82215J015796R77788
$$ -717978 2640728 4420925 4723997 4043348 2684269 1385762 1203547 2219343 3197131
37327C197131j00781q05559n90527m01256j001180j746656j581395n17483N29435
$$ 3197131 3096350 2290791 1700264 1299008 297828 -1448828 -3030223 -3547706 -3018271
37318c018271R51132Q57015M94061r8434p76778j122707q72612l08087L7791l4668
$$ -3018271 -2067139 -1210124 -716063 -814497 -1591275 -2713982 -3586594 -3894681 -3856890 -3891558
37308c891558l20277n95192p15283l83834O10878J704678J728902L36723j193147
$$ -3891558 -4211835 -4807027 -5522310 -5906144 -5295266 -3590588 -1861686 -1524963 -2718110
37299b718110j305695m1250J211695J576260J349187R53016M04215k8115J42714
$$ -2718110 -4023805 -4065055 -2853360 -1277100 72087 1025103 1429318 1401203 1543917
37290A543917N26420j8232j583741k694009k307585j177474l27439N56383J922450
$$ 1543917 2070337 2052105 468364 -2225645 -4533230 -5710704 -6038143 -5481760 -3559310
37281c559310K705423J653672l43935j128865k96885L65614m23932j848509k404799
$$ -3559310 -853887 799785 455850 -673015 -969900 -604286 -1028218 -2876727 -5281526
37272e281526j651241j94039J070456J468592J117015R22403J237089J054611
$$ -5281526 -6932767 -7126806 -6056350 -4587758 -3470743 -2548340 -1311251 -256640
37264b56640k38800j112210J10465K003405J459218j419670k794793n57058K453187
$$ -256640 -495440 -1607650 -1497185 506220 1965438 545768 -2249025 -2806083 -352896
37255c52896K509836m3091k151090k473991j847686p02432J099990K511757K135453
$$ -352896 2156940 2113849 -37241 -2511232 -4358918 -5061350 -3961360 -1449603 685850
37246F85850O66845Q3790M61371M2894j378303j807869n08553M37963n88636j994796
$$ 685850 1352695 1436485 1897856 1940750 562447 -1245422 -1753975 -1316012 -1904648 -3899444
37236c899444j362840Q22000J893769P89489q20026j132541l02337N32285J059543
$$ -3899444 -5262284 -4440284 -2546515 -1757026 -2577052 -3709593 -4011930 -3479645 -2420102
37227b420102J688604K186502J547109m57004k339704k364016p55298N13601L20920
$$ -2420102 -731498 1455004 3002113 2545109 205405 -2158611 -2913909 -2400308 -2079388
37218b079388l22904j56931L92155L21638R0922Q55180K162364K323652J128209
$$ -2079388 -2402292 -2559223 -2167068 -1845430 -1754508 -899328 1263036 3586688 4714897
37209D714897L17425Q46933J358243K61858j960756l530400l493272k203930n45357
$$ 4714897 5032322 5879255 7237498 7499356 5538600 2008200 -1485072 -3689002 -4234359
37200d234359M77074J37805j110724j724326q22266O89023J394024J090145M85024
$$ -4234359 -3757285 -3619480 -4730204 -6454530 -7276796 -6587773 -5193749 -4103604 -3618580
37191c618580j03085p55388j151501p86300J93583J116568J528046J231087O3402
$$ -3618580 -3721665 -4477053 -5628554 -6414854 -6221271 -5104703 -3576657 -2345570 -2282168
37182b282168j568635k362505j326486Q05471K200019J894679M56757j062695
$$ -2282168 -3850803 -6213308 -7539794 -6734323 -4534304 -2639625 -2182868 -3245563
37174c245563j906029j490879L00363K378270K985650J632741j05338l81880P15473
$$ -3245563 -5151592 -6642471 -6342108 -3963838 -978188 654553 549215 167335 882808
37165H82808J452409P81126m28300p93073l75436m05596j208141j504182l67085
$$ 882808 2335217 3116343 2688043 1894970 1519534 1113938 -94203 -1598385 -1965470
37156a965470J036996Q63318o53338j355390k69552J007152Q27153j4479K63851
$$ -1965470 -928474 -65156 -718494 -2073884 -2343436 -1336284 -509131 -523610 -259759
37147b59759J387231J293930o33291k373349j956464q0695R66928K82117q89147
$$ -259759 1127472 2421402 1788111 -585238 -2541702 -2622397 -1655469 -1373352 -2262499
37138b262499j147988o04585k03767k30278k64594k54509o51474j332607j311317
$$ -2262499 -3410487 -4015072 -4218839 -4449117 -4713711 -4968220 -5619694 -6952301 -8263618
37129h263618r4357J351062J724465R69321o3592r39215j540023j208094M44210
$$ -8263618 -8357975 -7006913 -5282448 -4313127 -4376719 -5315934 -6855957 -8064051 -7619841
37120g619841K030097J538382o45263j720484k96645J539539J264330n17831j258376
$$ -7619841 -5589744 -4051362 -4696625 -6417109 -6713754 -5174215 -3909885 -4427716 -5686092
37111e686092j19765J455122K208450K189848J593539K57715j412524k366284
$$ -5686092 -5805857 -4350735 -2142285 47563 1641102 1898817 486293 -1879991
37103a879991k098420j025918L32738J616692K203156J673239P20713M84818Q79418
$$ -1879991 -3978411 -5004329 -4671591 -3054899 -851743 821496 1542209 2027027 2906445
37094B906445O73293n82046j748676j557036p4163J522480K024293J037442o21602
$$ 2906445 3579738 2997692 1249016 -308020 -382183 1140297 3164590 4202032 3580430
37085C580430j532567j293638j067038j682631k032798q10135R16252R39429n61815
$$ 3580430 2047863 754225 -312813 -1995444 -4028242 -4838377 -3922125 -2982696 -3544511
37076c544511j121150J75218J460621J404745J155772J653274J506450m37083
$$ -3544511 -4665661 -4490443 -3029822 -1625077 -469305 1183969 2690419 2253336
37068B253336k447520k270282o44644J01398j56167K29798J138545P23117r01320
$$ 2253336 -194184 -2464466 -3109110 -3007712 -3163879 -2934081 -1795536 -1072419 -1973739
37059a973739j142155R26367K609041J391706j363865k469027j231956L49358
$$ -1973739 -3115894 -2189527 419514 1811220 447355 -2021672 -3253628 -2904270
37051b904270Q94190R87131J317270J379293N95023n37017j132404j028808o45311
$$ -2904270 -2010080 -1022949 294321 1673614 2268637 1731620 599216 -429592 -1074903
37042a074903k71770J7656J69646L24748Q08470J463067J362638r3422j942474
$$ -1074903 -1346673 -1329017 -1159371 -834623 -26153 1436914 2799552 2706130 763656
37033G63656k360793q38874J085399J718117J124640M00994l04978j689253l270436
$$ 763656 -1597137 -2436011 -1350612 367505 1492145 1893139 1588161 -101092 -3371528
37024c371528l118612n00475K391063K769624P84411p85778k76846J028620J269822
$$ -3371528 -6490140 -6990615 -4599552 -1829928 -1045517 -1831295 -2108141 -1079521 190301
37015A90301O20463L49056L95657l88151j891564k399502j044874P66703J209213
$$ 190301 810764 1159820 1555477 1167326 -724238 -3123740 -4168614 -3401911 -2192698
37006b192698L26852n13490p08061p06469n77205K81590J740116K464325J555480
$$ -2192698 -1865846 -2379336 -3087397 -3793866 -4371071 -4089481 -2349365 114960 1670440
36997A670440q3356q07033k59900L88674R3429q54722j401232j063977l78866
$$ 1670440 1587084 780051 520151 908825 1002254 147532 -1253700 -2317677 -2696543
36988b696543j12122l30742m97988l83759l77494o50869n80564L47133J439567
$$ -2696543 -2808665 -3139407 -3637395 -4021154 -4398648 -5049517 -5630081 -5282948 -3843381
36979c843381J469379L08455r69802j537553j430405q17936J75506Q69997N82257
$$ -3843381 -2374002 -2065547 -3035349 -4572902 -6003307 -6821243 -6645737 -5775740 -5193483
36970e193483k0327L83306J401333J121429o14059j281748N54336K611457K082382
$$ -5193483 -5213810 -4830504 -3429171 -2307742 -2921801 -4203549 -3649213 -1037756 1044626
36961A044626k54332j587869j350658j058556q45904N15026K357630K294124J81396
$$ 1044626 790294 -797575 -2148233 -3206789 -4052693 -3537667 -1180037 1114087 1295483
36952A295483j176713k16499J313547J577856J182493J038432L83495j168429
$$ 1295483 118770 -97729 1215818 2793674 3976167 5014599 5398094 4229665
36944D229665j989416j046835r0192q46675j891050j035947O83026N42270j236185
$$ 4229665 2240249 1193414 1103222 256547 -1634503 -2670450 -1987424 -1445154 -2681339
36935b681339j678619K10913J996230J636441J38491n64107k54676J93302M43873
$$ -2681339 -4359958 -4149045 -2152815 -516374 -377883 -941990 -1196666 -1003364 -559491
36926e59491N01812P6063p76542j229141p84710q0756J52789K68211J030761K212867
$$ -559491 -57679 18384 -758158 -1987299 -2772009 -2852765 -2699976 -2431765 -1401004 811863
36916H11863K626257J487226o47077k282818k249383p36796R03019J546820J312978
$$ 811863 3438120 4925346 4278269 1995451 -253932 -990728 -87709 1459111 2772089
36907B772089R31072N09786m10885j775427k773516k801983k076516j140734k64135
$$ 2772089 3703161 4212947 3802062 2026635 -746881 -3548864 -5625380 -6766114 -7030249
36898g030249M82952R41087R21776M87625R5951L17997J116221J497535N06440
$$ -7030249 -6547297 -5606210 -4684434 -4196809 -4100858 -3782861 -2666640 -1169105 -662665
36889f62665j296828k099910r67390R90778K037771J683733O53446j81005j88403
$$ -662665 -1959493 -4059403 -5026793 -4036015 -1998244 -314511 338935 157930 -30473
36880c0473Q21139J984671J851642L50026o74003L9738J155299O39186j249117
$$ -30473 790666 2775337 4626979 4977005 4303002 4342740 5498039 6137225 4888108
36871D888108k537155k400172j600050n85995P82299J783315J247895k96265q08456
$$ 4888108 2350953 -49219 -1649269 -2235264 -1452965 330350 1578245 1281980 473524
36862D73524M50078J939064K145614J285211K17564p43254j340900j213757q41568
$$ 473524 923602 2862666 5008280 6293491 6511055 5767801 4426901 3213144 2371576
36853B371576j173782j746115q83376J385710K471635O64264k105985k663462
$$ 2371576 1197794 -548321 -1431697 -45987 2425648 3089912 983927 -1679535
36845a679535o98741J276453J435411L48448n82023p65408k50912Q24869K005609
$$ -1679535 -2378276 -1101823 333588 682036 100013 -665395 -916307 -91438 1914171
36836A914171K386026J368406m65245j558918q32987R26528J606495K22288j651381
$$ 1914171 4300197 5668603 5203358 3644440 2811453 3737981 5344476 5566764 3915383
36827C915383j786725k09850J064340R73338M43881K93552p4007j083445j710518
$$ 3915383 2128658 1918808 2983148 3956486 4400367 4693919 4619912 3536467 1825949
36818A825949r82219M01809J099581Q40517J09003q55070j627807j241425L64527
$$ 1825949 843730 1245539 2345120 3185637 3294640 2439570 811763 -429662 -65135
36809f5135J412775L66023j681047k307383j081712J26101R4227k23593M09318
$$ -65135 1347640 1713663 32616 -2274767 -3356479 -3230378 -3136151 -3359744 -2950426
36800b950426J502601J600305L09080j203827j476504j42309J741324K601728
$$ -2950426 -1447825 152480 461560 -742267 -2218771 -2361080 -619756 1981972
36792A981972J834901M38428j38682K06563O1918j564560l519886l445585o91037
$$ 1981972 3816873 4255301 4116619 4323182 4385100 2820540 -699346 -4144931 -4835968
36783d835968K375385K840787Q08161p68416j27990R44273m4093k443037l363057
$$ -4835968 -2460583 380204 1188365 419949 291959 1236232 1192139 -1250898 -4613955
36774d613955j758371N24855J668587J733007J312021M07517o64465r86378m33001
$$ -4613955 -6372326 -5847471 -4178884 -2445877 -1133856 -726339 -1390804 -2377182 -2810183
36765b810183P0590J45278K43756R3902j096003k449006j911025K04334Q83822
$$ -2810183 -2739593 -2594315 -2350559 -2256657 -3352660 -5801666 -7712691 -7508357 -6624535
36756f624535r58317k326028o66277K098620K703296J413921O86661Q03236K91539
$$ -6624535 -7582852 -9908880 -10575157 -8476537 -5773241 -4359320 -3672659 -2869423 -2577884
36747b577884n56367j72706R20539O56350r14110j681022j076518n04191k24507
$$ -2577884 -3134251 -3306957 -2386418 -1730068 -2644178 -4325200 -5401718 -5905909 -6130416
36738f130416R03119K306970J734820q24117k447014j613199k63159k12695l92921
$$ -6130416 -5227297 -2920327 -1185507 -2009624 -4456638 -6069837 -6332996 -6545691 -6938612
36729f938612O05580J791457J642812P33480M51253O59287N13132K68974N14886
$$ -6938612 -6333032 -4541575 -2898763 -2165283 -1714030 -1054743 -541611 -272637 242249
36720B42249P47097L08749l22995o27092j239014k533175l191019j962384N4292
$$ 242249 989346 1298095 975100 348008 -891006 -3424181 -6615200 -8577584 -8523292
36711h523292P47350J4538l56236M71458J385134J251877M23455n7122J75422
$$ -8523292 -7775942 -7761404 -8117640 -7646182 -6261048 -5009171 -4585716 -4642838 -4467416
36702d467416O22353O35672J03334m62847n82470m18368l25381o4713O84228J263617
$$ -4467416 -3845063 -3209391 -3106057 -3568904 -4151374 -4569742 -4895123 -4959836 -4275608 -3011991
36692c011991P66677j85744p998J197752J424746j4087j025066J00331J830101
$$ -3011991 -2245314 -2431058 -2439056 -1241304 183442 169355 -855711 -755380 1074721
36683A074721J649231j13253r76007j59094N57604k06746j693500k670437l093042
$$ 1074721 2723952 2610699 1634692 1475598 2033202 1826456 132956 -2537481 -5630523
36674e630523l228774k396300J27767L316646M682142K876497m35592k094146
$$ -5630523 -8859297 -11255597 -11127830 -7811184 -3129042 -252545 -688137 -2782283
36666b782283r85666P91222R04244j14477j38397J001576J402976M50596j66228
$$ -2782283 -3767949 -2976727 -2072483 -2186960 -2325357 -1323781 79195 529791 363563
36657C63563N18709J068435K45422q31462p69411k66647m79319o88781J65920
$$ 363563 882272 1950707 2196129 1364667 595256 328609 -150710 -839491 -673571
36648f73571R80201K8510j866013k294272r53443J27476o4192l79805O0084N48108
$$ -673571 306630 335140 -1530873 -3825145 -4778588 -4651112 -4715304 -5095109 -5035025 -4486917
36638d486917M64143L54635O38118P80449M07074n4205l14580n93166p32798k38720
$$ -4486917 -4022774 -3668139 -3030021 -2249572 -1842498 -1896703 -2211283 -2804449 -3537247 -3775967
36628c775967N21173N52383n833J00802R55092Q89818q42124k335237j398745
$$ -3775967 -3254794 -2702411 -2708244 -2607442 -1652350 -762532 -1604656 -3939893 -5338638
36619e338638J287552K890005J919086k77239j511957j199450m28146k30384m39634
$$ -5338638 -4051086 -1161081 758005 480766 -1031191 -2230641 -2658787 -2889171 -3328805
36610c328805l45137L185j80524r90813j234804M2428J920056K410460Q42848
$$ -3328805 -3673942 -3670757 -3851281 -4842094 -6076898 -6034470 -4114414 -1703954 -861106
36601h61106j307739k066551r32894Q30539J540908P74478j72161J79655J493152
$$ -861106 -2168845 -4235396 -5168290 -4337751 -2796843 -2022365 -2194526 -2014871 -521719
36592e21719J955475Q21286n46776p84457l41186j57765Q2179Q32997J032623
$$ -521719 1433756 2255042 1708266 923809 582623 424858 507037 1340034 2372657
36583B372657m28627k378764k679785j436638o55343q75265n42645R62852K027695
$$ 2372657 1944030 -434734 -3114519 -4551157 -5206500 -6081765 -6624410 -5661558 -3633863
36574c633863J371082K6996k67908O88123J769115J889798O49093j336264k461371
$$ -3633863 -2262781 -2235785 -2503693 -1815570 -46455 1843343 2492436 1156172 -1305199
36565a305199j654898P494N21489k33842n13452M37196J444561J574559J220787
$$ -1305199 -2960097 -2952603 -2431114 -2664956 -3178408 -2741212 -1296651 277908 1498695
36556A498695O20432n70539j642035j089913O23994R93237o47850j641612o9049
$$ 1498695 2119127 1548588 -93447 -1183360 -559366 433871 -213979 -1855591 -1924640
36547a924640K092585K056254M48847j21448P33539J111648J30460j162582j791528
$$ -1924640 167945 2224199 2673046 2551598 3285137 4396785 4527245 3364663 1573135
36538A573135j703956r43814K36815P87659Q634j122519j277622q43312j038474
$$ 1573135 -130821 -1074635 -837820 -50161 -41527 -1164046 -2441668 -3284980 -4323454
36529d323454j598693j180217L14584J595098J897031J412958K05242j545079
$$ -4323454 -5922147 -7102364 -6787780 -5192682 -3295651 -1882693 -1677451 -3222530
36521c222530k538542j529413N74072J591915J037863M09242N16084N06557j03560
$$ -3222530 -5761072 -7290485 -6716413 -5124498 -4086635 -3677393 -3161309 -2654752 -2758312
36512b758312l74503L30332J124926J009820L65516K16316Q01885J514823J709041
$$ -2758312 -3132815 -2802483 -1677557 -667737 -302221 -85905 715980 2230803 3939844
36503C939844J198082L37067l38773q46747j714690k754076k718724j110911N86807
$$ 3939844 5137926 5474993 5136220 4289473 2574783 -179293 -2898017 -4008928 -3422121
36494c422121P74075l2648l36564j10424k17649k30491Q18732K003648J443653
$$ -3422121 -2648046 -2680694 -3017258 -3127682 -3345331 -3575822 -2757090 -753442 690211
36485F90211m10700j138932k18946K72419o20795j244479n96546j74220r96997
$$ 690211 279511 -859421 -1078367 -805948 -1426743 -2671222 -3267768 -3441988 -4438985
36476d438985j454833j42834J458981J460443P99711J425865K682575K280610
$$ -4438985 -5893818 -6036652 -4577671 -3117228 -2317517 -891652 1790923 4071533
36468D071533J03337j603142j629093j103690j258990j761798j651560o37950
$$ 4071533 4174870 2571728 942635 -161055 -1420045 -3181843 -4833403 -5471353
36460e471353P99311J748977J453102L49210M1857J256498K454943J740312m20992
$$ -5471353 -4672042 -2923065 -1469963 -1120753 -1078896 177602 2632545 4372857 3951865
36451C951865j837238j577714p41548l37414k8675O35823J079212N14212p89190
$$ 3951865 2114627 536913 -204635 -542049 -570724 65099 1144311 1658523 869333
36442H69333j656592j276452j60813K47387p15918j748380j041221R66939J775585
$$ 869333 -787259 -2063711 -2224524 -1977137 -2693055 -4441435 -5482656 -4515717 -2740132
36433b740132M38351p57409L36990K306131K271415K95441r09527k41299N27118
$$ -2740132 -2301781 -3059190 -2722200 -416069 1855346 2150787 1241260 999961 1527079
36424A527079k913q51628p37404j07377K1595k75387m20605m33828n06477m06259
$$ 1527079 1524166 672538 -64866 -172243 -150648 -426035 -846640 -1280468 -1786945 -2193204
36414b193204m8982J67258J23022J73637K09396l52711j171737q92045P74478
$$ -2193204 -2242186 -2074928 -1951906 -1778269 -1568873 -1921584 -3093321 -3985366 -3210888
36405c210888K130678J722112M55988K39124J207005J685646O93854p52392j099196
$$ -3210888 -1080210 641902 1097890 1337014 2544019 4229665 4923519 4171127 3071931
36396C071931k37131M98007J28561o72943n69515L46484M90228o90329j415205
$$ 3071931 2834800 3332807 3461368 2788425 2218910 2565394 3055622 2365293 950088
36387I50088j35563J698175J488548m83532j418037m16742K60345q54582k027228
$$ 950088 814525 2512700 4001248 3517716 2099679 1682937 1943282 1088700 -938528
36378i38528j406713n9811J68660j70278M64119J527912J390625M50884N30934
$$ -938528 -2345241 -2405052 -2236392 -2406670 -1942551 -414639 975986 1426870 1957804
36369A957804J570126J542918k24314j972526k183539j422418r35198r37477q90264
$$ 1957804 3527930 5070848 4846534 2874008 690469 -731949 -1667147 -2604624 -3494888
36360c494888l63659P19297J819332J846089N15577o80355j80225J297367J653781
$$ -3494888 -3858547 -3139250 -1319918 526171 1041748 361393 181168 1478535 3132316
36351C132316M15942q75000j152904q39492l52838L87047P48527j93359j574741
$$ 3132316 3548258 2673258 1520354 680862 328024 715071 1463598 1270239 -304502
36342c04502j269363P74717J934035O82355j185064j443595n30740q7721k01738
$$ -304502 -1573865 -799148 1134887 1817242 632178 -811417 -1342157 -1429878 -1631616
36333a631616l4211K03524j20010n27352l58523k05958o32828n69756R48149K436281
$$ -1631616 -1665827 -1462303 -1582313 -2109665 -2468188 -2674146 -3306974 -3876730 -2928581 -492300
36323d92300J751017l76243j146954R8384J028382K7410j620921k067695j401171
$$ -492300 1258717 882474 -264480 -166096 862286 889696 -731225 -2798920 -4200091
36314d200091o94666j28734O13114J093301N89661n57329j010760Q2982J985757
$$ -4200091 -4894757 -5023491 -4410377 -3317076 -2727415 -3284744 -4295504 -4212522 -2226765
36305b226765K834828J483780r73482k151331j288853k52866p20945j566589p21677
$$ -2226765 608063 2091843 1118361 -1032970 -2321823 -2574689 -3295634 -4862223 -5583900
36296e583900J317810K151514J271108O33621J189461J428214K51840j057324
$$ -5583900 -4266090 -2114576 -843468 -209847 979614 2407828 2659668 1602344
36288A602344j037219k40222K13001N16568J026847Q25562p10246k146111j751872
$$ 1602344 565125 324903 537904 1054472 2081319 2906881 2196635 50524 -1701348
36279a701348j54365O40802K06668j86804L9146J29682l55245q69094r44272o54663
$$ -1701348 -1855713 -1214911 -1008243 -1195047 -1155901 -1026219 -1381464 -2250558 -3194830 -3849493
36269c849493k2578R03764J503948J219482N38479K68610J75611m13113j023302
$$ -3849493 -3872071 -2968307 -1464359 -244877 293602 562212 737823 324710 -698592
36260f98592n30702R26121K014792K115150J674943P74421r35786k731726l079080
$$ -698592 -1229294 -303173 1711619 3826769 5501712 6276133 5340347 2608621 -470459
36251d70459j853712o08329j00763O55266K105441K797890J585189l46012j127313
$$ -470459 -2324171 -2932500 -3033263 -2377997 -272556 2525334 4110523 3764511 2637198
36242B637198p16594k85814j34841J90804M84254K15761k34649k11803j87538
$$ 2637198 1920604 1634790 1499949 1690753 2175007 2390768 2156119 1944316 1756778
36233A756778r55188j823939j378854J05963Q81688M94122L77521J132062J200352
$$ 1756778 801590 -1022349 -2401203 -2295240 -1413552 -919430 -541909 590153 1790505
36224A790505n63142k627790k708604r22973O52833R69448Q25057R09445P82108
$$ 1790505 1227363 -1400427 -4109031 -5032004 -4379171 -3409723 -2584666 -1675221 -893113
36215h93113J58774k49781Q4917N34886L33223j96182k83556k9639j31036n68626
$$ -893113 -734339 -984120 -899203 -364317 -31094 -227276 -510832 -540471 -671507 -1240133
36205a240133n27760L16754J209629J261139M84502l52992n95032k62610K2536
$$ -1240133 -1767893 -1451139 -241510 1019629 1504131 1151139 556107 293497 316033
36196C16033l16089r98233r06631N91065K458711K817454J082727j341486k668659
$$ 316033 -56 -998289 -1904920 -1313855 1144856 3962310 5045037 3703551 1034892
36187A034892k370700j015501O60318J928292K048457R52516l71964r12072q18470
$$ 1034892 -1335808 -2351309 -1690991 237301 2285758 3238274 2866310 1954238 1135768
36178A135768r15599j279502j083801J54429J818036K758681K232497M08933j590958
$$ 1135768 220169 -1059333 -2143134 -1988705 -170669 2588012 4820509 5229442 3638484
36169C638484k376311j589453l86719p7615n33566o28911J8006O79337Q23119
$$ 3638484 1262173 -327280 -713999 -791614 -1325180 -1954091 -1936085 -1256748 -433629
36160d33629P68326Q38737P62194K50585n27556j315434j934777j923350q36134
$$ -433629 334697 1173434 1935628 2186213 1658657 343223 -1591554 -3514904 -4351038
36151d351038Q11756J770539J622990J278831J450866J570855Q94131j98398q81084
$$ -4351038 -3539282 -1768743 -145753 1133078 2583944 4154799 5048930 4850532 3969448
36142C969448j141827j371766j300044m98750L97938K35934q77417j457015n94032
$$ 3969448 2827621 1455855 155811 -342939 54999 290933 -586484 -2043499 -2637531
36133b637531Q50321J412053P52604k06483m59360J52149R54360J134578N03362
$$ -2637531 -1787210 -375157 377447 170964 -288396 -136247 818113 1952691 2456053
36124B456053m03977j068716j587831k175190k336754j262932Q45927K521157
$$ 2456053 2052076 983360 -604471 -2779661 -5116415 -6379347 -5533420 -3012263
36116c012263K508406J147415j04754k99452J90028L37105l67516j399350j696170
$$ -3012263 -503857 643558 538804 239352 429380 766485 398969 -1000381 -2696551
36107b696551p24046Q59893J738023J228717j18195j302584j873751j824854r66949
$$ -2696551 -3420597 -2560704 -822681 406036 287841 -1014743 -2888494 -4713348 -5680297
36098e680297P29184K213425J889083l09367k211130j775896L26301J647521J188889
$$ -5680297 -4951113 -2737688 -848605 -1157972 -3369102 -5144998 -4818697 -3171176 -1982287
36089a982287K82407J68093L38917O852l03647J38484P16155N00202N3624N96561
$$ -1982287 -1699880 -1531787 -1192870 -1186018 -1489665 -1351181 -635026 -134824 -81200 515361
36079E15361J826074K186492J153570k18443r31962q43538k6723J120688J336891
$$ 515361 2341435 4527927 5681497 5463054 4531092 3687554 3660831 4781519 6118410
36070F118410j37424j740605j230910P07263R27967j481901l580657k890964q29305
$$ 6118410 5980986 4240381 3009471 3716734 4644701 3162800 -417857 -3308821 -4138126
36061d138126p088l54894k51100K83983J40417l98597l29966j20997o41282p82941
$$ -4138126 -4145214 -4500108 -4751208 -4467225 -4326808 -4725405 -5055371 -5176368 -5817650 -6600591
36051f600591R93718L307355L185234P15115q20619L7083R25815k02587j865010
$$ -6600591 -5606873 -2299518 885716 1600831 780212 817295 1743110 1540523 -324487
36042c24487j738529k86407L92403j88897p95421o68293j77675J40176K3074m87351
$$ -324487 -2063016 -2349423 -1957020 -2145917 -2941338 -3609631 -3787306 -3647130 -3624056 -4111407
36032d111407o99762K21259J784636K339207J418110N58407Q72173J339236P89639
$$ -4111407 -4811169 -4589910 -2805274 -466067 952043 1510450 2382623 3721859 4511498
36023D511498K6808K47060O48934l01403k062092k632984j588348m71458k60561
$$ 4511498 4538306 4785366 5434300 5132897 3070805 437821 -1150527 -1621985 -1882546
36014a882546k87004K02561R98761J605367J603027L69298k091607m058472l478318
$$ -1882546 -2169550 -1966989 -968228 637139 2240166 2609464 517857 -3540615 -7018933
36005g018933o87369J775816K341075J831297J429051J041040M13747J36231M11489
$$ -7018933 -7706302 -5930486 -3589411 -1758114 -329063 711977 1125724 1261955 1673444
35996A673444K57810q08047j518572o96725O55893P04121m43009r58420m3513
$$ 1673444 1931254 1123207 -395365 -1092090 -436197 267924 -175085 -1133505 -1177018
35987a177018J127580J321749P53198L01606K62804L67373L36090j0358p01379
$$ -1177018 -49438 1272311 2025509 2327115 2589919 2957292 3293382 3283024 2581645
35978B581645j376120j500585j032303m93036k26815K8974O34557J398358J646439
$$ 2581645 1205525 -295060 -1327363 -1820399 -2047214 -2018240 -1383683 14675 1661114
35969A661114Q80018n98055j686485j459839l68880L7188r30008k009618j677547
$$ 1661114 2541132 1943077 256592 -1203247 -1572127 -1534939 -2464947 -4474565 -6152112
35960f152112l46409L67224K53413P35212K250488L161264K147661K19278q72492
$$ -6152112 -6498521 -6131297 -5877884 -5142672 -2892184 269080 2416741 2636019 1763527
35951A763527j026691j143475j053098J18475J958319K910272K392761J284675
$$ 1763527 736836 -406639 -1459737 -1341262 617057 3527329 5920090 7204765
35943G204765K89901p00761j538239j686393j451717j774047k357022j641172
$$ 7204765 7494666 6793905 5255666 3569273 2117556 343509 -2013513 -3654685
35935c654685O65296K637662K685574J596696R15886O73163O4749q40934j583547
$$ -3654685 -2989389 -351727 2333847 3930543 4846429 5519592 5584341 4743407 3159860
35926C159860k420672l358788l105056q65226J610633J899209M11289j36100J309898
$$ 3159860 739188 -2619600 -5724656 -6589882 -4979249 -3080040 -2668751 -2804851 -1494953
35917a494953K838532K533995P39734j178532k520941k962184k174140o58253
$$ -1494953 1343579 3877574 4617308 3438776 917835 -2044349 -4218489 -4876742
35909d876742K72668J14810l01168m11067p09173j282970j027850O16038K332910
$$ -4876742 -4604074 -4489264 -4790432 -5201499 -5910672 -7193642 -8221492 -7605454 -5272544
35900e272544K527673J393792L19975p519J33915M81962R44367J149162P31582
$$ -5272544 -2744871 -1351079 -1031104 -1038623 -904708 -422746 521621 1670783 2402365
35891B402365r7513p62137q35307j77841Q65973J365018P84048R8220O61916J810383
$$ 2402365 2304852 1542715 707408 529567 1395540 2760558 3544606 3642826 4304742 6115125
35881F115125J303445j197385k965936j775292R61738K157855Q90650j322710
$$ 6115125 7418570 6221185 3255249 1479957 2441695 4599550 5490200 4167490
35873D167490k966867l501109k766220j193458l3005J12108K76495J249173J759191
$$ 4167490 1200623 -2300486 -5066706 -6260164 -6293169 -6181061 -5904566 -4655393 -2896202
35864b896202M12555j518010j526755M36563K043044K065047J396742O77509n38401
$$ -2896202 -2483647 -4001657 -5528412 -5091849 -3048805 -983758 412984 1090493 552092
35855E52092j851347j748304j21912J063223O23325j93314J3884N91879K00520
$$ 552092 -1299255 -3047559 -3169471 -2106248 -1482923 -1676237 -1662353 -1070474 -869954
35846h69954r96674j851154j935495j534216o88656P03798K301019L457937L524606
$$ -869954 -1866628 -3717782 -5653277 -7187493 -7876149 -7172351 -4871332 -1413395 2111211
35837B111211J904541j226989m092199m461642k125672Q53544K632837L029914
$$ 2111211 4015752 2788763 -1303436 -5765078 -7890750 -7037206 -4404369 -1374455
35829a374455K302234L79048j895729k631211j305946J74139J69538l81842J24016
$$ -1374455 927779 1306827 -588902 -3220113 -4526059 -4351920 -4182382 -4564224 -4440208
35820d440208J136591J025760N1240P4557J548598K713379K029970K6951j609489
$$ -4440208 -3303617 -2277857 -2226617 -2152060 -603462 2109917 4139887 4166838 2557349
$$ [...]
##END NTUPLES=NMR SPECTRUM
##END=
